Started 1 mo 0 days ago
Took 2 hr 8 min

Failed Build clang-d367776-g196c097bba8-t15015-b15015.tar.gz (Sep 30, 2020 7:20:03 PM)

Issues

Found 3 issues:
Ninja target: AArch64_halide_runtime.bc.o
[1478/11531] /Users/buildslave/jenkins/workspace/test-suite-verify-machineinstrs-aarch64-globalisel-O0-g/test-suite-build/tools/timeit --summary Bitcode/simd_ops/CMakeFiles/simd_ops_test_op_abs_38.dir/AArch64_scalar_tests/scalar_test_op_abs_38.bc.o.time /Users/buildslave/jenkins/workspace/test-suite-verify-machineinstrs-aarch64-globalisel-O0-g/compiler/bin/clang++  -DNDEBUG  -B /Applications/Xcode.app/Contents/Developer/Toolchains/XcodeDefault.xctoolchain/usr/bin    -Wno-unused-command-line-argument -mllvm -verify-machineinstrs -O0 -g -arch arm64 -isysroot /Applications/Xcode.app/Contents/Developer/Platforms/iPhoneOS.platform/Developer/SDKs/iPhoneOS13.5.sdk   -w -Werror=date-time -MD -MT Bitcode/simd_ops/CMakeFiles/simd_ops_test_op_abs_38.dir/AArch64_scalar_tests/scalar_test_op_abs_38.bc.o -MF Bitcode/simd_ops/CMakeFiles/simd_ops_test_op_abs_38.dir/AArch64_scalar_tests/scalar_test_op_abs_38.bc.o.d -o Bitcode/simd_ops/CMakeFiles/simd_ops_test_op_abs_38.dir/AArch64_scalar_tests/scalar_test_op_abs_38.bc.o -c /Users/buildslave/jenkins/workspace/test-suite-verify-machineinstrs-aarch64-globalisel-O0-g/test-suite/Bitcode/simd_ops/AArch64_scalar_tests/scalar_test_op_abs_38.bc
[1479/11531] /Users/buildslave/jenkins/workspace/test-suite-verify-machineinstrs-aarch64-globalisel-O0-g/test-suite-build/tools/timeit --summary Bitcode/simd_ops/CMakeFiles/simd_ops_test_op_sub_1295.dir/AArch64_halide_runtime.bc.o.time /Users/buildslave/jenkins/workspace/test-suite-verify-machineinstrs-aarch64-globalisel-O0-g/compiler/bin/clang++  -DNDEBUG  -B /Applications/Xcode.app/Contents/Developer/Toolchains/XcodeDefault.xctoolchain/usr/bin    -Wno-unused-command-line-argument -mllvm -verify-machineinstrs -O0 -g -arch arm64 -isysroot /Applications/Xcode.app/Contents/Developer/Platforms/iPhoneOS.platform/Developer/SDKs/iPhoneOS13.5.sdk   -w -Werror=date-time -MD -MT Bitcode/simd_ops/CMakeFiles/simd_ops_test_op_sub_1295.dir/AArch64_halide_runtime.bc.o -MF Bitcode/simd_ops/CMakeFiles/simd_ops_test_op_sub_1295.dir/AArch64_halide_runtime.bc.o.d -o Bitcode/simd_ops/CMakeFiles/simd_ops_test_op_sub_1295.dir/AArch64_halide_runtime.bc.o -c /Users/buildslave/jenkins/workspace/test-suite-verify-machineinstrs-aarch64-globalisel-O0-g/test-suite/Bitcode/simd_ops/AArch64_halide_runtime.bc
[1480/11531] /Users/buildslave/jenkins/workspace/test-suite-verify-machineinstrs-aarch64-globalisel-O0-g/test-suite-build/tools/timeit --summary Bitcode/simd_ops/CMakeFiles/simd_ops_test_op_cmhi_77.dir/AArch64_tests/test_op_cmhi_77.bc.o.time /Users/buildslave/jenkins/workspace/test-suite-verify-machineinstrs-aarch64-globalisel-O0-g/compiler/bin/clang++  -DNDEBUG  -B /Applications/Xcode.app/Contents/Developer/Toolchains/XcodeDefault.xctoolchain/usr/bin    -Wno-unused-command-line-argument -mllvm -verify-machineinstrs -O0 -g -arch arm64 -isysroot /Applications/Xcode.app/Contents/Developer/Platforms/iPhoneOS.platform/Developer/SDKs/iPhoneOS13.5.sdk   -w -Werror=date-time -MD -MT Bitcode/simd_ops/CMakeFiles/simd_ops_test_op_cmhi_77.dir/AArch64_tests/test_op_cmhi_77.bc.o -MF Bitcode/simd_ops/CMakeFiles/simd_ops_test_op_cmhi_77.dir/AArch64_tests/test_op_cmhi_77.bc.o.d -o Bitcode/simd_ops/CMakeFiles/simd_ops_test_op_cmhi_77.dir/AArch64_tests/test_op_cmhi_77.bc.o -c /Users/buildslave/jenkins/workspace/test-suite-verify-machineinstrs-aarch64-globalisel-O0-g/test-suite/Bitcode/simd_ops/AArch64_tests/test_op_cmhi_77.bc
[1481/11531] /Users/buildslave/jenkins/workspace/test-suite-verify-machineinstrs-aarch64-globalisel-O0-g/test-suite-build/tools/timeit --summary Bitcode/simd_ops/CMakeFiles/simd_ops_test_op_cmhi_77.dir/AArch64_scalar_tests/scalar_test_op_cmhi_77.bc.o.time /Users/buildslave/jenkins/workspace/test-suite-verify-machineinstrs-aarch64-globalisel-O0-g/compiler/bin/clang++  -DNDEBUG  -B /Applications/Xcode.app/Contents/Developer/Toolchains/XcodeDefault.xctoolchain/usr/bin    -Wno-unused-command-line-argument -mllvm -verify-machineinstrs -O0 -g -arch arm64 -isysroot /Applications/Xcode.app/Contents/Developer/Platforms/iPhoneOS.platform/Developer/SDKs/iPhoneOS13.5.sdk   -w -Werror=date-time -MD -MT Bitcode/simd_ops/CMakeFiles/simd_ops_test_op_cmhi_77.dir/AArch64_scalar_tests/scalar_test_op_cmhi_77.bc.o -MF Bitcode/simd_ops/CMakeFiles/simd_ops_test_op_cmhi_77.dir/AArch64_scalar_tests/scalar_test_op_cmhi_77.bc.o.d -o Bitcode/simd_ops/CMakeFiles/simd_ops_test_op_cmhi_77.dir/AArch64_scalar_tests/scalar_test_op_cmhi_77.bc.o -c /Users/buildslave/jenkins/workspace/test-suite-verify-machineinstrs-aarch64-globalisel-O0-g/test-suite/Bitcode/simd_ops/AArch64_scalar_tests/scalar_test_op_cmhi_77.bc
[1482/11531] /Users/buildslave/jenkins/workspace/test-suite-verify-machineinstrs-aarch64-globalisel-O0-g/test-suite-build/tools/timeit --summary Bitcode/simd_ops/CMakeFiles/simd_ops_test_op_smlal_1154.dir/AArch64_halide_runtime.bc.o.time /Users/buildslave/jenkins/workspace/test-suite-verify-machineinstrs-aarch64-globalisel-O0-g/compiler/bin/clang++  -DNDEBUG  -B /Applications/Xcode.app/Contents/Developer/Toolchains/XcodeDefault.xctoolchain/usr/bin    -Wno-unused-command-line-argument -mllvm -verify-machineinstrs -O0 -g -arch arm64 -isysroot /Applications/Xcode.app/Contents/Developer/Platforms/iPhoneOS.platform/Developer/SDKs/iPhoneOS13.5.sdk   -w -Werror=date-time -MD -MT Bitcode/simd_ops/CMakeFiles/simd_ops_test_op_smlal_1154.dir/AArch64_halide_runtime.bc.o -MF Bitcode/simd_ops/CMakeFiles/simd_ops_test_op_smlal_1154.dir/AArch64_halide_runtime.bc.o.d -o Bitcode/simd_ops/CMakeFiles/simd_ops_test_op_smlal_1154.dir/AArch64_halide_runtime.bc.o -c /Users/buildslave/jenkins/workspace/test-suite-verify-machineinstrs-aarch64-globalisel-O0-g/test-suite/Bitcode/simd_ops/AArch64_halide_runtime.bc
FAILED: Bitcode/simd_ops/CMakeFiles/simd_ops_test_op_smlal_1154.dir/AArch64_halide_runtime.bc.o 
/Users/buildslave/jenkins/workspace/test-suite-verify-machineinstrs-aarch64-globalisel-O0-g/test-suite-build/tools/timeit --summary Bitcode/simd_ops/CMakeFiles/simd_ops_test_op_smlal_1154.dir/AArch64_halide_runtime.bc.o.time /Users/buildslave/jenkins/workspace/test-suite-verify-machineinstrs-aarch64-globalisel-O0-g/compiler/bin/clang++  -DNDEBUG  -B /Applications/Xcode.app/Contents/Developer/Toolchains/XcodeDefault.xctoolchain/usr/bin    -Wno-unused-command-line-argument -mllvm -verify-machineinstrs -O0 -g -arch arm64 -isysroot /Applications/Xcode.app/Contents/Developer/Platforms/iPhoneOS.platform/Developer/SDKs/iPhoneOS13.5.sdk   -w -Werror=date-time -MD -MT Bitcode/simd_ops/CMakeFiles/simd_ops_test_op_smlal_1154.dir/AArch64_halide_runtime.bc.o -MF Bitcode/simd_ops/CMakeFiles/simd_ops_test_op_smlal_1154.dir/AArch64_halide_runtime.bc.o.d -o Bitcode/simd_ops/CMakeFiles/simd_ops_test_op_smlal_1154.dir/AArch64_halide_runtime.bc.o -c /Users/buildslave/jenkins/workspace/test-suite-verify-machineinstrs-aarch64-globalisel-O0-g/test-suite/Bitcode/simd_ops/AArch64_halide_runtime.bc
Assertion failed: (NumOperands == (isCopyLike(MI) ? 1 : MI.getNumOperands()) && "NumOperands must match, see constructor"), function verify, file /Users/buildslave/jenkins/workspace/clang-stage1-RA/llvm-project/llvm/lib/CodeGen/GlobalISel/RegisterBankInfo.cpp, line 602.
assertion: NumOperands == (isCopyLike(MI) ? 1 : MI.getNumOperands()) && "NumOperands must match, see constructor"
[1480/11531] /Users/buildslave/jenkins/workspace/test-suite-verify-machineinstrs-aarch64-globalisel-O0-g/test-suite-build/tools/timeit --summary Bitcode/simd_ops/CMakeFiles/simd_ops_test_op_cmhi_77.dir/AArch64_tests/test_op_cmhi_77.bc.o.time /Users/buildslave/jenkins/workspace/test-suite-verify-machineinstrs-aarch64-globalisel-O0-g/compiler/bin/clang++  -DNDEBUG  -B /Applications/Xcode.app/Contents/Developer/Toolchains/XcodeDefault.xctoolchain/usr/bin    -Wno-unused-command-line-argument -mllvm -verify-machineinstrs -O0 -g -arch arm64 -isysroot /Applications/Xcode.app/Contents/Developer/Platforms/iPhoneOS.platform/Developer/SDKs/iPhoneOS13.5.sdk   -w -Werror=date-time -MD -MT Bitcode/simd_ops/CMakeFiles/simd_ops_test_op_cmhi_77.dir/AArch64_tests/test_op_cmhi_77.bc.o -MF Bitcode/simd_ops/CMakeFiles/simd_ops_test_op_cmhi_77.dir/AArch64_tests/test_op_cmhi_77.bc.o.d -o Bitcode/simd_ops/CMakeFiles/simd_ops_test_op_cmhi_77.dir/AArch64_tests/test_op_cmhi_77.bc.o -c /Users/buildslave/jenkins/workspace/test-suite-verify-machineinstrs-aarch64-globalisel-O0-g/test-suite/Bitcode/simd_ops/AArch64_tests/test_op_cmhi_77.bc
[1481/11531] /Users/buildslave/jenkins/workspace/test-suite-verify-machineinstrs-aarch64-globalisel-O0-g/test-suite-build/tools/timeit --summary Bitcode/simd_ops/CMakeFiles/simd_ops_test_op_cmhi_77.dir/AArch64_scalar_tests/scalar_test_op_cmhi_77.bc.o.time /Users/buildslave/jenkins/workspace/test-suite-verify-machineinstrs-aarch64-globalisel-O0-g/compiler/bin/clang++  -DNDEBUG  -B /Applications/Xcode.app/Contents/Developer/Toolchains/XcodeDefault.xctoolchain/usr/bin    -Wno-unused-command-line-argument -mllvm -verify-machineinstrs -O0 -g -arch arm64 -isysroot /Applications/Xcode.app/Contents/Developer/Platforms/iPhoneOS.platform/Developer/SDKs/iPhoneOS13.5.sdk   -w -Werror=date-time -MD -MT Bitcode/simd_ops/CMakeFiles/simd_ops_test_op_cmhi_77.dir/AArch64_scalar_tests/scalar_test_op_cmhi_77.bc.o -MF Bitcode/simd_ops/CMakeFiles/simd_ops_test_op_cmhi_77.dir/AArch64_scalar_tests/scalar_test_op_cmhi_77.bc.o.d -o Bitcode/simd_ops/CMakeFiles/simd_ops_test_op_cmhi_77.dir/AArch64_scalar_tests/scalar_test_op_cmhi_77.bc.o -c /Users/buildslave/jenkins/workspace/test-suite-verify-machineinstrs-aarch64-globalisel-O0-g/test-suite/Bitcode/simd_ops/AArch64_scalar_tests/scalar_test_op_cmhi_77.bc
[1482/11531] /Users/buildslave/jenkins/workspace/test-suite-verify-machineinstrs-aarch64-globalisel-O0-g/test-suite-build/tools/timeit --summary Bitcode/simd_ops/CMakeFiles/simd_ops_test_op_smlal_1154.dir/AArch64_halide_runtime.bc.o.time /Users/buildslave/jenkins/workspace/test-suite-verify-machineinstrs-aarch64-globalisel-O0-g/compiler/bin/clang++  -DNDEBUG  -B /Applications/Xcode.app/Contents/Developer/Toolchains/XcodeDefault.xctoolchain/usr/bin    -Wno-unused-command-line-argument -mllvm -verify-machineinstrs -O0 -g -arch arm64 -isysroot /Applications/Xcode.app/Contents/Developer/Platforms/iPhoneOS.platform/Developer/SDKs/iPhoneOS13.5.sdk   -w -Werror=date-time -MD -MT Bitcode/simd_ops/CMakeFiles/simd_ops_test_op_smlal_1154.dir/AArch64_halide_runtime.bc.o -MF Bitcode/simd_ops/CMakeFiles/simd_ops_test_op_smlal_1154.dir/AArch64_halide_runtime.bc.o.d -o Bitcode/simd_ops/CMakeFiles/simd_ops_test_op_smlal_1154.dir/AArch64_halide_runtime.bc.o -c /Users/buildslave/jenkins/workspace/test-suite-verify-machineinstrs-aarch64-globalisel-O0-g/test-suite/Bitcode/simd_ops/AArch64_halide_runtime.bc
FAILED: Bitcode/simd_ops/CMakeFiles/simd_ops_test_op_smlal_1154.dir/AArch64_halide_runtime.bc.o 
/Users/buildslave/jenkins/workspace/test-suite-verify-machineinstrs-aarch64-globalisel-O0-g/test-suite-build/tools/timeit --summary Bitcode/simd_ops/CMakeFiles/simd_ops_test_op_smlal_1154.dir/AArch64_halide_runtime.bc.o.time /Users/buildslave/jenkins/workspace/test-suite-verify-machineinstrs-aarch64-globalisel-O0-g/compiler/bin/clang++  -DNDEBUG  -B /Applications/Xcode.app/Contents/Developer/Toolchains/XcodeDefault.xctoolchain/usr/bin    -Wno-unused-command-line-argument -mllvm -verify-machineinstrs -O0 -g -arch arm64 -isysroot /Applications/Xcode.app/Contents/Developer/Platforms/iPhoneOS.platform/Developer/SDKs/iPhoneOS13.5.sdk   -w -Werror=date-time -MD -MT Bitcode/simd_ops/CMakeFiles/simd_ops_test_op_smlal_1154.dir/AArch64_halide_runtime.bc.o -MF Bitcode/simd_ops/CMakeFiles/simd_ops_test_op_smlal_1154.dir/AArch64_halide_runtime.bc.o.d -o Bitcode/simd_ops/CMakeFiles/simd_ops_test_op_smlal_1154.dir/AArch64_halide_runtime.bc.o -c /Users/buildslave/jenkins/workspace/test-suite-verify-machineinstrs-aarch64-globalisel-O0-g/test-suite/Bitcode/simd_ops/AArch64_halide_runtime.bc
Assertion failed: (NumOperands == (isCopyLike(MI) ? 1 : MI.getNumOperands()) && "NumOperands must match, see constructor"), function verify, file /Users/buildslave/jenkins/workspace/clang-stage1-RA/llvm-project/llvm/lib/CodeGen/GlobalISel/RegisterBankInfo.cpp, line 602.
PLEASE submit a bug report to https://bugs.llvm.org/ and include the crash backtrace, preprocessed source, and associated run script.
Stack dump:
Error: clang frontend command failed with exit code 134 (use -v to see invocation)
27 clang++                  0x000000010dca95ad clang::driver::Compilation::ExecuteCommand(clang::driver::Command const&, clang::driver::Command const*&) const + 221
28 clang++                  0x000000010dca99cd clang::driver::Compilation::ExecuteJobs(clang::driver::JobList const&, llvm::SmallVectorImpl<std::__1::pair<int, clang::driver::Command const*> >&) const + 125
29 clang++                  0x000000010dcbe38c clang::driver::Driver::ExecuteCompilation(clang::driver::Compilation&, llvm::SmallVectorImpl<std::__1::pair<int, clang::driver::Command const*> >&) + 204
30 clang++                  0x000000010b76bfa3 main + 10515
31 libdyld.dylib            0x00007fff6a900cc9 start + 1
clang-12: error: clang frontend command failed with exit code 134 (use -v to see invocation)
clang version 12.0.0 (https://github.com/llvm/llvm-project.git 196c097bba8b0b3932f3fcdcd5310f78ebaa43a3)
Target: aarch64-apple-darwin19.5.0

Build Log

Changes
  1. Re-land "[PDB] Merge types in parallel when using ghashing" (details)
  2. [flang] Semantic analysis for FINAL subroutines (details)
  3. [OpenMP][libomptarget] make omp_get_initial_device 5.1 compliant (details)
  4. [OpenMP][OMPT] Update OMPT tests for newly added GOMP interface patches (details)
  5. Handle unknown OSes in DarwinTargetInfo::getExnObjectAlignment (details)
  6. [PowerPC] Add outer product instructions for MMA (details)
  7. Patch IEEEFloat::isSignificandAllZeros and IEEEFloat::isSignificandAllOnes (bug 34579) (details)
  8. [OpenMP][libarcher] Allow all possible argument separators in TSAN_OPTIONS (details)
  9. [ARM] Add missing target for Arm neon test case. (details)
  10. [AArch64][GlobalISel] NFC: Refactor G_FCMP selection code (details)
  11. [lldb] Make TestGuiBasicDebug more lenient (details)
  12. [flang] Allow record advancement in external formatted sequential READ (details)
  13. [AArch64][GlobalISel] Add some more legal types for G_PHI, G_IMPLICIT_DEF, G_FREEZE. (details)
  14. [WholeProgramDevirt][NewPM] Add NPM testing path to match legacy pass (details)
  15. Try to fix build. May have used a C++ feature too new/not supported on all platforms. (details)
  16. [lld][WebAssembly] Allow exporting of mutable globals (details)
  17. Remove `Ops` suffix from dialect library names (details)
  18. [flang] Fix Gw.d format output (details)
  19. [mlir] Split Dialect::addOperations into two functions (details)
  20. [AArch64][GlobalISel] Clamp oversize FP arithmetic vectors. (details)

Started by upstream project relay-test-suite-verify-machineinstrs build number 9076
originally caused by:

This run spent:

  • 1 hr 51 min waiting;
  • 2 hr 8 min build duration;
  • 2 hr 8 min total from scheduled to completion.
Revision: c2cc01b14ef84bee845318bde3ae623091934b96
  • refs/remotes/origin/master
Revision: 196c097bba8b0b3932f3fcdcd5310f78ebaa43a3
  • detached
Revision: 61eaf8a9eccf4edbef18f55593d1095254ed3ff5
  • refs/remotes/origin/master
Revision: 87d67af9d8565d068b6706c081b7ae07addcb882
  • refs/remotes/origin/master

Identified problems

Compile Error

This build failed because of a compile error. Below is a list of all errors in the build log:
Indication 1

Assertion failure

This build failed because of an assertion failure. Below is a list of all errors in the build log:
Indication 2

Ninja target failed

Below is a link to the first failed ninja target.
Indication 3