Started 1 mo 23 days ago
Took 2 hr 3 min

Failed Build clang-d327275-g8a12e40185c-t2053-b2053.tar.gz (Sep 19, 2019 3:59:13 AM)

Issues

Found 3 issues:
Ninja target: health.c.o
[2868/4714] /Users/buildslave/jenkins/workspace/test-suite-verify-machineinstrs-x86_64-O3/test-suite-build/tools/timeit --summary MultiSource/Benchmarks/Olden/health/CMakeFiles/health.dir/poisson.c.o.time /Users/buildslave/jenkins/workspace/test-suite-verify-machineinstrs-x86_64-O3/compiler/bin/clang -DNDEBUG  -B /Applications/Xcode.app/Contents/Developer/Toolchains/XcodeDefault.xctoolchain/usr/bin    -Wno-unused-command-line-argument -mllvm -verify-machineinstrs -O3 -arch x86_64 -isysroot /Applications/Xcode.app/Contents/Developer/Platforms/MacOSX.platform/Developer/SDKs/MacOSX10.14.sdk   -w -Werror=date-time -DTORONTO -MD -MT MultiSource/Benchmarks/Olden/health/CMakeFiles/health.dir/poisson.c.o -MF MultiSource/Benchmarks/Olden/health/CMakeFiles/health.dir/poisson.c.o.d -o MultiSource/Benchmarks/Olden/health/CMakeFiles/health.dir/poisson.c.o   -c /Users/buildslave/jenkins/workspace/test-suite-verify-machineinstrs-x86_64-O3/test-suite/MultiSource/Benchmarks/Olden/health/poisson.c
[2869/4714] /Users/buildslave/jenkins/workspace/test-suite-verify-machineinstrs-x86_64-O3/test-suite-build/tools/timeit --summary MultiSource/Benchmarks/Olden/mst/CMakeFiles/mst.dir/args.c.o.time /Users/buildslave/jenkins/workspace/test-suite-verify-machineinstrs-x86_64-O3/compiler/bin/clang -DNDEBUG  -B /Applications/Xcode.app/Contents/Developer/Toolchains/XcodeDefault.xctoolchain/usr/bin    -Wno-unused-command-line-argument -mllvm -verify-machineinstrs -O3 -arch x86_64 -isysroot /Applications/Xcode.app/Contents/Developer/Platforms/MacOSX.platform/Developer/SDKs/MacOSX10.14.sdk   -w -Werror=date-time -DTORONTO -MD -MT MultiSource/Benchmarks/Olden/mst/CMakeFiles/mst.dir/args.c.o -MF MultiSource/Benchmarks/Olden/mst/CMakeFiles/mst.dir/args.c.o.d -o MultiSource/Benchmarks/Olden/mst/CMakeFiles/mst.dir/args.c.o   -c /Users/buildslave/jenkins/workspace/test-suite-verify-machineinstrs-x86_64-O3/test-suite/MultiSource/Benchmarks/Olden/mst/args.c
[2870/4714] /Users/buildslave/jenkins/workspace/test-suite-verify-machineinstrs-x86_64-O3/test-suite-build/tools/timeit --summary MultiSource/Benchmarks/Olden/em3d/CMakeFiles/em3d.dir/make_graph.c.o.time /Users/buildslave/jenkins/workspace/test-suite-verify-machineinstrs-x86_64-O3/compiler/bin/clang -DNDEBUG  -B /Applications/Xcode.app/Contents/Developer/Toolchains/XcodeDefault.xctoolchain/usr/bin    -Wno-unused-command-line-argument -mllvm -verify-machineinstrs -O3 -arch x86_64 -isysroot /Applications/Xcode.app/Contents/Developer/Platforms/MacOSX.platform/Developer/SDKs/MacOSX10.14.sdk   -w -Werror=date-time -DTORONTO -MD -MT MultiSource/Benchmarks/Olden/em3d/CMakeFiles/em3d.dir/make_graph.c.o -MF MultiSource/Benchmarks/Olden/em3d/CMakeFiles/em3d.dir/make_graph.c.o.d -o MultiSource/Benchmarks/Olden/em3d/CMakeFiles/em3d.dir/make_graph.c.o   -c /Users/buildslave/jenkins/workspace/test-suite-verify-machineinstrs-x86_64-O3/test-suite/MultiSource/Benchmarks/Olden/em3d/make_graph.c
[2871/4714] /Users/buildslave/jenkins/workspace/test-suite-verify-machineinstrs-x86_64-O3/test-suite-build/tools/timeit --summary MultiSource/Benchmarks/Olden/bh/CMakeFiles/bh.dir/newbh.c.o.time /Users/buildslave/jenkins/workspace/test-suite-verify-machineinstrs-x86_64-O3/compiler/bin/clang -DNDEBUG  -B /Applications/Xcode.app/Contents/Developer/Toolchains/XcodeDefault.xctoolchain/usr/bin    -Wno-unused-command-line-argument -mllvm -verify-machineinstrs -O3 -arch x86_64 -isysroot /Applications/Xcode.app/Contents/Developer/Platforms/MacOSX.platform/Developer/SDKs/MacOSX10.14.sdk   -w -Werror=date-time -DTORONTO -MD -MT MultiSource/Benchmarks/Olden/bh/CMakeFiles/bh.dir/newbh.c.o -MF MultiSource/Benchmarks/Olden/bh/CMakeFiles/bh.dir/newbh.c.o.d -o MultiSource/Benchmarks/Olden/bh/CMakeFiles/bh.dir/newbh.c.o   -c /Users/buildslave/jenkins/workspace/test-suite-verify-machineinstrs-x86_64-O3/test-suite/MultiSource/Benchmarks/Olden/bh/newbh.c
[2872/4714] /Users/buildslave/jenkins/workspace/test-suite-verify-machineinstrs-x86_64-O3/test-suite-build/tools/timeit --summary MultiSource/Benchmarks/Olden/health/CMakeFiles/health.dir/health.c.o.time /Users/buildslave/jenkins/workspace/test-suite-verify-machineinstrs-x86_64-O3/compiler/bin/clang -DNDEBUG  -B /Applications/Xcode.app/Contents/Developer/Toolchains/XcodeDefault.xctoolchain/usr/bin    -Wno-unused-command-line-argument -mllvm -verify-machineinstrs -O3 -arch x86_64 -isysroot /Applications/Xcode.app/Contents/Developer/Platforms/MacOSX.platform/Developer/SDKs/MacOSX10.14.sdk   -w -Werror=date-time -DTORONTO -MD -MT MultiSource/Benchmarks/Olden/health/CMakeFiles/health.dir/health.c.o -MF MultiSource/Benchmarks/Olden/health/CMakeFiles/health.dir/health.c.o.d -o MultiSource/Benchmarks/Olden/health/CMakeFiles/health.dir/health.c.o   -c /Users/buildslave/jenkins/workspace/test-suite-verify-machineinstrs-x86_64-O3/test-suite/MultiSource/Benchmarks/Olden/health/health.c
FAILED: MultiSource/Benchmarks/Olden/health/CMakeFiles/health.dir/health.c.o 
/Users/buildslave/jenkins/workspace/test-suite-verify-machineinstrs-x86_64-O3/test-suite-build/tools/timeit --summary MultiSource/Benchmarks/Olden/health/CMakeFiles/health.dir/health.c.o.time /Users/buildslave/jenkins/workspace/test-suite-verify-machineinstrs-x86_64-O3/compiler/bin/clang -DNDEBUG  -B /Applications/Xcode.app/Contents/Developer/Toolchains/XcodeDefault.xctoolchain/usr/bin    -Wno-unused-command-line-argument -mllvm -verify-machineinstrs -O3 -arch x86_64 -isysroot /Applications/Xcode.app/Contents/Developer/Platforms/MacOSX.platform/Developer/SDKs/MacOSX10.14.sdk   -w -Werror=date-time -DTORONTO -MD -MT MultiSource/Benchmarks/Olden/health/CMakeFiles/health.dir/health.c.o -MF MultiSource/Benchmarks/Olden/health/CMakeFiles/health.dir/health.c.o.d -o MultiSource/Benchmarks/Olden/health/CMakeFiles/health.dir/health.c.o   -c /Users/buildslave/jenkins/workspace/test-suite-verify-machineinstrs-x86_64-O3/test-suite/MultiSource/Benchmarks/Olden/health/health.c
fatal error: error in backend: Cannot select: t80: v4f32 = X86ISD::BLENDI t75, t78, Constant:i8<1>
Fatal Error: error in backend: Cannot select: t80: v4f32 = X86ISD::BLENDI t75, t78, Constant:i8<1>
[2870/4714] /Users/buildslave/jenkins/workspace/test-suite-verify-machineinstrs-x86_64-O3/test-suite-build/tools/timeit --summary MultiSource/Benchmarks/Olden/em3d/CMakeFiles/em3d.dir/make_graph.c.o.time /Users/buildslave/jenkins/workspace/test-suite-verify-machineinstrs-x86_64-O3/compiler/bin/clang -DNDEBUG  -B /Applications/Xcode.app/Contents/Developer/Toolchains/XcodeDefault.xctoolchain/usr/bin    -Wno-unused-command-line-argument -mllvm -verify-machineinstrs -O3 -arch x86_64 -isysroot /Applications/Xcode.app/Contents/Developer/Platforms/MacOSX.platform/Developer/SDKs/MacOSX10.14.sdk   -w -Werror=date-time -DTORONTO -MD -MT MultiSource/Benchmarks/Olden/em3d/CMakeFiles/em3d.dir/make_graph.c.o -MF MultiSource/Benchmarks/Olden/em3d/CMakeFiles/em3d.dir/make_graph.c.o.d -o MultiSource/Benchmarks/Olden/em3d/CMakeFiles/em3d.dir/make_graph.c.o   -c /Users/buildslave/jenkins/workspace/test-suite-verify-machineinstrs-x86_64-O3/test-suite/MultiSource/Benchmarks/Olden/em3d/make_graph.c
[2871/4714] /Users/buildslave/jenkins/workspace/test-suite-verify-machineinstrs-x86_64-O3/test-suite-build/tools/timeit --summary MultiSource/Benchmarks/Olden/bh/CMakeFiles/bh.dir/newbh.c.o.time /Users/buildslave/jenkins/workspace/test-suite-verify-machineinstrs-x86_64-O3/compiler/bin/clang -DNDEBUG  -B /Applications/Xcode.app/Contents/Developer/Toolchains/XcodeDefault.xctoolchain/usr/bin    -Wno-unused-command-line-argument -mllvm -verify-machineinstrs -O3 -arch x86_64 -isysroot /Applications/Xcode.app/Contents/Developer/Platforms/MacOSX.platform/Developer/SDKs/MacOSX10.14.sdk   -w -Werror=date-time -DTORONTO -MD -MT MultiSource/Benchmarks/Olden/bh/CMakeFiles/bh.dir/newbh.c.o -MF MultiSource/Benchmarks/Olden/bh/CMakeFiles/bh.dir/newbh.c.o.d -o MultiSource/Benchmarks/Olden/bh/CMakeFiles/bh.dir/newbh.c.o   -c /Users/buildslave/jenkins/workspace/test-suite-verify-machineinstrs-x86_64-O3/test-suite/MultiSource/Benchmarks/Olden/bh/newbh.c
[2872/4714] /Users/buildslave/jenkins/workspace/test-suite-verify-machineinstrs-x86_64-O3/test-suite-build/tools/timeit --summary MultiSource/Benchmarks/Olden/health/CMakeFiles/health.dir/health.c.o.time /Users/buildslave/jenkins/workspace/test-suite-verify-machineinstrs-x86_64-O3/compiler/bin/clang -DNDEBUG  -B /Applications/Xcode.app/Contents/Developer/Toolchains/XcodeDefault.xctoolchain/usr/bin    -Wno-unused-command-line-argument -mllvm -verify-machineinstrs -O3 -arch x86_64 -isysroot /Applications/Xcode.app/Contents/Developer/Platforms/MacOSX.platform/Developer/SDKs/MacOSX10.14.sdk   -w -Werror=date-time -DTORONTO -MD -MT MultiSource/Benchmarks/Olden/health/CMakeFiles/health.dir/health.c.o -MF MultiSource/Benchmarks/Olden/health/CMakeFiles/health.dir/health.c.o.d -o MultiSource/Benchmarks/Olden/health/CMakeFiles/health.dir/health.c.o   -c /Users/buildslave/jenkins/workspace/test-suite-verify-machineinstrs-x86_64-O3/test-suite/MultiSource/Benchmarks/Olden/health/health.c
FAILED: MultiSource/Benchmarks/Olden/health/CMakeFiles/health.dir/health.c.o 
/Users/buildslave/jenkins/workspace/test-suite-verify-machineinstrs-x86_64-O3/test-suite-build/tools/timeit --summary MultiSource/Benchmarks/Olden/health/CMakeFiles/health.dir/health.c.o.time /Users/buildslave/jenkins/workspace/test-suite-verify-machineinstrs-x86_64-O3/compiler/bin/clang -DNDEBUG  -B /Applications/Xcode.app/Contents/Developer/Toolchains/XcodeDefault.xctoolchain/usr/bin    -Wno-unused-command-line-argument -mllvm -verify-machineinstrs -O3 -arch x86_64 -isysroot /Applications/Xcode.app/Contents/Developer/Platforms/MacOSX.platform/Developer/SDKs/MacOSX10.14.sdk   -w -Werror=date-time -DTORONTO -MD -MT MultiSource/Benchmarks/Olden/health/CMakeFiles/health.dir/health.c.o -MF MultiSource/Benchmarks/Olden/health/CMakeFiles/health.dir/health.c.o.d -o MultiSource/Benchmarks/Olden/health/CMakeFiles/health.dir/health.c.o   -c /Users/buildslave/jenkins/workspace/test-suite-verify-machineinstrs-x86_64-O3/test-suite/MultiSource/Benchmarks/Olden/health/health.c
fatal error: error in backend: Cannot select: t80: v4f32 = X86ISD::BLENDI t75, t78, Constant:i8<1>
  t75: v4f32,ch = load<(load 16 from constant-pool)> t0, t74, undef:i64
    t74: i64 = X86ISD::WrapperRIP TargetConstantPool:i64<<4 x float> <float undef, float 1.000000e+00, float undef, float undef>> 0
Error: clang frontend command failed with exit code 70 (use -v to see invocation)
            t6: i64 = undef
          t15: i64 = Constant<4>
        t6: i64 = undef
  t79: i8 = Constant<1>
In function: get_results
clang-10: error: clang frontend command failed with exit code 70 (use -v to see invocation)
clang version 10.0.0 (https://github.com/llvm/llvm-project.git 8a12e40185cd0ce7031e6abab4af12e6fc923110)
Target: x86_64-apple-darwin18.0.0

Build Log

Changes
  1. [TestCommit] Trivial change to test commit access. (detail)
  2. [TestCommit] Trivial change to test commit access. (detail)

Started by upstream project relay-test-suite-verify-machineinstrs build number 6236
originally caused by:

This run spent:

  • 27 sec waiting;
  • 2 hr 3 min build duration;
  • 2 hr 3 min total from scheduled to completion.
Revision: 8a12e40185cd0ce7031e6abab4af12e6fc923110
  • detached

Identified problems

Ninja target failed

Below is a link to the first failed ninja target.
Indication 1

Compile Error

This build failed because of a compile error. Below is a list of all errors in the build log:
Indication 2