Started 6 days 3 hr ago
Took 22 min

Failed Build clang-d358856-g05c479491c1-t12019-b12019.tar.gz (Jun 30, 2020 7:04:17 AM)

Issues

Found 2 issues:
Ninja target: mytimer.cpp.o [667/7668] /Users/buildslave/jenkins/workspace/test-suite-verify-machineinstrs-x86_64-O3/test-suite-build/tools/timeit --summary MicroBenchmarks/libs/benchmark-1.3.0/test/CMakeFiles/benchmark_test.dir/benchmark_test.cc.o.time /Users/buildslave/jenkins/workspace/test-suite-verify-machineinstrs-x86_64-O3/compiler/bin/clang++ -DHAVE_POSIX_REGEX -DHAVE_STD_REGEX -DHAVE_STEADY_CLOCK -DNDEBUG -DTEST_BENCHMARK_LIBRARY_HAS_NO_ASSERTIONS -I/Users/buildslave/jenkins/workspace/test-suite-verify-machineinstrs-x86_64-O3/test-suite/MicroBenchmarks/libs/benchmark-1.3.0/include -I/Users/buildslave/jenkins/workspace/test-suite-verify-machineinstrs-x86_64-O3/test-suite/MicroBenchmarks/libs/benchmark-1.3.0/src/../include -B /Applications/Xcode.app/Contents/Developer/Toolchains/XcodeDefault.xctoolchain/usr/bin -std=c++11 -Wall -Wextra -Wshadow -pedantic -pedantic-errors -Wshorten-64-to-32 -Wfloat-equal -fstrict-aliasing -Wzero-as-null-pointer-constant -Wstrict-aliasing -Wthread-safety -Wno-unused-command-line-argument -mllvm -verify-machineinstrs -O3 -Werror -arch x86_64 -isysroot /Applications/Xcode.app/Contents/Developer/Platforms/MacOSX.platform/Developer/SDKs/MacOSX10.15.sdk -w -Werror=date-time -UNDEBUG -std=gnu++11 -MD -MT MicroBenchmarks/libs/benchmark-1.3.0/test/CMakeFiles/benchmark_test.dir/benchmark_test.cc.o -MF MicroBenchmarks/libs/benchmark-1.3.0/test/CMakeFiles/benchmark_test.dir/benchmark_test.cc.o.d -o MicroBenchmarks/libs/benchmark-1.3.0/test/CMakeFiles/benchmark_test.dir/benchmark_test.cc.o -c /Users/buildslave/jenkins/workspace/test-suite-verify-machineinstrs-x86_64-O3/test-suite/MicroBenchmarks/libs/benchmark-1.3.0/test/benchmark_test.cc [668/7668] : && /Users/buildslave/jenkins/workspace/test-suite-verify-machineinstrs-x86_64-O3/test-suite-build/tools/timeit --summary MicroBenchmarks/libs/benchmark-1.3.0/test/benchmark_test.link.time /Users/buildslave/jenkins/workspace/test-suite-verify-machineinstrs-x86_64-O3/compiler/bin/clang++ -B /Applications/Xcode.app/Contents/Developer/Toolchains/XcodeDefault.xctoolchain/usr/bin -std=c++11 -Wall -Wextra -Wshadow -pedantic -pedantic-errors -Wshorten-64-to-32 -Wfloat-equal -fstrict-aliasing -Wzero-as-null-pointer-constant -Wstrict-aliasing -Wthread-safety -Wno-unused-command-line-argument -mllvm -verify-machineinstrs -O3 -Werror -arch x86_64 -isysroot /Applications/Xcode.app/Contents/Developer/Platforms/MacOSX.platform/Developer/SDKs/MacOSX10.15.sdk -Wl,-search_paths_first -Wl,-headerpad_max_install_names -B /Applications/Xcode.app/Contents/Developer/Toolchains/XcodeDefault.xctoolchain/usr/bin MicroBenchmarks/libs/benchmark-1.3.0/test/CMakeFiles/benchmark_test.dir/benchmark_test.cc.o -o MicroBenchmarks/libs/benchmark-1.3.0/test/benchmark_test MicroBenchmarks/libs/benchmark-1.3.0/src/libbenchmark.a && : [669/7668] /Users/buildslave/jenkins/workspace/test-suite-verify-machineinstrs-x86_64-O3/test-suite-build/tools/timeit --summary MultiSource/Benchmarks/DOE-ProxyApps-C++/miniFE/CMakeFiles/miniFE.dir/YAML_Doc.cpp.o.time /Users/buildslave/jenkins/workspace/test-suite-verify-machineinstrs-x86_64-O3/compiler/bin/clang++ -DNDEBUG -I/Users/buildslave/jenkins/workspace/test-suite-verify-machineinstrs-x86_64-O3/test-suite/MultiSource/Benchmarks/DOE-ProxyApps-C++/miniFE -B /Applications/Xcode.app/Contents/Developer/Toolchains/XcodeDefault.xctoolchain/usr/bin -Wno-unused-command-line-argument -mllvm -verify-machineinstrs -O3 -arch x86_64 -isysroot /Applications/Xcode.app/Contents/Developer/Platforms/MacOSX.platform/Developer/SDKs/MacOSX10.15.sdk -w -Werror=date-time -I. -DMINIFE_SCALAR=double -DMINIFE_LOCAL_ORDINAL=int -DMINIFE_GLOBAL_ORDINAL=int -DMINIFE_CSR_MATRIX -DREDSTORM -D_XOPEN_SOURCE=700 -MD -MT MultiSource/Benchmarks/DOE-ProxyApps-C++/miniFE/CMakeFiles/miniFE.dir/YAML_Doc.cpp.o -MF MultiSource/Benchmarks/DOE-ProxyApps-C++/miniFE/CMakeFiles/miniFE.dir/YAML_Doc.cpp.o.d -o MultiSource/Benchmarks/DOE-ProxyApps-C++/miniFE/CMakeFiles/miniFE.dir/YAML_Doc.cpp.o -c /Users/buildslave/jenkins/workspace/test-suite-verify-machineinstrs-x86_64-O3/test-suite/MultiSource/Benchmarks/DOE-ProxyApps-C++/miniFE/YAML_Doc.cpp [670/7668] /Users/buildslave/jenkins/workspace/test-suite-verify-machineinstrs-x86_64-O3/test-suite-build/tools/timeit --summary MultiSource/Benchmarks/DOE-ProxyApps-C++/miniFE/CMakeFiles/miniFE.dir/YAML_Element.cpp.o.time /Users/buildslave/jenkins/workspace/test-suite-verify-machineinstrs-x86_64-O3/compiler/bin/clang++ -DNDEBUG -I/Users/buildslave/jenkins/workspace/test-suite-verify-machineinstrs-x86_64-O3/test-suite/MultiSource/Benchmarks/DOE-ProxyApps-C++/miniFE -B /Applications/Xcode.app/Contents/Developer/Toolchains/XcodeDefault.xctoolchain/usr/bin -Wno-unused-command-line-argument -mllvm -verify-machineinstrs -O3 -arch x86_64 -isysroot /Applications/Xcode.app/Contents/Developer/Platforms/MacOSX.platform/Developer/SDKs/MacOSX10.15.sdk -w -Werror=date-time -I. -DMINIFE_SCALAR=double -DMINIFE_LOCAL_ORDINAL=int -DMINIFE_GLOBAL_ORDINAL=int -DMINIFE_CSR_MATRIX -DREDSTORM -D_XOPEN_SOURCE=700 -MD -MT MultiSource/Benchmarks/DOE-ProxyApps-C++/miniFE/CMakeFiles/miniFE.dir/YAML_Element.cpp.o -MF MultiSource/Benchmarks/DOE-ProxyApps-C++/miniFE/CMakeFiles/miniFE.dir/YAML_Element.cpp.o.d -o MultiSource/Benchmarks/DOE-ProxyApps-C++/miniFE/CMakeFiles/miniFE.dir/YAML_Element.cpp.o -c /Users/buildslave/jenkins/workspace/test-suite-verify-machineinstrs-x86_64-O3/test-suite/MultiSource/Benchmarks/DOE-ProxyApps-C++/miniFE/YAML_Element.cpp [671/7668] /Users/buildslave/jenkins/workspace/test-suite-verify-machineinstrs-x86_64-O3/test-suite-build/tools/timeit --summary MultiSource/Benchmarks/DOE-ProxyApps-C++/miniFE/CMakeFiles/miniFE.dir/mytimer.cpp.o.time /Users/buildslave/jenkins/workspace/test-suite-verify-machineinstrs-x86_64-O3/compiler/bin/clang++ -DNDEBUG -I/Users/buildslave/jenkins/workspace/test-suite-verify-machineinstrs-x86_64-O3/test-suite/MultiSource/Benchmarks/DOE-ProxyApps-C++/miniFE -B /Applications/Xcode.app/Contents/Developer/Toolchains/XcodeDefault.xctoolchain/usr/bin -Wno-unused-command-line-argument -mllvm -verify-machineinstrs -O3 -arch x86_64 -isysroot /Applications/Xcode.app/Contents/Developer/Platforms/MacOSX.platform/Developer/SDKs/MacOSX10.15.sdk -w -Werror=date-time -I. -DMINIFE_SCALAR=double -DMINIFE_LOCAL_ORDINAL=int -DMINIFE_GLOBAL_ORDINAL=int -DMINIFE_CSR_MATRIX -DREDSTORM -D_XOPEN_SOURCE=700 -MD -MT MultiSource/Benchmarks/DOE-ProxyApps-C++/miniFE/CMakeFiles/miniFE.dir/mytimer.cpp.o -MF MultiSource/Benchmarks/DOE-ProxyApps-C++/miniFE/CMakeFiles/miniFE.dir/mytimer.cpp.o.d -o MultiSource/Benchmarks/DOE-ProxyApps-C++/miniFE/CMakeFiles/miniFE.dir/mytimer.cpp.o -c /Users/buildslave/jenkins/workspace/test-suite-verify-machineinstrs-x86_64-O3/test-suite/MultiSource/Benchmarks/DOE-ProxyApps-C++/miniFE/mytimer.cpp FAILED: MultiSource/Benchmarks/DOE-ProxyApps-C++/miniFE/CMakeFiles/miniFE.dir/mytimer.cpp.o /Users/buildslave/jenkins/workspace/test-suite-verify-machineinstrs-x86_64-O3/test-suite-build/tools/timeit --summary MultiSource/Benchmarks/DOE-ProxyApps-C++/miniFE/CMakeFiles/miniFE.dir/mytimer.cpp.o.time /Users/buildslave/jenkins/workspace/test-suite-verify-machineinstrs-x86_64-O3/compiler/bin/clang++ -DNDEBUG -I/Users/buildslave/jenkins/workspace/test-suite-verify-machineinstrs-x86_64-O3/test-suite/MultiSource/Benchmarks/DOE-ProxyApps-C++/miniFE -B /Applications/Xcode.app/Contents/Developer/Toolchains/XcodeDefault.xctoolchain/usr/bin -Wno-unused-command-line-argument -mllvm -verify-machineinstrs -O3 -arch x86_64 -isysroot /Applications/Xcode.app/Contents/Developer/Platforms/MacOSX.platform/Developer/SDKs/MacOSX10.15.sdk -w -Werror=date-time -I. -DMINIFE_SCALAR=double -DMINIFE_LOCAL_ORDINAL=int -DMINIFE_GLOBAL_ORDINAL=int -DMINIFE_CSR_MATRIX -DREDSTORM -D_XOPEN_SOURCE=700 -MD -MT MultiSource/Benchmarks/DOE-ProxyApps-C++/miniFE/CMakeFiles/miniFE.dir/mytimer.cpp.o -MF MultiSource/Benchmarks/DOE-ProxyApps-C++/miniFE/CMakeFiles/miniFE.dir/mytimer.cpp.o.d -o MultiSource/Benchmarks/DOE-ProxyApps-C++/miniFE/CMakeFiles/miniFE.dir/mytimer.cpp.o -c /Users/buildslave/jenkins/workspace/test-suite-verify-machineinstrs-x86_64-O3/test-suite/MultiSource/Benchmarks/DOE-ProxyApps-C++/miniFE/mytimer.cpp /Users/buildslave/jenkins/workspace/test-suite-verify-machineinstrs-x86_64-O3/test-suite/MultiSource/Benchmarks/DOE-ProxyApps-C++/miniFE/mytimer.cpp:116:19: error: variable has incomplete type 'struct timezone' mytimer.cpp error: variable has incomplete type 'struct timezone' [669/7668] /Users/buildslave/jenkins/workspace/test-suite-verify-machineinstrs-x86_64-O3/test-suite-build/tools/timeit --summary MultiSource/Benchmarks/DOE-ProxyApps-C++/miniFE/CMakeFiles/miniFE.dir/YAML_Doc.cpp.o.time /Users/buildslave/jenkins/workspace/test-suite-verify-machineinstrs-x86_64-O3/compiler/bin/clang++ -DNDEBUG -I/Users/buildslave/jenkins/workspace/test-suite-verify-machineinstrs-x86_64-O3/test-suite/MultiSource/Benchmarks/DOE-ProxyApps-C++/miniFE -B /Applications/Xcode.app/Contents/Developer/Toolchains/XcodeDefault.xctoolchain/usr/bin -Wno-unused-command-line-argument -mllvm -verify-machineinstrs -O3 -arch x86_64 -isysroot /Applications/Xcode.app/Contents/Developer/Platforms/MacOSX.platform/Developer/SDKs/MacOSX10.15.sdk -w -Werror=date-time -I. -DMINIFE_SCALAR=double -DMINIFE_LOCAL_ORDINAL=int -DMINIFE_GLOBAL_ORDINAL=int -DMINIFE_CSR_MATRIX -DREDSTORM -D_XOPEN_SOURCE=700 -MD -MT MultiSource/Benchmarks/DOE-ProxyApps-C++/miniFE/CMakeFiles/miniFE.dir/YAML_Doc.cpp.o -MF MultiSource/Benchmarks/DOE-ProxyApps-C++/miniFE/CMakeFiles/miniFE.dir/YAML_Doc.cpp.o.d -o MultiSource/Benchmarks/DOE-ProxyApps-C++/miniFE/CMakeFiles/miniFE.dir/YAML_Doc.cpp.o -c /Users/buildslave/jenkins/workspace/test-suite-verify-machineinstrs-x86_64-O3/test-suite/MultiSource/Benchmarks/DOE-ProxyApps-C++/miniFE/YAML_Doc.cpp [670/7668] /Users/buildslave/jenkins/workspace/test-suite-verify-machineinstrs-x86_64-O3/test-suite-build/tools/timeit --summary MultiSource/Benchmarks/DOE-ProxyApps-C++/miniFE/CMakeFiles/miniFE.dir/YAML_Element.cpp.o.time /Users/buildslave/jenkins/workspace/test-suite-verify-machineinstrs-x86_64-O3/compiler/bin/clang++ -DNDEBUG -I/Users/buildslave/jenkins/workspace/test-suite-verify-machineinstrs-x86_64-O3/test-suite/MultiSource/Benchmarks/DOE-ProxyApps-C++/miniFE -B /Applications/Xcode.app/Contents/Developer/Toolchains/XcodeDefault.xctoolchain/usr/bin -Wno-unused-command-line-argument -mllvm -verify-machineinstrs -O3 -arch x86_64 -isysroot /Applications/Xcode.app/Contents/Developer/Platforms/MacOSX.platform/Developer/SDKs/MacOSX10.15.sdk -w -Werror=date-time -I. -DMINIFE_SCALAR=double -DMINIFE_LOCAL_ORDINAL=int -DMINIFE_GLOBAL_ORDINAL=int -DMINIFE_CSR_MATRIX -DREDSTORM -D_XOPEN_SOURCE=700 -MD -MT MultiSource/Benchmarks/DOE-ProxyApps-C++/miniFE/CMakeFiles/miniFE.dir/YAML_Element.cpp.o -MF MultiSource/Benchmarks/DOE-ProxyApps-C++/miniFE/CMakeFiles/miniFE.dir/YAML_Element.cpp.o.d -o MultiSource/Benchmarks/DOE-ProxyApps-C++/miniFE/CMakeFiles/miniFE.dir/YAML_Element.cpp.o -c /Users/buildslave/jenkins/workspace/test-suite-verify-machineinstrs-x86_64-O3/test-suite/MultiSource/Benchmarks/DOE-ProxyApps-C++/miniFE/YAML_Element.cpp [671/7668] /Users/buildslave/jenkins/workspace/test-suite-verify-machineinstrs-x86_64-O3/test-suite-build/tools/timeit --summary MultiSource/Benchmarks/DOE-ProxyApps-C++/miniFE/CMakeFiles/miniFE.dir/mytimer.cpp.o.time /Users/buildslave/jenkins/workspace/test-suite-verify-machineinstrs-x86_64-O3/compiler/bin/clang++ -DNDEBUG -I/Users/buildslave/jenkins/workspace/test-suite-verify-machineinstrs-x86_64-O3/test-suite/MultiSource/Benchmarks/DOE-ProxyApps-C++/miniFE -B /Applications/Xcode.app/Contents/Developer/Toolchains/XcodeDefault.xctoolchain/usr/bin -Wno-unused-command-line-argument -mllvm -verify-machineinstrs -O3 -arch x86_64 -isysroot /Applications/Xcode.app/Contents/Developer/Platforms/MacOSX.platform/Developer/SDKs/MacOSX10.15.sdk -w -Werror=date-time -I. -DMINIFE_SCALAR=double -DMINIFE_LOCAL_ORDINAL=int -DMINIFE_GLOBAL_ORDINAL=int -DMINIFE_CSR_MATRIX -DREDSTORM -D_XOPEN_SOURCE=700 -MD -MT MultiSource/Benchmarks/DOE-ProxyApps-C++/miniFE/CMakeFiles/miniFE.dir/mytimer.cpp.o -MF MultiSource/Benchmarks/DOE-ProxyApps-C++/miniFE/CMakeFiles/miniFE.dir/mytimer.cpp.o.d -o MultiSource/Benchmarks/DOE-ProxyApps-C++/miniFE/CMakeFiles/miniFE.dir/mytimer.cpp.o -c /Users/buildslave/jenkins/workspace/test-suite-verify-machineinstrs-x86_64-O3/test-suite/MultiSource/Benchmarks/DOE-ProxyApps-C++/miniFE/mytimer.cpp FAILED: MultiSource/Benchmarks/DOE-ProxyApps-C++/miniFE/CMakeFiles/miniFE.dir/mytimer.cpp.o /Users/buildslave/jenkins/workspace/test-suite-verify-machineinstrs-x86_64-O3/test-suite-build/tools/timeit --summary MultiSource/Benchmarks/DOE-ProxyApps-C++/miniFE/CMakeFiles/miniFE.dir/mytimer.cpp.o.time /Users/buildslave/jenkins/workspace/test-suite-verify-machineinstrs-x86_64-O3/compiler/bin/clang++ -DNDEBUG -I/Users/buildslave/jenkins/workspace/test-suite-verify-machineinstrs-x86_64-O3/test-suite/MultiSource/Benchmarks/DOE-ProxyApps-C++/miniFE -B /Applications/Xcode.app/Contents/Developer/Toolchains/XcodeDefault.xctoolchain/usr/bin -Wno-unused-command-line-argument -mllvm -verify-machineinstrs -O3 -arch x86_64 -isysroot /Applications/Xcode.app/Contents/Developer/Platforms/MacOSX.platform/Developer/SDKs/MacOSX10.15.sdk -w -Werror=date-time -I. -DMINIFE_SCALAR=double -DMINIFE_LOCAL_ORDINAL=int -DMINIFE_GLOBAL_ORDINAL=int -DMINIFE_CSR_MATRIX -DREDSTORM -D_XOPEN_SOURCE=700 -MD -MT MultiSource/Benchmarks/DOE-ProxyApps-C++/miniFE/CMakeFiles/miniFE.dir/mytimer.cpp.o -MF MultiSource/Benchmarks/DOE-ProxyApps-C++/miniFE/CMakeFiles/miniFE.dir/mytimer.cpp.o.d -o MultiSource/Benchmarks/DOE-ProxyApps-C++/miniFE/CMakeFiles/miniFE.dir/mytimer.cpp.o -c /Users/buildslave/jenkins/workspace/test-suite-verify-machineinstrs-x86_64-O3/test-suite/MultiSource/Benchmarks/DOE-ProxyApps-C++/miniFE/mytimer.cpp /Users/buildslave/jenkins/workspace/test-suite-verify-machineinstrs-x86_64-O3/test-suite/MultiSource/Benchmarks/DOE-ProxyApps-C++/miniFE/mytimer.cpp:116:19: error: variable has incomplete type 'struct timezone' struct timezone tz; ^

Build Log

Changes
  1. [AST] Fix handling of some edge cases in fixed-point division. (details)
  2. [lldb] Tab completion for `frame recognizer delete` (details)
  3. [X86] Add tests for cmp-zero + and/trunc + or-reduction patterns (details)
  4. [lldb] Fix TestModuleGetXcodeSDK test after DWARFYAML change (details)
  5. [PM] Fix new PM to perform SpeculativeExecution as in old PM (details)
  6. [NFC][ARM] Tail predication reduction tests (details)
  7. [Alignment][NFC] Migrate SelectionDAGTargetInfo::EmitTargetCodeForMemset to Align (details)
  8. [Alignment][NFC] Migrate SelectionDAGTargetInfo::EmitTargetCodeForMemmove to Align (details)
  9. [clangd] Suppress GCC -Woverloaded-virtual by renaming ThreadsafeFS extension point (details)
  10. [Alignment][NFC] Migrate SelectionDAGTargetInfo::EmitTargetCodeForMemcpy to Align (details)
  11. Make it possible for client code to consume CLANG_LINK_CLANG_DYLIB (details)

Started by upstream project relay-test-suite-verify-machineinstrs build number 8279
originally caused by:

This run spent:

  • 7.2 sec waiting;
  • 22 min build duration;
  • 22 min total from scheduled to completion.
Revision: 40dd3891d6e81726fb450af140659f52c12bcf43
  • refs/remotes/origin/master
Revision: 05c479491c1d3236cae4eccaa3fcd2794598522c
  • detached
Revision: f34ad041dce4f3b55a013ab6e7d712349a2844a0
  • refs/remotes/origin/master
Revision: 0bfeb655e49fc6feeeb63d534019019bf4bb4d7c
  • refs/remotes/origin/master

Identified problems

Compile Error

This build failed because of a compile error. Below is a list of all errors in the build log:
Indication 1

Ninja target failed

Below is a link to the first failed ninja target.
Indication 2