Started 15 days ago
Took 2 hr 3 min

Failed Build clang-d358845-g80eb42281fe-t12016-b12016.tar.gz (Jun 30, 2020 5:00:36 AM)

Issues

Found 2 issues:
Ninja target: mytimer.cpp.o [3440/7668] /Users/buildslave/jenkins/workspace/test-suite-verify-machineinstrs-x86_64h-O3/test-suite-build/tools/timeit --summary MultiSource/Benchmarks/DOE-ProxyApps-C++/PENNANT/CMakeFiles/PENNANT.dir/TTS.cc.o.time /Users/buildslave/jenkins/workspace/test-suite-verify-machineinstrs-x86_64h-O3/compiler/bin/clang++ -DNDEBUG -B /Applications/Xcode.app/Contents/Developer/Toolchains/XcodeDefault.xctoolchain/usr/bin -Wno-unused-command-line-argument -mllvm -verify-machineinstrs -O3 -arch x86_64h -isysroot /Applications/Xcode.app/Contents/Developer/Platforms/MacOSX.platform/Developer/SDKs/MacOSX10.15.sdk -w -Werror=date-time -MD -MT MultiSource/Benchmarks/DOE-ProxyApps-C++/PENNANT/CMakeFiles/PENNANT.dir/TTS.cc.o -MF MultiSource/Benchmarks/DOE-ProxyApps-C++/PENNANT/CMakeFiles/PENNANT.dir/TTS.cc.o.d -o MultiSource/Benchmarks/DOE-ProxyApps-C++/PENNANT/CMakeFiles/PENNANT.dir/TTS.cc.o -c /Users/buildslave/jenkins/workspace/test-suite-verify-machineinstrs-x86_64h-O3/test-suite/MultiSource/Benchmarks/DOE-ProxyApps-C++/PENNANT/TTS.cc [3441/7668] /Users/buildslave/jenkins/workspace/test-suite-verify-machineinstrs-x86_64h-O3/test-suite-build/tools/timeit --summary MultiSource/Benchmarks/DOE-ProxyApps-C++/miniFE/CMakeFiles/miniFE.dir/BoxPartition.cpp.o.time /Users/buildslave/jenkins/workspace/test-suite-verify-machineinstrs-x86_64h-O3/compiler/bin/clang++ -DNDEBUG -I/Users/buildslave/jenkins/workspace/test-suite-verify-machineinstrs-x86_64h-O3/test-suite/MultiSource/Benchmarks/DOE-ProxyApps-C++/miniFE -B /Applications/Xcode.app/Contents/Developer/Toolchains/XcodeDefault.xctoolchain/usr/bin -Wno-unused-command-line-argument -mllvm -verify-machineinstrs -O3 -arch x86_64h -isysroot /Applications/Xcode.app/Contents/Developer/Platforms/MacOSX.platform/Developer/SDKs/MacOSX10.15.sdk -w -Werror=date-time -I. -DMINIFE_SCALAR=double -DMINIFE_LOCAL_ORDINAL=int -DMINIFE_GLOBAL_ORDINAL=int -DMINIFE_CSR_MATRIX -DREDSTORM -D_XOPEN_SOURCE=700 -MD -MT MultiSource/Benchmarks/DOE-ProxyApps-C++/miniFE/CMakeFiles/miniFE.dir/BoxPartition.cpp.o -MF MultiSource/Benchmarks/DOE-ProxyApps-C++/miniFE/CMakeFiles/miniFE.dir/BoxPartition.cpp.o.d -o MultiSource/Benchmarks/DOE-ProxyApps-C++/miniFE/CMakeFiles/miniFE.dir/BoxPartition.cpp.o -c /Users/buildslave/jenkins/workspace/test-suite-verify-machineinstrs-x86_64h-O3/test-suite/MultiSource/Benchmarks/DOE-ProxyApps-C++/miniFE/BoxPartition.cpp [3442/7668] /Users/buildslave/jenkins/workspace/test-suite-verify-machineinstrs-x86_64h-O3/test-suite-build/tools/timeit --summary MultiSource/Benchmarks/DOE-ProxyApps-C++/PENNANT/CMakeFiles/PENNANT.dir/main.cc.o.time /Users/buildslave/jenkins/workspace/test-suite-verify-machineinstrs-x86_64h-O3/compiler/bin/clang++ -DNDEBUG -B /Applications/Xcode.app/Contents/Developer/Toolchains/XcodeDefault.xctoolchain/usr/bin -Wno-unused-command-line-argument -mllvm -verify-machineinstrs -O3 -arch x86_64h -isysroot /Applications/Xcode.app/Contents/Developer/Platforms/MacOSX.platform/Developer/SDKs/MacOSX10.15.sdk -w -Werror=date-time -MD -MT MultiSource/Benchmarks/DOE-ProxyApps-C++/PENNANT/CMakeFiles/PENNANT.dir/main.cc.o -MF MultiSource/Benchmarks/DOE-ProxyApps-C++/PENNANT/CMakeFiles/PENNANT.dir/main.cc.o.d -o MultiSource/Benchmarks/DOE-ProxyApps-C++/PENNANT/CMakeFiles/PENNANT.dir/main.cc.o -c /Users/buildslave/jenkins/workspace/test-suite-verify-machineinstrs-x86_64h-O3/test-suite/MultiSource/Benchmarks/DOE-ProxyApps-C++/PENNANT/main.cc [3443/7668] /Users/buildslave/jenkins/workspace/test-suite-verify-machineinstrs-x86_64h-O3/test-suite-build/tools/timeit --summary MultiSource/Benchmarks/DOE-ProxyApps-C++/PENNANT/CMakeFiles/PENNANT.dir/Mesh.cc.o.time /Users/buildslave/jenkins/workspace/test-suite-verify-machineinstrs-x86_64h-O3/compiler/bin/clang++ -DNDEBUG -B /Applications/Xcode.app/Contents/Developer/Toolchains/XcodeDefault.xctoolchain/usr/bin -Wno-unused-command-line-argument -mllvm -verify-machineinstrs -O3 -arch x86_64h -isysroot /Applications/Xcode.app/Contents/Developer/Platforms/MacOSX.platform/Developer/SDKs/MacOSX10.15.sdk -w -Werror=date-time -MD -MT MultiSource/Benchmarks/DOE-ProxyApps-C++/PENNANT/CMakeFiles/PENNANT.dir/Mesh.cc.o -MF MultiSource/Benchmarks/DOE-ProxyApps-C++/PENNANT/CMakeFiles/PENNANT.dir/Mesh.cc.o.d -o MultiSource/Benchmarks/DOE-ProxyApps-C++/PENNANT/CMakeFiles/PENNANT.dir/Mesh.cc.o -c /Users/buildslave/jenkins/workspace/test-suite-verify-machineinstrs-x86_64h-O3/test-suite/MultiSource/Benchmarks/DOE-ProxyApps-C++/PENNANT/Mesh.cc [3444/7668] /Users/buildslave/jenkins/workspace/test-suite-verify-machineinstrs-x86_64h-O3/test-suite-build/tools/timeit --summary MultiSource/Benchmarks/DOE-ProxyApps-C++/miniFE/CMakeFiles/miniFE.dir/mytimer.cpp.o.time /Users/buildslave/jenkins/workspace/test-suite-verify-machineinstrs-x86_64h-O3/compiler/bin/clang++ -DNDEBUG -I/Users/buildslave/jenkins/workspace/test-suite-verify-machineinstrs-x86_64h-O3/test-suite/MultiSource/Benchmarks/DOE-ProxyApps-C++/miniFE -B /Applications/Xcode.app/Contents/Developer/Toolchains/XcodeDefault.xctoolchain/usr/bin -Wno-unused-command-line-argument -mllvm -verify-machineinstrs -O3 -arch x86_64h -isysroot /Applications/Xcode.app/Contents/Developer/Platforms/MacOSX.platform/Developer/SDKs/MacOSX10.15.sdk -w -Werror=date-time -I. -DMINIFE_SCALAR=double -DMINIFE_LOCAL_ORDINAL=int -DMINIFE_GLOBAL_ORDINAL=int -DMINIFE_CSR_MATRIX -DREDSTORM -D_XOPEN_SOURCE=700 -MD -MT MultiSource/Benchmarks/DOE-ProxyApps-C++/miniFE/CMakeFiles/miniFE.dir/mytimer.cpp.o -MF MultiSource/Benchmarks/DOE-ProxyApps-C++/miniFE/CMakeFiles/miniFE.dir/mytimer.cpp.o.d -o MultiSource/Benchmarks/DOE-ProxyApps-C++/miniFE/CMakeFiles/miniFE.dir/mytimer.cpp.o -c /Users/buildslave/jenkins/workspace/test-suite-verify-machineinstrs-x86_64h-O3/test-suite/MultiSource/Benchmarks/DOE-ProxyApps-C++/miniFE/mytimer.cpp FAILED: MultiSource/Benchmarks/DOE-ProxyApps-C++/miniFE/CMakeFiles/miniFE.dir/mytimer.cpp.o /Users/buildslave/jenkins/workspace/test-suite-verify-machineinstrs-x86_64h-O3/test-suite-build/tools/timeit --summary MultiSource/Benchmarks/DOE-ProxyApps-C++/miniFE/CMakeFiles/miniFE.dir/mytimer.cpp.o.time /Users/buildslave/jenkins/workspace/test-suite-verify-machineinstrs-x86_64h-O3/compiler/bin/clang++ -DNDEBUG -I/Users/buildslave/jenkins/workspace/test-suite-verify-machineinstrs-x86_64h-O3/test-suite/MultiSource/Benchmarks/DOE-ProxyApps-C++/miniFE -B /Applications/Xcode.app/Contents/Developer/Toolchains/XcodeDefault.xctoolchain/usr/bin -Wno-unused-command-line-argument -mllvm -verify-machineinstrs -O3 -arch x86_64h -isysroot /Applications/Xcode.app/Contents/Developer/Platforms/MacOSX.platform/Developer/SDKs/MacOSX10.15.sdk -w -Werror=date-time -I. -DMINIFE_SCALAR=double -DMINIFE_LOCAL_ORDINAL=int -DMINIFE_GLOBAL_ORDINAL=int -DMINIFE_CSR_MATRIX -DREDSTORM -D_XOPEN_SOURCE=700 -MD -MT MultiSource/Benchmarks/DOE-ProxyApps-C++/miniFE/CMakeFiles/miniFE.dir/mytimer.cpp.o -MF MultiSource/Benchmarks/DOE-ProxyApps-C++/miniFE/CMakeFiles/miniFE.dir/mytimer.cpp.o.d -o MultiSource/Benchmarks/DOE-ProxyApps-C++/miniFE/CMakeFiles/miniFE.dir/mytimer.cpp.o -c /Users/buildslave/jenkins/workspace/test-suite-verify-machineinstrs-x86_64h-O3/test-suite/MultiSource/Benchmarks/DOE-ProxyApps-C++/miniFE/mytimer.cpp /Users/buildslave/jenkins/workspace/test-suite-verify-machineinstrs-x86_64h-O3/test-suite/MultiSource/Benchmarks/DOE-ProxyApps-C++/miniFE/mytimer.cpp:116:19: error: variable has incomplete type 'struct timezone' mytimer.cpp error: variable has incomplete type 'struct timezone' [3442/7668] /Users/buildslave/jenkins/workspace/test-suite-verify-machineinstrs-x86_64h-O3/test-suite-build/tools/timeit --summary MultiSource/Benchmarks/DOE-ProxyApps-C++/PENNANT/CMakeFiles/PENNANT.dir/main.cc.o.time /Users/buildslave/jenkins/workspace/test-suite-verify-machineinstrs-x86_64h-O3/compiler/bin/clang++ -DNDEBUG -B /Applications/Xcode.app/Contents/Developer/Toolchains/XcodeDefault.xctoolchain/usr/bin -Wno-unused-command-line-argument -mllvm -verify-machineinstrs -O3 -arch x86_64h -isysroot /Applications/Xcode.app/Contents/Developer/Platforms/MacOSX.platform/Developer/SDKs/MacOSX10.15.sdk -w -Werror=date-time -MD -MT MultiSource/Benchmarks/DOE-ProxyApps-C++/PENNANT/CMakeFiles/PENNANT.dir/main.cc.o -MF MultiSource/Benchmarks/DOE-ProxyApps-C++/PENNANT/CMakeFiles/PENNANT.dir/main.cc.o.d -o MultiSource/Benchmarks/DOE-ProxyApps-C++/PENNANT/CMakeFiles/PENNANT.dir/main.cc.o -c /Users/buildslave/jenkins/workspace/test-suite-verify-machineinstrs-x86_64h-O3/test-suite/MultiSource/Benchmarks/DOE-ProxyApps-C++/PENNANT/main.cc [3443/7668] /Users/buildslave/jenkins/workspace/test-suite-verify-machineinstrs-x86_64h-O3/test-suite-build/tools/timeit --summary MultiSource/Benchmarks/DOE-ProxyApps-C++/PENNANT/CMakeFiles/PENNANT.dir/Mesh.cc.o.time /Users/buildslave/jenkins/workspace/test-suite-verify-machineinstrs-x86_64h-O3/compiler/bin/clang++ -DNDEBUG -B /Applications/Xcode.app/Contents/Developer/Toolchains/XcodeDefault.xctoolchain/usr/bin -Wno-unused-command-line-argument -mllvm -verify-machineinstrs -O3 -arch x86_64h -isysroot /Applications/Xcode.app/Contents/Developer/Platforms/MacOSX.platform/Developer/SDKs/MacOSX10.15.sdk -w -Werror=date-time -MD -MT MultiSource/Benchmarks/DOE-ProxyApps-C++/PENNANT/CMakeFiles/PENNANT.dir/Mesh.cc.o -MF MultiSource/Benchmarks/DOE-ProxyApps-C++/PENNANT/CMakeFiles/PENNANT.dir/Mesh.cc.o.d -o MultiSource/Benchmarks/DOE-ProxyApps-C++/PENNANT/CMakeFiles/PENNANT.dir/Mesh.cc.o -c /Users/buildslave/jenkins/workspace/test-suite-verify-machineinstrs-x86_64h-O3/test-suite/MultiSource/Benchmarks/DOE-ProxyApps-C++/PENNANT/Mesh.cc [3444/7668] /Users/buildslave/jenkins/workspace/test-suite-verify-machineinstrs-x86_64h-O3/test-suite-build/tools/timeit --summary MultiSource/Benchmarks/DOE-ProxyApps-C++/miniFE/CMakeFiles/miniFE.dir/mytimer.cpp.o.time /Users/buildslave/jenkins/workspace/test-suite-verify-machineinstrs-x86_64h-O3/compiler/bin/clang++ -DNDEBUG -I/Users/buildslave/jenkins/workspace/test-suite-verify-machineinstrs-x86_64h-O3/test-suite/MultiSource/Benchmarks/DOE-ProxyApps-C++/miniFE -B /Applications/Xcode.app/Contents/Developer/Toolchains/XcodeDefault.xctoolchain/usr/bin -Wno-unused-command-line-argument -mllvm -verify-machineinstrs -O3 -arch x86_64h -isysroot /Applications/Xcode.app/Contents/Developer/Platforms/MacOSX.platform/Developer/SDKs/MacOSX10.15.sdk -w -Werror=date-time -I. -DMINIFE_SCALAR=double -DMINIFE_LOCAL_ORDINAL=int -DMINIFE_GLOBAL_ORDINAL=int -DMINIFE_CSR_MATRIX -DREDSTORM -D_XOPEN_SOURCE=700 -MD -MT MultiSource/Benchmarks/DOE-ProxyApps-C++/miniFE/CMakeFiles/miniFE.dir/mytimer.cpp.o -MF MultiSource/Benchmarks/DOE-ProxyApps-C++/miniFE/CMakeFiles/miniFE.dir/mytimer.cpp.o.d -o MultiSource/Benchmarks/DOE-ProxyApps-C++/miniFE/CMakeFiles/miniFE.dir/mytimer.cpp.o -c /Users/buildslave/jenkins/workspace/test-suite-verify-machineinstrs-x86_64h-O3/test-suite/MultiSource/Benchmarks/DOE-ProxyApps-C++/miniFE/mytimer.cpp FAILED: MultiSource/Benchmarks/DOE-ProxyApps-C++/miniFE/CMakeFiles/miniFE.dir/mytimer.cpp.o /Users/buildslave/jenkins/workspace/test-suite-verify-machineinstrs-x86_64h-O3/test-suite-build/tools/timeit --summary MultiSource/Benchmarks/DOE-ProxyApps-C++/miniFE/CMakeFiles/miniFE.dir/mytimer.cpp.o.time /Users/buildslave/jenkins/workspace/test-suite-verify-machineinstrs-x86_64h-O3/compiler/bin/clang++ -DNDEBUG -I/Users/buildslave/jenkins/workspace/test-suite-verify-machineinstrs-x86_64h-O3/test-suite/MultiSource/Benchmarks/DOE-ProxyApps-C++/miniFE -B /Applications/Xcode.app/Contents/Developer/Toolchains/XcodeDefault.xctoolchain/usr/bin -Wno-unused-command-line-argument -mllvm -verify-machineinstrs -O3 -arch x86_64h -isysroot /Applications/Xcode.app/Contents/Developer/Platforms/MacOSX.platform/Developer/SDKs/MacOSX10.15.sdk -w -Werror=date-time -I. -DMINIFE_SCALAR=double -DMINIFE_LOCAL_ORDINAL=int -DMINIFE_GLOBAL_ORDINAL=int -DMINIFE_CSR_MATRIX -DREDSTORM -D_XOPEN_SOURCE=700 -MD -MT MultiSource/Benchmarks/DOE-ProxyApps-C++/miniFE/CMakeFiles/miniFE.dir/mytimer.cpp.o -MF MultiSource/Benchmarks/DOE-ProxyApps-C++/miniFE/CMakeFiles/miniFE.dir/mytimer.cpp.o.d -o MultiSource/Benchmarks/DOE-ProxyApps-C++/miniFE/CMakeFiles/miniFE.dir/mytimer.cpp.o -c /Users/buildslave/jenkins/workspace/test-suite-verify-machineinstrs-x86_64h-O3/test-suite/MultiSource/Benchmarks/DOE-ProxyApps-C++/miniFE/mytimer.cpp /Users/buildslave/jenkins/workspace/test-suite-verify-machineinstrs-x86_64h-O3/test-suite/MultiSource/Benchmarks/DOE-ProxyApps-C++/miniFE/mytimer.cpp:116:19: error: variable has incomplete type 'struct timezone' struct timezone tz; ^

Build Log

Changes
  1. [IR] NoFree IntrinsicProperty. (details)
  2. [lldb] Modernize TestOperatorOverload.py asserts (details)
  3. [Alignment][NFC] Migrate AtomicExpandPass to Align (details)
  4. [AST][RecoveryExpr] Add error-bit to NestNameSpecifierDependence and TemplateNameDependence. (details)
  5. [mlir] Extended BufferPlacement to support nested region control flow. (details)
  6. [clangd] Remove redundant `findRefs` calls. NFC. (details)
  7. [llvm][Z3][NFC] Improve mkBitvector performance (details)
  8. [SystemZ] Add NoMerge MIFlag (details)
  9. [lldb][NFC] Remove ImportInProgress lock in ClangASTSource (details)
  10. [lldb] Tab completion for `frame select` (details)

Started by upstream project relay-test-suite-verify-machineinstrs build number 8278
originally caused by:

This run spent:

  • 1 hr 40 min waiting;
  • 2 hr 3 min build duration;
  • 2 hr 3 min total from scheduled to completion.
Revision: 40dd3891d6e81726fb450af140659f52c12bcf43
  • refs/remotes/origin/master
Revision: 80eb42281feb7834054be5f933f63d8c64af229d
  • detached
Revision: f34ad041dce4f3b55a013ab6e7d712349a2844a0
  • refs/remotes/origin/master
Revision: 0bfeb655e49fc6feeeb63d534019019bf4bb4d7c
  • refs/remotes/origin/master

Identified problems

Compile Error

This build failed because of a compile error. Below is a list of all errors in the build log:
Indication 1

Ninja target failed

Below is a link to the first failed ninja target.
Indication 2