Started 3 hr 22 min ago
Took 1 hr 12 min

Failed Build clang-d385416-g09d1f6e6b74c-t20126-b20126.tar.gz (Apr 14, 2021 1:22:15 AM)

Issues

Found 3 issues:
Ninja target: macroblock.c.o
[5814/11549] : && /Users/buildslave/jenkins/workspace/test-suite-verify-machineinstrs-aarch64-O3/test-suite-build/tools/timeit --summary MicroBenchmarks/MemFunctions/MemFunctions.link.time /Users/buildslave/jenkins/workspace/test-suite-verify-machineinstrs-aarch64-O3/compiler/bin/clang++  -B /Applications/Xcode.app/Contents/Developer/Toolchains/XcodeDefault.xctoolchain/usr/bin    -Wno-unused-command-line-argument -mllvm -verify-machineinstrs -O3 -arch arm64 -isysroot /Applications/Xcode.app/Contents/Developer/Platforms/iPhoneOS.platform/Developer/SDKs/iPhoneOS13.5.sdk -Wl,-search_paths_first -Wl,-headerpad_max_install_names -B /Applications/Xcode.app/Contents/Developer/Toolchains/XcodeDefault.xctoolchain/usr/bin MicroBenchmarks/MemFunctions/CMakeFiles/MemFunctions.dir/main.cpp.o  -o MicroBenchmarks/MemFunctions/MemFunctions  MicroBenchmarks/libs/benchmark-1.3.0/src/libbenchmark.a && :
[5815/11549] /Users/buildslave/jenkins/workspace/test-suite-verify-machineinstrs-aarch64-O3/test-suite-build/tools/timeit --summary MultiSource/Applications/JM/lencod/CMakeFiles/lencod.dir/md_highfast.c.o.time /Users/buildslave/jenkins/workspace/test-suite-verify-machineinstrs-aarch64-O3/compiler/bin/clang -DNDEBUG  -B /Applications/Xcode.app/Contents/Developer/Toolchains/XcodeDefault.xctoolchain/usr/bin    -Wno-unused-command-line-argument -mllvm -verify-machineinstrs -O3 -arch arm64 -isysroot /Applications/Xcode.app/Contents/Developer/Platforms/iPhoneOS.platform/Developer/SDKs/iPhoneOS13.5.sdk   -w -Werror=date-time -fcommon -D__USE_LARGEFILE64 -D_FILE_OFFSET_BITS=64 -MD -MT MultiSource/Applications/JM/lencod/CMakeFiles/lencod.dir/md_highfast.c.o -MF MultiSource/Applications/JM/lencod/CMakeFiles/lencod.dir/md_highfast.c.o.d -o MultiSource/Applications/JM/lencod/CMakeFiles/lencod.dir/md_highfast.c.o   -c /Users/buildslave/jenkins/workspace/test-suite-verify-machineinstrs-aarch64-O3/test-suite/MultiSource/Applications/JM/lencod/md_highfast.c
[5816/11549] /Users/buildslave/jenkins/workspace/test-suite-verify-machineinstrs-aarch64-O3/test-suite-build/tools/timeit --summary MultiSource/Applications/JM/lencod/CMakeFiles/lencod.dir/md_highloss.c.o.time /Users/buildslave/jenkins/workspace/test-suite-verify-machineinstrs-aarch64-O3/compiler/bin/clang -DNDEBUG  -B /Applications/Xcode.app/Contents/Developer/Toolchains/XcodeDefault.xctoolchain/usr/bin    -Wno-unused-command-line-argument -mllvm -verify-machineinstrs -O3 -arch arm64 -isysroot /Applications/Xcode.app/Contents/Developer/Platforms/iPhoneOS.platform/Developer/SDKs/iPhoneOS13.5.sdk   -w -Werror=date-time -fcommon -D__USE_LARGEFILE64 -D_FILE_OFFSET_BITS=64 -MD -MT MultiSource/Applications/JM/lencod/CMakeFiles/lencod.dir/md_highloss.c.o -MF MultiSource/Applications/JM/lencod/CMakeFiles/lencod.dir/md_highloss.c.o.d -o MultiSource/Applications/JM/lencod/CMakeFiles/lencod.dir/md_highloss.c.o   -c /Users/buildslave/jenkins/workspace/test-suite-verify-machineinstrs-aarch64-O3/test-suite/MultiSource/Applications/JM/lencod/md_highloss.c
[5817/11549] /Users/buildslave/jenkins/workspace/test-suite-verify-machineinstrs-aarch64-O3/test-suite-build/tools/timeit --summary MultiSource/Applications/JM/lencod/CMakeFiles/lencod.dir/md_low.c.o.time /Users/buildslave/jenkins/workspace/test-suite-verify-machineinstrs-aarch64-O3/compiler/bin/clang -DNDEBUG  -B /Applications/Xcode.app/Contents/Developer/Toolchains/XcodeDefault.xctoolchain/usr/bin    -Wno-unused-command-line-argument -mllvm -verify-machineinstrs -O3 -arch arm64 -isysroot /Applications/Xcode.app/Contents/Developer/Platforms/iPhoneOS.platform/Developer/SDKs/iPhoneOS13.5.sdk   -w -Werror=date-time -fcommon -D__USE_LARGEFILE64 -D_FILE_OFFSET_BITS=64 -MD -MT MultiSource/Applications/JM/lencod/CMakeFiles/lencod.dir/md_low.c.o -MF MultiSource/Applications/JM/lencod/CMakeFiles/lencod.dir/md_low.c.o.d -o MultiSource/Applications/JM/lencod/CMakeFiles/lencod.dir/md_low.c.o   -c /Users/buildslave/jenkins/workspace/test-suite-verify-machineinstrs-aarch64-O3/test-suite/MultiSource/Applications/JM/lencod/md_low.c
[5818/11549] /Users/buildslave/jenkins/workspace/test-suite-verify-machineinstrs-aarch64-O3/test-suite-build/tools/timeit --summary MultiSource/Applications/JM/lencod/CMakeFiles/lencod.dir/macroblock.c.o.time /Users/buildslave/jenkins/workspace/test-suite-verify-machineinstrs-aarch64-O3/compiler/bin/clang -DNDEBUG  -B /Applications/Xcode.app/Contents/Developer/Toolchains/XcodeDefault.xctoolchain/usr/bin    -Wno-unused-command-line-argument -mllvm -verify-machineinstrs -O3 -arch arm64 -isysroot /Applications/Xcode.app/Contents/Developer/Platforms/iPhoneOS.platform/Developer/SDKs/iPhoneOS13.5.sdk   -w -Werror=date-time -fcommon -D__USE_LARGEFILE64 -D_FILE_OFFSET_BITS=64 -MD -MT MultiSource/Applications/JM/lencod/CMakeFiles/lencod.dir/macroblock.c.o -MF MultiSource/Applications/JM/lencod/CMakeFiles/lencod.dir/macroblock.c.o.d -o MultiSource/Applications/JM/lencod/CMakeFiles/lencod.dir/macroblock.c.o   -c /Users/buildslave/jenkins/workspace/test-suite-verify-machineinstrs-aarch64-O3/test-suite/MultiSource/Applications/JM/lencod/macroblock.c
FAILED: MultiSource/Applications/JM/lencod/CMakeFiles/lencod.dir/macroblock.c.o 
/Users/buildslave/jenkins/workspace/test-suite-verify-machineinstrs-aarch64-O3/test-suite-build/tools/timeit --summary MultiSource/Applications/JM/lencod/CMakeFiles/lencod.dir/macroblock.c.o.time /Users/buildslave/jenkins/workspace/test-suite-verify-machineinstrs-aarch64-O3/compiler/bin/clang -DNDEBUG  -B /Applications/Xcode.app/Contents/Developer/Toolchains/XcodeDefault.xctoolchain/usr/bin    -Wno-unused-command-line-argument -mllvm -verify-machineinstrs -O3 -arch arm64 -isysroot /Applications/Xcode.app/Contents/Developer/Platforms/iPhoneOS.platform/Developer/SDKs/iPhoneOS13.5.sdk   -w -Werror=date-time -fcommon -D__USE_LARGEFILE64 -D_FILE_OFFSET_BITS=64 -MD -MT MultiSource/Applications/JM/lencod/CMakeFiles/lencod.dir/macroblock.c.o -MF MultiSource/Applications/JM/lencod/CMakeFiles/lencod.dir/macroblock.c.o.d -o MultiSource/Applications/JM/lencod/CMakeFiles/lencod.dir/macroblock.c.o   -c /Users/buildslave/jenkins/workspace/test-suite-verify-machineinstrs-aarch64-O3/test-suite/MultiSource/Applications/JM/lencod/macroblock.c
Assertion failed: (!isInvalid() && "Loop not in a valid state!"), function getBlocks, file /Users/buildslave/jenkins/workspace/clang-stage1-RA/llvm-project/llvm/include/llvm/Analysis/LoopInfo.h, line 172.
assertion: !isInvalid() && "Loop not in a valid state!"
[5816/11549] /Users/buildslave/jenkins/workspace/test-suite-verify-machineinstrs-aarch64-O3/test-suite-build/tools/timeit --summary MultiSource/Applications/JM/lencod/CMakeFiles/lencod.dir/md_highloss.c.o.time /Users/buildslave/jenkins/workspace/test-suite-verify-machineinstrs-aarch64-O3/compiler/bin/clang -DNDEBUG  -B /Applications/Xcode.app/Contents/Developer/Toolchains/XcodeDefault.xctoolchain/usr/bin    -Wno-unused-command-line-argument -mllvm -verify-machineinstrs -O3 -arch arm64 -isysroot /Applications/Xcode.app/Contents/Developer/Platforms/iPhoneOS.platform/Developer/SDKs/iPhoneOS13.5.sdk   -w -Werror=date-time -fcommon -D__USE_LARGEFILE64 -D_FILE_OFFSET_BITS=64 -MD -MT MultiSource/Applications/JM/lencod/CMakeFiles/lencod.dir/md_highloss.c.o -MF MultiSource/Applications/JM/lencod/CMakeFiles/lencod.dir/md_highloss.c.o.d -o MultiSource/Applications/JM/lencod/CMakeFiles/lencod.dir/md_highloss.c.o   -c /Users/buildslave/jenkins/workspace/test-suite-verify-machineinstrs-aarch64-O3/test-suite/MultiSource/Applications/JM/lencod/md_highloss.c
[5817/11549] /Users/buildslave/jenkins/workspace/test-suite-verify-machineinstrs-aarch64-O3/test-suite-build/tools/timeit --summary MultiSource/Applications/JM/lencod/CMakeFiles/lencod.dir/md_low.c.o.time /Users/buildslave/jenkins/workspace/test-suite-verify-machineinstrs-aarch64-O3/compiler/bin/clang -DNDEBUG  -B /Applications/Xcode.app/Contents/Developer/Toolchains/XcodeDefault.xctoolchain/usr/bin    -Wno-unused-command-line-argument -mllvm -verify-machineinstrs -O3 -arch arm64 -isysroot /Applications/Xcode.app/Contents/Developer/Platforms/iPhoneOS.platform/Developer/SDKs/iPhoneOS13.5.sdk   -w -Werror=date-time -fcommon -D__USE_LARGEFILE64 -D_FILE_OFFSET_BITS=64 -MD -MT MultiSource/Applications/JM/lencod/CMakeFiles/lencod.dir/md_low.c.o -MF MultiSource/Applications/JM/lencod/CMakeFiles/lencod.dir/md_low.c.o.d -o MultiSource/Applications/JM/lencod/CMakeFiles/lencod.dir/md_low.c.o   -c /Users/buildslave/jenkins/workspace/test-suite-verify-machineinstrs-aarch64-O3/test-suite/MultiSource/Applications/JM/lencod/md_low.c
[5818/11549] /Users/buildslave/jenkins/workspace/test-suite-verify-machineinstrs-aarch64-O3/test-suite-build/tools/timeit --summary MultiSource/Applications/JM/lencod/CMakeFiles/lencod.dir/macroblock.c.o.time /Users/buildslave/jenkins/workspace/test-suite-verify-machineinstrs-aarch64-O3/compiler/bin/clang -DNDEBUG  -B /Applications/Xcode.app/Contents/Developer/Toolchains/XcodeDefault.xctoolchain/usr/bin    -Wno-unused-command-line-argument -mllvm -verify-machineinstrs -O3 -arch arm64 -isysroot /Applications/Xcode.app/Contents/Developer/Platforms/iPhoneOS.platform/Developer/SDKs/iPhoneOS13.5.sdk   -w -Werror=date-time -fcommon -D__USE_LARGEFILE64 -D_FILE_OFFSET_BITS=64 -MD -MT MultiSource/Applications/JM/lencod/CMakeFiles/lencod.dir/macroblock.c.o -MF MultiSource/Applications/JM/lencod/CMakeFiles/lencod.dir/macroblock.c.o.d -o MultiSource/Applications/JM/lencod/CMakeFiles/lencod.dir/macroblock.c.o   -c /Users/buildslave/jenkins/workspace/test-suite-verify-machineinstrs-aarch64-O3/test-suite/MultiSource/Applications/JM/lencod/macroblock.c
FAILED: MultiSource/Applications/JM/lencod/CMakeFiles/lencod.dir/macroblock.c.o 
/Users/buildslave/jenkins/workspace/test-suite-verify-machineinstrs-aarch64-O3/test-suite-build/tools/timeit --summary MultiSource/Applications/JM/lencod/CMakeFiles/lencod.dir/macroblock.c.o.time /Users/buildslave/jenkins/workspace/test-suite-verify-machineinstrs-aarch64-O3/compiler/bin/clang -DNDEBUG  -B /Applications/Xcode.app/Contents/Developer/Toolchains/XcodeDefault.xctoolchain/usr/bin    -Wno-unused-command-line-argument -mllvm -verify-machineinstrs -O3 -arch arm64 -isysroot /Applications/Xcode.app/Contents/Developer/Platforms/iPhoneOS.platform/Developer/SDKs/iPhoneOS13.5.sdk   -w -Werror=date-time -fcommon -D__USE_LARGEFILE64 -D_FILE_OFFSET_BITS=64 -MD -MT MultiSource/Applications/JM/lencod/CMakeFiles/lencod.dir/macroblock.c.o -MF MultiSource/Applications/JM/lencod/CMakeFiles/lencod.dir/macroblock.c.o.d -o MultiSource/Applications/JM/lencod/CMakeFiles/lencod.dir/macroblock.c.o   -c /Users/buildslave/jenkins/workspace/test-suite-verify-machineinstrs-aarch64-O3/test-suite/MultiSource/Applications/JM/lencod/macroblock.c
Assertion failed: (!isInvalid() && "Loop not in a valid state!"), function getBlocks, file /Users/buildslave/jenkins/workspace/clang-stage1-RA/llvm-project/llvm/include/llvm/Analysis/LoopInfo.h, line 172.
PLEASE submit a bug report to https://bugs.llvm.org/ and include the crash backtrace, preprocessed source, and associated run script.
Stack dump:
Error: clang frontend command failed with exit code 134 (use -v to see invocation)
59 clang                    0x00000001086f6a3d clang::driver::Compilation::ExecuteJobs(clang::driver::JobList const&, llvm::SmallVectorImpl<std::__1::pair<int, clang::driver::Command const*> >&) const + 125
60 clang                    0x000000010870d0cc clang::driver::Driver::ExecuteCompilation(clang::driver::Compilation&, llvm::SmallVectorImpl<std::__1::pair<int, clang::driver::Command const*> >&) + 204
61 clang                    0x0000000105ef12a5 main + 10389
62 libdyld.dylib            0x00007fff72e18cc9 start + 1
63 libdyld.dylib            0x000000000000001a start + 18446603338588779346
clang-13: error: clang frontend command failed with exit code 134 (use -v to see invocation)
clang version 13.0.0 (https://github.com/llvm/llvm-project.git 09d1f6e6b74c9330d80c0346a271a43efbe0384d)
Target: aarch64-apple-darwin19.5.0

Build Log

Changes
  1. [mlir][StandardToSPIRV] Add support for lowering math.powf to SPIR-V. (details)
  2. [Live Intervals] Teach Greedy RA to recognize special case live-through (details)
  3. [clangd] Add support for inline parameter hints (details)
  4. [gn build] Port cbc9c4ea90e1 (details)
  5. Revert "Title: [RISCV] Add missing part of instruction vmsge {u}. VX Review By: craig.topper  Differential Revision : https://reviews.llvm.org/D100115" (details)
  6. [LLD] Implement /guard:[no]ehcont (details)
  7. [NFC] Fix unused warning. (details)
  8. [clang] Fix copy constructor of CompilerInvocation (details)

Started by upstream project relay-test-suite-verify-machineinstrs build number 9635
originally caused by:

This run spent:

  • 8.9 sec waiting;
  • 1 hr 12 min build duration;
  • 1 hr 12 min total from scheduled to completion.
Revision: c7b839f96b97a405a8c66acda7bccc31e0904850
  • refs/remotes/origin/main
Revision: 09d1f6e6b74c9330d80c0346a271a43efbe0384d
  • detached
Revision: f48d431f44610e339d00a33d57564c6029c4ff43
  • refs/remotes/origin/main
Revision: d590d0b156e471cbe8db457c453341bf9536a009
  • refs/remotes/origin/main

Identified problems

Compile Error

This build failed because of a compile error. Below is a list of all errors in the build log:
Indication 1

Ninja target failed

Below is a link to the first failed ninja target.
Indication 2

Assertion failure

This build failed because of an assertion failure. Below is a list of all errors in the build log:
Indication 3