FailedConsole Output

Started by an SCM change
Running as SYSTEM
Building remotely on labmaster2 (Zorg) in workspace /Users/buildslave/jenkins/workspace/LNT_Tests
No credentials specified
 > git rev-parse --is-inside-work-tree # timeout=10
Fetching changes from the remote Git repository
 > git config remote.origin.url http://labmaster3.local/git/llvm-test-suite.git # timeout=10
Fetching upstream changes from http://labmaster3.local/git/llvm-test-suite.git
 > git --version # timeout=10
 > git fetch --tags --progress http://labmaster3.local/git/llvm-test-suite.git +refs/heads/*:refs/remotes/origin/*
 > git rev-parse refs/remotes/origin/master^{commit} # timeout=10
 > git rev-parse refs/remotes/origin/origin/master^{commit} # timeout=10
Checking out Revision ae6c21adfe7b49db292717735437f01605e8de92 (refs/remotes/origin/master)
 > git config core.sparsecheckout # timeout=10
 > git checkout -f ae6c21adfe7b49db292717735437f01605e8de92
Commit message: "[test-suite] Guard DG_CFLAGS filtering"
 > git rev-list --no-walk ae6c21adfe7b49db292717735437f01605e8de92 # timeout=10
No credentials specified
 > git rev-parse --is-inside-work-tree # timeout=10
Fetching changes from the remote Git repository
 > git config remote.origin.url http://labmaster3.local/git/llvm-lnt.git # timeout=10
Fetching upstream changes from http://labmaster3.local/git/llvm-lnt.git
 > git --version # timeout=10
 > git fetch --tags --progress http://labmaster3.local/git/llvm-lnt.git +refs/heads/*:refs/remotes/origin/*
 > git rev-parse refs/remotes/origin/master^{commit} # timeout=10
 > git rev-parse refs/remotes/origin/origin/master^{commit} # timeout=10
Checking out Revision 3a8556e08644f94792bbfa67b827c696d2906c13 (refs/remotes/origin/master)
 > git config core.sparsecheckout # timeout=10
 > git checkout -f 3a8556e08644f94792bbfa67b827c696d2906c13
Commit message: "[LNT] Fix execfile Python 3 migration"
 > git rev-list --no-walk 3a8556e08644f94792bbfa67b827c696d2906c13 # timeout=10
No credentials specified
 > git rev-parse --is-inside-work-tree # timeout=10
Fetching changes from the remote Git repository
 > git config remote.origin.url http://labmaster3.local/git/llvm-project.git # timeout=10
Fetching upstream changes from http://labmaster3.local/git/llvm-project.git
 > git --version # timeout=10
 > git fetch --tags --progress http://labmaster3.local/git/llvm-project.git +refs/heads/*:refs/remotes/origin/*
 > git rev-parse refs/remotes/origin/master^{commit} # timeout=10
 > git rev-parse refs/remotes/origin/origin/master^{commit} # timeout=10
Checking out Revision ffcd7698aea7bcbb2b4edffc484793e1ff47b85d (refs/remotes/origin/master)
 > git config core.sparsecheckout # timeout=10
 > git checkout -f ffcd7698aea7bcbb2b4edffc484793e1ff47b85d
Commit message: "[AArch64] Adding support for PMMIR_EL1 register"
 > git rev-list --no-walk 65f61c0030c5c375852f27ff6dd21e6a078e2420 # timeout=10
No emails were triggered.
[LNT_Tests] $ /bin/sh -xe /var/folders/q0/p3jrdx7n2s74x5bnw_pkhqr80000gn/T/jenkins3899808446514785687.sh
+ set -u
+ rm -rf lnt.xunit.xml test-results.xunit.xml
+ echo '@@@ Configure Build @@@'
Configure Build

Hide Details

@@@ Configure Build @@@ + export PATH=/usr/local/bin/:/usr/bin:/bin:/usr/sbin:/sbin + PATH=/usr/local/bin/:/usr/bin:/bin:/usr/sbin:/sbin + export PYTHON_EGG_CACHE=/Users/buildslave/jenkins/workspace/LNT_Tests/python_egg_cache + PYTHON_EGG_CACHE=/Users/buildslave/jenkins/workspace/LNT_Tests/python_egg_cache + export PIP_DOWNLOAD_CACHE=/Users/buildslave/jenkins/workspace/LNT_Tests/pip_download_cache + PIP_DOWNLOAD_CACHE=/Users/buildslave/jenkins/workspace/LNT_Tests/pip_download_cache + rm -rf venv + virtualenv venv New python executable in /Users/buildslave/jenkins/workspace/LNT_Tests/venv/bin/python2.7 Also creating executable in /Users/buildslave/jenkins/workspace/LNT_Tests/venv/bin/python Installing setuptools, pip, wheel...done. + set +u + source venv/bin/activate ++ deactivate nondestructive ++ unset -f pydoc ++ '[' -z '' ']' ++ '[' -z '' ']' ++ '[' -n /bin/sh ']' ++ hash -r ++ '[' -z '' ']' ++ unset VIRTUAL_ENV ++ '[' '!' nondestructive = nondestructive ']' ++ VIRTUAL_ENV=/Users/buildslave/jenkins/workspace/LNT_Tests/venv ++ export VIRTUAL_ENV ++ _OLD_VIRTUAL_PATH=/usr/local/bin/:/usr/bin:/bin:/usr/sbin:/sbin ++ PATH=/Users/buildslave/jenkins/workspace/LNT_Tests/venv/bin:/usr/local/bin/:/usr/bin:/bin:/usr/sbin:/sbin ++ export PATH ++ '[' -z '' ']' ++ '[' -z '' ']' ++ _OLD_VIRTUAL_PS1= ++ '[' x '!=' x ']' +++ basename /Users/buildslave/jenkins/workspace/LNT_Tests/venv ++ PS1='(venv) ' ++ export PS1 ++ alias pydoc ++ '[' -n /bin/sh ']' ++ hash -r + set -u + curl https://bootstrap.pypa.io/get-pip.py + python % Total % Received % Xferd Average Speed Time Time Time Current Dload Upload Total Spent Left Speed 0 0 0 0 0 0 0 0 --:--:-- --:--:-- --:--:-- 0 0 0 0 0 0 0 0 0 --:--:-- 0:00:01 --:--:-- 0 0 0 0 0 0 0 0 0 --:--:-- 0:00:02 --:--:-- 0 62 1734k 62 1087k 0 0 394k 0 0:00:04 0:00:02 0:00:02 394k 100 1734k 100 1734k 0 0 614k 0 0:00:02 0:00:02 --:--:-- 614k DEPRECATION: Python 2.7 will reach the end of its life on January 1st, 2020. Please upgrade your Python as Python 2.7 won't be maintained after that date. A future version of pip will drop support for Python 2.7. More details about Python 2 support in pip, can be found at https://pip.pypa.io/en/latest/development/release-process/#python-2-support Collecting pip Using cached https://files.pythonhosted.org/packages/00/b6/9cfa56b4081ad13874b0c6f96af8ce16cfbc1cb06bedf8e9164ce5551ec1/pip-19.3.1-py2.py3-none-any.whl Installing collected packages: pip Found existing installation: pip 19.3.1 Uninstalling pip-19.3.1: Successfully uninstalled pip-19.3.1 Successfully installed pip-19.3.1 + echo @@@@@@ @@@@@@
+ echo '@@@ Dependencies @@@'
Dependencies

Hide Details

@@@ Dependencies @@@ + cd /Users/buildslave/jenkins/workspace/LNT_Tests/llvm-lnt + /Users/buildslave/jenkins/workspace/LNT_Tests/venv/bin/pip install -r requirements.txt DEPRECATION: Python 2.7 will reach the end of its life on January 1st, 2020. Please upgrade your Python as Python 2.7 won't be maintained after that date. A future version of pip will drop support for Python 2.7. More details about Python 2 support in pip, can be found at https://pip.pypa.io/en/latest/development/release-process/#python-2-support Collecting six Using cached https://files.pythonhosted.org/packages/73/fb/00a976f728d0d1fecfe898238ce23f502a721c0ac0ecfedb80e0d88c64e9/six-1.12.0-py2.py3-none-any.whl Processing /Users/buildslave/Library/Caches/pip/wheels/03/22/40/9b2f558eaa39d530e792583795d55365b67efb4299d0dbd5c7/aniso8601-1.2.0-cp27-none-any.whl Collecting Flask==0.12.2 Using cached https://files.pythonhosted.org/packages/77/32/e3597cb19ffffe724ad4bf0beca4153419918e7fa4ba6a34b04ee4da3371/Flask-0.12.2-py2.py3-none-any.whl Collecting Flask-RESTful==0.3.4 Using cached https://files.pythonhosted.org/packages/d5/9b/e512b03799f881a345c6b3c2feb35c9d9fa44943e08dc2628baa6383c1de/Flask_RESTful-0.3.4-py2.py3-none-any.whl Processing /Users/buildslave/Library/Caches/pip/wheels/59/a3/6b/51924066cac6ac011024f40b5575b7a4a0a146836644d8b4cf/Jinja2-2.7.2-cp27-none-any.whl Processing /Users/buildslave/Library/Caches/pip/wheels/28/de/65/f28b426d990edb591113e1549c8a0f09034e5958e440629306/MarkupSafe-0.23-cp27-cp27m-macosx_10_10_x86_64.whl Processing /Users/buildslave/Library/Caches/pip/wheels/c2/05/49/544f56621e6766ebeba43c42f7ea4405bcd37cff04c3e571a6/SQLAlchemy-1.1.11-cp27-cp27m-macosx_10_10_x86_64.whl Collecting Werkzeug==0.12.2 Using cached https://files.pythonhosted.org/packages/97/02/306e0d57fdbf467ec1c763bc1757ec6ba20b1332e0ea7e49111533d71d1c/Werkzeug-0.12.2-py2.py3-none-any.whl Processing /Users/buildslave/Library/Caches/pip/wheels/2c/4a/61/5599631c1554768c6290b08c02c72d7317910374ca602ff1e5/itsdangerous-0.24-cp27-none-any.whl Collecting python-dateutil==2.6.0 Using cached https://files.pythonhosted.org/packages/40/8b/275015d7a9ec293cf1bbf55433258fbc9d0711890a7f6dc538bac7b86bce/python_dateutil-2.6.0-py2.py3-none-any.whl Processing /Users/buildslave/Library/Caches/pip/wheels/1f/cf/6a/f2821cc41923b0714765ae30fe699d7d7b5d233a208eedd1d6/python_gnupg-0.3.7-cp27-none-any.whl Collecting pytz==2016.10 Using cached https://files.pythonhosted.org/packages/f5/fa/4a9aefc206aa49a4b5e0a72f013df1f471b4714cdbe6d78f0134feeeecdb/pytz-2016.10-py2.py3-none-any.whl Collecting WTForms==2.0.2 Using cached https://files.pythonhosted.org/packages/3a/fd/8dd4b9cbe8d71b415399228db1c2f84b869eb682c3046869376955d892b7/WTForms-2.0.2-py27-none-any.whl Collecting Flask-WTF==0.12 Using cached https://files.pythonhosted.org/packages/2e/2f/47f6bc1d15d7df32a49582028d71caa7f6a8b53b61e0ca48ebdc9ed2c881/Flask_WTF-0.12-py2-none-any.whl Collecting typing Using cached https://files.pythonhosted.org/packages/22/30/64ca29543375759dc589ade14a6cd36382abf2bec17d67de8481bc9814d7/typing-3.7.4.1-py2-none-any.whl Collecting click==6.7 Using cached https://files.pythonhosted.org/packages/34/c1/8806f99713ddb993c5366c362b2f908f18269f8d792aff1abfd700775a77/click-6.7-py2.py3-none-any.whl Processing /Users/buildslave/Library/Caches/pip/wheels/ad/da/0c/74eb680767247273e2cf2723482cb9c924fe70af57c334513f/PyYAML-3.13-cp27-cp27m-macosx_10_10_x86_64.whl Collecting requests Using cached https://files.pythonhosted.org/packages/51/bd/23c926cd341ea6b7dd0b2a00aba99ae0f828be89d72b2190f27c11d4b7fb/requests-2.22.0-py2.py3-none-any.whl Processing /Users/buildslave/Library/Caches/pip/wheels/74/bc/50/ae030267a192919b289f84661cfeb5573cf383841c543e8696/future-0.18.1-cp27-none-any.whl Obtaining lit from svn+https://llvm.org/svn/llvm-project/llvm/trunk/utils/lit/#egg=lit (from -r requirements.client.txt (line 21))
SVN Checking out

Hide Details

Checking out https://llvm.org/svn/llvm-project/llvm/trunk/utils/lit/ to /Users/buildslave/jenkins/workspace/LNT_Tests/venv/src/lit Running command svn checkout -q --non-interactive https://llvm.org/svn/llvm-project/llvm/trunk/utils/lit/ /Users/buildslave/jenkins/workspace/LNT_Tests/venv/src/lit Collecting psycopg2==2.7 Using cached https://files.pythonhosted.org/packages/9e/1b/3eab32f7afbc1a812e00d6f37ad12c539a50ca9be4979195aaf293f16e3c/psycopg2-2.7-cp27-cp27m-macosx_10_6_intel.macosx_10_9_intel.macosx_10_9_x86_64.macosx_10_10_intel.macosx_10_10_x86_64.whl Processing /Users/buildslave/Library/Caches/pip/wheels/61/12/6d/27e0d8c49a317c509c131d818b8fc94d1cbfbc61a479d5a396/gunicorn-18.0-cp27-none-any.whl Collecting progressbar2 Using cached https://files.pythonhosted.org/packages/16/68/adc395e0a3c86571081c8a2e2daaa5b58270f6854276a089a0e9b5fa2c33/progressbar2-3.47.0-py2.py3-none-any.whl Collecting idna<2.9,>=2.5 Using cached https://files.pythonhosted.org/packages/14/2c/cd551d81dbe15200be1cf41cd03869a46fe7226e7450af7a6545bfc474c9/idna-2.8-py2.py3-none-any.whl Collecting chardet<3.1.0,>=3.0.2 Using cached https://files.pythonhosted.org/packages/bc/a9/01ffebfb562e4274b6487b4bb1ddec7ca55ec7510b22e4c51f14098443b8/chardet-3.0.4-py2.py3-none-any.whl Collecting certifi>=2017.4.17 Using cached https://files.pythonhosted.org/packages/18/b0/8146a4f8dd402f60744fa380bc73ca47303cccf8b9190fd16a827281eac2/certifi-2019.9.11-py2.py3-none-any.whl Collecting urllib3!=1.25.0,!=1.25.1,<1.26,>=1.21.1 Using cached https://files.pythonhosted.org/packages/e0/da/55f51ea951e1b7c63a579c09dd7db825bb730ec1fe9c0180fc77bfb31448/urllib3-1.25.6-py2.py3-none-any.whl Collecting python-utils>=2.3.0 Using cached https://files.pythonhosted.org/packages/eb/a0/19119d8b7c05be49baf6c593f11c432d571b70d805f2fe94c0585e55e4c8/python_utils-2.3.0-py2.py3-none-any.whl Installing collected packages: six, python-dateutil, aniso8601, click, Werkzeug, MarkupSafe, Jinja2, itsdangerous, Flask, pytz, Flask-RESTful, SQLAlchemy, python-gnupg, WTForms, Flask-WTF, typing, pyyaml, idna, chardet, certifi, urllib3, requests, future, lit, psycopg2, gunicorn, python-utils, progressbar2 Running setup.py develop for lit Successfully installed Flask-0.12.2 Flask-RESTful-0.3.4 Flask-WTF-0.12 Jinja2-2.7.2 MarkupSafe-0.23 SQLAlchemy-1.1.11 WTForms-2.0.2 Werkzeug-0.12.2 aniso8601-1.2.0 certifi-2019.9.11 chardet-3.0.4 click-6.7 future-0.18.1 gunicorn-18.0 idna-2.8 itsdangerous-0.24 lit progressbar2-3.47.0 psycopg2-2.7 python-dateutil-2.6.0 python-gnupg-0.3.7 python-utils-2.3.0 pytz-2016.10 pyyaml-3.13 requests-2.22.0 six-1.12.0 typing-3.7.4.1 urllib3-1.25.6 + /Users/buildslave/jenkins/workspace/LNT_Tests/venv/bin/pip install pep8 sphinx sphinx-bootstrap-theme DEPRECATION: Python 2.7 will reach the end of its life on January 1st, 2020. Please upgrade your Python as Python 2.7 won't be maintained after that date. A future version of pip will drop support for Python 2.7. More details about Python 2 support in pip, can be found at https://pip.pypa.io/en/latest/development/release-process/#python-2-support Collecting pep8 Using cached https://files.pythonhosted.org/packages/42/3f/669429ce58de2c22d8d2c542752e137ec4b9885fff398d3eceb1a7f5acb4/pep8-1.7.1-py2.py3-none-any.whl Collecting sphinx Using cached https://files.pythonhosted.org/packages/7d/66/a4af242b4348b729b9d46ce5db23943ce9bca7da9bbe2ece60dc27f26420/Sphinx-1.8.5-py2.py3-none-any.whl Processing /Users/buildslave/Library/Caches/pip/wheels/71/28/10/e04d1ab1110dbde7f436dd159ed5ee35113f66536df6d99a79/sphinx_bootstrap_theme-0.7.1-cp27-none-any.whl Requirement already satisfied: setuptools in /Users/buildslave/jenkins/workspace/LNT_Tests/venv/lib/python2.7/site-packages (from sphinx) (41.4.0) Requirement already satisfied: requests>=2.0.0 in /Users/buildslave/jenkins/workspace/LNT_Tests/venv/lib/python2.7/site-packages (from sphinx) (2.22.0) Collecting babel!=2.0,>=1.3 Using cached https://files.pythonhosted.org/packages/2c/60/f2af68eb046c5de5b1fe6dd4743bf42c074f7141fe7b2737d3061533b093/Babel-2.7.0-py2.py3-none-any.whl Collecting sphinxcontrib-websupport Using cached https://files.pythonhosted.org/packages/2a/59/d64bda9b7480a84a3569be4dde267c0f6675b255ba63b4c8e84469940457/sphinxcontrib_websupport-1.1.2-py2.py3-none-any.whl Collecting Pygments>=2.0 Using cached https://files.pythonhosted.org/packages/5c/73/1dfa428150e3ccb0fa3e68db406e5be48698f2a979ccbcec795f28f44048/Pygments-2.4.2-py2.py3-none-any.whl Collecting snowballstemmer>=1.1 Using cached https://files.pythonhosted.org/packages/7d/4b/cdf1113a0e88b641893b814e9c36f69a6fda28cd88b62c7f0d858cde3166/snowballstemmer-2.0.0-py2.py3-none-any.whl Collecting alabaster<0.8,>=0.7 Using cached https://files.pythonhosted.org/packages/10/ad/00b090d23a222943eb0eda509720a404f531a439e803f6538f35136cae9e/alabaster-0.7.12-py2.py3-none-any.whl Requirement already satisfied: typing; python_version < "3.5" in /Users/buildslave/jenkins/workspace/LNT_Tests/venv/lib/python2.7/site-packages (from sphinx) (3.7.4.1) Requirement already satisfied: six>=1.5 in /Users/buildslave/jenkins/workspace/LNT_Tests/venv/lib/python2.7/site-packages (from sphinx) (1.12.0) Collecting imagesize Using cached https://files.pythonhosted.org/packages/fc/b6/aef66b4c52a6ad6ac18cf6ebc5731ed06d8c9ae4d3b2d9951f261150be67/imagesize-1.1.0-py2.py3-none-any.whl Collecting packaging Using cached https://files.pythonhosted.org/packages/cf/94/9672c2d4b126e74c4496c6b3c58a8b51d6419267be9e70660ba23374c875/packaging-19.2-py2.py3-none-any.whl Requirement already satisfied: Jinja2>=2.3 in /Users/buildslave/jenkins/workspace/LNT_Tests/venv/lib/python2.7/site-packages (from sphinx) (2.7.2) Collecting docutils>=0.11 Using cached https://files.pythonhosted.org/packages/3a/dc/bf2b15d1fa15a6f7a9e77a61b74ecbbae7258558fcda8ffc9a6638a6b327/docutils-0.15.2-py2-none-any.whl Requirement already satisfied: idna<2.9,>=2.5 in /Users/buildslave/jenkins/workspace/LNT_Tests/venv/lib/python2.7/site-packages (from requests>=2.0.0->sphinx) (2.8) Requirement already satisfied: chardet<3.1.0,>=3.0.2 in /Users/buildslave/jenkins/workspace/LNT_Tests/venv/lib/python2.7/site-packages (from requests>=2.0.0->sphinx) (3.0.4) Requirement already satisfied: certifi>=2017.4.17 in /Users/buildslave/jenkins/workspace/LNT_Tests/venv/lib/python2.7/site-packages (from requests>=2.0.0->sphinx) (2019.9.11) Requirement already satisfied: urllib3!=1.25.0,!=1.25.1,<1.26,>=1.21.1 in /Users/buildslave/jenkins/workspace/LNT_Tests/venv/lib/python2.7/site-packages (from requests>=2.0.0->sphinx) (1.25.6) Requirement already satisfied: pytz>=2015.7 in /Users/buildslave/jenkins/workspace/LNT_Tests/venv/lib/python2.7/site-packages (from babel!=2.0,>=1.3->sphinx) (2016.10) Collecting pyparsing>=2.0.2 Using cached https://files.pythonhosted.org/packages/11/fa/0160cd525c62d7abd076a070ff02b2b94de589f1a9789774f17d7c54058e/pyparsing-2.4.2-py2.py3-none-any.whl Requirement already satisfied: markupsafe in /Users/buildslave/jenkins/workspace/LNT_Tests/venv/lib/python2.7/site-packages (from Jinja2>=2.3->sphinx) (0.23) Installing collected packages: pep8, babel, sphinxcontrib-websupport, Pygments, snowballstemmer, alabaster, imagesize, pyparsing, packaging, docutils, sphinx, sphinx-bootstrap-theme Successfully installed Pygments-2.4.2 alabaster-0.7.12 babel-2.7.0 docutils-0.15.2 imagesize-1.1.0 packaging-19.2 pep8-1.7.1 pyparsing-2.4.2 snowballstemmer-2.0.0 sphinx-1.8.5 sphinx-bootstrap-theme-0.7.1 sphinxcontrib-websupport-1.1.2 + /Users/buildslave/jenkins/workspace/LNT_Tests/venv/bin/pip install mysql-python DEPRECATION: Python 2.7 will reach the end of its life on January 1st, 2020. Please upgrade your Python as Python 2.7 won't be maintained after that date. A future version of pip will drop support for Python 2.7. More details about Python 2 support in pip, can be found at https://pip.pypa.io/en/latest/development/release-process/#python-2-support Processing /Users/buildslave/Library/Caches/pip/wheels/07/d2/5f/314860e4cb53a44bf0ee0d051d4b34465e4b4fbe9de6d42f42/MySQL_python-1.2.5-cp27-cp27m-macosx_10_10_x86_64.whl Installing collected packages: mysql-python Successfully installed mysql-python-1.2.5 + killall mysqld No matching processes belonging to you were found + true + /Users/buildslave/jenkins/workspace/LNT_Tests/venv/bin/python setup.py develop running develop running egg_info writing requirements to LNT.egg-info/requires.txt writing LNT.egg-info/PKG-INFO writing top-level names to LNT.egg-info/top_level.txt writing dependency_links to LNT.egg-info/dependency_links.txt writing entry points to LNT.egg-info/entry_points.txt reading manifest file 'LNT.egg-info/SOURCES.txt' reading manifest template 'MANIFEST.in' no previously-included directories found matching 'tests/*/Output' writing manifest file 'LNT.egg-info/SOURCES.txt' running build_ext copying build/lib.macosx-10.10-x86_64-2.7/lnt/testing/profile/cPerf.so -> lnt/testing/profile Creating /Users/buildslave/jenkins/workspace/LNT_Tests/venv/lib/python2.7/site-packages/LNT.egg-link (link to .) Adding LNT 0.4.2.dev0 to easy-install.pth file Installing lnt script to /Users/buildslave/jenkins/workspace/LNT_Tests/venv/bin

Hide Details

Installed /Users/buildslave/jenkins/workspace/LNT_Tests/llvm-lnt Processing dependencies for LNT==0.4.2.dev0 Searching for lit==0.10.0.dev0 Best match: lit 0.10.0.dev0 lit 0.10.0.dev0 is already the active version in easy-install.pth Installing lit script to /Users/buildslave/jenkins/workspace/LNT_Tests/venv/bin

Hide Details

Using /Users/buildslave/jenkins/workspace/LNT_Tests/venv/src/lit Searching for future==0.18.1 Best match: future 0.18.1 Adding future 0.18.1 to easy-install.pth file Installing pasteurize script to /Users/buildslave/jenkins/workspace/LNT_Tests/venv/bin Installing futurize script to /Users/buildslave/jenkins/workspace/LNT_Tests/venv/bin

Hide Details

Using /Users/buildslave/jenkins/workspace/LNT_Tests/venv/lib/python2.7/site-packages Searching for requests==2.22.0 Best match: requests 2.22.0 Adding requests 2.22.0 to easy-install.pth file

Hide Details

Using /Users/buildslave/jenkins/workspace/LNT_Tests/venv/lib/python2.7/site-packages Searching for PyYAML==3.13 Best match: PyYAML 3.13 Adding PyYAML 3.13 to easy-install.pth file

Hide Details

Using /Users/buildslave/jenkins/workspace/LNT_Tests/venv/lib/python2.7/site-packages Searching for click==6.7 Best match: click 6.7 Adding click 6.7 to easy-install.pth file

Hide Details

Using /Users/buildslave/jenkins/workspace/LNT_Tests/venv/lib/python2.7/site-packages Searching for typing==3.7.4.1 Best match: typing 3.7.4.1 Adding typing 3.7.4.1 to easy-install.pth file

Hide Details

Using /Users/buildslave/jenkins/workspace/LNT_Tests/venv/lib/python2.7/site-packages Searching for Flask-WTF==0.12 Best match: Flask-WTF 0.12 Adding Flask-WTF 0.12 to easy-install.pth file

Hide Details

Using /Users/buildslave/jenkins/workspace/LNT_Tests/venv/lib/python2.7/site-packages Searching for WTForms==2.0.2 Best match: WTForms 2.0.2 Adding WTForms 2.0.2 to easy-install.pth file

Hide Details

Using /Users/buildslave/jenkins/workspace/LNT_Tests/venv/lib/python2.7/site-packages Searching for pytz==2016.10 Best match: pytz 2016.10 Adding pytz 2016.10 to easy-install.pth file

Hide Details

Using /Users/buildslave/jenkins/workspace/LNT_Tests/venv/lib/python2.7/site-packages Searching for python-gnupg==0.3.7 Best match: python-gnupg 0.3.7 Adding python-gnupg 0.3.7 to easy-install.pth file

Hide Details

Using /Users/buildslave/jenkins/workspace/LNT_Tests/venv/lib/python2.7/site-packages Searching for python-dateutil==2.6.0 Best match: python-dateutil 2.6.0 Adding python-dateutil 2.6.0 to easy-install.pth file

Hide Details

Using /Users/buildslave/jenkins/workspace/LNT_Tests/venv/lib/python2.7/site-packages Searching for itsdangerous==0.24 Best match: itsdangerous 0.24 Adding itsdangerous 0.24 to easy-install.pth file

Hide Details

Using /Users/buildslave/jenkins/workspace/LNT_Tests/venv/lib/python2.7/site-packages Searching for Werkzeug==0.12.2 Best match: Werkzeug 0.12.2 Adding Werkzeug 0.12.2 to easy-install.pth file

Hide Details

Using /Users/buildslave/jenkins/workspace/LNT_Tests/venv/lib/python2.7/site-packages Searching for SQLAlchemy==1.1.11 Best match: SQLAlchemy 1.1.11 Adding SQLAlchemy 1.1.11 to easy-install.pth file

Hide Details

Using /Users/buildslave/jenkins/workspace/LNT_Tests/venv/lib/python2.7/site-packages Searching for MarkupSafe==0.23 Best match: MarkupSafe 0.23 Adding MarkupSafe 0.23 to easy-install.pth file

Hide Details

Using /Users/buildslave/jenkins/workspace/LNT_Tests/venv/lib/python2.7/site-packages Searching for Jinja2==2.7.2 Best match: Jinja2 2.7.2 Adding Jinja2 2.7.2 to easy-install.pth file

Hide Details

Using /Users/buildslave/jenkins/workspace/LNT_Tests/venv/lib/python2.7/site-packages Searching for Flask-RESTful==0.3.4 Best match: Flask-RESTful 0.3.4 Adding Flask-RESTful 0.3.4 to easy-install.pth file

Hide Details

Using /Users/buildslave/jenkins/workspace/LNT_Tests/venv/lib/python2.7/site-packages Searching for Flask==0.12.2 Best match: Flask 0.12.2 Adding Flask 0.12.2 to easy-install.pth file Installing flask script to /Users/buildslave/jenkins/workspace/LNT_Tests/venv/bin

Hide Details

Using /Users/buildslave/jenkins/workspace/LNT_Tests/venv/lib/python2.7/site-packages Searching for aniso8601==1.2.0 Best match: aniso8601 1.2.0 Adding aniso8601 1.2.0 to easy-install.pth file

Hide Details

Using /Users/buildslave/jenkins/workspace/LNT_Tests/venv/lib/python2.7/site-packages Searching for six==1.12.0 Best match: six 1.12.0 Adding six 1.12.0 to easy-install.pth file

Hide Details

Using /Users/buildslave/jenkins/workspace/LNT_Tests/venv/lib/python2.7/site-packages Searching for urllib3==1.25.6 Best match: urllib3 1.25.6 Adding urllib3 1.25.6 to easy-install.pth file

Hide Details

Using /Users/buildslave/jenkins/workspace/LNT_Tests/venv/lib/python2.7/site-packages Searching for certifi==2019.9.11 Best match: certifi 2019.9.11 Adding certifi 2019.9.11 to easy-install.pth file

Hide Details

Using /Users/buildslave/jenkins/workspace/LNT_Tests/venv/lib/python2.7/site-packages Searching for chardet==3.0.4 Best match: chardet 3.0.4 Adding chardet 3.0.4 to easy-install.pth file Installing chardetect script to /Users/buildslave/jenkins/workspace/LNT_Tests/venv/bin

Hide Details

Using /Users/buildslave/jenkins/workspace/LNT_Tests/venv/lib/python2.7/site-packages Searching for idna==2.8 Best match: idna 2.8 Adding idna 2.8 to easy-install.pth file

Hide Details

Using /Users/buildslave/jenkins/workspace/LNT_Tests/venv/lib/python2.7/site-packages Finished processing dependencies for LNT==0.4.2.dev0 + cd .. + cd /Users/buildslave/jenkins/workspace/LNT_Tests/llvm-project/llvm/utils/lit + /Users/buildslave/jenkins/workspace/LNT_Tests/venv/bin/python setup.py install /Users/buildslave/jenkins/workspace/LNT_Tests/venv/lib/python2.7/site-packages/setuptools/dist.py:475: UserWarning: Normalizing '0.10.0dev' to '0.10.0.dev0' normalized_version, running install running bdist_egg running egg_info writing lit.egg-info/PKG-INFO writing top-level names to lit.egg-info/top_level.txt writing dependency_links to lit.egg-info/dependency_links.txt writing entry points to lit.egg-info/entry_points.txt reading manifest file 'lit.egg-info/SOURCES.txt' reading manifest template 'MANIFEST.in' warning: no files found matching 'TODO' warning: no previously-included files matching '*pyc' found anywhere in distribution warning: no previously-included files matching '*~' found anywhere in distribution no previously-included directories found matching 'tests/Output' no previously-included directories found matching 'tests/*/Output' no previously-included directories found matching 'tests/*/*/Output' no previously-included directories found matching 'tests/*/*/*/Output' writing manifest file 'lit.egg-info/SOURCES.txt' installing library code to build/bdist.macosx-10.10-x86_64/egg running install_lib running build_py creating build/bdist.macosx-10.10-x86_64/egg creating build/bdist.macosx-10.10-x86_64/egg/lit copying build/lib/lit/__init__.py -> build/bdist.macosx-10.10-x86_64/egg/lit copying build/lib/lit/BooleanExpression.py -> build/bdist.macosx-10.10-x86_64/egg/lit creating build/bdist.macosx-10.10-x86_64/egg/lit/builtin_commands copying build/lib/lit/builtin_commands/__init__.py -> build/bdist.macosx-10.10-x86_64/egg/lit/builtin_commands copying build/lib/lit/builtin_commands/cat.py -> build/bdist.macosx-10.10-x86_64/egg/lit/builtin_commands copying build/lib/lit/builtin_commands/diff.py -> build/bdist.macosx-10.10-x86_64/egg/lit/builtin_commands copying build/lib/lit/cl_arguments.py -> build/bdist.macosx-10.10-x86_64/egg/lit copying build/lib/lit/discovery.py -> build/bdist.macosx-10.10-x86_64/egg/lit copying build/lib/lit/display.py -> build/bdist.macosx-10.10-x86_64/egg/lit creating build/bdist.macosx-10.10-x86_64/egg/lit/formats copying build/lib/lit/formats/__init__.py -> build/bdist.macosx-10.10-x86_64/egg/lit/formats copying build/lib/lit/formats/base.py -> build/bdist.macosx-10.10-x86_64/egg/lit/formats copying build/lib/lit/formats/googletest.py -> build/bdist.macosx-10.10-x86_64/egg/lit/formats copying build/lib/lit/formats/shtest.py -> build/bdist.macosx-10.10-x86_64/egg/lit/formats copying build/lib/lit/LitConfig.py -> build/bdist.macosx-10.10-x86_64/egg/lit copying build/lib/lit/LitTestCase.py -> build/bdist.macosx-10.10-x86_64/egg/lit creating build/bdist.macosx-10.10-x86_64/egg/lit/llvm copying build/lib/lit/llvm/__init__.py -> build/bdist.macosx-10.10-x86_64/egg/lit/llvm copying build/lib/lit/llvm/config.py -> build/bdist.macosx-10.10-x86_64/egg/lit/llvm copying build/lib/lit/llvm/subst.py -> build/bdist.macosx-10.10-x86_64/egg/lit/llvm copying build/lib/lit/main.py -> build/bdist.macosx-10.10-x86_64/egg/lit copying build/lib/lit/ProgressBar.py -> build/bdist.macosx-10.10-x86_64/egg/lit copying build/lib/lit/run.py -> build/bdist.macosx-10.10-x86_64/egg/lit copying build/lib/lit/ShCommands.py -> build/bdist.macosx-10.10-x86_64/egg/lit copying build/lib/lit/ShUtil.py -> build/bdist.macosx-10.10-x86_64/egg/lit copying build/lib/lit/Test.py -> build/bdist.macosx-10.10-x86_64/egg/lit copying build/lib/lit/TestingConfig.py -> build/bdist.macosx-10.10-x86_64/egg/lit copying build/lib/lit/TestRunner.py -> build/bdist.macosx-10.10-x86_64/egg/lit copying build/lib/lit/util.py -> build/bdist.macosx-10.10-x86_64/egg/lit copying build/lib/lit/worker.py -> build/bdist.macosx-10.10-x86_64/egg/lit byte-compiling build/bdist.macosx-10.10-x86_64/egg/lit/__init__.py to __init__.pyc byte-compiling build/bdist.macosx-10.10-x86_64/egg/lit/BooleanExpression.py to BooleanExpression.pyc byte-compiling build/bdist.macosx-10.10-x86_64/egg/lit/builtin_commands/__init__.py to __init__.pyc byte-compiling build/bdist.macosx-10.10-x86_64/egg/lit/builtin_commands/cat.py to cat.pyc byte-compiling build/bdist.macosx-10.10-x86_64/egg/lit/builtin_commands/diff.py to diff.pyc byte-compiling build/bdist.macosx-10.10-x86_64/egg/lit/cl_arguments.py to cl_arguments.pyc byte-compiling build/bdist.macosx-10.10-x86_64/egg/lit/discovery.py to discovery.pyc byte-compiling build/bdist.macosx-10.10-x86_64/egg/lit/display.py to display.pyc byte-compiling build/bdist.macosx-10.10-x86_64/egg/lit/formats/__init__.py to __init__.pyc byte-compiling build/bdist.macosx-10.10-x86_64/egg/lit/formats/base.py to base.pyc byte-compiling build/bdist.macosx-10.10-x86_64/egg/lit/formats/googletest.py to googletest.pyc byte-compiling build/bdist.macosx-10.10-x86_64/egg/lit/formats/shtest.py to shtest.pyc byte-compiling build/bdist.macosx-10.10-x86_64/egg/lit/LitConfig.py to LitConfig.pyc byte-compiling build/bdist.macosx-10.10-x86_64/egg/lit/LitTestCase.py to LitTestCase.pyc byte-compiling build/bdist.macosx-10.10-x86_64/egg/lit/llvm/__init__.py to __init__.pyc byte-compiling build/bdist.macosx-10.10-x86_64/egg/lit/llvm/config.py to config.pyc byte-compiling build/bdist.macosx-10.10-x86_64/egg/lit/llvm/subst.py to subst.pyc byte-compiling build/bdist.macosx-10.10-x86_64/egg/lit/main.py to main.pyc byte-compiling build/bdist.macosx-10.10-x86_64/egg/lit/ProgressBar.py to ProgressBar.pyc byte-compiling build/bdist.macosx-10.10-x86_64/egg/lit/run.py to run.pyc byte-compiling build/bdist.macosx-10.10-x86_64/egg/lit/ShCommands.py to ShCommands.pyc byte-compiling build/bdist.macosx-10.10-x86_64/egg/lit/ShUtil.py to ShUtil.pyc byte-compiling build/bdist.macosx-10.10-x86_64/egg/lit/Test.py to Test.pyc byte-compiling build/bdist.macosx-10.10-x86_64/egg/lit/TestingConfig.py to TestingConfig.pyc byte-compiling build/bdist.macosx-10.10-x86_64/egg/lit/TestRunner.py to TestRunner.pyc byte-compiling build/bdist.macosx-10.10-x86_64/egg/lit/util.py to util.pyc byte-compiling build/bdist.macosx-10.10-x86_64/egg/lit/worker.py to worker.pyc creating build/bdist.macosx-10.10-x86_64/egg/EGG-INFO copying lit.egg-info/PKG-INFO -> build/bdist.macosx-10.10-x86_64/egg/EGG-INFO copying lit.egg-info/SOURCES.txt -> build/bdist.macosx-10.10-x86_64/egg/EGG-INFO copying lit.egg-info/dependency_links.txt -> build/bdist.macosx-10.10-x86_64/egg/EGG-INFO copying lit.egg-info/entry_points.txt -> build/bdist.macosx-10.10-x86_64/egg/EGG-INFO copying lit.egg-info/not-zip-safe -> build/bdist.macosx-10.10-x86_64/egg/EGG-INFO copying lit.egg-info/top_level.txt -> build/bdist.macosx-10.10-x86_64/egg/EGG-INFO creating 'dist/lit-0.10.0.dev0-py2.7.egg' and adding 'build/bdist.macosx-10.10-x86_64/egg' to it removing 'build/bdist.macosx-10.10-x86_64/egg' (and everything under it) Processing lit-0.10.0.dev0-py2.7.egg creating /Users/buildslave/jenkins/workspace/LNT_Tests/venv/lib/python2.7/site-packages/lit-0.10.0.dev0-py2.7.egg Extracting lit-0.10.0.dev0-py2.7.egg to /Users/buildslave/jenkins/workspace/LNT_Tests/venv/lib/python2.7/site-packages Removing lit 0.10.0.dev0 from easy-install.pth file Adding lit 0.10.0.dev0 to easy-install.pth file Installing lit script to /Users/buildslave/jenkins/workspace/LNT_Tests/venv/bin

Hide Details

Installed /Users/buildslave/jenkins/workspace/LNT_Tests/venv/lib/python2.7/site-packages/lit-0.10.0.dev0-py2.7.egg Processing dependencies for lit==0.10.0.dev0 Finished processing dependencies for lit==0.10.0.dev0 + cd .. + cd /Users/buildslave/jenkins/workspace/LNT_Tests/llvm-lnt/tests/ + echo @@@@@@ @@@@@@ + echo '@@@ Test LNT @@@'
Test LNT

Hide Details

@@@ Test LNT @@@ + rm -rf test_run_tmp + /Users/buildslave/jenkins/workspace/LNT_Tests/venv/bin/lit -j1 --xunit-xml-output=/Users/buildslave/jenkins/workspace/LNT_Tests/lnt.xunit.xml -v --param postgres=True --param mysql=True . -- Testing: 72 tests, 1 workers -- PASS: LNT :: Formats/json.py (1 of 72) PASS: LNT :: Formats/plist.py (2 of 72) PASS: LNT :: lnttool/MySQLDB.shtest (3 of 72) PASS: LNT :: lnttool/PostgresDB.shtest (4 of 72) PASS: LNT :: lnttool/Profile.py (5 of 72) PASS: LNT :: lnttool/UpdateDB.py (6 of 72) PASS: LNT :: lnttool/admin.shtest (7 of 72) PASS: LNT :: lnttool/check_no_errors.shtest (8 of 72) PASS: LNT :: lnttool/checkformat.shtest (9 of 72) PASS: LNT :: lnttool/email_tools.py (10 of 72) PASS: LNT :: lnttool/showtests.shtest (11 of 72) PASS: LNT :: lnttool/submit.shtest (12 of 72) PASS: LNT :: lnttool/submit_badurl.shtest (13 of 72) PASS: LNT :: lnttool/test_importreport.py (14 of 72) PASS: LNT :: lnttool/view-comparison.shtest (15 of 72) PASS: LNT :: runtest/exclude_stat.py (16 of 72) PASS: LNT :: runtest/multisample.py (17 of 72) PASS: LNT :: runtest/nt-darwin.py (18 of 72) FAIL: LNT :: runtest/nt.py (19 of 72) ******************** TEST 'LNT :: runtest/nt.py' FAILED ******************** Script: -- : 'RUN: at line 4'; lnt runtest nt --sandbox /Users/buildslave/jenkins/workspace/LNT_Tests/llvm-lnt/tests/test_run_tmp/runtest/Output/nt.py.tmp.SANDBOX --test-suite /Users/buildslave/jenkins/workspace/LNT_Tests/llvm-lnt/tests/runtest/Inputs/test-suite --cc /Users/buildslave/jenkins/workspace/LNT_Tests/llvm-lnt/tests/../tests/SharedInputs/FakeCompilers/clang-r154331 --no-timestamp > /Users/buildslave/jenkins/workspace/LNT_Tests/llvm-lnt/tests/test_run_tmp/runtest/Output/nt.py.tmp.log 2> /Users/buildslave/jenkins/workspace/LNT_Tests/llvm-lnt/tests/test_run_tmp/runtest/Output/nt.py.tmp.err : 'RUN: at line 9'; FileCheck --check-prefix CHECK-STDOUT < /Users/buildslave/jenkins/workspace/LNT_Tests/llvm-lnt/tests/test_run_tmp/runtest/Output/nt.py.tmp.log /Users/buildslave/jenkins/workspace/LNT_Tests/llvm-lnt/tests/runtest/nt.py : 'RUN: at line 10'; FileCheck --check-prefix CHECK-BASIC < /Users/buildslave/jenkins/workspace/LNT_Tests/llvm-lnt/tests/test_run_tmp/runtest/Output/nt.py.tmp.err /Users/buildslave/jenkins/workspace/LNT_Tests/llvm-lnt/tests/runtest/nt.py : 'RUN: at line 11'; FileCheck --check-prefix CHECK-REPORT < /Users/buildslave/jenkins/workspace/LNT_Tests/llvm-lnt/tests/test_run_tmp/runtest/Output/nt.py.tmp.SANDBOX/build/report.json /Users/buildslave/jenkins/workspace/LNT_Tests/llvm-lnt/tests/runtest/nt.py : 'RUN: at line 34'; lnt runtest nt --sandbox /Users/buildslave/jenkins/workspace/LNT_Tests/llvm-lnt/tests/test_run_tmp/runtest/Output/nt.py.tmp.SANDBOX --test-suite /Users/buildslave/jenkins/workspace/LNT_Tests/llvm-lnt/tests/runtest/Inputs/test-suite --cc /Users/buildslave/jenkins/workspace/LNT_Tests/llvm-lnt/tests/../tests/SharedInputs/FakeCompilers/clang-r154331 --no-timestamp --no-configure > /Users/buildslave/jenkins/workspace/LNT_Tests/llvm-lnt/tests/test_run_tmp/runtest/Output/nt.py.tmp.log 2> /Users/buildslave/jenkins/workspace/LNT_Tests/llvm-lnt/tests/test_run_tmp/runtest/Output/nt.py.tmp.err : 'RUN: at line 39'; FileCheck --check-prefix CHECK-NOCONF < /Users/buildslave/jenkins/workspace/LNT_Tests/llvm-lnt/tests/test_run_tmp/runtest/Output/nt.py.tmp.err /Users/buildslave/jenkins/workspace/LNT_Tests/llvm-lnt/tests/runtest/nt.py : 'RUN: at line 43'; lnt runtest nt --sandbox /Users/buildslave/jenkins/workspace/LNT_Tests/llvm-lnt/tests/test_run_tmp/runtest/Output/nt.py.tmp.SANDBOX-NO-HASH --test-suite /Users/buildslave/jenkins/workspace/LNT_Tests/llvm-lnt/tests/runtest/Inputs/test-suite-nohash --cc /Users/buildslave/jenkins/workspace/LNT_Tests/llvm-lnt/tests/../tests/SharedInputs/FakeCompilers/clang-r154331 --no-timestamp > /Users/buildslave/jenkins/workspace/LNT_Tests/llvm-lnt/tests/test_run_tmp/runtest/Output/nt.py.tmp.log 2> /Users/buildslave/jenkins/workspace/LNT_Tests/llvm-lnt/tests/test_run_tmp/runtest/Output/nt.py.tmp.err : 'RUN: at line 48'; FileCheck --check-prefix CHECK-STDOUT < /Users/buildslave/jenkins/workspace/LNT_Tests/llvm-lnt/tests/test_run_tmp/runtest/Output/nt.py.tmp.log /Users/buildslave/jenkins/workspace/LNT_Tests/llvm-lnt/tests/runtest/nt.py : 'RUN: at line 49'; FileCheck --check-prefix CHECK-BASIC < /Users/buildslave/jenkins/workspace/LNT_Tests/llvm-lnt/tests/test_run_tmp/runtest/Output/nt.py.tmp.err /Users/buildslave/jenkins/workspace/LNT_Tests/llvm-lnt/tests/runtest/nt.py : 'RUN: at line 50'; FileCheck --check-prefix CHECK-REPORT < /Users/buildslave/jenkins/workspace/LNT_Tests/llvm-lnt/tests/test_run_tmp/runtest/Output/nt.py.tmp.SANDBOX-NO-HASH/build/report.json /Users/buildslave/jenkins/workspace/LNT_Tests/llvm-lnt/tests/runtest/nt.py : 'RUN: at line 53'; lnt runtest nt --sandbox /Users/buildslave/jenkins/workspace/LNT_Tests/llvm-lnt/tests/test_run_tmp/runtest/Output/nt.py.tmp.SANDBOX --test-suite /Users/buildslave/jenkins/workspace/LNT_Tests/llvm-lnt/tests/runtest/Inputs/test-suite --cc /Users/buildslave/jenkins/workspace/LNT_Tests/llvm-lnt/tests/../tests/SharedInputs/FakeCompilers/clang-r154331 --no-timestamp --run-order=123 > /Users/buildslave/jenkins/workspace/LNT_Tests/llvm-lnt/tests/test_run_tmp/runtest/Output/nt.py.tmp.log 2> /Users/buildslave/jenkins/workspace/LNT_Tests/llvm-lnt/tests/test_run_tmp/runtest/Output/nt.py.tmp.err : 'RUN: at line 58'; FileCheck --check-prefix CHECK-RESULTS < /Users/buildslave/jenkins/workspace/LNT_Tests/llvm-lnt/tests/test_run_tmp/runtest/Output/nt.py.tmp.SANDBOX/build/report.json /Users/buildslave/jenkins/workspace/LNT_Tests/llvm-lnt/tests/runtest/nt.py : 'RUN: at line 62'; lnt runtest nt --sandbox /Users/buildslave/jenkins/workspace/LNT_Tests/llvm-lnt/tests/test_run_tmp/runtest/Output/nt.py.tmp.SANDBOX --test-suite /Users/buildslave/jenkins/workspace/LNT_Tests/llvm-lnt/tests/runtest/Inputs/test-suite --cc /Users/buildslave/jenkins/workspace/LNT_Tests/llvm-lnt/tests/../tests/SharedInputs/FakeCompilers/clang-r154331 --no-auto-name foo > /Users/buildslave/jenkins/workspace/LNT_Tests/llvm-lnt/tests/test_run_tmp/runtest/Output/nt.py.tmp.log 2> /Users/buildslave/jenkins/workspace/LNT_Tests/llvm-lnt/tests/test_run_tmp/runtest/Output/nt.py.tmp.err : 'RUN: at line 67'; FileCheck --check-prefix CHECK-AUTONAME < /Users/buildslave/jenkins/workspace/LNT_Tests/llvm-lnt/tests/test_run_tmp/runtest/Output/nt.py.tmp.err /Users/buildslave/jenkins/workspace/LNT_Tests/llvm-lnt/tests/runtest/nt.py : 'RUN: at line 71'; lnt runtest nt --sandbox /Users/buildslave/jenkins/workspace/LNT_Tests/llvm-lnt/tests/test_run_tmp/runtest/Output/nt.py.tmp.SANDBOX --test-suite /Users/buildslave/jenkins/workspace/LNT_Tests/llvm-lnt/tests/runtest/Inputs/test-suite --cc /Users/buildslave/jenkins/workspace/LNT_Tests/llvm-lnt/tests/../tests/SharedInputs/FakeCompilers/clang-r154331 --no-timestamp --without-llvm > /Users/buildslave/jenkins/workspace/LNT_Tests/llvm-lnt/tests/test_run_tmp/runtest/Output/nt.py.tmp.log 2> /Users/buildslave/jenkins/workspace/LNT_Tests/llvm-lnt/tests/test_run_tmp/runtest/Output/nt.py.tmp.err : 'RUN: at line 80'; lnt runtest nt --sandbox /Users/buildslave/jenkins/workspace/LNT_Tests/llvm-lnt/tests/test_run_tmp/runtest/Output/nt.py.tmp.SANDBOX --test-suite /Users/buildslave/jenkins/workspace/LNT_Tests/llvm-lnt/tests/runtest/Inputs/test-suite --cc /Users/buildslave/jenkins/workspace/LNT_Tests/llvm-lnt/tests/../tests/SharedInputs/FakeCompilers/clang-r154331 --cflag '-Wall' --no-timestamp > /Users/buildslave/jenkins/workspace/LNT_Tests/llvm-lnt/tests/test_run_tmp/runtest/Output/nt.py.tmp.log 2> /Users/buildslave/jenkins/workspace/LNT_Tests/llvm-lnt/tests/test_run_tmp/runtest/Output/nt.py.tmp.err : 'RUN: at line 86'; FileCheck --check-prefix CHECK-CFLAG1 < /Users/buildslave/jenkins/workspace/LNT_Tests/llvm-lnt/tests/test_run_tmp/runtest/Output/nt.py.tmp.err /Users/buildslave/jenkins/workspace/LNT_Tests/llvm-lnt/tests/runtest/nt.py : 'RUN: at line 91'; lnt runtest nt --sandbox /Users/buildslave/jenkins/workspace/LNT_Tests/llvm-lnt/tests/test_run_tmp/runtest/Output/nt.py.tmp.SANDBOX --test-suite /Users/buildslave/jenkins/workspace/LNT_Tests/llvm-lnt/tests/runtest/Inputs/test-suite --cc /Users/buildslave/jenkins/workspace/LNT_Tests/llvm-lnt/tests/../tests/SharedInputs/FakeCompilers/clang-r154331 --cflag '-Wall' --cflag '-mfloat-abi=hard' --cflag '-O3' --no-timestamp > /Users/buildslave/jenkins/workspace/LNT_Tests/llvm-lnt/tests/test_run_tmp/runtest/Output/nt.py.tmp.log 2> /Users/buildslave/jenkins/workspace/LNT_Tests/llvm-lnt/tests/test_run_tmp/runtest/Output/nt.py.tmp.err : 'RUN: at line 99'; FileCheck --check-prefix CHECK-CFLAG2 < /Users/buildslave/jenkins/workspace/LNT_Tests/llvm-lnt/tests/test_run_tmp/runtest/Output/nt.py.tmp.err /Users/buildslave/jenkins/workspace/LNT_Tests/llvm-lnt/tests/runtest/nt.py : 'RUN: at line 104'; lnt runtest nt --sandbox /Users/buildslave/jenkins/workspace/LNT_Tests/llvm-lnt/tests/test_run_tmp/runtest/Output/nt.py.tmp.SANDBOX --test-suite /Users/buildslave/jenkins/workspace/LNT_Tests/llvm-lnt/tests/runtest/Inputs/test-suite --cc /Users/buildslave/jenkins/workspace/LNT_Tests/llvm-lnt/tests/../tests/SharedInputs/FakeCompilers/clang-r154331 --cflags '-Wall -mfloat-abi=hard -O3' --no-timestamp > /Users/buildslave/jenkins/workspace/LNT_Tests/llvm-lnt/tests/test_run_tmp/runtest/Output/nt.py.tmp.log 2> /Users/buildslave/jenkins/workspace/LNT_Tests/llvm-lnt/tests/test_run_tmp/runtest/Output/nt.py.tmp.err : 'RUN: at line 110'; FileCheck --check-prefix CHECK-CFLAG3 < /Users/buildslave/jenkins/workspace/LNT_Tests/llvm-lnt/tests/test_run_tmp/runtest/Output/nt.py.tmp.err /Users/buildslave/jenkins/workspace/LNT_Tests/llvm-lnt/tests/runtest/nt.py : 'RUN: at line 115'; lnt runtest nt --sandbox /Users/buildslave/jenkins/workspace/LNT_Tests/llvm-lnt/tests/test_run_tmp/runtest/Output/nt.py.tmp.SANDBOX --test-suite /Users/buildslave/jenkins/workspace/LNT_Tests/llvm-lnt/tests/runtest/Inputs/test-suite --cc /Users/buildslave/jenkins/workspace/LNT_Tests/llvm-lnt/tests/../tests/SharedInputs/FakeCompilers/clang-r154331 --cflags "-Wall -test=escaped\ space -some-option='stay with me' -O3" --no-timestamp > /Users/buildslave/jenkins/workspace/LNT_Tests/llvm-lnt/tests/test_run_tmp/runtest/Output/nt.py.tmp.log 2> /Users/buildslave/jenkins/workspace/LNT_Tests/llvm-lnt/tests/test_run_tmp/runtest/Output/nt.py.tmp.err : 'RUN: at line 121'; FileCheck --check-prefix CHECK-CFLAG4 < /Users/buildslave/jenkins/workspace/LNT_Tests/llvm-lnt/tests/test_run_tmp/runtest/Output/nt.py.tmp.err /Users/buildslave/jenkins/workspace/LNT_Tests/llvm-lnt/tests/runtest/nt.py : 'RUN: at line 126'; lnt runtest nt --sandbox /Users/buildslave/jenkins/workspace/LNT_Tests/llvm-lnt/tests/test_run_tmp/runtest/Output/nt.py.tmp.SANDBOX --test-suite /Users/buildslave/jenkins/workspace/LNT_Tests/llvm-lnt/tests/runtest/Inputs/test-suite --cc /Users/buildslave/jenkins/workspace/LNT_Tests/llvm-lnt/tests/../tests/SharedInputs/FakeCompilers/clang-r154331 --cflag '--target=armv7a-none-eabi' --cflag '-Weverything' --cflags '-Wall -test=escaped\ space -some-option="stay with me" -O3' --no-timestamp > /Users/buildslave/jenkins/workspace/LNT_Tests/llvm-lnt/tests/test_run_tmp/runtest/Output/nt.py.tmp.log 2> /Users/buildslave/jenkins/workspace/LNT_Tests/llvm-lnt/tests/test_run_tmp/runtest/Output/nt.py.tmp.err : 'RUN: at line 134'; FileCheck --check-prefix CHECK-CFLAG5 < /Users/buildslave/jenkins/workspace/LNT_Tests/llvm-lnt/tests/test_run_tmp/runtest/Output/nt.py.tmp.err /Users/buildslave/jenkins/workspace/LNT_Tests/llvm-lnt/tests/runtest/nt.py : 'RUN: at line 140'; lnt runtest nt --sandbox /Users/buildslave/jenkins/workspace/LNT_Tests/llvm-lnt/tests/test_run_tmp/runtest/Output/nt.py.tmp.SANDBOX --test-suite /Users/buildslave/jenkins/workspace/LNT_Tests/llvm-lnt/tests/runtest/Inputs/test-suite --cc /Users/buildslave/jenkins/workspace/LNT_Tests/llvm-lnt/tests/../tests/SharedInputs/FakeCompilers/clang-r154331 --qemu-user-mode TEST --qemu-flag '-soundhw gus' --qemu-flag '-net nic' --qemu-flags '-device gus,irq=5 -test=escaped\ space -some-option="stay with me"' --no-timestamp > /Users/buildslave/jenkins/workspace/LNT_Tests/llvm-lnt/tests/test_run_tmp/runtest/Output/nt.py.tmp.log 2> /Users/buildslave/jenkins/workspace/LNT_Tests/llvm-lnt/tests/test_run_tmp/runtest/Output/nt.py.tmp.err : 'RUN: at line 149'; FileCheck --check-prefix CHECK-QEMU-FLAG1 < /Users/buildslave/jenkins/workspace/LNT_Tests/llvm-lnt/tests/test_run_tmp/runtest/Output/nt.py.tmp.err /Users/buildslave/jenkins/workspace/LNT_Tests/llvm-lnt/tests/runtest/nt.py : 'RUN: at line 154'; rm -rf test_run_tmp/runtest/nt_server_instance : 'RUN: at line 155'; mkdir -p test_run_tmp/runtest/nt_server_instance : 'RUN: at line 156'; rsync -av --exclude .svn /Users/buildslave/jenkins/workspace/LNT_Tests/llvm-lnt/tests/runtest/Inputs/rerun_server_instance/ test_run_tmp/runtest/nt_server_instance : 'RUN: at line 158'; /Users/buildslave/jenkins/workspace/LNT_Tests/llvm-lnt/tests/../tests/SharedInputs/server_wrapper.sh test_run_tmp/runtest/nt_server_instance 9089 lnt runtest nt --submit "http://localhost:9089/db_default/submitRun" --sandbox /Users/buildslave/jenkins/workspace/LNT_Tests/llvm-lnt/tests/test_run_tmp/runtest/Output/nt.py.tmp.SANDBOX --test-suite /Users/buildslave/jenkins/workspace/LNT_Tests/llvm-lnt/tests/runtest/Inputs/rerun-test-suite1 --cc /Users/buildslave/jenkins/workspace/LNT_Tests/llvm-lnt/tests/../tests/SharedInputs/FakeCompilers/clang-r154331 --no-timestamp --rerun --run-order 1 > /Users/buildslave/jenkins/workspace/LNT_Tests/llvm-lnt/tests/test_run_tmp/runtest/Output/nt.py.tmp.log 2> /Users/buildslave/jenkins/workspace/LNT_Tests/llvm-lnt/tests/test_run_tmp/runtest/Output/nt.py.tmp.err : 'RUN: at line 165'; FileCheck --check-prefix CHECK-SUBMIT-STDOUT < /Users/buildslave/jenkins/workspace/LNT_Tests/llvm-lnt/tests/test_run_tmp/runtest/Output/nt.py.tmp.log /Users/buildslave/jenkins/workspace/LNT_Tests/llvm-lnt/tests/runtest/nt.py : 'RUN: at line 166'; FileCheck --check-prefix CHECK-SUBMIT-STDERR < /Users/buildslave/jenkins/workspace/LNT_Tests/llvm-lnt/tests/test_run_tmp/runtest/Output/nt.py.tmp.err /Users/buildslave/jenkins/workspace/LNT_Tests/llvm-lnt/tests/runtest/nt.py : 'RUN: at line 185'; rsync -av --exclude .svn /Users/buildslave/jenkins/workspace/LNT_Tests/llvm-lnt/tests/runtest/Inputs/rerun_server_instance/ test_run_tmp/runtest/nt_server_instance : 'RUN: at line 187'; /Users/buildslave/jenkins/workspace/LNT_Tests/llvm-lnt/tests/../tests/SharedInputs/server_wrapper.sh test_run_tmp/runtest/nt_server_instance 9089 lnt runtest nt --submit "http://localhost:9089/db_default/submitRun" --commit 1 --sandbox /Users/buildslave/jenkins/workspace/LNT_Tests/llvm-lnt/tests/test_run_tmp/runtest/Output/nt.py.tmp.SANDBOX --test-suite /Users/buildslave/jenkins/workspace/LNT_Tests/llvm-lnt/tests/runtest/Inputs/rerun-test-suite1 --cc /Users/buildslave/jenkins/workspace/LNT_Tests/llvm-lnt/tests/../tests/SharedInputs/FakeCompilers/clang-r154331 --no-timestamp --rerun --run-order 2 > /Users/buildslave/jenkins/workspace/LNT_Tests/llvm-lnt/tests/test_run_tmp/runtest/Output/nt.py.tmp.log 2> /Users/buildslave/jenkins/workspace/LNT_Tests/llvm-lnt/tests/test_run_tmp/runtest/Output/nt.py.tmp.err : 'RUN: at line 195'; FileCheck --check-prefix CHECK-SUBMIT-STDOUT < /Users/buildslave/jenkins/workspace/LNT_Tests/llvm-lnt/tests/test_run_tmp/runtest/Output/nt.py.tmp.log /Users/buildslave/jenkins/workspace/LNT_Tests/llvm-lnt/tests/runtest/nt.py : 'RUN: at line 196'; FileCheck --check-prefix CHECK-SUBMIT-STDERR < /Users/buildslave/jenkins/workspace/LNT_Tests/llvm-lnt/tests/test_run_tmp/runtest/Output/nt.py.tmp.err /Users/buildslave/jenkins/workspace/LNT_Tests/llvm-lnt/tests/runtest/nt.py -- Exit Code: 1

Hide Details

Command Output (stdout): -- $ ":" "RUN: at line 4" $ "lnt" "runtest" "nt" "--sandbox" "/Users/buildslave/jenkins/workspace/LNT_Tests/llvm-lnt/tests/test_run_tmp/runtest/Output/nt.py.tmp.SANDBOX" "--test-suite" "/Users/buildslave/jenkins/workspace/LNT_Tests/llvm-lnt/tests/runtest/Inputs/test-suite" "--cc" "/Users/buildslave/jenkins/workspace/LNT_Tests/llvm-lnt/tests/../tests/SharedInputs/FakeCompilers/clang-r154331" "--no-timestamp" $ ":" "RUN: at line 9" $ "FileCheck" "--check-prefix" "CHECK-STDOUT" "/Users/buildslave/jenkins/workspace/LNT_Tests/llvm-lnt/tests/runtest/nt.py" $ ":" "RUN: at line 10" $ "FileCheck" "--check-prefix" "CHECK-BASIC" "/Users/buildslave/jenkins/workspace/LNT_Tests/llvm-lnt/tests/runtest/nt.py" $ ":" "RUN: at line 11" $ "FileCheck" "--check-prefix" "CHECK-REPORT" "/Users/buildslave/jenkins/workspace/LNT_Tests/llvm-lnt/tests/runtest/nt.py" $ ":" "RUN: at line 34" $ "lnt" "runtest" "nt" "--sandbox" "/Users/buildslave/jenkins/workspace/LNT_Tests/llvm-lnt/tests/test_run_tmp/runtest/Output/nt.py.tmp.SANDBOX" "--test-suite" "/Users/buildslave/jenkins/workspace/LNT_Tests/llvm-lnt/tests/runtest/Inputs/test-suite" "--cc" "/Users/buildslave/jenkins/workspace/LNT_Tests/llvm-lnt/tests/../tests/SharedInputs/FakeCompilers/clang-r154331" "--no-timestamp" "--no-configure" $ ":" "RUN: at line 39" $ "FileCheck" "--check-prefix" "CHECK-NOCONF" "/Users/buildslave/jenkins/workspace/LNT_Tests/llvm-lnt/tests/runtest/nt.py" $ ":" "RUN: at line 43" $ "lnt" "runtest" "nt" "--sandbox" "/Users/buildslave/jenkins/workspace/LNT_Tests/llvm-lnt/tests/test_run_tmp/runtest/Output/nt.py.tmp.SANDBOX-NO-HASH" "--test-suite" "/Users/buildslave/jenkins/workspace/LNT_Tests/llvm-lnt/tests/runtest/Inputs/test-suite-nohash" "--cc" "/Users/buildslave/jenkins/workspace/LNT_Tests/llvm-lnt/tests/../tests/SharedInputs/FakeCompilers/clang-r154331" "--no-timestamp" $ ":" "RUN: at line 48" $ "FileCheck" "--check-prefix" "CHECK-STDOUT" "/Users/buildslave/jenkins/workspace/LNT_Tests/llvm-lnt/tests/runtest/nt.py" $ ":" "RUN: at line 49" $ "FileCheck" "--check-prefix" "CHECK-BASIC" "/Users/buildslave/jenkins/workspace/LNT_Tests/llvm-lnt/tests/runtest/nt.py" $ ":" "RUN: at line 50" $ "FileCheck" "--check-prefix" "CHECK-REPORT" "/Users/buildslave/jenkins/workspace/LNT_Tests/llvm-lnt/tests/runtest/nt.py" $ ":" "RUN: at line 53" $ "lnt" "runtest" "nt" "--sandbox" "/Users/buildslave/jenkins/workspace/LNT_Tests/llvm-lnt/tests/test_run_tmp/runtest/Output/nt.py.tmp.SANDBOX" "--test-suite" "/Users/buildslave/jenkins/workspace/LNT_Tests/llvm-lnt/tests/runtest/Inputs/test-suite" "--cc" "/Users/buildslave/jenkins/workspace/LNT_Tests/llvm-lnt/tests/../tests/SharedInputs/FakeCompilers/clang-r154331" "--no-timestamp" "--run-order=123" $ ":" "RUN: at line 58" $ "FileCheck" "--check-prefix" "CHECK-RESULTS" "/Users/buildslave/jenkins/workspace/LNT_Tests/llvm-lnt/tests/runtest/nt.py" $ ":" "RUN: at line 62" $ "lnt" "runtest" "nt" "--sandbox" "/Users/buildslave/jenkins/workspace/LNT_Tests/llvm-lnt/tests/test_run_tmp/runtest/Output/nt.py.tmp.SANDBOX" "--test-suite" "/Users/buildslave/jenkins/workspace/LNT_Tests/llvm-lnt/tests/runtest/Inputs/test-suite" "--cc" "/Users/buildslave/jenkins/workspace/LNT_Tests/llvm-lnt/tests/../tests/SharedInputs/FakeCompilers/clang-r154331" "--no-auto-name" "foo" $ ":" "RUN: at line 67" $ "FileCheck" "--check-prefix" "CHECK-AUTONAME" "/Users/buildslave/jenkins/workspace/LNT_Tests/llvm-lnt/tests/runtest/nt.py" $ ":" "RUN: at line 71" $ "lnt" "runtest" "nt" "--sandbox" "/Users/buildslave/jenkins/workspace/LNT_Tests/llvm-lnt/tests/test_run_tmp/runtest/Output/nt.py.tmp.SANDBOX" "--test-suite" "/Users/buildslave/jenkins/workspace/LNT_Tests/llvm-lnt/tests/runtest/Inputs/test-suite" "--cc" "/Users/buildslave/jenkins/workspace/LNT_Tests/llvm-lnt/tests/../tests/SharedInputs/FakeCompilers/clang-r154331" "--no-timestamp" "--without-llvm" $ ":" "RUN: at line 80" $ "lnt" "runtest" "nt" "--sandbox" "/Users/buildslave/jenkins/workspace/LNT_Tests/llvm-lnt/tests/test_run_tmp/runtest/Output/nt.py.tmp.SANDBOX" "--test-suite" "/Users/buildslave/jenkins/workspace/LNT_Tests/llvm-lnt/tests/runtest/Inputs/test-suite" "--cc" "/Users/buildslave/jenkins/workspace/LNT_Tests/llvm-lnt/tests/../tests/SharedInputs/FakeCompilers/clang-r154331" "--cflag" "-Wall" "--no-timestamp" $ ":" "RUN: at line 86" $ "FileCheck" "--check-prefix" "CHECK-CFLAG1" "/Users/buildslave/jenkins/workspace/LNT_Tests/llvm-lnt/tests/runtest/nt.py" $ ":" "RUN: at line 91" $ "lnt" "runtest" "nt" "--sandbox" "/Users/buildslave/jenkins/workspace/LNT_Tests/llvm-lnt/tests/test_run_tmp/runtest/Output/nt.py.tmp.SANDBOX" "--test-suite" "/Users/buildslave/jenkins/workspace/LNT_Tests/llvm-lnt/tests/runtest/Inputs/test-suite" "--cc" "/Users/buildslave/jenkins/workspace/LNT_Tests/llvm-lnt/tests/../tests/SharedInputs/FakeCompilers/clang-r154331" "--cflag" "-Wall" "--cflag" "-mfloat-abi=hard" "--cflag" "-O3" "--no-timestamp" $ ":" "RUN: at line 99" $ "FileCheck" "--check-prefix" "CHECK-CFLAG2" "/Users/buildslave/jenkins/workspace/LNT_Tests/llvm-lnt/tests/runtest/nt.py" $ ":" "RUN: at line 104" $ "lnt" "runtest" "nt" "--sandbox" "/Users/buildslave/jenkins/workspace/LNT_Tests/llvm-lnt/tests/test_run_tmp/runtest/Output/nt.py.tmp.SANDBOX" "--test-suite" "/Users/buildslave/jenkins/workspace/LNT_Tests/llvm-lnt/tests/runtest/Inputs/test-suite" "--cc" "/Users/buildslave/jenkins/workspace/LNT_Tests/llvm-lnt/tests/../tests/SharedInputs/FakeCompilers/clang-r154331" "--cflags" "-Wall -mfloat-abi=hard -O3" "--no-timestamp" $ ":" "RUN: at line 110" $ "FileCheck" "--check-prefix" "CHECK-CFLAG3" "/Users/buildslave/jenkins/workspace/LNT_Tests/llvm-lnt/tests/runtest/nt.py" $ ":" "RUN: at line 115" $ "lnt" "runtest" "nt" "--sandbox" "/Users/buildslave/jenkins/workspace/LNT_Tests/llvm-lnt/tests/test_run_tmp/runtest/Output/nt.py.tmp.SANDBOX" "--test-suite" "/Users/buildslave/jenkins/workspace/LNT_Tests/llvm-lnt/tests/runtest/Inputs/test-suite" "--cc" "/Users/buildslave/jenkins/workspace/LNT_Tests/llvm-lnt/tests/../tests/SharedInputs/FakeCompilers/clang-r154331" "--cflags" "-Wall -test=escaped\ space -some-option='stay with me' -O3" "--no-timestamp" $ ":" "RUN: at line 121" $ "FileCheck" "--check-prefix" "CHECK-CFLAG4" "/Users/buildslave/jenkins/workspace/LNT_Tests/llvm-lnt/tests/runtest/nt.py" $ ":" "RUN: at line 126" $ "lnt" "runtest" "nt" "--sandbox" "/Users/buildslave/jenkins/workspace/LNT_Tests/llvm-lnt/tests/test_run_tmp/runtest/Output/nt.py.tmp.SANDBOX" "--test-suite" "/Users/buildslave/jenkins/workspace/LNT_Tests/llvm-lnt/tests/runtest/Inputs/test-suite" "--cc" "/Users/buildslave/jenkins/workspace/LNT_Tests/llvm-lnt/tests/../tests/SharedInputs/FakeCompilers/clang-r154331" "--cflag" "--target=armv7a-none-eabi" "--cflag" "-Weverything" "--cflags" "-Wall -test=escaped\ space -some-option="stay with me" -O3" "--no-timestamp" $ ":" "RUN: at line 134" $ "FileCheck" "--check-prefix" "CHECK-CFLAG5" "/Users/buildslave/jenkins/workspace/LNT_Tests/llvm-lnt/tests/runtest/nt.py" $ ":" "RUN: at line 140" $ "lnt" "runtest" "nt" "--sandbox" "/Users/buildslave/jenkins/workspace/LNT_Tests/llvm-lnt/tests/test_run_tmp/runtest/Output/nt.py.tmp.SANDBOX" "--test-suite" "/Users/buildslave/jenkins/workspace/LNT_Tests/llvm-lnt/tests/runtest/Inputs/test-suite" "--cc" "/Users/buildslave/jenkins/workspace/LNT_Tests/llvm-lnt/tests/../tests/SharedInputs/FakeCompilers/clang-r154331" "--qemu-user-mode" "TEST" "--qemu-flag" "-soundhw gus" "--qemu-flag" "-net nic" "--qemu-flags" "-device gus,irq=5 -test=escaped\ space -some-option="stay with me"" "--no-timestamp" $ ":" "RUN: at line 149" $ "FileCheck" "--check-prefix" "CHECK-QEMU-FLAG1" "/Users/buildslave/jenkins/workspace/LNT_Tests/llvm-lnt/tests/runtest/nt.py" $ ":" "RUN: at line 154" $ "rm" "-rf" "test_run_tmp/runtest/nt_server_instance" $ ":" "RUN: at line 155" $ "mkdir" "-p" "test_run_tmp/runtest/nt_server_instance" $ ":" "RUN: at line 156" $ "rsync" "-av" "--exclude" ".svn" "/Users/buildslave/jenkins/workspace/LNT_Tests/llvm-lnt/tests/runtest/Inputs/rerun_server_instance/" "test_run_tmp/runtest/nt_server_instance" # command output: building file list ... done ./ lnt.cfg lnt.wsgi data/ data/lnt.db

Hide Details

sent 264461 bytes received 98 bytes 529118.00 bytes/sec total size is 264151 speedup is 1.00

Hide Details

$ ":" "RUN: at line 158" $ "/Users/buildslave/jenkins/workspace/LNT_Tests/llvm-lnt/tests/../tests/SharedInputs/server_wrapper.sh" "test_run_tmp/runtest/nt_server_instance" "9089" "lnt" "runtest" "nt" "--submit" "http://localhost:9089/db_default/submitRun" "--sandbox" "/Users/buildslave/jenkins/workspace/LNT_Tests/llvm-lnt/tests/test_run_tmp/runtest/Output/nt.py.tmp.SANDBOX" "--test-suite" "/Users/buildslave/jenkins/workspace/LNT_Tests/llvm-lnt/tests/runtest/Inputs/rerun-test-suite1" "--cc" "/Users/buildslave/jenkins/workspace/LNT_Tests/llvm-lnt/tests/../tests/SharedInputs/FakeCompilers/clang-r154331" "--no-timestamp" "--rerun" "--run-order" "1" $ ":" "RUN: at line 165" $ "FileCheck" "--check-prefix" "CHECK-SUBMIT-STDOUT" "/Users/buildslave/jenkins/workspace/LNT_Tests/llvm-lnt/tests/runtest/nt.py" $ ":" "RUN: at line 166" $ "FileCheck" "--check-prefix" "CHECK-SUBMIT-STDERR" "/Users/buildslave/jenkins/workspace/LNT_Tests/llvm-lnt/tests/runtest/nt.py" $ ":" "RUN: at line 185" $ "rsync" "-av" "--exclude" ".svn" "/Users/buildslave/jenkins/workspace/LNT_Tests/llvm-lnt/tests/runtest/Inputs/rerun_server_instance/" "test_run_tmp/runtest/nt_server_instance" # command output: building file list ... done ./ data/ data/lnt.db

Hide Details

sent 262362 bytes received 54 bytes 524832.00 bytes/sec total size is 264151 speedup is 1.01

Hide Details

$ ":" "RUN: at line 187" $ "/Users/buildslave/jenkins/workspace/LNT_Tests/llvm-lnt/tests/../tests/SharedInputs/server_wrapper.sh" "test_run_tmp/runtest/nt_server_instance" "9089" "lnt" "runtest" "nt" "--submit" "http://localhost:9089/db_default/submitRun" "--commit" "1" "--sandbox" "/Users/buildslave/jenkins/workspace/LNT_Tests/llvm-lnt/tests/test_run_tmp/runtest/Output/nt.py.tmp.SANDBOX" "--test-suite" "/Users/buildslave/jenkins/workspace/LNT_Tests/llvm-lnt/tests/runtest/Inputs/rerun-test-suite1" "--cc" "/Users/buildslave/jenkins/workspace/LNT_Tests/llvm-lnt/tests/../tests/SharedInputs/FakeCompilers/clang-r154331" "--no-timestamp" "--rerun" "--run-order" "2" note: command had no output on stdout or stderr error: command failed with exit status: 1

Hide Details

--

Hide Details

******************** UNRESOLVED: LNT :: runtest/only_test.py (20 of 72) ******************** TEST 'LNT :: runtest/only_test.py' FAILED ******************** Exception during script execution: Traceback (most recent call last): File "/Users/buildslave/jenkins/workspace/LNT_Tests/venv/lib/python2.7/site-packages/lit-0.10.0.dev0-py2.7.egg/lit/worker.py", line 93, in _execute_test_handle_errors return _adapt_result(test.config.test_format.execute(test, lit_config)) File "/Users/buildslave/jenkins/workspace/LNT_Tests/venv/lib/python2.7/site-packages/lit-0.10.0.dev0-py2.7.egg/lit/formats/shtest.py", line 25, in execute self.execute_external) File "/Users/buildslave/jenkins/workspace/LNT_Tests/venv/lib/python2.7/site-packages/lit-0.10.0.dev0-py2.7.egg/lit/TestRunner.py", line 1641, in executeShTest script = parseIntegratedTestScript(test) File "/Users/buildslave/jenkins/workspace/LNT_Tests/venv/lib/python2.7/site-packages/lit-0.10.0.dev0-py2.7.egg/lit/TestRunner.py", line 1547, in parseIntegratedTestScript keyword_parsers.keys()): File "/Users/buildslave/jenkins/workspace/LNT_Tests/venv/lib/python2.7/site-packages/lit-0.10.0.dev0-py2.7.egg/lit/TestRunner.py", line 1217, in parseIntegratedTestScriptCommands f = open(source_path, 'rb') IOError: [Errno 2] No such file or directory: '/Users/buildslave/jenkins/workspace/LNT_Tests/llvm-lnt/tests/runtest/only_test.py'

Hide Details

Hide Details

******************** UNRESOLVED: LNT :: runtest/rerun.py (21 of 72) ******************** TEST 'LNT :: runtest/rerun.py' FAILED ******************** Exception during script execution: Traceback (most recent call last): File "/Users/buildslave/jenkins/workspace/LNT_Tests/venv/lib/python2.7/site-packages/lit-0.10.0.dev0-py2.7.egg/lit/worker.py", line 93, in _execute_test_handle_errors return _adapt_result(test.config.test_format.execute(test, lit_config)) File "/Users/buildslave/jenkins/workspace/LNT_Tests/venv/lib/python2.7/site-packages/lit-0.10.0.dev0-py2.7.egg/lit/formats/shtest.py", line 25, in execute self.execute_external) File "/Users/buildslave/jenkins/workspace/LNT_Tests/venv/lib/python2.7/site-packages/lit-0.10.0.dev0-py2.7.egg/lit/TestRunner.py", line 1641, in executeShTest script = parseIntegratedTestScript(test) File "/Users/buildslave/jenkins/workspace/LNT_Tests/venv/lib/python2.7/site-packages/lit-0.10.0.dev0-py2.7.egg/lit/TestRunner.py", line 1547, in parseIntegratedTestScript keyword_parsers.keys()): File "/Users/buildslave/jenkins/workspace/LNT_Tests/venv/lib/python2.7/site-packages/lit-0.10.0.dev0-py2.7.egg/lit/TestRunner.py", line 1217, in parseIntegratedTestScriptCommands f = open(source_path, 'rb') IOError: [Errno 2] No such file or directory: '/Users/buildslave/jenkins/workspace/LNT_Tests/llvm-lnt/tests/runtest/rerun.py'

Hide Details

Hide Details

******************** UNRESOLVED: LNT :: runtest/test_suite-benchmarking-only.shtest (22 of 72) ******************** TEST 'LNT :: runtest/test_suite-benchmarking-only.shtest' FAILED ******************** Exception during script execution: Traceback (most recent call last): File "/Users/buildslave/jenkins/workspace/LNT_Tests/venv/lib/python2.7/site-packages/lit-0.10.0.dev0-py2.7.egg/lit/worker.py", line 93, in _execute_test_handle_errors return _adapt_result(test.config.test_format.execute(test, lit_config)) File "/Users/buildslave/jenkins/workspace/LNT_Tests/venv/lib/python2.7/site-packages/lit-0.10.0.dev0-py2.7.egg/lit/formats/shtest.py", line 25, in execute self.execute_external) File "/Users/buildslave/jenkins/workspace/LNT_Tests/venv/lib/python2.7/site-packages/lit-0.10.0.dev0-py2.7.egg/lit/TestRunner.py", line 1641, in executeShTest script = parseIntegratedTestScript(test) File "/Users/buildslave/jenkins/workspace/LNT_Tests/venv/lib/python2.7/site-packages/lit-0.10.0.dev0-py2.7.egg/lit/TestRunner.py", line 1547, in parseIntegratedTestScript keyword_parsers.keys()): File "/Users/buildslave/jenkins/workspace/LNT_Tests/venv/lib/python2.7/site-packages/lit-0.10.0.dev0-py2.7.egg/lit/TestRunner.py", line 1217, in parseIntegratedTestScriptCommands f = open(source_path, 'rb') IOError: [Errno 2] No such file or directory: '/Users/buildslave/jenkins/workspace/LNT_Tests/llvm-lnt/tests/runtest/test_suite-benchmarking-only.shtest'

Hide Details

Hide Details

******************** UNRESOLVED: LNT :: runtest/test_suite-c-compiler.shtest (23 of 72) ******************** TEST 'LNT :: runtest/test_suite-c-compiler.shtest' FAILED ******************** Exception during script execution: Traceback (most recent call last): File "/Users/buildslave/jenkins/workspace/LNT_Tests/venv/lib/python2.7/site-packages/lit-0.10.0.dev0-py2.7.egg/lit/worker.py", line 93, in _execute_test_handle_errors return _adapt_result(test.config.test_format.execute(test, lit_config)) File "/Users/buildslave/jenkins/workspace/LNT_Tests/venv/lib/python2.7/site-packages/lit-0.10.0.dev0-py2.7.egg/lit/formats/shtest.py", line 25, in execute self.execute_external) File "/Users/buildslave/jenkins/workspace/LNT_Tests/venv/lib/python2.7/site-packages/lit-0.10.0.dev0-py2.7.egg/lit/TestRunner.py", line 1641, in executeShTest script = parseIntegratedTestScript(test) File "/Users/buildslave/jenkins/workspace/LNT_Tests/venv/lib/python2.7/site-packages/lit-0.10.0.dev0-py2.7.egg/lit/TestRunner.py", line 1547, in parseIntegratedTestScript keyword_parsers.keys()): File "/Users/buildslave/jenkins/workspace/LNT_Tests/venv/lib/python2.7/site-packages/lit-0.10.0.dev0-py2.7.egg/lit/TestRunner.py", line 1217, in parseIntegratedTestScriptCommands f = open(source_path, 'rb') IOError: [Errno 2] No such file or directory: '/Users/buildslave/jenkins/workspace/LNT_Tests/llvm-lnt/tests/runtest/test_suite-c-compiler.shtest'

Hide Details

Hide Details

******************** UNRESOLVED: LNT :: runtest/test_suite-cache.shtest (24 of 72) ******************** TEST 'LNT :: runtest/test_suite-cache.shtest' FAILED ******************** Exception during script execution: Traceback (most recent call last): File "/Users/buildslave/jenkins/workspace/LNT_Tests/venv/lib/python2.7/site-packages/lit-0.10.0.dev0-py2.7.egg/lit/worker.py", line 93, in _execute_test_handle_errors return _adapt_result(test.config.test_format.execute(test, lit_config)) File "/Users/buildslave/jenkins/workspace/LNT_Tests/venv/lib/python2.7/site-packages/lit-0.10.0.dev0-py2.7.egg/lit/formats/shtest.py", line 25, in execute self.execute_external) File "/Users/buildslave/jenkins/workspace/LNT_Tests/venv/lib/python2.7/site-packages/lit-0.10.0.dev0-py2.7.egg/lit/TestRunner.py", line 1641, in executeShTest script = parseIntegratedTestScript(test) File "/Users/buildslave/jenkins/workspace/LNT_Tests/venv/lib/python2.7/site-packages/lit-0.10.0.dev0-py2.7.egg/lit/TestRunner.py", line 1547, in parseIntegratedTestScript keyword_parsers.keys()): File "/Users/buildslave/jenkins/workspace/LNT_Tests/venv/lib/python2.7/site-packages/lit-0.10.0.dev0-py2.7.egg/lit/TestRunner.py", line 1217, in parseIntegratedTestScriptCommands f = open(source_path, 'rb') IOError: [Errno 2] No such file or directory: '/Users/buildslave/jenkins/workspace/LNT_Tests/llvm-lnt/tests/runtest/test_suite-cache.shtest'

Hide Details

Hide Details

******************** UNRESOLVED: LNT :: runtest/test_suite-cc.shtest (25 of 72) ******************** TEST 'LNT :: runtest/test_suite-cc.shtest' FAILED ******************** Exception during script execution: Traceback (most recent call last): File "/Users/buildslave/jenkins/workspace/LNT_Tests/venv/lib/python2.7/site-packages/lit-0.10.0.dev0-py2.7.egg/lit/worker.py", line 93, in _execute_test_handle_errors return _adapt_result(test.config.test_format.execute(test, lit_config)) File "/Users/buildslave/jenkins/workspace/LNT_Tests/venv/lib/python2.7/site-packages/lit-0.10.0.dev0-py2.7.egg/lit/formats/shtest.py", line 25, in execute self.execute_external) File "/Users/buildslave/jenkins/workspace/LNT_Tests/venv/lib/python2.7/site-packages/lit-0.10.0.dev0-py2.7.egg/lit/TestRunner.py", line 1641, in executeShTest script = parseIntegratedTestScript(test) File "/Users/buildslave/jenkins/workspace/LNT_Tests/venv/lib/python2.7/site-packages/lit-0.10.0.dev0-py2.7.egg/lit/TestRunner.py", line 1547, in parseIntegratedTestScript keyword_parsers.keys()): File "/Users/buildslave/jenkins/workspace/LNT_Tests/venv/lib/python2.7/site-packages/lit-0.10.0.dev0-py2.7.egg/lit/TestRunner.py", line 1217, in parseIntegratedTestScriptCommands f = open(source_path, 'rb') IOError: [Errno 2] No such file or directory: '/Users/buildslave/jenkins/workspace/LNT_Tests/llvm-lnt/tests/runtest/test_suite-cc.shtest'

Hide Details

Hide Details

******************** UNRESOLVED: LNT :: runtest/test_suite-cflags0.shtest (26 of 72) ******************** TEST 'LNT :: runtest/test_suite-cflags0.shtest' FAILED ******************** Exception during script execution: Traceback (most recent call last): File "/Users/buildslave/jenkins/workspace/LNT_Tests/venv/lib/python2.7/site-packages/lit-0.10.0.dev0-py2.7.egg/lit/worker.py", line 93, in _execute_test_handle_errors return _adapt_result(test.config.test_format.execute(test, lit_config)) File "/Users/buildslave/jenkins/workspace/LNT_Tests/venv/lib/python2.7/site-packages/lit-0.10.0.dev0-py2.7.egg/lit/formats/shtest.py", line 25, in execute self.execute_external) File "/Users/buildslave/jenkins/workspace/LNT_Tests/venv/lib/python2.7/site-packages/lit-0.10.0.dev0-py2.7.egg/lit/TestRunner.py", line 1641, in executeShTest script = parseIntegratedTestScript(test) File "/Users/buildslave/jenkins/workspace/LNT_Tests/venv/lib/python2.7/site-packages/lit-0.10.0.dev0-py2.7.egg/lit/TestRunner.py", line 1547, in parseIntegratedTestScript keyword_parsers.keys()): File "/Users/buildslave/jenkins/workspace/LNT_Tests/venv/lib/python2.7/site-packages/lit-0.10.0.dev0-py2.7.egg/lit/TestRunner.py", line 1217, in parseIntegratedTestScriptCommands f = open(source_path, 'rb') IOError: [Errno 2] No such file or directory: '/Users/buildslave/jenkins/workspace/LNT_Tests/llvm-lnt/tests/runtest/test_suite-cflags0.shtest'

Hide Details

Hide Details

******************** UNRESOLVED: LNT :: runtest/test_suite-cflags1.shtest (27 of 72) ******************** TEST 'LNT :: runtest/test_suite-cflags1.shtest' FAILED ******************** Exception during script execution: Traceback (most recent call last): File "/Users/buildslave/jenkins/workspace/LNT_Tests/venv/lib/python2.7/site-packages/lit-0.10.0.dev0-py2.7.egg/lit/worker.py", line 93, in _execute_test_handle_errors return _adapt_result(test.config.test_format.execute(test, lit_config)) File "/Users/buildslave/jenkins/workspace/LNT_Tests/venv/lib/python2.7/site-packages/lit-0.10.0.dev0-py2.7.egg/lit/formats/shtest.py", line 25, in execute self.execute_external) File "/Users/buildslave/jenkins/workspace/LNT_Tests/venv/lib/python2.7/site-packages/lit-0.10.0.dev0-py2.7.egg/lit/TestRunner.py", line 1641, in executeShTest script = parseIntegratedTestScript(test) File "/Users/buildslave/jenkins/workspace/LNT_Tests/venv/lib/python2.7/site-packages/lit-0.10.0.dev0-py2.7.egg/lit/TestRunner.py", line 1547, in parseIntegratedTestScript keyword_parsers.keys()): File "/Users/buildslave/jenkins/workspace/LNT_Tests/venv/lib/python2.7/site-packages/lit-0.10.0.dev0-py2.7.egg/lit/TestRunner.py", line 1217, in parseIntegratedTestScriptCommands f = open(source_path, 'rb') IOError: [Errno 2] No such file or directory: '/Users/buildslave/jenkins/workspace/LNT_Tests/llvm-lnt/tests/runtest/test_suite-cflags1.shtest'

Hide Details

Hide Details

******************** UNRESOLVED: LNT :: runtest/test_suite-cflags2.shtest (28 of 72) ******************** TEST 'LNT :: runtest/test_suite-cflags2.shtest' FAILED ******************** Exception during script execution: Traceback (most recent call last): File "/Users/buildslave/jenkins/workspace/LNT_Tests/venv/lib/python2.7/site-packages/lit-0.10.0.dev0-py2.7.egg/lit/worker.py", line 93, in _execute_test_handle_errors return _adapt_result(test.config.test_format.execute(test, lit_config)) File "/Users/buildslave/jenkins/workspace/LNT_Tests/venv/lib/python2.7/site-packages/lit-0.10.0.dev0-py2.7.egg/lit/formats/shtest.py", line 25, in execute self.execute_external) File "/Users/buildslave/jenkins/workspace/LNT_Tests/venv/lib/python2.7/site-packages/lit-0.10.0.dev0-py2.7.egg/lit/TestRunner.py", line 1641, in executeShTest script = parseIntegratedTestScript(test) File "/Users/buildslave/jenkins/workspace/LNT_Tests/venv/lib/python2.7/site-packages/lit-0.10.0.dev0-py2.7.egg/lit/TestRunner.py", line 1547, in parseIntegratedTestScript keyword_parsers.keys()): File "/Users/buildslave/jenkins/workspace/LNT_Tests/venv/lib/python2.7/site-packages/lit-0.10.0.dev0-py2.7.egg/lit/TestRunner.py", line 1217, in parseIntegratedTestScriptCommands f = open(source_path, 'rb') IOError: [Errno 2] No such file or directory: '/Users/buildslave/jenkins/workspace/LNT_Tests/llvm-lnt/tests/runtest/test_suite-cflags2.shtest'

Hide Details

Hide Details

******************** UNRESOLVED: LNT :: runtest/test_suite-cflags3.shtest (29 of 72) ******************** TEST 'LNT :: runtest/test_suite-cflags3.shtest' FAILED ******************** Exception during script execution: Traceback (most recent call last): File "/Users/buildslave/jenkins/workspace/LNT_Tests/venv/lib/python2.7/site-packages/lit-0.10.0.dev0-py2.7.egg/lit/worker.py", line 93, in _execute_test_handle_errors return _adapt_result(test.config.test_format.execute(test, lit_config)) File "/Users/buildslave/jenkins/workspace/LNT_Tests/venv/lib/python2.7/site-packages/lit-0.10.0.dev0-py2.7.egg/lit/formats/shtest.py", line 25, in execute self.execute_external) File "/Users/buildslave/jenkins/workspace/LNT_Tests/venv/lib/python2.7/site-packages/lit-0.10.0.dev0-py2.7.egg/lit/TestRunner.py", line 1641, in executeShTest script = parseIntegratedTestScript(test) File "/Users/buildslave/jenkins/workspace/LNT_Tests/venv/lib/python2.7/site-packages/lit-0.10.0.dev0-py2.7.egg/lit/TestRunner.py", line 1547, in parseIntegratedTestScript keyword_parsers.keys()): File "/Users/buildslave/jenkins/workspace/LNT_Tests/venv/lib/python2.7/site-packages/lit-0.10.0.dev0-py2.7.egg/lit/TestRunner.py", line 1217, in parseIntegratedTestScriptCommands f = open(source_path, 'rb') IOError: [Errno 2] No such file or directory: '/Users/buildslave/jenkins/workspace/LNT_Tests/llvm-lnt/tests/runtest/test_suite-cflags3.shtest'

Hide Details

Hide Details

******************** UNRESOLVED: LNT :: runtest/test_suite-cflags4.shtest (30 of 72) ******************** TEST 'LNT :: runtest/test_suite-cflags4.shtest' FAILED ******************** Exception during script execution: Traceback (most recent call last): File "/Users/buildslave/jenkins/workspace/LNT_Tests/venv/lib/python2.7/site-packages/lit-0.10.0.dev0-py2.7.egg/lit/worker.py", line 93, in _execute_test_handle_errors return _adapt_result(test.config.test_format.execute(test, lit_config)) File "/Users/buildslave/jenkins/workspace/LNT_Tests/venv/lib/python2.7/site-packages/lit-0.10.0.dev0-py2.7.egg/lit/formats/shtest.py", line 25, in execute self.execute_external) File "/Users/buildslave/jenkins/workspace/LNT_Tests/venv/lib/python2.7/site-packages/lit-0.10.0.dev0-py2.7.egg/lit/TestRunner.py", line 1641, in executeShTest script = parseIntegratedTestScript(test) File "/Users/buildslave/jenkins/workspace/LNT_Tests/venv/lib/python2.7/site-packages/lit-0.10.0.dev0-py2.7.egg/lit/TestRunner.py", line 1547, in parseIntegratedTestScript keyword_parsers.keys()): File "/Users/buildslave/jenkins/workspace/LNT_Tests/venv/lib/python2.7/site-packages/lit-0.10.0.dev0-py2.7.egg/lit/TestRunner.py", line 1217, in parseIntegratedTestScriptCommands f = open(source_path, 'rb') IOError: [Errno 2] No such file or directory: '/Users/buildslave/jenkins/workspace/LNT_Tests/llvm-lnt/tests/runtest/test_suite-cflags4.shtest'

Hide Details

Hide Details

******************** UNRESOLVED: LNT :: runtest/test_suite-compile-only.shtest (31 of 72) ******************** TEST 'LNT :: runtest/test_suite-compile-only.shtest' FAILED ******************** Exception during script execution: Traceback (most recent call last): File "/Users/buildslave/jenkins/workspace/LNT_Tests/venv/lib/python2.7/site-packages/lit-0.10.0.dev0-py2.7.egg/lit/worker.py", line 93, in _execute_test_handle_errors return _adapt_result(test.config.test_format.execute(test, lit_config)) File "/Users/buildslave/jenkins/workspace/LNT_Tests/venv/lib/python2.7/site-packages/lit-0.10.0.dev0-py2.7.egg/lit/formats/shtest.py", line 25, in execute self.execute_external) File "/Users/buildslave/jenkins/workspace/LNT_Tests/venv/lib/python2.7/site-packages/lit-0.10.0.dev0-py2.7.egg/lit/TestRunner.py", line 1641, in executeShTest script = parseIntegratedTestScript(test) File "/Users/buildslave/jenkins/workspace/LNT_Tests/venv/lib/python2.7/site-packages/lit-0.10.0.dev0-py2.7.egg/lit/TestRunner.py", line 1547, in parseIntegratedTestScript keyword_parsers.keys()): File "/Users/buildslave/jenkins/workspace/LNT_Tests/venv/lib/python2.7/site-packages/lit-0.10.0.dev0-py2.7.egg/lit/TestRunner.py", line 1217, in parseIntegratedTestScriptCommands f = open(source_path, 'rb') IOError: [Errno 2] No such file or directory: '/Users/buildslave/jenkins/workspace/LNT_Tests/llvm-lnt/tests/runtest/test_suite-compile-only.shtest'

Hide Details

Hide Details

******************** UNRESOLVED: LNT :: runtest/test_suite-cross.shtest (32 of 72) ******************** TEST 'LNT :: runtest/test_suite-cross.shtest' FAILED ******************** Exception during script execution: Traceback (most recent call last): File "/Users/buildslave/jenkins/workspace/LNT_Tests/venv/lib/python2.7/site-packages/lit-0.10.0.dev0-py2.7.egg/lit/worker.py", line 93, in _execute_test_handle_errors return _adapt_result(test.config.test_format.execute(test, lit_config)) File "/Users/buildslave/jenkins/workspace/LNT_Tests/venv/lib/python2.7/site-packages/lit-0.10.0.dev0-py2.7.egg/lit/formats/shtest.py", line 25, in execute self.execute_external) File "/Users/buildslave/jenkins/workspace/LNT_Tests/venv/lib/python2.7/site-packages/lit-0.10.0.dev0-py2.7.egg/lit/TestRunner.py", line 1641, in executeShTest script = parseIntegratedTestScript(test) File "/Users/buildslave/jenkins/workspace/LNT_Tests/venv/lib/python2.7/site-packages/lit-0.10.0.dev0-py2.7.egg/lit/TestRunner.py", line 1547, in parseIntegratedTestScript keyword_parsers.keys()): File "/Users/buildslave/jenkins/workspace/LNT_Tests/venv/lib/python2.7/site-packages/lit-0.10.0.dev0-py2.7.egg/lit/TestRunner.py", line 1217, in parseIntegratedTestScriptCommands f = open(source_path, 'rb') IOError: [Errno 2] No such file or directory: '/Users/buildslave/jenkins/workspace/LNT_Tests/llvm-lnt/tests/runtest/test_suite-cross.shtest'

Hide Details

Hide Details

******************** UNRESOLVED: LNT :: runtest/test_suite-fail-compile.shtest (33 of 72) ******************** TEST 'LNT :: runtest/test_suite-fail-compile.shtest' FAILED ******************** Exception during script execution: Traceback (most recent call last): File "/Users/buildslave/jenkins/workspace/LNT_Tests/venv/lib/python2.7/site-packages/lit-0.10.0.dev0-py2.7.egg/lit/worker.py", line 93, in _execute_test_handle_errors return _adapt_result(test.config.test_format.execute(test, lit_config)) File "/Users/buildslave/jenkins/workspace/LNT_Tests/venv/lib/python2.7/site-packages/lit-0.10.0.dev0-py2.7.egg/lit/formats/shtest.py", line 25, in execute self.execute_external) File "/Users/buildslave/jenkins/workspace/LNT_Tests/venv/lib/python2.7/site-packages/lit-0.10.0.dev0-py2.7.egg/lit/TestRunner.py", line 1641, in executeShTest script = parseIntegratedTestScript(test) File "/Users/buildslave/jenkins/workspace/LNT_Tests/venv/lib/python2.7/site-packages/lit-0.10.0.dev0-py2.7.egg/lit/TestRunner.py", line 1547, in parseIntegratedTestScript keyword_parsers.keys()): File "/Users/buildslave/jenkins/workspace/LNT_Tests/venv/lib/python2.7/site-packages/lit-0.10.0.dev0-py2.7.egg/lit/TestRunner.py", line 1217, in parseIntegratedTestScriptCommands f = open(source_path, 'rb') IOError: [Errno 2] No such file or directory: '/Users/buildslave/jenkins/workspace/LNT_Tests/llvm-lnt/tests/runtest/test_suite-fail-compile.shtest'

Hide Details

Hide Details

******************** UNRESOLVED: LNT :: runtest/test_suite-fail-exec.shtest (34 of 72) ******************** TEST 'LNT :: runtest/test_suite-fail-exec.shtest' FAILED ******************** Exception during script execution: Traceback (most recent call last): File "/Users/buildslave/jenkins/workspace/LNT_Tests/venv/lib/python2.7/site-packages/lit-0.10.0.dev0-py2.7.egg/lit/worker.py", line 93, in _execute_test_handle_errors return _adapt_result(test.config.test_format.execute(test, lit_config)) File "/Users/buildslave/jenkins/workspace/LNT_Tests/venv/lib/python2.7/site-packages/lit-0.10.0.dev0-py2.7.egg/lit/formats/shtest.py", line 25, in execute self.execute_external) File "/Users/buildslave/jenkins/workspace/LNT_Tests/venv/lib/python2.7/site-packages/lit-0.10.0.dev0-py2.7.egg/lit/TestRunner.py", line 1641, in executeShTest script = parseIntegratedTestScript(test) File "/Users/buildslave/jenkins/workspace/LNT_Tests/venv/lib/python2.7/site-packages/lit-0.10.0.dev0-py2.7.egg/lit/TestRunner.py", line 1547, in parseIntegratedTestScript keyword_parsers.keys()): File "/Users/buildslave/jenkins/workspace/LNT_Tests/venv/lib/python2.7/site-packages/lit-0.10.0.dev0-py2.7.egg/lit/TestRunner.py", line 1217, in parseIntegratedTestScriptCommands f = open(source_path, 'rb') IOError: [Errno 2] No such file or directory: '/Users/buildslave/jenkins/workspace/LNT_Tests/llvm-lnt/tests/runtest/test_suite-fail-exec.shtest'

Hide Details

Hide Details

******************** UNRESOLVED: LNT :: runtest/test_suite-machine-name.shtest (35 of 72) ******************** TEST 'LNT :: runtest/test_suite-machine-name.shtest' FAILED ******************** Exception during script execution: Traceback (most recent call last): File "/Users/buildslave/jenkins/workspace/LNT_Tests/venv/lib/python2.7/site-packages/lit-0.10.0.dev0-py2.7.egg/lit/worker.py", line 93, in _execute_test_handle_errors return _adapt_result(test.config.test_format.execute(test, lit_config)) File "/Users/buildslave/jenkins/workspace/LNT_Tests/venv/lib/python2.7/site-packages/lit-0.10.0.dev0-py2.7.egg/lit/formats/shtest.py", line 25, in execute self.execute_external) File "/Users/buildslave/jenkins/workspace/LNT_Tests/venv/lib/python2.7/site-packages/lit-0.10.0.dev0-py2.7.egg/lit/TestRunner.py", line 1641, in executeShTest script = parseIntegratedTestScript(test) File "/Users/buildslave/jenkins/workspace/LNT_Tests/venv/lib/python2.7/site-packages/lit-0.10.0.dev0-py2.7.egg/lit/TestRunner.py", line 1547, in parseIntegratedTestScript keyword_parsers.keys()): File "/Users/buildslave/jenkins/workspace/LNT_Tests/venv/lib/python2.7/site-packages/lit-0.10.0.dev0-py2.7.egg/lit/TestRunner.py", line 1217, in parseIntegratedTestScriptCommands f = open(source_path, 'rb') IOError: [Errno 2] No such file or directory: '/Users/buildslave/jenkins/workspace/LNT_Tests/llvm-lnt/tests/runtest/test_suite-machine-name.shtest'

Hide Details

Hide Details

******************** UNRESOLVED: LNT :: runtest/test_suite-metrics.shtest (36 of 72) ******************** TEST 'LNT :: runtest/test_suite-metrics.shtest' FAILED ******************** Exception during script execution: Traceback (most recent call last): File "/Users/buildslave/jenkins/workspace/LNT_Tests/venv/lib/python2.7/site-packages/lit-0.10.0.dev0-py2.7.egg/lit/worker.py", line 93, in _execute_test_handle_errors return _adapt_result(test.config.test_format.execute(test, lit_config)) File "/Users/buildslave/jenkins/workspace/LNT_Tests/venv/lib/python2.7/site-packages/lit-0.10.0.dev0-py2.7.egg/lit/formats/shtest.py", line 25, in execute self.execute_external) File "/Users/buildslave/jenkins/workspace/LNT_Tests/venv/lib/python2.7/site-packages/lit-0.10.0.dev0-py2.7.egg/lit/TestRunner.py", line 1641, in executeShTest script = parseIntegratedTestScript(test) File "/Users/buildslave/jenkins/workspace/LNT_Tests/venv/lib/python2.7/site-packages/lit-0.10.0.dev0-py2.7.egg/lit/TestRunner.py", line 1547, in parseIntegratedTestScript keyword_parsers.keys()): File "/Users/buildslave/jenkins/workspace/LNT_Tests/venv/lib/python2.7/site-packages/lit-0.10.0.dev0-py2.7.egg/lit/TestRunner.py", line 1217, in parseIntegratedTestScriptCommands f = open(source_path, 'rb') IOError: [Errno 2] No such file or directory: '/Users/buildslave/jenkins/workspace/LNT_Tests/llvm-lnt/tests/runtest/test_suite-metrics.shtest'

Hide Details

Hide Details

******************** UNRESOLVED: LNT :: runtest/test_suite-only-test.shtest (37 of 72) ******************** TEST 'LNT :: runtest/test_suite-only-test.shtest' FAILED ******************** Exception during script execution: Traceback (most recent call last): File "/Users/buildslave/jenkins/workspace/LNT_Tests/venv/lib/python2.7/site-packages/lit-0.10.0.dev0-py2.7.egg/lit/worker.py", line 93, in _execute_test_handle_errors return _adapt_result(test.config.test_format.execute(test, lit_config)) File "/Users/buildslave/jenkins/workspace/LNT_Tests/venv/lib/python2.7/site-packages/lit-0.10.0.dev0-py2.7.egg/lit/formats/shtest.py", line 25, in execute self.execute_external) File "/Users/buildslave/jenkins/workspace/LNT_Tests/venv/lib/python2.7/site-packages/lit-0.10.0.dev0-py2.7.egg/lit/TestRunner.py", line 1641, in executeShTest script = parseIntegratedTestScript(test) File "/Users/buildslave/jenkins/workspace/LNT_Tests/venv/lib/python2.7/site-packages/lit-0.10.0.dev0-py2.7.egg/lit/TestRunner.py", line 1547, in parseIntegratedTestScript keyword_parsers.keys()): File "/Users/buildslave/jenkins/workspace/LNT_Tests/venv/lib/python2.7/site-packages/lit-0.10.0.dev0-py2.7.egg/lit/TestRunner.py", line 1217, in parseIntegratedTestScriptCommands f = open(source_path, 'rb') IOError: [Errno 2] No such file or directory: '/Users/buildslave/jenkins/workspace/LNT_Tests/llvm-lnt/tests/runtest/test_suite-only-test.shtest'

Hide Details

Hide Details

******************** UNRESOLVED: LNT :: runtest/test_suite-perf-events.shtest (38 of 72) ******************** TEST 'LNT :: runtest/test_suite-perf-events.shtest' FAILED ******************** Exception during script execution: Traceback (most recent call last): File "/Users/buildslave/jenkins/workspace/LNT_Tests/venv/lib/python2.7/site-packages/lit-0.10.0.dev0-py2.7.egg/lit/worker.py", line 93, in _execute_test_handle_errors return _adapt_result(test.config.test_format.execute(test, lit_config)) File "/Users/buildslave/jenkins/workspace/LNT_Tests/venv/lib/python2.7/site-packages/lit-0.10.0.dev0-py2.7.egg/lit/formats/shtest.py", line 25, in execute self.execute_external) File "/Users/buildslave/jenkins/workspace/LNT_Tests/venv/lib/python2.7/site-packages/lit-0.10.0.dev0-py2.7.egg/lit/TestRunner.py", line 1641, in executeShTest script = parseIntegratedTestScript(test) File "/Users/buildslave/jenkins/workspace/LNT_Tests/venv/lib/python2.7/site-packages/lit-0.10.0.dev0-py2.7.egg/lit/TestRunner.py", line 1547, in parseIntegratedTestScript keyword_parsers.keys()): File "/Users/buildslave/jenkins/workspace/LNT_Tests/venv/lib/python2.7/site-packages/lit-0.10.0.dev0-py2.7.egg/lit/TestRunner.py", line 1217, in parseIntegratedTestScriptCommands f = open(source_path, 'rb') IOError: [Errno 2] No such file or directory: '/Users/buildslave/jenkins/workspace/LNT_Tests/llvm-lnt/tests/runtest/test_suite-perf-events.shtest'

Hide Details

Hide Details

******************** UNRESOLVED: LNT :: runtest/test_suite-pgo.shtest (39 of 72) ******************** TEST 'LNT :: runtest/test_suite-pgo.shtest' FAILED ******************** Exception during script execution: Traceback (most recent call last): File "/Users/buildslave/jenkins/workspace/LNT_Tests/venv/lib/python2.7/site-packages/lit-0.10.0.dev0-py2.7.egg/lit/worker.py", line 93, in _execute_test_handle_errors return _adapt_result(test.config.test_format.execute(test, lit_config)) File "/Users/buildslave/jenkins/workspace/LNT_Tests/venv/lib/python2.7/site-packages/lit-0.10.0.dev0-py2.7.egg/lit/formats/shtest.py", line 25, in execute self.execute_external) File "/Users/buildslave/jenkins/workspace/LNT_Tests/venv/lib/python2.7/site-packages/lit-0.10.0.dev0-py2.7.egg/lit/TestRunner.py", line 1641, in executeShTest script = parseIntegratedTestScript(test) File "/Users/buildslave/jenkins/workspace/LNT_Tests/venv/lib/python2.7/site-packages/lit-0.10.0.dev0-py2.7.egg/lit/TestRunner.py", line 1547, in parseIntegratedTestScript keyword_parsers.keys()): File "/Users/buildslave/jenkins/workspace/LNT_Tests/venv/lib/python2.7/site-packages/lit-0.10.0.dev0-py2.7.egg/lit/TestRunner.py", line 1217, in parseIntegratedTestScriptCommands f = open(source_path, 'rb') IOError: [Errno 2] No such file or directory: '/Users/buildslave/jenkins/workspace/LNT_Tests/llvm-lnt/tests/runtest/test_suite-pgo.shtest'

Hide Details

Hide Details

******************** UNRESOLVED: LNT :: runtest/test_suite-profile.shtest (40 of 72) ******************** TEST 'LNT :: runtest/test_suite-profile.shtest' FAILED ******************** Exception during script execution: Traceback (most recent call last): File "/Users/buildslave/jenkins/workspace/LNT_Tests/venv/lib/python2.7/site-packages/lit-0.10.0.dev0-py2.7.egg/lit/worker.py", line 93, in _execute_test_handle_errors return _adapt_result(test.config.test_format.execute(test, lit_config)) File "/Users/buildslave/jenkins/workspace/LNT_Tests/venv/lib/python2.7/site-packages/lit-0.10.0.dev0-py2.7.egg/lit/formats/shtest.py", line 25, in execute self.execute_external) File "/Users/buildslave/jenkins/workspace/LNT_Tests/venv/lib/python2.7/site-packages/lit-0.10.0.dev0-py2.7.egg/lit/TestRunner.py", line 1641, in executeShTest script = parseIntegratedTestScript(test) File "/Users/buildslave/jenkins/workspace/LNT_Tests/venv/lib/python2.7/site-packages/lit-0.10.0.dev0-py2.7.egg/lit/TestRunner.py", line 1547, in parseIntegratedTestScript keyword_parsers.keys()): File "/Users/buildslave/jenkins/workspace/LNT_Tests/venv/lib/python2.7/site-packages/lit-0.10.0.dev0-py2.7.egg/lit/TestRunner.py", line 1217, in parseIntegratedTestScriptCommands f = open(source_path, 'rb') IOError: [Errno 2] No such file or directory: '/Users/buildslave/jenkins/workspace/LNT_Tests/llvm-lnt/tests/runtest/test_suite-profile.shtest'

Hide Details

Hide Details

******************** UNRESOLVED: LNT :: runtest/test_suite-run-order.shtest (41 of 72) ******************** TEST 'LNT :: runtest/test_suite-run-order.shtest' FAILED ******************** Exception during script execution: Traceback (most recent call last): File "/Users/buildslave/jenkins/workspace/LNT_Tests/venv/lib/python2.7/site-packages/lit-0.10.0.dev0-py2.7.egg/lit/worker.py", line 93, in _execute_test_handle_errors return _adapt_result(test.config.test_format.execute(test, lit_config)) File "/Users/buildslave/jenkins/workspace/LNT_Tests/venv/lib/python2.7/site-packages/lit-0.10.0.dev0-py2.7.egg/lit/formats/shtest.py", line 25, in execute self.execute_external) File "/Users/buildslave/jenkins/workspace/LNT_Tests/venv/lib/python2.7/site-packages/lit-0.10.0.dev0-py2.7.egg/lit/TestRunner.py", line 1641, in executeShTest script = parseIntegratedTestScript(test) File "/Users/buildslave/jenkins/workspace/LNT_Tests/venv/lib/python2.7/site-packages/lit-0.10.0.dev0-py2.7.egg/lit/TestRunner.py", line 1547, in parseIntegratedTestScript keyword_parsers.keys()): File "/Users/buildslave/jenkins/workspace/LNT_Tests/venv/lib/python2.7/site-packages/lit-0.10.0.dev0-py2.7.egg/lit/TestRunner.py", line 1217, in parseIntegratedTestScriptCommands f = open(source_path, 'rb') IOError: [Errno 2] No such file or directory: '/Users/buildslave/jenkins/workspace/LNT_Tests/llvm-lnt/tests/runtest/test_suite-run-order.shtest'

Hide Details

Hide Details

******************** UNRESOLVED: LNT :: runtest/test_suite-run-under.shtest (42 of 72) ******************** TEST 'LNT :: runtest/test_suite-run-under.shtest' FAILED ******************** Exception during script execution: Traceback (most recent call last): File "/Users/buildslave/jenkins/workspace/LNT_Tests/venv/lib/python2.7/site-packages/lit-0.10.0.dev0-py2.7.egg/lit/worker.py", line 93, in _execute_test_handle_errors return _adapt_result(test.config.test_format.execute(test, lit_config)) File "/Users/buildslave/jenkins/workspace/LNT_Tests/venv/lib/python2.7/site-packages/lit-0.10.0.dev0-py2.7.egg/lit/formats/shtest.py", line 25, in execute self.execute_external) File "/Users/buildslave/jenkins/workspace/LNT_Tests/venv/lib/python2.7/site-packages/lit-0.10.0.dev0-py2.7.egg/lit/TestRunner.py", line 1641, in executeShTest script = parseIntegratedTestScript(test) File "/Users/buildslave/jenkins/workspace/LNT_Tests/venv/lib/python2.7/site-packages/lit-0.10.0.dev0-py2.7.egg/lit/TestRunner.py", line 1547, in parseIntegratedTestScript keyword_parsers.keys()): File "/Users/buildslave/jenkins/workspace/LNT_Tests/venv/lib/python2.7/site-packages/lit-0.10.0.dev0-py2.7.egg/lit/TestRunner.py", line 1217, in parseIntegratedTestScriptCommands f = open(source_path, 'rb') IOError: [Errno 2] No such file or directory: '/Users/buildslave/jenkins/workspace/LNT_Tests/llvm-lnt/tests/runtest/test_suite-run-under.shtest'

Hide Details

Hide Details

******************** UNRESOLVED: LNT :: runtest/test_suite-use-perf.shtest (43 of 72) ******************** TEST 'LNT :: runtest/test_suite-use-perf.shtest' FAILED ******************** Exception during script execution: Traceback (most recent call last): File "/Users/buildslave/jenkins/workspace/LNT_Tests/venv/lib/python2.7/site-packages/lit-0.10.0.dev0-py2.7.egg/lit/worker.py", line 93, in _execute_test_handle_errors return _adapt_result(test.config.test_format.execute(test, lit_config)) File "/Users/buildslave/jenkins/workspace/LNT_Tests/venv/lib/python2.7/site-packages/lit-0.10.0.dev0-py2.7.egg/lit/formats/shtest.py", line 25, in execute self.execute_external) File "/Users/buildslave/jenkins/workspace/LNT_Tests/venv/lib/python2.7/site-packages/lit-0.10.0.dev0-py2.7.egg/lit/TestRunner.py", line 1641, in executeShTest script = parseIntegratedTestScript(test) File "/Users/buildslave/jenkins/workspace/LNT_Tests/venv/lib/python2.7/site-packages/lit-0.10.0.dev0-py2.7.egg/lit/TestRunner.py", line 1547, in parseIntegratedTestScript keyword_parsers.keys()): File "/Users/buildslave/jenkins/workspace/LNT_Tests/venv/lib/python2.7/site-packages/lit-0.10.0.dev0-py2.7.egg/lit/TestRunner.py", line 1217, in parseIntegratedTestScriptCommands f = open(source_path, 'rb') IOError: [Errno 2] No such file or directory: '/Users/buildslave/jenkins/workspace/LNT_Tests/llvm-lnt/tests/runtest/test_suite-use-perf.shtest'

Hide Details

Hide Details

******************** UNRESOLVED: LNT :: runtest/test_suite.shtest (44 of 72) ******************** TEST 'LNT :: runtest/test_suite.shtest' FAILED ******************** Exception during script execution: Traceback (most recent call last): File "/Users/buildslave/jenkins/workspace/LNT_Tests/venv/lib/python2.7/site-packages/lit-0.10.0.dev0-py2.7.egg/lit/worker.py", line 93, in _execute_test_handle_errors return _adapt_result(test.config.test_format.execute(test, lit_config)) File "/Users/buildslave/jenkins/workspace/LNT_Tests/venv/lib/python2.7/site-packages/lit-0.10.0.dev0-py2.7.egg/lit/formats/shtest.py", line 25, in execute self.execute_external) File "/Users/buildslave/jenkins/workspace/LNT_Tests/venv/lib/python2.7/site-packages/lit-0.10.0.dev0-py2.7.egg/lit/TestRunner.py", line 1641, in executeShTest script = parseIntegratedTestScript(test) File "/Users/buildslave/jenkins/workspace/LNT_Tests/venv/lib/python2.7/site-packages/lit-0.10.0.dev0-py2.7.egg/lit/TestRunner.py", line 1547, in parseIntegratedTestScript keyword_parsers.keys()): File "/Users/buildslave/jenkins/workspace/LNT_Tests/venv/lib/python2.7/site-packages/lit-0.10.0.dev0-py2.7.egg/lit/TestRunner.py", line 1217, in parseIntegratedTestScriptCommands f = open(source_path, 'rb') IOError: [Errno 2] No such file or directory: '/Users/buildslave/jenkins/workspace/LNT_Tests/llvm-lnt/tests/runtest/test_suite.shtest'

Hide Details

Hide Details

******************** UNRESOLVED: LNT :: runtest/test_suite_diagnose.shtest (45 of 72) ******************** TEST 'LNT :: runtest/test_suite_diagnose.shtest' FAILED ******************** Exception during script execution: Traceback (most recent call last): File "/Users/buildslave/jenkins/workspace/LNT_Tests/venv/lib/python2.7/site-packages/lit-0.10.0.dev0-py2.7.egg/lit/worker.py", line 93, in _execute_test_handle_errors return _adapt_result(test.config.test_format.execute(test, lit_config)) File "/Users/buildslave/jenkins/workspace/LNT_Tests/venv/lib/python2.7/site-packages/lit-0.10.0.dev0-py2.7.egg/lit/formats/shtest.py", line 25, in execute self.execute_external) File "/Users/buildslave/jenkins/workspace/LNT_Tests/venv/lib/python2.7/site-packages/lit-0.10.0.dev0-py2.7.egg/lit/TestRunner.py", line 1641, in executeShTest script = parseIntegratedTestScript(test) File "/Users/buildslave/jenkins/workspace/LNT_Tests/venv/lib/python2.7/site-packages/lit-0.10.0.dev0-py2.7.egg/lit/TestRunner.py", line 1547, in parseIntegratedTestScript keyword_parsers.keys()): File "/Users/buildslave/jenkins/workspace/LNT_Tests/venv/lib/python2.7/site-packages/lit-0.10.0.dev0-py2.7.egg/lit/TestRunner.py", line 1217, in parseIntegratedTestScriptCommands f = open(source_path, 'rb') IOError: [Errno 2] No such file or directory: '/Users/buildslave/jenkins/workspace/LNT_Tests/llvm-lnt/tests/runtest/test_suite_diagnose.shtest'

Hide Details

Hide Details

******************** UNRESOLVED: LNT :: server/db/CreateV4TestSuite.py (46 of 72) ******************** TEST 'LNT :: server/db/CreateV4TestSuite.py' FAILED ******************** Exception during script execution: Traceback (most recent call last): File "/Users/buildslave/jenkins/workspace/LNT_Tests/venv/lib/python2.7/site-packages/lit-0.10.0.dev0-py2.7.egg/lit/worker.py", line 93, in _execute_test_handle_errors return _adapt_result(test.config.test_format.execute(test, lit_config)) File "/Users/buildslave/jenkins/workspace/LNT_Tests/venv/lib/python2.7/site-packages/lit-0.10.0.dev0-py2.7.egg/lit/formats/shtest.py", line 25, in execute self.execute_external) File "/Users/buildslave/jenkins/workspace/LNT_Tests/venv/lib/python2.7/site-packages/lit-0.10.0.dev0-py2.7.egg/lit/TestRunner.py", line 1641, in executeShTest script = parseIntegratedTestScript(test) File "/Users/buildslave/jenkins/workspace/LNT_Tests/venv/lib/python2.7/site-packages/lit-0.10.0.dev0-py2.7.egg/lit/TestRunner.py", line 1547, in parseIntegratedTestScript keyword_parsers.keys()): File "/Users/buildslave/jenkins/workspace/LNT_Tests/venv/lib/python2.7/site-packages/lit-0.10.0.dev0-py2.7.egg/lit/TestRunner.py", line 1217, in parseIntegratedTestScriptCommands f = open(source_path, 'rb') IOError: [Errno 2] No such file or directory: '/Users/buildslave/jenkins/workspace/LNT_Tests/llvm-lnt/tests/server/db/CreateV4TestSuite.py'

Hide Details

Hide Details

******************** UNRESOLVED: LNT :: server/db/CreateV4TestSuiteInstance.py (47 of 72) ******************** TEST 'LNT :: server/db/CreateV4TestSuiteInstance.py' FAILED ******************** Exception during script execution: Traceback (most recent call last): File "/Users/buildslave/jenkins/workspace/LNT_Tests/venv/lib/python2.7/site-packages/lit-0.10.0.dev0-py2.7.egg/lit/worker.py", line 93, in _execute_test_handle_errors return _adapt_result(test.config.test_format.execute(test, lit_config)) File "/Users/buildslave/jenkins/workspace/LNT_Tests/venv/lib/python2.7/site-packages/lit-0.10.0.dev0-py2.7.egg/lit/formats/shtest.py", line 25, in execute self.execute_external) File "/Users/buildslave/jenkins/workspace/LNT_Tests/venv/lib/python2.7/site-packages/lit-0.10.0.dev0-py2.7.egg/lit/TestRunner.py", line 1641, in executeShTest script = parseIntegratedTestScript(test) File "/Users/buildslave/jenkins/workspace/LNT_Tests/venv/lib/python2.7/site-packages/lit-0.10.0.dev0-py2.7.egg/lit/TestRunner.py", line 1547, in parseIntegratedTestScript keyword_parsers.keys()): File "/Users/buildslave/jenkins/workspace/LNT_Tests/venv/lib/python2.7/site-packages/lit-0.10.0.dev0-py2.7.egg/lit/TestRunner.py", line 1217, in parseIntegratedTestScriptCommands f = open(source_path, 'rb') IOError: [Errno 2] No such file or directory: '/Users/buildslave/jenkins/workspace/LNT_Tests/llvm-lnt/tests/server/db/CreateV4TestSuiteInstance.py'

Hide Details

Hide Details

******************** UNRESOLVED: LNT :: server/db/ImportProfile.py (48 of 72) ******************** TEST 'LNT :: server/db/ImportProfile.py' FAILED ******************** Exception during script execution: Traceback (most recent call last): File "/Users/buildslave/jenkins/workspace/LNT_Tests/venv/lib/python2.7/site-packages/lit-0.10.0.dev0-py2.7.egg/lit/worker.py", line 93, in _execute_test_handle_errors return _adapt_result(test.config.test_format.execute(test, lit_config)) File "/Users/buildslave/jenkins/workspace/LNT_Tests/venv/lib/python2.7/site-packages/lit-0.10.0.dev0-py2.7.egg/lit/formats/shtest.py", line 25, in execute self.execute_external) File "/Users/buildslave/jenkins/workspace/LNT_Tests/venv/lib/python2.7/site-packages/lit-0.10.0.dev0-py2.7.egg/lit/TestRunner.py", line 1641, in executeShTest script = parseIntegratedTestScript(test) File "/Users/buildslave/jenkins/workspace/LNT_Tests/venv/lib/python2.7/site-packages/lit-0.10.0.dev0-py2.7.egg/lit/TestRunner.py", line 1547, in parseIntegratedTestScript keyword_parsers.keys()): File "/Users/buildslave/jenkins/workspace/LNT_Tests/venv/lib/python2.7/site-packages/lit-0.10.0.dev0-py2.7.egg/lit/TestRunner.py", line 1217, in parseIntegratedTestScriptCommands f = open(source_path, 'rb') IOError: [Errno 2] No such file or directory: '/Users/buildslave/jenkins/workspace/LNT_Tests/llvm-lnt/tests/server/db/ImportProfile.py'

Hide Details

Hide Details

******************** UNRESOLVED: LNT :: server/db/ImportV4TestSuiteInstance.py (49 of 72) ******************** TEST 'LNT :: server/db/ImportV4TestSuiteInstance.py' FAILED ******************** Exception during script execution: Traceback (most recent call last): File "/Users/buildslave/jenkins/workspace/LNT_Tests/venv/lib/python2.7/site-packages/lit-0.10.0.dev0-py2.7.egg/lit/worker.py", line 93, in _execute_test_handle_errors return _adapt_result(test.config.test_format.execute(test, lit_config)) File "/Users/buildslave/jenkins/workspace/LNT_Tests/venv/lib/python2.7/site-packages/lit-0.10.0.dev0-py2.7.egg/lit/formats/shtest.py", line 25, in execute self.execute_external) File "/Users/buildslave/jenkins/workspace/LNT_Tests/venv/lib/python2.7/site-packages/lit-0.10.0.dev0-py2.7.egg/lit/TestRunner.py", line 1641, in executeShTest script = parseIntegratedTestScript(test) File "/Users/buildslave/jenkins/workspace/LNT_Tests/venv/lib/python2.7/site-packages/lit-0.10.0.dev0-py2.7.egg/lit/TestRunner.py", line 1547, in parseIntegratedTestScript keyword_parsers.keys()): File "/Users/buildslave/jenkins/workspace/LNT_Tests/venv/lib/python2.7/site-packages/lit-0.10.0.dev0-py2.7.egg/lit/TestRunner.py", line 1217, in parseIntegratedTestScriptCommands f = open(source_path, 'rb') IOError: [Errno 2] No such file or directory: '/Users/buildslave/jenkins/workspace/LNT_Tests/llvm-lnt/tests/server/db/ImportV4TestSuiteInstance.py'

Hide Details

Hide Details

******************** UNRESOLVED: LNT :: server/db/Migrations.py (50 of 72) ******************** TEST 'LNT :: server/db/Migrations.py' FAILED ******************** Exception during script execution: Traceback (most recent call last): File "/Users/buildslave/jenkins/workspace/LNT_Tests/venv/lib/python2.7/site-packages/lit-0.10.0.dev0-py2.7.egg/lit/worker.py", line 93, in _execute_test_handle_errors return _adapt_result(test.config.test_format.execute(test, lit_config)) File "/Users/buildslave/jenkins/workspace/LNT_Tests/venv/lib/python2.7/site-packages/lit-0.10.0.dev0-py2.7.egg/lit/formats/shtest.py", line 25, in execute self.execute_external) File "/Users/buildslave/jenkins/workspace/LNT_Tests/venv/lib/python2.7/site-packages/lit-0.10.0.dev0-py2.7.egg/lit/TestRunner.py", line 1641, in executeShTest script = parseIntegratedTestScript(test) File "/Users/buildslave/jenkins/workspace/LNT_Tests/venv/lib/python2.7/site-packages/lit-0.10.0.dev0-py2.7.egg/lit/TestRunner.py", line 1547, in parseIntegratedTestScript keyword_parsers.keys()): File "/Users/buildslave/jenkins/workspace/LNT_Tests/venv/lib/python2.7/site-packages/lit-0.10.0.dev0-py2.7.egg/lit/TestRunner.py", line 1217, in parseIntegratedTestScriptCommands f = open(source_path, 'rb') IOError: [Errno 2] No such file or directory: '/Users/buildslave/jenkins/workspace/LNT_Tests/llvm-lnt/tests/server/db/Migrations.py'

Hide Details

Hide Details

******************** UNRESOLVED: LNT :: server/db/rules.py (51 of 72) ******************** TEST 'LNT :: server/db/rules.py' FAILED ******************** Exception during script execution: Traceback (most recent call last): File "/Users/buildslave/jenkins/workspace/LNT_Tests/venv/lib/python2.7/site-packages/lit-0.10.0.dev0-py2.7.egg/lit/worker.py", line 93, in _execute_test_handle_errors return _adapt_result(test.config.test_format.execute(test, lit_config)) File "/Users/buildslave/jenkins/workspace/LNT_Tests/venv/lib/python2.7/site-packages/lit-0.10.0.dev0-py2.7.egg/lit/formats/shtest.py", line 25, in execute self.execute_external) File "/Users/buildslave/jenkins/workspace/LNT_Tests/venv/lib/python2.7/site-packages/lit-0.10.0.dev0-py2.7.egg/lit/TestRunner.py", line 1641, in executeShTest script = parseIntegratedTestScript(test) File "/Users/buildslave/jenkins/workspace/LNT_Tests/venv/lib/python2.7/site-packages/lit-0.10.0.dev0-py2.7.egg/lit/TestRunner.py", line 1547, in parseIntegratedTestScript keyword_parsers.keys()): File "/Users/buildslave/jenkins/workspace/LNT_Tests/venv/lib/python2.7/site-packages/lit-0.10.0.dev0-py2.7.egg/lit/TestRunner.py", line 1217, in parseIntegratedTestScriptCommands f = open(source_path, 'rb') IOError: [Errno 2] No such file or directory: '/Users/buildslave/jenkins/workspace/LNT_Tests/llvm-lnt/tests/server/db/rules.py'

Hide Details

Hide Details

******************** UNRESOLVED: LNT :: server/db/search.py (52 of 72) ******************** TEST 'LNT :: server/db/search.py' FAILED ******************** Exception during script execution: Traceback (most recent call last): File "/Users/buildslave/jenkins/workspace/LNT_Tests/venv/lib/python2.7/site-packages/lit-0.10.0.dev0-py2.7.egg/lit/worker.py", line 93, in _execute_test_handle_errors return _adapt_result(test.config.test_format.execute(test, lit_config)) File "/Users/buildslave/jenkins/workspace/LNT_Tests/venv/lib/python2.7/site-packages/lit-0.10.0.dev0-py2.7.egg/lit/formats/shtest.py", line 25, in execute self.execute_external) File "/Users/buildslave/jenkins/workspace/LNT_Tests/venv/lib/python2.7/site-packages/lit-0.10.0.dev0-py2.7.egg/lit/TestRunner.py", line 1641, in executeShTest script = parseIntegratedTestScript(test) File "/Users/buildslave/jenkins/workspace/LNT_Tests/venv/lib/python2.7/site-packages/lit-0.10.0.dev0-py2.7.egg/lit/TestRunner.py", line 1547, in parseIntegratedTestScript keyword_parsers.keys()): File "/Users/buildslave/jenkins/workspace/LNT_Tests/venv/lib/python2.7/site-packages/lit-0.10.0.dev0-py2.7.egg/lit/TestRunner.py", line 1217, in parseIntegratedTestScriptCommands f = open(source_path, 'rb') IOError: [Errno 2] No such file or directory: '/Users/buildslave/jenkins/workspace/LNT_Tests/llvm-lnt/tests/server/db/search.py'

Hide Details

Hide Details

******************** UNRESOLVED: LNT :: server/db/yamlschema.shtest (53 of 72) ******************** TEST 'LNT :: server/db/yamlschema.shtest' FAILED ******************** Exception during script execution: Traceback (most recent call last): File "/Users/buildslave/jenkins/workspace/LNT_Tests/venv/lib/python2.7/site-packages/lit-0.10.0.dev0-py2.7.egg/lit/worker.py", line 93, in _execute_test_handle_errors return _adapt_result(test.config.test_format.execute(test, lit_config)) File "/Users/buildslave/jenkins/workspace/LNT_Tests/venv/lib/python2.7/site-packages/lit-0.10.0.dev0-py2.7.egg/lit/formats/shtest.py", line 25, in execute self.execute_external) File "/Users/buildslave/jenkins/workspace/LNT_Tests/venv/lib/python2.7/site-packages/lit-0.10.0.dev0-py2.7.egg/lit/TestRunner.py", line 1641, in executeShTest script = parseIntegratedTestScript(test) File "/Users/buildslave/jenkins/workspace/LNT_Tests/venv/lib/python2.7/site-packages/lit-0.10.0.dev0-py2.7.egg/lit/TestRunner.py", line 1547, in parseIntegratedTestScript keyword_parsers.keys()): File "/Users/buildslave/jenkins/workspace/LNT_Tests/venv/lib/python2.7/site-packages/lit-0.10.0.dev0-py2.7.egg/lit/TestRunner.py", line 1217, in parseIntegratedTestScriptCommands f = open(source_path, 'rb') IOError: [Errno 2] No such file or directory: '/Users/buildslave/jenkins/workspace/LNT_Tests/llvm-lnt/tests/server/db/yamlschema.shtest'

Hide Details

Hide Details

******************** UNRESOLVED: LNT :: server/reporting/analysis.py (54 of 72) ******************** TEST 'LNT :: server/reporting/analysis.py' FAILED ******************** Exception during script execution: Traceback (most recent call last): File "/Users/buildslave/jenkins/workspace/LNT_Tests/venv/lib/python2.7/site-packages/lit-0.10.0.dev0-py2.7.egg/lit/worker.py", line 93, in _execute_test_handle_errors return _adapt_result(test.config.test_format.execute(test, lit_config)) File "/Users/buildslave/jenkins/workspace/LNT_Tests/venv/lib/python2.7/site-packages/lit-0.10.0.dev0-py2.7.egg/lit/formats/shtest.py", line 25, in execute self.execute_external) File "/Users/buildslave/jenkins/workspace/LNT_Tests/venv/lib/python2.7/site-packages/lit-0.10.0.dev0-py2.7.egg/lit/TestRunner.py", line 1641, in executeShTest script = parseIntegratedTestScript(test) File "/Users/buildslave/jenkins/workspace/LNT_Tests/venv/lib/python2.7/site-packages/lit-0.10.0.dev0-py2.7.egg/lit/TestRunner.py", line 1547, in parseIntegratedTestScript keyword_parsers.keys()): File "/Users/buildslave/jenkins/workspace/LNT_Tests/venv/lib/python2.7/site-packages/lit-0.10.0.dev0-py2.7.egg/lit/TestRunner.py", line 1217, in parseIntegratedTestScriptCommands f = open(source_path, 'rb') IOError: [Errno 2] No such file or directory: '/Users/buildslave/jenkins/workspace/LNT_Tests/llvm-lnt/tests/server/reporting/analysis.py'

Hide Details

Hide Details

******************** UNRESOLVED: LNT :: server/ui/V4Pages.py (55 of 72) ******************** TEST 'LNT :: server/ui/V4Pages.py' FAILED ******************** Exception during script execution: Traceback (most recent call last): File "/Users/buildslave/jenkins/workspace/LNT_Tests/venv/lib/python2.7/site-packages/lit-0.10.0.dev0-py2.7.egg/lit/worker.py", line 93, in _execute_test_handle_errors return _adapt_result(test.config.test_format.execute(test, lit_config)) File "/Users/buildslave/jenkins/workspace/LNT_Tests/venv/lib/python2.7/site-packages/lit-0.10.0.dev0-py2.7.egg/lit/formats/shtest.py", line 25, in execute self.execute_external) File "/Users/buildslave/jenkins/workspace/LNT_Tests/venv/lib/python2.7/site-packages/lit-0.10.0.dev0-py2.7.egg/lit/TestRunner.py", line 1641, in executeShTest script = parseIntegratedTestScript(test) File "/Users/buildslave/jenkins/workspace/LNT_Tests/venv/lib/python2.7/site-packages/lit-0.10.0.dev0-py2.7.egg/lit/TestRunner.py", line 1547, in parseIntegratedTestScript keyword_parsers.keys()): File "/Users/buildslave/jenkins/workspace/LNT_Tests/venv/lib/python2.7/site-packages/lit-0.10.0.dev0-py2.7.egg/lit/TestRunner.py", line 1217, in parseIntegratedTestScriptCommands f = open(source_path, 'rb') IOError: [Errno 2] No such file or directory: '/Users/buildslave/jenkins/workspace/LNT_Tests/llvm-lnt/tests/server/ui/V4Pages.py'

Hide Details

Hide Details

******************** UNRESOLVED: LNT :: server/ui/change_processing.py (56 of 72) ******************** TEST 'LNT :: server/ui/change_processing.py' FAILED ******************** Exception during script execution: Traceback (most recent call last): File "/Users/buildslave/jenkins/workspace/LNT_Tests/venv/lib/python2.7/site-packages/lit-0.10.0.dev0-py2.7.egg/lit/worker.py", line 93, in _execute_test_handle_errors return _adapt_result(test.config.test_format.execute(test, lit_config)) File "/Users/buildslave/jenkins/workspace/LNT_Tests/venv/lib/python2.7/site-packages/lit-0.10.0.dev0-py2.7.egg/lit/formats/shtest.py", line 25, in execute self.execute_external) File "/Users/buildslave/jenkins/workspace/LNT_Tests/venv/lib/python2.7/site-packages/lit-0.10.0.dev0-py2.7.egg/lit/TestRunner.py", line 1641, in executeShTest script = parseIntegratedTestScript(test) File "/Users/buildslave/jenkins/workspace/LNT_Tests/venv/lib/python2.7/site-packages/lit-0.10.0.dev0-py2.7.egg/lit/TestRunner.py", line 1547, in parseIntegratedTestScript keyword_parsers.keys()): File "/Users/buildslave/jenkins/workspace/LNT_Tests/venv/lib/python2.7/site-packages/lit-0.10.0.dev0-py2.7.egg/lit/TestRunner.py", line 1217, in parseIntegratedTestScriptCommands f = open(source_path, 'rb') IOError: [Errno 2] No such file or directory: '/Users/buildslave/jenkins/workspace/LNT_Tests/llvm-lnt/tests/server/ui/change_processing.py'

Hide Details

Hide Details

******************** UNRESOLVED: LNT :: server/ui/statsTester.py (57 of 72) ******************** TEST 'LNT :: server/ui/statsTester.py' FAILED ******************** Exception during script execution: Traceback (most recent call last): File "/Users/buildslave/jenkins/workspace/LNT_Tests/venv/lib/python2.7/site-packages/lit-0.10.0.dev0-py2.7.egg/lit/worker.py", line 93, in _execute_test_handle_errors return _adapt_result(test.config.test_format.execute(test, lit_config)) File "/Users/buildslave/jenkins/workspace/LNT_Tests/venv/lib/python2.7/site-packages/lit-0.10.0.dev0-py2.7.egg/lit/formats/shtest.py", line 25, in execute self.execute_external) File "/Users/buildslave/jenkins/workspace/LNT_Tests/venv/lib/python2.7/site-packages/lit-0.10.0.dev0-py2.7.egg/lit/TestRunner.py", line 1641, in executeShTest script = parseIntegratedTestScript(test) File "/Users/buildslave/jenkins/workspace/LNT_Tests/venv/lib/python2.7/site-packages/lit-0.10.0.dev0-py2.7.egg/lit/TestRunner.py", line 1547, in parseIntegratedTestScript keyword_parsers.keys()): File "/Users/buildslave/jenkins/workspace/LNT_Tests/venv/lib/python2.7/site-packages/lit-0.10.0.dev0-py2.7.egg/lit/TestRunner.py", line 1217, in parseIntegratedTestScriptCommands f = open(source_path, 'rb') IOError: [Errno 2] No such file or directory: '/Users/buildslave/jenkins/workspace/LNT_Tests/llvm-lnt/tests/server/ui/statsTester.py'

Hide Details

Hide Details

******************** UNRESOLVED: LNT :: server/ui/test_api.py (58 of 72) ******************** TEST 'LNT :: server/ui/test_api.py' FAILED ******************** Exception during script execution: Traceback (most recent call last): File "/Users/buildslave/jenkins/workspace/LNT_Tests/venv/lib/python2.7/site-packages/lit-0.10.0.dev0-py2.7.egg/lit/worker.py", line 93, in _execute_test_handle_errors return _adapt_result(test.config.test_format.execute(test, lit_config)) File "/Users/buildslave/jenkins/workspace/LNT_Tests/venv/lib/python2.7/site-packages/lit-0.10.0.dev0-py2.7.egg/lit/formats/shtest.py", line 25, in execute self.execute_external) File "/Users/buildslave/jenkins/workspace/LNT_Tests/venv/lib/python2.7/site-packages/lit-0.10.0.dev0-py2.7.egg/lit/TestRunner.py", line 1641, in executeShTest script = parseIntegratedTestScript(test) File "/Users/buildslave/jenkins/workspace/LNT_Tests/venv/lib/python2.7/site-packages/lit-0.10.0.dev0-py2.7.egg/lit/TestRunner.py", line 1547, in parseIntegratedTestScript keyword_parsers.keys()): File "/Users/buildslave/jenkins/workspace/LNT_Tests/venv/lib/python2.7/site-packages/lit-0.10.0.dev0-py2.7.egg/lit/TestRunner.py", line 1217, in parseIntegratedTestScriptCommands f = open(source_path, 'rb') IOError: [Errno 2] No such file or directory: '/Users/buildslave/jenkins/workspace/LNT_Tests/llvm-lnt/tests/server/ui/test_api.py'

Hide Details

Hide Details

******************** UNRESOLVED: LNT :: server/ui/test_api_modify.py (59 of 72) ******************** TEST 'LNT :: server/ui/test_api_modify.py' FAILED ******************** Exception during script execution: Traceback (most recent call last): File "/Users/buildslave/jenkins/workspace/LNT_Tests/venv/lib/python2.7/site-packages/lit-0.10.0.dev0-py2.7.egg/lit/worker.py", line 93, in _execute_test_handle_errors return _adapt_result(test.config.test_format.execute(test, lit_config)) File "/Users/buildslave/jenkins/workspace/LNT_Tests/venv/lib/python2.7/site-packages/lit-0.10.0.dev0-py2.7.egg/lit/formats/shtest.py", line 25, in execute self.execute_external) File "/Users/buildslave/jenkins/workspace/LNT_Tests/venv/lib/python2.7/site-packages/lit-0.10.0.dev0-py2.7.egg/lit/TestRunner.py", line 1641, in executeShTest script = parseIntegratedTestScript(test) File "/Users/buildslave/jenkins/workspace/LNT_Tests/venv/lib/python2.7/site-packages/lit-0.10.0.dev0-py2.7.egg/lit/TestRunner.py", line 1547, in parseIntegratedTestScript keyword_parsers.keys()): File "/Users/buildslave/jenkins/workspace/LNT_Tests/venv/lib/python2.7/site-packages/lit-0.10.0.dev0-py2.7.egg/lit/TestRunner.py", line 1217, in parseIntegratedTestScriptCommands f = open(source_path, 'rb') IOError: [Errno 2] No such file or directory: '/Users/buildslave/jenkins/workspace/LNT_Tests/llvm-lnt/tests/server/ui/test_api_modify.py'

Hide Details

Hide Details

******************** UNRESOLVED: LNT :: server/ui/test_api_roundtrip.py (60 of 72) ******************** TEST 'LNT :: server/ui/test_api_roundtrip.py' FAILED ******************** Exception during script execution: Traceback (most recent call last): File "/Users/buildslave/jenkins/workspace/LNT_Tests/venv/lib/python2.7/site-packages/lit-0.10.0.dev0-py2.7.egg/lit/worker.py", line 93, in _execute_test_handle_errors return _adapt_result(test.config.test_format.execute(test, lit_config)) File "/Users/buildslave/jenkins/workspace/LNT_Tests/venv/lib/python2.7/site-packages/lit-0.10.0.dev0-py2.7.egg/lit/formats/shtest.py", line 25, in execute self.execute_external) File "/Users/buildslave/jenkins/workspace/LNT_Tests/venv/lib/python2.7/site-packages/lit-0.10.0.dev0-py2.7.egg/lit/TestRunner.py", line 1641, in executeShTest script = parseIntegratedTestScript(test) File "/Users/buildslave/jenkins/workspace/LNT_Tests/venv/lib/python2.7/site-packages/lit-0.10.0.dev0-py2.7.egg/lit/TestRunner.py", line 1547, in parseIntegratedTestScript keyword_parsers.keys()): File "/Users/buildslave/jenkins/workspace/LNT_Tests/venv/lib/python2.7/site-packages/lit-0.10.0.dev0-py2.7.egg/lit/TestRunner.py", line 1217, in parseIntegratedTestScriptCommands f = open(source_path, 'rb') IOError: [Errno 2] No such file or directory: '/Users/buildslave/jenkins/workspace/LNT_Tests/llvm-lnt/tests/server/ui/test_api_roundtrip.py'

Hide Details

Hide Details

******************** UNRESOLVED: LNT :: server/ui/test_matrix_page.py (61 of 72) ******************** TEST 'LNT :: server/ui/test_matrix_page.py' FAILED ******************** Exception during script execution: Traceback (most recent call last): File "/Users/buildslave/jenkins/workspace/LNT_Tests/venv/lib/python2.7/site-packages/lit-0.10.0.dev0-py2.7.egg/lit/worker.py", line 93, in _execute_test_handle_errors return _adapt_result(test.config.test_format.execute(test, lit_config)) File "/Users/buildslave/jenkins/workspace/LNT_Tests/venv/lib/python2.7/site-packages/lit-0.10.0.dev0-py2.7.egg/lit/formats/shtest.py", line 25, in execute self.execute_external) File "/Users/buildslave/jenkins/workspace/LNT_Tests/venv/lib/python2.7/site-packages/lit-0.10.0.dev0-py2.7.egg/lit/TestRunner.py", line 1641, in executeShTest script = parseIntegratedTestScript(test) File "/Users/buildslave/jenkins/workspace/LNT_Tests/venv/lib/python2.7/site-packages/lit-0.10.0.dev0-py2.7.egg/lit/TestRunner.py", line 1547, in parseIntegratedTestScript keyword_parsers.keys()): File "/Users/buildslave/jenkins/workspace/LNT_Tests/venv/lib/python2.7/site-packages/lit-0.10.0.dev0-py2.7.egg/lit/TestRunner.py", line 1217, in parseIntegratedTestScriptCommands f = open(source_path, 'rb') IOError: [Errno 2] No such file or directory: '/Users/buildslave/jenkins/workspace/LNT_Tests/llvm-lnt/tests/server/ui/test_matrix_page.py'

Hide Details

Hide Details

******************** UNRESOLVED: LNT :: server/ui/test_roundtrip.py (62 of 72) ******************** TEST 'LNT :: server/ui/test_roundtrip.py' FAILED ******************** Exception during script execution: Traceback (most recent call last): File "/Users/buildslave/jenkins/workspace/LNT_Tests/venv/lib/python2.7/site-packages/lit-0.10.0.dev0-py2.7.egg/lit/worker.py", line 93, in _execute_test_handle_errors return _adapt_result(test.config.test_format.execute(test, lit_config)) File "/Users/buildslave/jenkins/workspace/LNT_Tests/venv/lib/python2.7/site-packages/lit-0.10.0.dev0-py2.7.egg/lit/formats/shtest.py", line 25, in execute self.execute_external) File "/Users/buildslave/jenkins/workspace/LNT_Tests/venv/lib/python2.7/site-packages/lit-0.10.0.dev0-py2.7.egg/lit/TestRunner.py", line 1641, in executeShTest script = parseIntegratedTestScript(test) File "/Users/buildslave/jenkins/workspace/LNT_Tests/venv/lib/python2.7/site-packages/lit-0.10.0.dev0-py2.7.egg/lit/TestRunner.py", line 1547, in parseIntegratedTestScript keyword_parsers.keys()): File "/Users/buildslave/jenkins/workspace/LNT_Tests/venv/lib/python2.7/site-packages/lit-0.10.0.dev0-py2.7.egg/lit/TestRunner.py", line 1217, in parseIntegratedTestScriptCommands f = open(source_path, 'rb') IOError: [Errno 2] No such file or directory: '/Users/buildslave/jenkins/workspace/LNT_Tests/llvm-lnt/tests/server/ui/test_roundtrip.py'

Hide Details

Hide Details

******************** UNRESOLVED: LNT :: server/ui/test_system_info.py (63 of 72) ******************** TEST 'LNT :: server/ui/test_system_info.py' FAILED ******************** Exception during script execution: Traceback (most recent call last): File "/Users/buildslave/jenkins/workspace/LNT_Tests/venv/lib/python2.7/site-packages/lit-0.10.0.dev0-py2.7.egg/lit/worker.py", line 93, in _execute_test_handle_errors return _adapt_result(test.config.test_format.execute(test, lit_config)) File "/Users/buildslave/jenkins/workspace/LNT_Tests/venv/lib/python2.7/site-packages/lit-0.10.0.dev0-py2.7.egg/lit/formats/shtest.py", line 25, in execute self.execute_external) File "/Users/buildslave/jenkins/workspace/LNT_Tests/venv/lib/python2.7/site-packages/lit-0.10.0.dev0-py2.7.egg/lit/TestRunner.py", line 1641, in executeShTest script = parseIntegratedTestScript(test) File "/Users/buildslave/jenkins/workspace/LNT_Tests/venv/lib/python2.7/site-packages/lit-0.10.0.dev0-py2.7.egg/lit/TestRunner.py", line 1547, in parseIntegratedTestScript keyword_parsers.keys()): File "/Users/buildslave/jenkins/workspace/LNT_Tests/venv/lib/python2.7/site-packages/lit-0.10.0.dev0-py2.7.egg/lit/TestRunner.py", line 1217, in parseIntegratedTestScriptCommands f = open(source_path, 'rb') IOError: [Errno 2] No such file or directory: '/Users/buildslave/jenkins/workspace/LNT_Tests/llvm-lnt/tests/server/ui/test_system_info.py'

Hide Details

Hide Details

******************** UNRESOLVED: LNT :: testing/CalltreeDataLoading.py (64 of 72) ******************** TEST 'LNT :: testing/CalltreeDataLoading.py' FAILED ******************** Exception during script execution: Traceback (most recent call last): File "/Users/buildslave/jenkins/workspace/LNT_Tests/venv/lib/python2.7/site-packages/lit-0.10.0.dev0-py2.7.egg/lit/worker.py", line 93, in _execute_test_handle_errors return _adapt_result(test.config.test_format.execute(test, lit_config)) File "/Users/buildslave/jenkins/workspace/LNT_Tests/venv/lib/python2.7/site-packages/lit-0.10.0.dev0-py2.7.egg/lit/formats/shtest.py", line 25, in execute self.execute_external) File "/Users/buildslave/jenkins/workspace/LNT_Tests/venv/lib/python2.7/site-packages/lit-0.10.0.dev0-py2.7.egg/lit/TestRunner.py", line 1641, in executeShTest script = parseIntegratedTestScript(test) File "/Users/buildslave/jenkins/workspace/LNT_Tests/venv/lib/python2.7/site-packages/lit-0.10.0.dev0-py2.7.egg/lit/TestRunner.py", line 1547, in parseIntegratedTestScript keyword_parsers.keys()): File "/Users/buildslave/jenkins/workspace/LNT_Tests/venv/lib/python2.7/site-packages/lit-0.10.0.dev0-py2.7.egg/lit/TestRunner.py", line 1217, in parseIntegratedTestScriptCommands f = open(source_path, 'rb') IOError: [Errno 2] No such file or directory: '/Users/buildslave/jenkins/workspace/LNT_Tests/llvm-lnt/tests/testing/CalltreeDataLoading.py'

Hide Details

Hide Details

******************** UNRESOLVED: LNT :: testing/Compilers.py (65 of 72) ******************** TEST 'LNT :: testing/Compilers.py' FAILED ******************** Exception during script execution: Traceback (most recent call last): File "/Users/buildslave/jenkins/workspace/LNT_Tests/venv/lib/python2.7/site-packages/lit-0.10.0.dev0-py2.7.egg/lit/worker.py", line 93, in _execute_test_handle_errors return _adapt_result(test.config.test_format.execute(test, lit_config)) File "/Users/buildslave/jenkins/workspace/LNT_Tests/venv/lib/python2.7/site-packages/lit-0.10.0.dev0-py2.7.egg/lit/formats/shtest.py", line 25, in execute self.execute_external) File "/Users/buildslave/jenkins/workspace/LNT_Tests/venv/lib/python2.7/site-packages/lit-0.10.0.dev0-py2.7.egg/lit/TestRunner.py", line 1641, in executeShTest script = parseIntegratedTestScript(test) File "/Users/buildslave/jenkins/workspace/LNT_Tests/venv/lib/python2.7/site-packages/lit-0.10.0.dev0-py2.7.egg/lit/TestRunner.py", line 1547, in parseIntegratedTestScript keyword_parsers.keys()): File "/Users/buildslave/jenkins/workspace/LNT_Tests/venv/lib/python2.7/site-packages/lit-0.10.0.dev0-py2.7.egg/lit/TestRunner.py", line 1217, in parseIntegratedTestScriptCommands f = open(source_path, 'rb') IOError: [Errno 2] No such file or directory: '/Users/buildslave/jenkins/workspace/LNT_Tests/llvm-lnt/tests/testing/Compilers.py'

Hide Details

Hide Details

******************** UNRESOLVED: LNT :: testing/TestingTest.py (66 of 72) ******************** TEST 'LNT :: testing/TestingTest.py' FAILED ******************** Exception during script execution: Traceback (most recent call last): File "/Users/buildslave/jenkins/workspace/LNT_Tests/venv/lib/python2.7/site-packages/lit-0.10.0.dev0-py2.7.egg/lit/worker.py", line 93, in _execute_test_handle_errors return _adapt_result(test.config.test_format.execute(test, lit_config)) File "/Users/buildslave/jenkins/workspace/LNT_Tests/venv/lib/python2.7/site-packages/lit-0.10.0.dev0-py2.7.egg/lit/formats/shtest.py", line 25, in execute self.execute_external) File "/Users/buildslave/jenkins/workspace/LNT_Tests/venv/lib/python2.7/site-packages/lit-0.10.0.dev0-py2.7.egg/lit/TestRunner.py", line 1641, in executeShTest script = parseIntegratedTestScript(test) File "/Users/buildslave/jenkins/workspace/LNT_Tests/venv/lib/python2.7/site-packages/lit-0.10.0.dev0-py2.7.egg/lit/TestRunner.py", line 1547, in parseIntegratedTestScript keyword_parsers.keys()): File "/Users/buildslave/jenkins/workspace/LNT_Tests/venv/lib/python2.7/site-packages/lit-0.10.0.dev0-py2.7.egg/lit/TestRunner.py", line 1217, in parseIntegratedTestScriptCommands f = open(source_path, 'rb') IOError: [Errno 2] No such file or directory: '/Users/buildslave/jenkins/workspace/LNT_Tests/llvm-lnt/tests/testing/TestingTest.py'

Hide Details

Hide Details

******************** UNRESOLVED: LNT :: testing/cPerf.py (67 of 72) ******************** TEST 'LNT :: testing/cPerf.py' FAILED ******************** Exception during script execution: Traceback (most recent call last): File "/Users/buildslave/jenkins/workspace/LNT_Tests/venv/lib/python2.7/site-packages/lit-0.10.0.dev0-py2.7.egg/lit/worker.py", line 93, in _execute_test_handle_errors return _adapt_result(test.config.test_format.execute(test, lit_config)) File "/Users/buildslave/jenkins/workspace/LNT_Tests/venv/lib/python2.7/site-packages/lit-0.10.0.dev0-py2.7.egg/lit/formats/shtest.py", line 25, in execute self.execute_external) File "/Users/buildslave/jenkins/workspace/LNT_Tests/venv/lib/python2.7/site-packages/lit-0.10.0.dev0-py2.7.egg/lit/TestRunner.py", line 1641, in executeShTest script = parseIntegratedTestScript(test) File "/Users/buildslave/jenkins/workspace/LNT_Tests/venv/lib/python2.7/site-packages/lit-0.10.0.dev0-py2.7.egg/lit/TestRunner.py", line 1547, in parseIntegratedTestScript keyword_parsers.keys()): File "/Users/buildslave/jenkins/workspace/LNT_Tests/venv/lib/python2.7/site-packages/lit-0.10.0.dev0-py2.7.egg/lit/TestRunner.py", line 1217, in parseIntegratedTestScriptCommands f = open(source_path, 'rb') IOError: [Errno 2] No such file or directory: '/Users/buildslave/jenkins/workspace/LNT_Tests/llvm-lnt/tests/testing/cPerf.py'

Hide Details

Hide Details

******************** UNRESOLVED: LNT :: testing/profilev1impl.py (68 of 72) ******************** TEST 'LNT :: testing/profilev1impl.py' FAILED ******************** Exception during script execution: Traceback (most recent call last): File "/Users/buildslave/jenkins/workspace/LNT_Tests/venv/lib/python2.7/site-packages/lit-0.10.0.dev0-py2.7.egg/lit/worker.py", line 93, in _execute_test_handle_errors return _adapt_result(test.config.test_format.execute(test, lit_config)) File "/Users/buildslave/jenkins/workspace/LNT_Tests/venv/lib/python2.7/site-packages/lit-0.10.0.dev0-py2.7.egg/lit/formats/shtest.py", line 25, in execute self.execute_external) File "/Users/buildslave/jenkins/workspace/LNT_Tests/venv/lib/python2.7/site-packages/lit-0.10.0.dev0-py2.7.egg/lit/TestRunner.py", line 1641, in executeShTest script = parseIntegratedTestScript(test) File "/Users/buildslave/jenkins/workspace/LNT_Tests/venv/lib/python2.7/site-packages/lit-0.10.0.dev0-py2.7.egg/lit/TestRunner.py", line 1547, in parseIntegratedTestScript keyword_parsers.keys()): File "/Users/buildslave/jenkins/workspace/LNT_Tests/venv/lib/python2.7/site-packages/lit-0.10.0.dev0-py2.7.egg/lit/TestRunner.py", line 1217, in parseIntegratedTestScriptCommands f = open(source_path, 'rb') IOError: [Errno 2] No such file or directory: '/Users/buildslave/jenkins/workspace/LNT_Tests/llvm-lnt/tests/testing/profilev1impl.py'

Hide Details

Hide Details

******************** UNRESOLVED: LNT :: testing/profilev2impl.py (69 of 72) ******************** TEST 'LNT :: testing/profilev2impl.py' FAILED ******************** Exception during script execution: Traceback (most recent call last): File "/Users/buildslave/jenkins/workspace/LNT_Tests/venv/lib/python2.7/site-packages/lit-0.10.0.dev0-py2.7.egg/lit/worker.py", line 93, in _execute_test_handle_errors return _adapt_result(test.config.test_format.execute(test, lit_config)) File "/Users/buildslave/jenkins/workspace/LNT_Tests/venv/lib/python2.7/site-packages/lit-0.10.0.dev0-py2.7.egg/lit/formats/shtest.py", line 25, in execute self.execute_external) File "/Users/buildslave/jenkins/workspace/LNT_Tests/venv/lib/python2.7/site-packages/lit-0.10.0.dev0-py2.7.egg/lit/TestRunner.py", line 1641, in executeShTest script = parseIntegratedTestScript(test) File "/Users/buildslave/jenkins/workspace/LNT_Tests/venv/lib/python2.7/site-packages/lit-0.10.0.dev0-py2.7.egg/lit/TestRunner.py", line 1547, in parseIntegratedTestScript keyword_parsers.keys()): File "/Users/buildslave/jenkins/workspace/LNT_Tests/venv/lib/python2.7/site-packages/lit-0.10.0.dev0-py2.7.egg/lit/TestRunner.py", line 1217, in parseIntegratedTestScriptCommands f = open(source_path, 'rb') IOError: [Errno 2] No such file or directory: '/Users/buildslave/jenkins/workspace/LNT_Tests/llvm-lnt/tests/testing/profilev2impl.py'

Hide Details

Hide Details

******************** UNRESOLVED: LNT :: utils/Installation.py (70 of 72) ******************** TEST 'LNT :: utils/Installation.py' FAILED ******************** Exception during script execution: Traceback (most recent call last): File "/Users/buildslave/jenkins/workspace/LNT_Tests/venv/lib/python2.7/site-packages/lit-0.10.0.dev0-py2.7.egg/lit/worker.py", line 93, in _execute_test_handle_errors return _adapt_result(test.config.test_format.execute(test, lit_config)) File "/Users/buildslave/jenkins/workspace/LNT_Tests/venv/lib/python2.7/site-packages/lit-0.10.0.dev0-py2.7.egg/lit/formats/shtest.py", line 25, in execute self.execute_external) File "/Users/buildslave/jenkins/workspace/LNT_Tests/venv/lib/python2.7/site-packages/lit-0.10.0.dev0-py2.7.egg/lit/TestRunner.py", line 1641, in executeShTest script = parseIntegratedTestScript(test) File "/Users/buildslave/jenkins/workspace/LNT_Tests/venv/lib/python2.7/site-packages/lit-0.10.0.dev0-py2.7.egg/lit/TestRunner.py", line 1547, in parseIntegratedTestScript keyword_parsers.keys()): File "/Users/buildslave/jenkins/workspace/LNT_Tests/venv/lib/python2.7/site-packages/lit-0.10.0.dev0-py2.7.egg/lit/TestRunner.py", line 1217, in parseIntegratedTestScriptCommands f = open(source_path, 'rb') IOError: [Errno 2] No such file or directory: '/Users/buildslave/jenkins/workspace/LNT_Tests/llvm-lnt/tests/utils/Installation.py'

Hide Details

Hide Details

******************** UNRESOLVED: LNT :: utils/SourceDistribution.py (71 of 72) ******************** TEST 'LNT :: utils/SourceDistribution.py' FAILED ******************** Exception during script execution: Traceback (most recent call last): File "/Users/buildslave/jenkins/workspace/LNT_Tests/venv/lib/python2.7/site-packages/lit-0.10.0.dev0-py2.7.egg/lit/worker.py", line 93, in _execute_test_handle_errors return _adapt_result(test.config.test_format.execute(test, lit_config)) File "/Users/buildslave/jenkins/workspace/LNT_Tests/venv/lib/python2.7/site-packages/lit-0.10.0.dev0-py2.7.egg/lit/formats/shtest.py", line 25, in execute self.execute_external) File "/Users/buildslave/jenkins/workspace/LNT_Tests/venv/lib/python2.7/site-packages/lit-0.10.0.dev0-py2.7.egg/lit/TestRunner.py", line 1641, in executeShTest script = parseIntegratedTestScript(test) File "/Users/buildslave/jenkins/workspace/LNT_Tests/venv/lib/python2.7/site-packages/lit-0.10.0.dev0-py2.7.egg/lit/TestRunner.py", line 1547, in parseIntegratedTestScript keyword_parsers.keys()): File "/Users/buildslave/jenkins/workspace/LNT_Tests/venv/lib/python2.7/site-packages/lit-0.10.0.dev0-py2.7.egg/lit/TestRunner.py", line 1217, in parseIntegratedTestScriptCommands f = open(source_path, 'rb') IOError: [Errno 2] No such file or directory: '/Users/buildslave/jenkins/workspace/LNT_Tests/llvm-lnt/tests/utils/SourceDistribution.py'

Hide Details

Hide Details

******************** UNRESOLVED: LNT :: utils/blast.py (72 of 72) ******************** TEST 'LNT :: utils/blast.py' FAILED ******************** Exception during script execution: Traceback (most recent call last): File "/Users/buildslave/jenkins/workspace/LNT_Tests/venv/lib/python2.7/site-packages/lit-0.10.0.dev0-py2.7.egg/lit/worker.py", line 93, in _execute_test_handle_errors return _adapt_result(test.config.test_format.execute(test, lit_config)) File "/Users/buildslave/jenkins/workspace/LNT_Tests/venv/lib/python2.7/site-packages/lit-0.10.0.dev0-py2.7.egg/lit/formats/shtest.py", line 25, in execute self.execute_external) File "/Users/buildslave/jenkins/workspace/LNT_Tests/venv/lib/python2.7/site-packages/lit-0.10.0.dev0-py2.7.egg/lit/TestRunner.py", line 1641, in executeShTest script = parseIntegratedTestScript(test) File "/Users/buildslave/jenkins/workspace/LNT_Tests/venv/lib/python2.7/site-packages/lit-0.10.0.dev0-py2.7.egg/lit/TestRunner.py", line 1547, in parseIntegratedTestScript keyword_parsers.keys()): File "/Users/buildslave/jenkins/workspace/LNT_Tests/venv/lib/python2.7/site-packages/lit-0.10.0.dev0-py2.7.egg/lit/TestRunner.py", line 1217, in parseIntegratedTestScriptCommands f = open(source_path, 'rb') IOError: [Errno 2] No such file or directory: '/Users/buildslave/jenkins/workspace/LNT_Tests/llvm-lnt/tests/utils/blast.py'

Hide Details

Hide Details

******************** Testing Time: 208.61s ******************** Failing Tests (1): LNT :: runtest/nt.py

Hide Details

******************** Unresolved Tests (53): LNT :: runtest/only_test.py LNT :: runtest/rerun.py LNT :: runtest/test_suite-benchmarking-only.shtest LNT :: runtest/test_suite-c-compiler.shtest LNT :: runtest/test_suite-cache.shtest LNT :: runtest/test_suite-cc.shtest LNT :: runtest/test_suite-cflags0.shtest LNT :: runtest/test_suite-cflags1.shtest LNT :: runtest/test_suite-cflags2.shtest LNT :: runtest/test_suite-cflags3.shtest LNT :: runtest/test_suite-cflags4.shtest LNT :: runtest/test_suite-compile-only.shtest LNT :: runtest/test_suite-cross.shtest LNT :: runtest/test_suite-fail-compile.shtest LNT :: runtest/test_suite-fail-exec.shtest LNT :: runtest/test_suite-machine-name.shtest LNT :: runtest/test_suite-metrics.shtest LNT :: runtest/test_suite-only-test.shtest LNT :: runtest/test_suite-perf-events.shtest LNT :: runtest/test_suite-pgo.shtest LNT :: runtest/test_suite-profile.shtest LNT :: runtest/test_suite-run-order.shtest LNT :: runtest/test_suite-run-under.shtest LNT :: runtest/test_suite-use-perf.shtest LNT :: runtest/test_suite.shtest LNT :: runtest/test_suite_diagnose.shtest LNT :: server/db/CreateV4TestSuite.py LNT :: server/db/CreateV4TestSuiteInstance.py LNT :: server/db/ImportProfile.py LNT :: server/db/ImportV4TestSuiteInstance.py LNT :: server/db/Migrations.py LNT :: server/db/rules.py LNT :: server/db/search.py LNT :: server/db/yamlschema.shtest LNT :: server/reporting/analysis.py LNT :: server/ui/V4Pages.py LNT :: server/ui/change_processing.py LNT :: server/ui/statsTester.py LNT :: server/ui/test_api.py LNT :: server/ui/test_api_modify.py LNT :: server/ui/test_api_roundtrip.py LNT :: server/ui/test_matrix_page.py LNT :: server/ui/test_roundtrip.py LNT :: server/ui/test_system_info.py LNT :: testing/CalltreeDataLoading.py LNT :: testing/Compilers.py LNT :: testing/TestingTest.py LNT :: testing/cPerf.py LNT :: testing/profilev1impl.py LNT :: testing/profilev2impl.py LNT :: utils/Installation.py LNT :: utils/SourceDistribution.py LNT :: utils/blast.py

Hide Details

Expected Passes : 18 Unresolved Tests : 53 Unexpected Failures: 1 Build step 'Execute shell' marked build as failure [WARNINGS] Parsing warnings in console log with parser Pep8 Skipping warnings blame since Git is the only supported SCM up to now.%n [WARNINGS] Computing warning deltas based on reference build #3809 [WARNINGS] Ignore new warnings since this is the first valid build [WARNINGS] Plug-in Result: Success - no threshold has been exceeded Recording test results [BFA] Scanning build for known causes... [BFA] Found failure cause(s): [BFA] Regression test failed from category Test [BFA] Done. 0s Email was triggered for: Failure - Any Sending email for trigger: Failure - Any

Hide Details

Begin Pre-Send Script... javax.mail.internet.AddressException: Missing '>' in string ``Bruno Lopes <blopes@apple.com'' at position 29 at javax.mail.internet.InternetAddress.parse(InternetAddress.java:811) at javax.mail.internet.InternetAddress.parse(InternetAddress.java:633) at javax.mail.internet.InternetAddress.<init>(InternetAddress.java:111) at sun.reflect.GeneratedConstructorAccessor504.newInstance(Unknown Source) at sun.reflect.DelegatingConstructorAccessorImpl.newInstance(DelegatingConstructorAccessorImpl.java:45) at java.lang.reflect.Constructor.newInstance(Constructor.java:423) at org.codehaus.groovy.reflection.CachedConstructor.invoke(CachedConstructor.java:83) at org.codehaus.groovy.runtime.callsite.ConstructorSite$ConstructorSiteNoUnwrapNoCoerce.callConstructor(ConstructorSite.java:105) at org.codehaus.groovy.runtime.callsite.CallSiteArray.defaultCallConstructor(CallSiteArray.java:60) at org.codehaus.groovy.runtime.callsite.AbstractCallSite.callConstructor(AbstractCallSite.java:235) at org.kohsuke.groovy.sandbox.impl.Checker$3.call(Checker.java:203) at org.kohsuke.groovy.sandbox.impl.Checker.checkedConstructor(Checker.java:205) at org.kohsuke.groovy.sandbox.impl.Checker$checkedConstructor$4.callStatic(Unknown Source) at org.codehaus.groovy.runtime.callsite.CallSiteArray.defaultCallStatic(CallSiteArray.java:56) at org.codehaus.groovy.runtime.callsite.AbstractCallSite.callStatic(AbstractCallSite.java:194) at org.codehaus.groovy.runtime.callsite.AbstractCallSite.callStatic(AbstractCallSite.java:214) at Script1.run(Script1.groovy:66) at hudson.plugins.emailext.ExtendedEmailPublisher.executeScript(ExtendedEmailPublisher.java:623) at hudson.plugins.emailext.ExtendedEmailPublisher.executePresendScript(ExtendedEmailPublisher.java:573) at hudson.plugins.emailext.ExtendedEmailPublisher.sendMail(ExtendedEmailPublisher.java:456) at hudson.plugins.emailext.ExtendedEmailPublisher._perform(ExtendedEmailPublisher.java:441) at hudson.plugins.emailext.ExtendedEmailPublisher.perform(ExtendedEmailPublisher.java:349) at hudson.tasks.BuildStepMonitor$1.perform(BuildStepMonitor.java:20) at hudson.model.AbstractBuild$AbstractBuildExecution.perform(AbstractBuild.java:741) at hudson.model.AbstractBuild$AbstractBuildExecution.performAllBuildSteps(AbstractBuild.java:690) at hudson.model.Build$BuildExecution.cleanUp(Build.java:196) at hudson.model.Run.execute(Run.java:1865) at hudson.model.FreeStyleBuild.run(FreeStyleBuild.java:43) at hudson.model.ResourceController.execute(ResourceController.java:97) at hudson.model.Executor.run(Executor.java:429)

Hide Details

Sending email to: drew_maxwell@apple.com Finished: FAILURE