UnstableConsole Output

Skipping 8,952 KB.. Full Log
0.0000 
exec_time: 0.0006 
hash: "61ab2a39328bb70f40e3d650f2685f88" 
link_time: 0.0108 
**********
PASS: test-suite :: SingleSource/Regression/C/gcc-c-torture/execute/GCC-C-execute-pr66757.test (1621 of 2039)
********** TEST 'test-suite :: SingleSource/Regression/C/gcc-c-torture/execute/GCC-C-execute-pr66757.test' RESULTS **********
compile_time: 0.0000 
exec_time: 0.0006 
hash: "f4d5daa00a9618715e645af2a65f313c" 
link_time: 0.0094 
**********
PASS: test-suite :: SingleSource/Regression/C/gcc-c-torture/execute/GCC-C-execute-pr66940.test (1622 of 2039)
********** TEST 'test-suite :: SingleSource/Regression/C/gcc-c-torture/execute/GCC-C-execute-pr66940.test' RESULTS **********
compile_time: 0.0000 
exec_time: 0.0006 
hash: "51299ea4d9b14eb80483f16f382a670c" 
link_time: 0.0092 
**********
PASS: test-suite :: SingleSource/Regression/C/gcc-c-torture/execute/GCC-C-execute-pr67037.test (1623 of 2039)
********** TEST 'test-suite :: SingleSource/Regression/C/gcc-c-torture/execute/GCC-C-execute-pr67037.test' RESULTS **********
compile_time: 0.0000 
exec_time: 0.0006 
hash: "d6e150a4fbc170cc153f1802a23ab06f" 
link_time: 0.0109 
**********
PASS: test-suite :: SingleSource/Regression/C/gcc-c-torture/execute/GCC-C-execute-pr67226.test (1624 of 2039)
********** TEST 'test-suite :: SingleSource/Regression/C/gcc-c-torture/execute/GCC-C-execute-pr67226.test' RESULTS **********
compile_time: 0.0000 
exec_time: 0.0006 
hash: "5021453b216e99ba156cc7240fd49db7" 
link_time: 0.0101 
**********
PASS: test-suite :: SingleSource/Regression/C/gcc-c-torture/execute/GCC-C-execute-pr67714.test (1625 of 2039)
********** TEST 'test-suite :: SingleSource/Regression/C/gcc-c-torture/execute/GCC-C-execute-pr67714.test' RESULTS **********
compile_time: 0.0000 
exec_time: 0.0006 
hash: "93a1dee26f29bae8ad025e54a90ddd25" 
link_time: 0.0106 
**********
PASS: test-suite :: SingleSource/Regression/C/gcc-c-torture/execute/GCC-C-execute-pr67781.test (1626 of 2039)
********** TEST 'test-suite :: SingleSource/Regression/C/gcc-c-torture/execute/GCC-C-execute-pr67781.test' RESULTS **********
compile_time: 0.0000 
exec_time: 0.0006 
hash: "b0d9fd19279feed9bb1531482ee8d701" 
link_time: 0.0106 
**********
PASS: test-suite :: SingleSource/Regression/C/gcc-c-torture/execute/GCC-C-execute-pr67929_1.test (1627 of 2039)
********** TEST 'test-suite :: SingleSource/Regression/C/gcc-c-torture/execute/GCC-C-execute-pr67929_1.test' RESULTS **********
compile_time: 0.0000 
exec_time: 0.0006 
hash: "2eca70f491163bbb59e8cab37f8f3c70" 
link_time: 0.0096 
**********
PASS: test-suite :: SingleSource/Regression/C/gcc-c-torture/execute/GCC-C-execute-pr68143_1.test (1628 of 2039)
********** TEST 'test-suite :: SingleSource/Regression/C/gcc-c-torture/execute/GCC-C-execute-pr68143_1.test' RESULTS **********
compile_time: 0.0000 
exec_time: 0.0006 
hash: "dba4318c51a3bd71f048fbc9b20ec687" 
link_time: 0.0107 
**********
PASS: test-suite :: SingleSource/Regression/C/gcc-c-torture/execute/GCC-C-execute-pr68185.test (1629 of 2039)
********** TEST 'test-suite :: SingleSource/Regression/C/gcc-c-torture/execute/GCC-C-execute-pr68185.test' RESULTS **********
compile_time: 0.0000 
exec_time: 0.0006 
hash: "20280bd15dc5d4cb5ba88792de7f2300" 
link_time: 0.0098 
**********
PASS: test-suite :: SingleSource/Regression/C/gcc-c-torture/execute/GCC-C-execute-pr68249.test (1630 of 2039)
********** TEST 'test-suite :: SingleSource/Regression/C/gcc-c-torture/execute/GCC-C-execute-pr68249.test' RESULTS **********
compile_time: 0.0000 
exec_time: 0.0006 
hash: "9a48d035683297734da59d71fc4a00e4" 
link_time: 0.0098 
**********
PASS: test-suite :: SingleSource/Regression/C/gcc-c-torture/execute/GCC-C-execute-pr68250.test (1631 of 2039)
********** TEST 'test-suite :: SingleSource/Regression/C/gcc-c-torture/execute/GCC-C-execute-pr68250.test' RESULTS **********
compile_time: 0.0000 
exec_time: 0.0006 
hash: "cc1a23ef0df0cc49fdee5f0e3ac6d924" 
link_time: 0.0106 
**********
PASS: test-suite :: SingleSource/Regression/C/gcc-c-torture/execute/GCC-C-execute-pr68321.test (1632 of 2039)
********** TEST 'test-suite :: SingleSource/Regression/C/gcc-c-torture/execute/GCC-C-execute-pr68321.test' RESULTS **********
compile_time: 0.0000 
exec_time: 0.0006 
hash: "dfbbeed2b086484ffeae2d0cb74f14e2" 
link_time: 0.0080 
**********
PASS: test-suite :: SingleSource/Regression/C/gcc-c-torture/execute/GCC-C-execute-pr68328.test (1633 of 2039)
********** TEST 'test-suite :: SingleSource/Regression/C/gcc-c-torture/execute/GCC-C-execute-pr68328.test' RESULTS **********
compile_time: 0.0000 
exec_time: 0.0006 
hash: "b138d6f220f468e4631074df2c0ea3a1" 
link_time: 0.0106 
**********
PASS: test-suite :: SingleSource/Regression/C/gcc-c-torture/execute/GCC-C-execute-pr68376-1.test (1634 of 2039)
********** TEST 'test-suite :: SingleSource/Regression/C/gcc-c-torture/execute/GCC-C-execute-pr68376-1.test' RESULTS **********
compile_time: 0.0000 
exec_time: 0.0006 
hash: "50a43a998b3a1097d96607d236a8d561" 
link_time: 0.0104 
**********
PASS: test-suite :: SingleSource/Regression/C/gcc-c-torture/execute/GCC-C-execute-pr68376-2.test (1635 of 2039)
********** TEST 'test-suite :: SingleSource/Regression/C/gcc-c-torture/execute/GCC-C-execute-pr68376-2.test' RESULTS **********
compile_time: 0.0000 
exec_time: 0.0006 
hash: "2120a52c382403c6ef781d97809b7754" 
link_time: 0.0106 
**********
NOEXE: test-suite :: SingleSource/Regression/C/gcc-c-torture/execute/GCC-C-execute-pr68381.test (1636 of 2039)
******************** TEST 'test-suite :: SingleSource/Regression/C/gcc-c-torture/execute/GCC-C-execute-pr68381.test' FAILED ********************
Executable '/Users/buildslave/jenkins/workspace/Testsuite-Tester@5/sandbox/build/SingleSource/Regression/C/gcc-c-torture/execute/GCC-C-execute-pr68381' is missing
********************
PASS: test-suite :: SingleSource/Regression/C/gcc-c-torture/execute/GCC-C-execute-pr68390.test (1637 of 2039)
********** TEST 'test-suite :: SingleSource/Regression/C/gcc-c-torture/execute/GCC-C-execute-pr68390.test' RESULTS **********
compile_time: 0.0000 
exec_time: 0.0006 
hash: "abbec6cac7ff0e13a34a063363e1f3a7" 
link_time: 0.0104 
**********
PASS: test-suite :: SingleSource/Regression/C/gcc-c-torture/execute/GCC-C-execute-pr68506.test (1638 of 2039)
********** TEST 'test-suite :: SingleSource/Regression/C/gcc-c-torture/execute/GCC-C-execute-pr68506.test' RESULTS **********
compile_time: 0.0000 
exec_time: 0.0006 
hash: "2565405679d3e10cabfd804033a45d00" 
link_time: 0.0094 
**********
NOEXE: test-suite :: SingleSource/Regression/C/gcc-c-torture/execute/GCC-C-execute-pr68532.test (1639 of 2039)
******************** TEST 'test-suite :: SingleSource/Regression/C/gcc-c-torture/execute/GCC-C-execute-pr68532.test' FAILED ********************
Executable '/Users/buildslave/jenkins/workspace/Testsuite-Tester@5/sandbox/build/SingleSource/Regression/C/gcc-c-torture/execute/GCC-C-execute-pr68532' is missing
********************
PASS: test-suite :: SingleSource/Regression/C/gcc-c-torture/execute/GCC-C-execute-pr68624.test (1640 of 2039)
********** TEST 'test-suite :: SingleSource/Regression/C/gcc-c-torture/execute/GCC-C-execute-pr68624.test' RESULTS **********
compile_time: 0.0000 
exec_time: 0.0006 
hash: "45e117e957e52364494fb1d0be678afc" 
link_time: 0.0109 
**********
PASS: test-suite :: SingleSource/Regression/C/gcc-c-torture/execute/GCC-C-execute-pr68648.test (1641 of 2039)
********** TEST 'test-suite :: SingleSource/Regression/C/gcc-c-torture/execute/GCC-C-execute-pr68648.test' RESULTS **********
compile_time: 0.0000 
exec_time: 0.0006 
hash: "e89d854f6d9e49af7ddca2e5792f4286" 
link_time: 0.0081 
**********
PASS: test-suite :: SingleSource/Regression/C/gcc-c-torture/execute/GCC-C-execute-pr68841.test (1642 of 2039)
********** TEST 'test-suite :: SingleSource/Regression/C/gcc-c-torture/execute/GCC-C-execute-pr68841.test' RESULTS **********
compile_time: 0.0000 
exec_time: 0.0006 
hash: "6a83a59e2b257b7320168ca44a3b4109" 
link_time: 0.0104 
**********
PASS: test-suite :: SingleSource/Regression/C/gcc-c-torture/execute/GCC-C-execute-pr68911.test (1643 of 2039)
********** TEST 'test-suite :: SingleSource/Regression/C/gcc-c-torture/execute/GCC-C-execute-pr68911.test' RESULTS **********
compile_time: 0.0000 
exec_time: 0.0006 
hash: "6f729f6f85aefd4c1a6733f01e7379f3" 
link_time: 0.0106 
**********
PASS: test-suite :: SingleSource/Regression/C/gcc-c-torture/execute/GCC-C-execute-pr69097-1.test (1644 of 2039)
********** TEST 'test-suite :: SingleSource/Regression/C/gcc-c-torture/execute/GCC-C-execute-pr69097-1.test' RESULTS **********
compile_time: 0.0000 
exec_time: 0.0005 
hash: "25a455c1d6b8167ccc86c93794a2c355" 
link_time: 0.0082 
**********
PASS: test-suite :: SingleSource/Regression/C/gcc-c-torture/execute/GCC-C-execute-pr69097-2.test (1645 of 2039)
********** TEST 'test-suite :: SingleSource/Regression/C/gcc-c-torture/execute/GCC-C-execute-pr69097-2.test' RESULTS **********
compile_time: 0.0000 
exec_time: 0.0006 
hash: "c1462ebb2f6f6f157640684114b06f23" 
link_time: 0.0107 
**********
PASS: test-suite :: SingleSource/Regression/C/gcc-c-torture/execute/GCC-C-execute-pr69320-1.test (1646 of 2039)
********** TEST 'test-suite :: SingleSource/Regression/C/gcc-c-torture/execute/GCC-C-execute-pr69320-1.test' RESULTS **********
compile_time: 0.0000 
exec_time: 0.0006 
hash: "89eced637ef3c91cb65fb527c90b3e17" 
link_time: 0.0108 
**********
PASS: test-suite :: SingleSource/Regression/C/gcc-c-torture/execute/GCC-C-execute-pr69320-2.test (1647 of 2039)
********** TEST 'test-suite :: SingleSource/Regression/C/gcc-c-torture/execute/GCC-C-execute-pr69320-2.test' RESULTS **********
compile_time: 0.0000 
exec_time: 0.0006 
hash: "0de31b95618c67b2c2e8284c76892ebd" 
link_time: 0.0100 
**********
PASS: test-suite :: SingleSource/Regression/C/gcc-c-torture/execute/GCC-C-execute-pr69320-3.test (1648 of 2039)
********** TEST 'test-suite :: SingleSource/Regression/C/gcc-c-torture/execute/GCC-C-execute-pr69320-3.test' RESULTS **********
compile_time: 0.0000 
exec_time: 0.0006 
hash: "e4a5eb9c0601a1b4ac6fb219b2e2a56a" 
link_time: 0.0107 
**********
PASS: test-suite :: SingleSource/Regression/C/gcc-c-torture/execute/GCC-C-execute-pr69320-4.test (1649 of 2039)
********** TEST 'test-suite :: SingleSource/Regression/C/gcc-c-torture/execute/GCC-C-execute-pr69320-4.test' RESULTS **********
compile_time: 0.0000 
exec_time: 0.0006 
hash: "5615d0fba178b415a9c29d24722fed59" 
link_time: 0.0100 
**********
PASS: test-suite :: SingleSource/Regression/C/gcc-c-torture/execute/GCC-C-execute-pr69403.test (1650 of 2039)
********** TEST 'test-suite :: SingleSource/Regression/C/gcc-c-torture/execute/GCC-C-execute-pr69403.test' RESULTS **********
compile_time: 0.0000 
exec_time: 0.0006 
hash: "f5274dc74e8561704b3ca373d579b3f6" 
link_time: 0.0111 
**********
PASS: test-suite :: SingleSource/Regression/C/gcc-c-torture/execute/GCC-C-execute-pr69447.test (1651 of 2039)
********** TEST 'test-suite :: SingleSource/Regression/C/gcc-c-torture/execute/GCC-C-execute-pr69447.test' RESULTS **********
compile_time: 0.0000 
exec_time: 0.0006 
hash: "7f5faab7c16c3d0981d5c0b7973ab3d6" 
link_time: 0.0101 
**********
PASS: test-suite :: SingleSource/Regression/C/gcc-c-torture/execute/GCC-C-execute-pr69691.test (1652 of 2039)
********** TEST 'test-suite :: SingleSource/Regression/C/gcc-c-torture/execute/GCC-C-execute-pr69691.test' RESULTS **********
compile_time: 0.0000 
exec_time: 0.0006 
hash: "3f0db3fefb9d4682098e90252f1ba2d5" 
link_time: 0.0097 
**********
PASS: test-suite :: SingleSource/Regression/C/gcc-c-torture/execute/GCC-C-execute-pr70005.test (1653 of 2039)
********** TEST 'test-suite :: SingleSource/Regression/C/gcc-c-torture/execute/GCC-C-execute-pr70005.test' RESULTS **********
compile_time: 0.0000 
exec_time: 0.0006 
hash: "d71256d278e47628ee7ec487e9e19158" 
link_time: 0.0100 
**********
PASS: test-suite :: SingleSource/Regression/C/gcc-c-torture/execute/GCC-C-execute-pr70127.test (1654 of 2039)
********** TEST 'test-suite :: SingleSource/Regression/C/gcc-c-torture/execute/GCC-C-execute-pr70127.test' RESULTS **********
compile_time: 0.0000 
exec_time: 0.0006 
hash: "475b2a26085ed1943bd84b91ecfe3407" 
link_time: 0.0111 
**********
PASS: test-suite :: SingleSource/Regression/C/gcc-c-torture/execute/GCC-C-execute-pr70222-1.test (1655 of 2039)
********** TEST 'test-suite :: SingleSource/Regression/C/gcc-c-torture/execute/GCC-C-execute-pr70222-1.test' RESULTS **********
compile_time: 0.0000 
exec_time: 0.0006 
hash: "69a53217cd7584f3999f7ecadef24c8d" 
link_time: 0.0106 
**********
PASS: test-suite :: SingleSource/Regression/C/gcc-c-torture/execute/GCC-C-execute-pr70222-2.test (1656 of 2039)
********** TEST 'test-suite :: SingleSource/Regression/C/gcc-c-torture/execute/GCC-C-execute-pr70222-2.test' RESULTS **********
compile_time: 0.0000 
exec_time: 0.0006 
hash: "d040a4a5012f71d45b806989101b211b" 
link_time: 0.0087 
**********
PASS: test-suite :: SingleSource/Regression/C/gcc-c-torture/execute/GCC-C-execute-pr70429.test (1657 of 2039)
********** TEST 'test-suite :: SingleSource/Regression/C/gcc-c-torture/execute/GCC-C-execute-pr70429.test' RESULTS **********
compile_time: 0.0000 
exec_time: 0.0006 
hash: "73a1970714842b18c906f2774be8e333" 
link_time: 0.0105 
**********
PASS: test-suite :: SingleSource/Regression/C/gcc-c-torture/execute/GCC-C-execute-pr70460.test (1658 of 2039)
********** TEST 'test-suite :: SingleSource/Regression/C/gcc-c-torture/execute/GCC-C-execute-pr70460.test' RESULTS **********
compile_time: 0.0000 
exec_time: 0.0006 
hash: "ecddb23617da4da06b0b3d732275342f" 
link_time: 0.0101 
**********
PASS: test-suite :: SingleSource/Regression/C/gcc-c-torture/execute/GCC-C-execute-pr70566.test (1659 of 2039)
********** TEST 'test-suite :: SingleSource/Regression/C/gcc-c-torture/execute/GCC-C-execute-pr70566.test' RESULTS **********
compile_time: 0.0000 
exec_time: 0.0006 
hash: "20d3f60779e8a57647bc7b4bc5769420" 
link_time: 0.0109 
**********
PASS: test-suite :: SingleSource/Regression/C/gcc-c-torture/execute/GCC-C-execute-pr70586.test (1660 of 2039)
********** TEST 'test-suite :: SingleSource/Regression/C/gcc-c-torture/execute/GCC-C-execute-pr70586.test' RESULTS **********
compile_time: 0.0000 
exec_time: 0.0006 
hash: "3ea3acb75dc0b96263d858d5d7934dd1" 
link_time: 0.0086 
**********
PASS: test-suite :: SingleSource/Regression/C/gcc-c-torture/execute/GCC-C-execute-pr70602.test (1661 of 2039)
********** TEST 'test-suite :: SingleSource/Regression/C/gcc-c-torture/execute/GCC-C-execute-pr70602.test' RESULTS **********
compile_time: 0.0000 
exec_time: 0.0006 
hash: "f20d89971d7b32576be2a7f355f7711d" 
link_time: 0.0110 
**********
PASS: test-suite :: SingleSource/Regression/C/gcc-c-torture/execute/GCC-C-execute-pr70903.test (1662 of 2039)
********** TEST 'test-suite :: SingleSource/Regression/C/gcc-c-torture/execute/GCC-C-execute-pr70903.test' RESULTS **********
compile_time: 0.0000 
exec_time: 0.0006 
hash: "394c551482a12847b47dce131d1757ea" 
link_time: 0.0107 
**********
NOEXE: test-suite :: SingleSource/Regression/C/gcc-c-torture/execute/GCC-C-execute-pr71083.test (1663 of 2039)
******************** TEST 'test-suite :: SingleSource/Regression/C/gcc-c-torture/execute/GCC-C-execute-pr71083.test' FAILED ********************
Executable '/Users/buildslave/jenkins/workspace/Testsuite-Tester@5/sandbox/build/SingleSource/Regression/C/gcc-c-torture/execute/GCC-C-execute-pr71083' is missing
********************
PASS: test-suite :: SingleSource/Regression/C/gcc-c-torture/execute/GCC-C-execute-pr71335.test (1664 of 2039)
********** TEST 'test-suite :: SingleSource/Regression/C/gcc-c-torture/execute/GCC-C-execute-pr71335.test' RESULTS **********
compile_time: 0.0000 
exec_time: 0.0006 
hash: "a08c120f3755f9dec2aaf7416c22f9b7" 
link_time: 0.0091 
**********
PASS: test-suite :: SingleSource/Regression/C/gcc-c-torture/execute/GCC-C-execute-pr71550.test (1665 of 2039)
********** TEST 'test-suite :: SingleSource/Regression/C/gcc-c-torture/execute/GCC-C-execute-pr71550.test' RESULTS **********
compile_time: 0.0000 
exec_time: 0.0006 
hash: "ee350c5704664d65af029c81c137ca9f" 
link_time: 0.0097 
**********
NOEXE: test-suite :: SingleSource/Regression/C/gcc-c-torture/execute/GCC-C-execute-pr71554.test (1666 of 2039)
******************** TEST 'test-suite :: SingleSource/Regression/C/gcc-c-torture/execute/GCC-C-execute-pr71554.test' FAILED ********************
Executable '/Users/buildslave/jenkins/workspace/Testsuite-Tester@5/sandbox/build/SingleSource/Regression/C/gcc-c-torture/execute/GCC-C-execute-pr71554' is missing
********************
PASS: test-suite :: SingleSource/Regression/C/gcc-c-torture/execute/GCC-C-execute-pr71626-1.test (1667 of 2039)
********** TEST 'test-suite :: SingleSource/Regression/C/gcc-c-torture/execute/GCC-C-execute-pr71626-1.test' RESULTS **********
compile_time: 0.0000 
exec_time: 0.0006 
hash: "1d0382bb57c4d88e6367ef047025f5ad" 
link_time: 0.0108 
**********
PASS: test-suite :: SingleSource/Regression/C/gcc-c-torture/execute/GCC-C-execute-pr71626-2.test (1668 of 2039)
********** TEST 'test-suite :: SingleSource/Regression/C/gcc-c-torture/execute/GCC-C-execute-pr71626-2.test' RESULTS **********
compile_time: 0.0000 
exec_time: 0.0006 
hash: "323ca59a93d6deeb496f33d3e4db81ed" 
link_time: 0.0096 
**********
PASS: test-suite :: SingleSource/Regression/C/gcc-c-torture/execute/GCC-C-execute-pr71631.test (1669 of 2039)
********** TEST 'test-suite :: SingleSource/Regression/C/gcc-c-torture/execute/GCC-C-execute-pr71631.test' RESULTS **********
compile_time: 0.0000 
exec_time: 0.0006 
hash: "1a86c3a701b56d5d70bdd96e7e6dd00b" 
link_time: 0.0108 
**********
PASS: test-suite :: SingleSource/Regression/C/gcc-c-torture/execute/GCC-C-execute-pr71700.test (1670 of 2039)
********** TEST 'test-suite :: SingleSource/Regression/C/gcc-c-torture/execute/GCC-C-execute-pr71700.test' RESULTS **********
compile_time: 0.0000 
exec_time: 0.0006 
hash: "f8a51a9d91d5aff72807736481831cf2" 
link_time: 0.0089 
**********
PASS: test-suite :: SingleSource/Regression/C/gcc-c-torture/execute/GCC-C-execute-pr7284-1.test (1671 of 2039)
********** TEST 'test-suite :: SingleSource/Regression/C/gcc-c-torture/execute/GCC-C-execute-pr7284-1.test' RESULTS **********
compile_time: 0.0000 
exec_time: 0.0006 
hash: "bc870cd2fa8d771bdc06ed22c632bdf9" 
link_time: 0.0100 
**********
PASS: test-suite :: SingleSource/Regression/C/gcc-c-torture/execute/GCC-C-execute-pr77718.test (1672 of 2039)
********** TEST 'test-suite :: SingleSource/Regression/C/gcc-c-torture/execute/GCC-C-execute-pr77718.test' RESULTS **********
compile_time: 0.0000 
exec_time: 0.0006 
hash: "96f1f9a5ef2f58c15b1670ffcafa898a" 
link_time: 0.0088 
**********
PASS: test-suite :: SingleSource/Regression/C/gcc-c-torture/execute/GCC-C-execute-pr77766.test (1673 of 2039)
********** TEST 'test-suite :: SingleSource/Regression/C/gcc-c-torture/execute/GCC-C-execute-pr77766.test' RESULTS **********
compile_time: 0.0000 
exec_time: 0.0005 
hash: "725b45baaa432f08a91e8e92669d59ec" 
link_time: 0.0092 
**********
PASS: test-suite :: SingleSource/Regression/C/gcc-c-torture/execute/GCC-C-execute-pr77767.test (1674 of 2039)
********** TEST 'test-suite :: SingleSource/Regression/C/gcc-c-torture/execute/GCC-C-execute-pr77767.test' RESULTS **********
compile_time: 0.0000 
exec_time: 0.0006 
hash: "bd2ea74b940387f766007e96a66f6867" 
link_time: 0.0088 
**********
PASS: test-suite :: SingleSource/Regression/C/gcc-c-torture/execute/GCC-C-execute-pr78170.test (1675 of 2039)
********** TEST 'test-suite :: SingleSource/Regression/C/gcc-c-torture/execute/GCC-C-execute-pr78170.test' RESULTS **********
compile_time: 0.0000 
exec_time: 0.0006 
hash: "d0e5e336c14b11ff6659595924a7d88c" 
link_time: 0.0108 
**********
PASS: test-suite :: SingleSource/Regression/C/gcc-c-torture/execute/GCC-C-execute-pr78378.test (1676 of 2039)
********** TEST 'test-suite :: SingleSource/Regression/C/gcc-c-torture/execute/GCC-C-execute-pr78378.test' RESULTS **********
compile_time: 0.0000 
exec_time: 0.0006 
hash: "a654f623881e29bc3e8ab9ff6f9a4095" 
link_time: 0.0107 
**********
PASS: test-suite :: SingleSource/Regression/C/gcc-c-torture/execute/GCC-C-execute-pr78436.test (1677 of 2039)
********** TEST 'test-suite :: SingleSource/Regression/C/gcc-c-torture/execute/GCC-C-execute-pr78436.test' RESULTS **********
compile_time: 0.0000 
exec_time: 0.0006 
hash: "83f71872f98e435ff8bf81ea2d02ea91" 
link_time: 0.0089 
**********
PASS: test-suite :: SingleSource/Regression/C/gcc-c-torture/execute/GCC-C-execute-pr78438.test (1678 of 2039)
********** TEST 'test-suite :: SingleSource/Regression/C/gcc-c-torture/execute/GCC-C-execute-pr78438.test' RESULTS **********
compile_time: 0.0000 
exec_time: 0.0006 
hash: "4523b101cd06a50114bcbcc07179d7fb" 
link_time: 0.0094 
**********
PASS: test-suite :: SingleSource/Regression/C/gcc-c-torture/execute/GCC-C-execute-pr78477.test (1679 of 2039)
********** TEST 'test-suite :: SingleSource/Regression/C/gcc-c-torture/execute/GCC-C-execute-pr78477.test' RESULTS **********
compile_time: 0.0000 
exec_time: 0.0006 
hash: "43499b6cfe5dc59a3b5902eed345970c" 
link_time: 0.0115 
**********
PASS: test-suite :: SingleSource/Regression/C/gcc-c-torture/execute/GCC-C-execute-pr78559.test (1680 of 2039)
********** TEST 'test-suite :: SingleSource/Regression/C/gcc-c-torture/execute/GCC-C-execute-pr78559.test' RESULTS **********
compile_time: 0.0000 
exec_time: 0.0006 
hash: "e93cb795fd04a6ebc3fe85e534c1d398" 
link_time: 0.0101 
**********
PASS: test-suite :: SingleSource/Regression/C/gcc-c-torture/execute/GCC-C-execute-pr78617.test (1681 of 2039)
********** TEST 'test-suite :: SingleSource/Regression/C/gcc-c-torture/execute/GCC-C-execute-pr78617.test' RESULTS **********
compile_time: 0.0000 
exec_time: 0.0006 
hash: "fcaa94ec0899d4e9dcab520e5f9edc9e" 
link_time: 0.0109 
**********
PASS: test-suite :: SingleSource/Regression/C/gcc-c-torture/execute/GCC-C-execute-pr78622.test (1682 of 2039)
********** TEST 'test-suite :: SingleSource/Regression/C/gcc-c-torture/execute/GCC-C-execute-pr78622.test' RESULTS **********
compile_time: 0.0000 
exec_time: 0.0006 
hash: "0d5d8ee3eadcfbef1894a1f4c63abb2c" 
link_time: 0.0088 
**********
PASS: test-suite :: SingleSource/Regression/C/gcc-c-torture/execute/GCC-C-execute-pr78675.test (1683 of 2039)
********** TEST 'test-suite :: SingleSource/Regression/C/gcc-c-torture/execute/GCC-C-execute-pr78675.test' RESULTS **********
compile_time: 0.0000 
exec_time: 0.0006 
hash: "817f28aee855088f4e15922e0a7c0294" 
link_time: 0.0085 
**********
PASS: test-suite :: SingleSource/Regression/C/gcc-c-torture/execute/GCC-C-execute-pr78720.test (1684 of 2039)
********** TEST 'test-suite :: SingleSource/Regression/C/gcc-c-torture/execute/GCC-C-execute-pr78720.test' RESULTS **********
compile_time: 0.0000 
exec_time: 0.0006 
hash: "1b24e343cf5334885435d7c7f2739670" 
link_time: 0.0078 
**********
PASS: test-suite :: SingleSource/Regression/C/gcc-c-torture/execute/GCC-C-execute-pr78726.test (1685 of 2039)
********** TEST 'test-suite :: SingleSource/Regression/C/gcc-c-torture/execute/GCC-C-execute-pr78726.test' RESULTS **********
compile_time: 0.0000 
exec_time: 0.0006 
hash: "d40602b056585d3055197b0b243424ae" 
link_time: 0.0083 
**********
PASS: test-suite :: SingleSource/Regression/C/gcc-c-torture/execute/GCC-C-execute-pr78791.test (1686 of 2039)
********** TEST 'test-suite :: SingleSource/Regression/C/gcc-c-torture/execute/GCC-C-execute-pr78791.test' RESULTS **********
compile_time: 0.0000 
exec_time: 0.0006 
hash: "ed4e885eabbbede69ac11fe7cff0ecd6" 
link_time: 0.0082 
**********
PASS: test-suite :: SingleSource/Regression/C/gcc-c-torture/execute/GCC-C-execute-pr78856.test (1687 of 2039)
********** TEST 'test-suite :: SingleSource/Regression/C/gcc-c-torture/execute/GCC-C-execute-pr78856.test' RESULTS **********
compile_time: 0.0000 
exec_time: 0.0006 
hash: "31b9c462372e45cb32e89e19d4325abf" 
link_time: 0.0107 
**********
PASS: test-suite :: SingleSource/Regression/C/gcc-c-torture/execute/GCC-C-execute-pr79121.test (1688 of 2039)
********** TEST 'test-suite :: SingleSource/Regression/C/gcc-c-torture/execute/GCC-C-execute-pr79121.test' RESULTS **********
compile_time: 0.0000 
exec_time: 0.0006 
hash: "e9cd48c00e01cdef54f734a9f8dc7017" 
link_time: 0.0116 
**********
PASS: test-suite :: SingleSource/Regression/C/gcc-c-torture/execute/GCC-C-execute-pr79286.test (1689 of 2039)
********** TEST 'test-suite :: SingleSource/Regression/C/gcc-c-torture/execute/GCC-C-execute-pr79286.test' RESULTS **********
compile_time: 0.0000 
exec_time: 0.0006 
hash: "e9b1882dcdd398c9738bd85eb5723383" 
link_time: 0.0087 
**********
PASS: test-suite :: SingleSource/Regression/C/gcc-c-torture/execute/GCC-C-execute-pr79354.test (1690 of 2039)
********** TEST 'test-suite :: SingleSource/Regression/C/gcc-c-torture/execute/GCC-C-execute-pr79354.test' RESULTS **********
compile_time: 0.0000 
exec_time: 0.0006 
hash: "9375334b617b1dd3c10390a946a7ce37" 
link_time: 0.0101 
**********
PASS: test-suite :: SingleSource/Regression/C/gcc-c-torture/execute/GCC-C-execute-pr79388.test (1691 of 2039)
********** TEST 'test-suite :: SingleSource/Regression/C/gcc-c-torture/execute/GCC-C-execute-pr79388.test' RESULTS **********
compile_time: 0.0000 
exec_time: 0.0006 
hash: "2be29cceaac7e3e797a03fde0e077a6f" 
link_time: 0.0104 
**********
PASS: test-suite :: SingleSource/Regression/C/gcc-c-torture/execute/GCC-C-execute-pr79450.test (1692 of 2039)
********** TEST 'test-suite :: SingleSource/Regression/C/gcc-c-torture/execute/GCC-C-execute-pr79450.test' RESULTS **********
compile_time: 0.0000 
exec_time: 0.0006 
hash: "165da82b059c2c10a350dc25cb556a78" 
link_time: 0.0109 
**********
PASS: test-suite :: SingleSource/Regression/C/gcc-c-torture/execute/GCC-C-execute-pr79737-1.test (1693 of 2039)
********** TEST 'test-suite :: SingleSource/Regression/C/gcc-c-torture/execute/GCC-C-execute-pr79737-1.test' RESULTS **********
compile_time: 0.0000 
exec_time: 0.0006 
hash: "a6a5317a7ca643c89bedbe9b74b3d441" 
link_time: 0.0085 
**********
PASS: test-suite :: SingleSource/Regression/C/gcc-c-torture/execute/GCC-C-execute-pr79737-2.test (1694 of 2039)
********** TEST 'test-suite :: SingleSource/Regression/C/gcc-c-torture/execute/GCC-C-execute-pr79737-2.test' RESULTS **********
compile_time: 0.0000 
exec_time: 0.0006 
hash: "aca1bdfaf745a5df3dc4afbd827b63ee" 
link_time: 0.0104 
**********
PASS: test-suite :: SingleSource/Regression/C/gcc-c-torture/execute/GCC-C-execute-pr80153.test (1695 of 2039)
********** TEST 'test-suite :: SingleSource/Regression/C/gcc-c-torture/execute/GCC-C-execute-pr80153.test' RESULTS **********
compile_time: 0.0000 
exec_time: 0.0006 
hash: "f124798d041593394294fd311ddbc8a7" 
link_time: 0.0090 
**********
PASS: test-suite :: SingleSource/Regression/C/gcc-c-torture/execute/GCC-C-execute-pr80421.test (1696 of 2039)
********** TEST 'test-suite :: SingleSource/Regression/C/gcc-c-torture/execute/GCC-C-execute-pr80421.test' RESULTS **********
compile_time: 0.0000 
exec_time: 0.0006 
hash: "2b60c00b3e4661d8c19a7b66695d6d1e" 
link_time: 0.0100 
**********
PASS: test-suite :: SingleSource/Regression/C/gcc-c-torture/execute/GCC-C-execute-pr80501.test (1697 of 2039)
********** TEST 'test-suite :: SingleSource/Regression/C/gcc-c-torture/execute/GCC-C-execute-pr80501.test' RESULTS **********
compile_time: 0.0000 
exec_time: 0.0006 
hash: "eef3e734444e8206e0707e69eb5f493a" 
link_time: 0.0109 
**********
PASS: test-suite :: SingleSource/Regression/C/gcc-c-torture/execute/GCC-C-execute-pr81281.test (1698 of 2039)
********** TEST 'test-suite :: SingleSource/Regression/C/gcc-c-torture/execute/GCC-C-execute-pr81281.test' RESULTS **********
compile_time: 0.0000 
exec_time: 0.0006 
hash: "2bb2f801679b5299b528d2c12f292ce2" 
link_time: 0.0076 
**********
PASS: test-suite :: SingleSource/Regression/C/gcc-c-torture/execute/GCC-C-execute-pr81423.test (1699 of 2039)
********** TEST 'test-suite :: SingleSource/Regression/C/gcc-c-torture/execute/GCC-C-execute-pr81423.test' RESULTS **********
compile_time: 0.0000 
exec_time: 0.0006 
hash: "1f9b443b55111dfaf4702ad68db664f1" 
link_time: 0.0087 
**********
PASS: test-suite :: SingleSource/Regression/C/gcc-c-torture/execute/GCC-C-execute-pr81503.test (1700 of 2039)
********** TEST 'test-suite :: SingleSource/Regression/C/gcc-c-torture/execute/GCC-C-execute-pr81503.test' RESULTS **********
compile_time: 0.0000 
exec_time: 0.0006 
hash: "164cfce00f0b76f6cb8406835cb3ec86" 
link_time: 0.0104 
**********
PASS: test-suite :: SingleSource/Regression/C/gcc-c-torture/execute/GCC-C-execute-pr81555.test (1701 of 2039)
********** TEST 'test-suite :: SingleSource/Regression/C/gcc-c-torture/execute/GCC-C-execute-pr81555.test' RESULTS **********
compile_time: 0.0000 
exec_time: 0.0006 
hash: "dec467bba9d0b4bea2cbed6c224d02df" 
link_time: 0.0100 
**********
PASS: test-suite :: SingleSource/Regression/C/gcc-c-torture/execute/GCC-C-execute-pr81556.test (1702 of 2039)
********** TEST 'test-suite :: SingleSource/Regression/C/gcc-c-torture/execute/GCC-C-execute-pr81556.test' RESULTS **********
compile_time: 0.0000 
exec_time: 0.0006 
hash: "8d4b38e8e5df4035b062f20e7cb9d70c" 
link_time: 0.0085 
**********
PASS: test-suite :: SingleSource/Regression/C/gcc-c-torture/execute/GCC-C-execute-pr81588.test (1703 of 2039)
********** TEST 'test-suite :: SingleSource/Regression/C/gcc-c-torture/execute/GCC-C-execute-pr81588.test' RESULTS **********
compile_time: 0.0000 
exec_time: 0.0006 
hash: "6db13f07a7e8b80c319566b0692cc410" 
link_time: 0.0097 
**********
NOEXE: test-suite :: SingleSource/Regression/C/gcc-c-torture/execute/GCC-C-execute-pr81913.test (1704 of 2039)
******************** TEST 'test-suite :: SingleSource/Regression/C/gcc-c-torture/execute/GCC-C-execute-pr81913.test' FAILED ********************
Executable '/Users/buildslave/jenkins/workspace/Testsuite-Tester@5/sandbox/build/SingleSource/Regression/C/gcc-c-torture/execute/GCC-C-execute-pr81913' is missing
********************
PASS: test-suite :: SingleSource/Regression/C/gcc-c-torture/execute/GCC-C-execute-pr82192.test (1705 of 2039)
********** TEST 'test-suite :: SingleSource/Regression/C/gcc-c-torture/execute/GCC-C-execute-pr82192.test' RESULTS **********
compile_time: 0.0000 
exec_time: 0.0006 
hash: "931c44de9dc2772c9cbd67953aed9484" 
link_time: 0.0095 
**********
PASS: test-suite :: SingleSource/Regression/C/gcc-c-torture/execute/GCC-C-execute-pr82387.test (1706 of 2039)
********** TEST 'test-suite :: SingleSource/Regression/C/gcc-c-torture/execute/GCC-C-execute-pr82387.test' RESULTS **********
compile_time: 0.0000 
exec_time: 0.0006 
hash: "864d9ed474828f2b0406cc13f632f877" 
link_time: 0.0102 
**********
PASS: test-suite :: SingleSource/Regression/C/gcc-c-torture/execute/GCC-C-execute-pr82388.test (1707 of 2039)
********** TEST 'test-suite :: SingleSource/Regression/C/gcc-c-torture/execute/GCC-C-execute-pr82388.test' RESULTS **********
compile_time: 0.0000 
exec_time: 0.0006 
hash: "6b38c3721a605a80f8e7c2dca5dcce08" 
link_time: 0.0104 
**********
PASS: test-suite :: SingleSource/Regression/C/gcc-c-torture/execute/GCC-C-execute-pr82524.test (1708 of 2039)
********** TEST 'test-suite :: SingleSource/Regression/C/gcc-c-torture/execute/GCC-C-execute-pr82524.test' RESULTS **********
compile_time: 0.0000 
exec_time: 0.0006 
hash: "aa60b19cd0c53a5aea64dc7d427b1e82" 
link_time: 0.0097 
**********
PASS: test-suite :: SingleSource/Regression/C/gcc-c-torture/execute/GCC-C-execute-pr82954.test (1709 of 2039)
********** TEST 'test-suite :: SingleSource/Regression/C/gcc-c-torture/execute/GCC-C-execute-pr82954.test' RESULTS **********
compile_time: 0.0000 
exec_time: 0.0006 
hash: "052dcf8d87d0d47b61f2fd6976f1102c" 
link_time: 0.0103 
**********
PASS: test-suite :: SingleSource/Regression/C/gcc-c-torture/execute/GCC-C-execute-pr83269.test (1710 of 2039)
********** TEST 'test-suite :: SingleSource/Regression/C/gcc-c-torture/execute/GCC-C-execute-pr83269.test' RESULTS **********
compile_time: 0.0000 
exec_time: 0.0006 
hash: "9ce225ce9ea619db3525683b97a2ccda" 
link_time: 0.0108 
**********
PASS: test-suite :: SingleSource/Regression/C/gcc-c-torture/execute/GCC-C-execute-pr83298.test (1711 of 2039)
********** TEST 'test-suite :: SingleSource/Regression/C/gcc-c-torture/execute/GCC-C-execute-pr83298.test' RESULTS **********
compile_time: 0.0000 
exec_time: 0.0006 
hash: "9cf3b447dca9ebc9bf99690067966101" 
link_time: 0.0107 
**********
NOEXE: test-suite :: SingleSource/Regression/C/gcc-c-torture/execute/GCC-C-execute-pr83362.test (1712 of 2039)
******************** TEST 'test-suite :: SingleSource/Regression/C/gcc-c-torture/execute/GCC-C-execute-pr83362.test' FAILED ********************
Executable '/Users/buildslave/jenkins/workspace/Testsuite-Tester@5/sandbox/build/SingleSource/Regression/C/gcc-c-torture/execute/GCC-C-execute-pr83362' is missing
********************
PASS: test-suite :: SingleSource/Regression/C/gcc-c-torture/execute/GCC-C-execute-pr83383.test (1713 of 2039)
********** TEST 'test-suite :: SingleSource/Regression/C/gcc-c-torture/execute/GCC-C-execute-pr83383.test' RESULTS **********
compile_time: 0.0000 
exec_time: 0.0006 
hash: "3b4f57fa126e6c483c60b2cbc80f4db6" 
link_time: 0.0097 
**********
PASS: test-suite :: SingleSource/Regression/C/gcc-c-torture/execute/GCC-C-execute-pr83477.test (1714 of 2039)
********** TEST 'test-suite :: SingleSource/Regression/C/gcc-c-torture/execute/GCC-C-execute-pr83477.test' RESULTS **********
compile_time: 0.0000 
exec_time: 0.0006 
hash: "b87dc34be140ab23908fee59258c6c67" 
link_time: 0.0106 
**********
PASS: test-suite :: SingleSource/Regression/C/gcc-c-torture/execute/GCC-C-execute-pr84521.test (1715 of 2039)
********** TEST 'test-suite :: SingleSource/Regression/C/gcc-c-torture/execute/GCC-C-execute-pr84521.test' RESULTS **********
compile_time: 0.0000 
exec_time: 0.0006 
hash: "4130239c4879758353ec900ac2938150" 
link_time: 0.0109 
**********
PASS: test-suite :: SingleSource/Regression/C/gcc-c-torture/execute/GCC-C-execute-pr84524.test (1716 of 2039)
********** TEST 'test-suite :: SingleSource/Regression/C/gcc-c-torture/execute/GCC-C-execute-pr84524.test' RESULTS **********
compile_time: 0.0000 
exec_time: 0.0006 
hash: "ad812848c899c374a1f07567285dc131" 
link_time: 0.0104 
**********
PASS: test-suite :: SingleSource/Regression/C/gcc-c-torture/execute/GCC-C-execute-pr84748.test (1717 of 2039)
********** TEST 'test-suite :: SingleSource/Regression/C/gcc-c-torture/execute/GCC-C-execute-pr84748.test' RESULTS **********
compile_time: 0.0000 
exec_time: 0.0006 
hash: "1b060b8cc9e239be89ebec3bdf935336" 
link_time: 0.0108 
**********
NOEXE: test-suite :: SingleSource/Regression/C/gcc-c-torture/execute/GCC-C-execute-pr85095.test (1718 of 2039)
******************** TEST 'test-suite :: SingleSource/Regression/C/gcc-c-torture/execute/GCC-C-execute-pr85095.test' FAILED ********************
Executable '/Users/buildslave/jenkins/workspace/Testsuite-Tester@5/sandbox/build/SingleSource/Regression/C/gcc-c-torture/execute/GCC-C-execute-pr85095' is missing
********************
PASS: test-suite :: SingleSource/Regression/C/gcc-c-torture/execute/GCC-C-execute-pr85156.test (1719 of 2039)
********** TEST 'test-suite :: SingleSource/Regression/C/gcc-c-torture/execute/GCC-C-execute-pr85156.test' RESULTS **********
compile_time: 0.0000 
exec_time: 0.0006 
hash: "da2308e4e8201732b14e7ad0f5cd651a" 
link_time: 0.0102 
**********
PASS: test-suite :: SingleSource/Regression/C/gcc-c-torture/execute/GCC-C-execute-pr85169.test (1720 of 2039)
********** TEST 'test-suite :: SingleSource/Regression/C/gcc-c-torture/execute/GCC-C-execute-pr85169.test' RESULTS **********
compile_time: 0.0000 
exec_time: 0.0006 
hash: "d4d0742070ba4fd770d10e678d6c8686" 
link_time: 0.0105 
**********
PASS: test-suite :: SingleSource/Regression/C/gcc-c-torture/execute/GCC-C-execute-pr85529-1.test (1721 of 2039)
********** TEST 'test-suite :: SingleSource/Regression/C/gcc-c-torture/execute/GCC-C-execute-pr85529-1.test' RESULTS **********
compile_time: 0.0000 
exec_time: 0.0006 
hash: "2d65a7481d40b8e3a60ceff87fd08610" 
link_time: 0.0102 
**********
PASS: test-suite :: SingleSource/Regression/C/gcc-c-torture/execute/GCC-C-execute-pr85529-2.test (1722 of 2039)
********** TEST 'test-suite :: SingleSource/Regression/C/gcc-c-torture/execute/GCC-C-execute-pr85529-2.test' RESULTS **********
compile_time: 0.0000 
exec_time: 0.0006 
hash: "66e79446829f32e762bbb20c3cc55b19" 
link_time: 0.0107 
**********
PASS: test-suite :: SingleSource/Regression/C/gcc-c-torture/execute/GCC-C-execute-pr85582-1.test (1723 of 2039)
********** TEST 'test-suite :: SingleSource/Regression/C/gcc-c-torture/execute/GCC-C-execute-pr85582-1.test' RESULTS **********
compile_time: 0.0000 
exec_time: 0.0005 
hash: "cb8a89b7179676f22e19328d1fb73fc1" 
link_time: 0.0101 
**********
PASS: test-suite :: SingleSource/Regression/C/gcc-c-torture/execute/GCC-C-execute-pr85582-2.test (1724 of 2039)
********** TEST 'test-suite :: SingleSource/Regression/C/gcc-c-torture/execute/GCC-C-execute-pr85582-2.test' RESULTS **********
compile_time: 0.0000 
exec_time: 0.0006 
hash: "55758e09751915befda9c0951659322a" 
link_time: 0.0079 
**********
PASS: test-suite :: SingleSource/Regression/C/gcc-c-torture/execute/GCC-C-execute-pr85582-3.test (1725 of 2039)
********** TEST 'test-suite :: SingleSource/Regression/C/gcc-c-torture/execute/GCC-C-execute-pr85582-3.test' RESULTS **********
compile_time: 0.0000 
exec_time: 0.0006 
hash: "11d904de17d4d49941ca8284cb54252a" 
link_time: 0.0104 
**********
PASS: test-suite :: SingleSource/Regression/C/gcc-c-torture/execute/GCC-C-execute-pr85756.test (1726 of 2039)
********** TEST 'test-suite :: SingleSource/Regression/C/gcc-c-torture/execute/GCC-C-execute-pr85756.test' RESULTS **********
compile_time: 0.0000 
exec_time: 0.0006 
hash: "b0de25802661c826073c64a6a37323d4" 
link_time: 0.0105 
**********
PASS: test-suite :: SingleSource/Regression/C/gcc-c-torture/execute/GCC-C-execute-pr86231.test (1727 of 2039)
********** TEST 'test-suite :: SingleSource/Regression/C/gcc-c-torture/execute/GCC-C-execute-pr86231.test' RESULTS **********
compile_time: 0.0000 
exec_time: 0.0006 
hash: "2d2dfcc471bec21c4bc78f589bd59309" 
link_time: 0.0106 
**********
PASS: test-suite :: SingleSource/Regression/C/gcc-c-torture/execute/GCC-C-execute-pr86492.test (1728 of 2039)
********** TEST 'test-suite :: SingleSource/Regression/C/gcc-c-torture/execute/GCC-C-execute-pr86492.test' RESULTS **********
compile_time: 0.0000 
exec_time: 0.0006 
hash: "20c21fcaf79f486de95457a103790b20" 
link_time: 0.0086 
**********
PASS: test-suite :: SingleSource/Regression/C/gcc-c-torture/execute/GCC-C-execute-pr86528.test (1729 of 2039)
********** TEST 'test-suite :: SingleSource/Regression/C/gcc-c-torture/execute/GCC-C-execute-pr86528.test' RESULTS **********
compile_time: 0.0000 
exec_time: 0.0006 
hash: "bc11d2d73207eb2de3dfae67c2fc0330" 
link_time: 0.0099 
**********
PASS: test-suite :: SingleSource/Regression/C/gcc-c-torture/execute/GCC-C-execute-pr86714.test (1730 of 2039)
********** TEST 'test-suite :: SingleSource/Regression/C/gcc-c-torture/execute/GCC-C-execute-pr86714.test' RESULTS **********
compile_time: 0.0000 
exec_time: 0.0006 
hash: "9578463e5ffd95faa11305e963e7c75f" 
link_time: 0.0110 
**********
PASS: test-suite :: SingleSource/Regression/C/gcc-c-torture/execute/GCC-C-execute-pr86844.test (1731 of 2039)
********** TEST 'test-suite :: SingleSource/Regression/C/gcc-c-torture/execute/GCC-C-execute-pr86844.test' RESULTS **********
compile_time: 0.0000 
exec_time: 0.0006 
hash: "92cbee2d443d00d7e19811a506f7122e" 
link_time: 0.0101 
**********
PASS: test-suite :: SingleSource/Regression/C/gcc-c-torture/execute/GCC-C-execute-pr87053.test (1732 of 2039)
********** TEST 'test-suite :: SingleSource/Regression/C/gcc-c-torture/execute/GCC-C-execute-pr87053.test' RESULTS **********
compile_time: 0.0000 
exec_time: 0.0006 
hash: "fa832a1d0bd9b81df64b1c6e750c7c68" 
link_time: 0.0107 
**********
PASS: test-suite :: SingleSource/Regression/C/gcc-c-torture/execute/GCC-C-execute-pr87290.test (1733 of 2039)
********** TEST 'test-suite :: SingleSource/Regression/C/gcc-c-torture/execute/GCC-C-execute-pr87290.test' RESULTS **********
compile_time: 0.0000 
exec_time: 0.0006 
hash: "b55fc992cb1a185593fc5313b95dfc3d" 
link_time: 0.0095 
**********
PASS: test-suite :: SingleSource/Regression/C/gcc-c-torture/execute/GCC-C-execute-pr87623.test (1734 of 2039)
********** TEST 'test-suite :: SingleSource/Regression/C/gcc-c-torture/execute/GCC-C-execute-pr87623.test' RESULTS **********
compile_time: 0.0000 
exec_time: 0.0006 
hash: "7d48284d6e86aaf1c448cdcf434bcc51" 
link_time: 0.0104 
**********
PASS: test-suite :: SingleSource/Regression/C/gcc-c-torture/execute/GCC-C-execute-pr88693.test (1735 of 2039)
********** TEST 'test-suite :: SingleSource/Regression/C/gcc-c-torture/execute/GCC-C-execute-pr88693.test' RESULTS **********
compile_time: 0.0000 
exec_time: 0.0006 
hash: "44ee79e24d08881a3acfc94751d09141" 
link_time: 0.0105 
**********
PASS: test-suite :: SingleSource/Regression/C/gcc-c-torture/execute/GCC-C-execute-pr88714.test (1736 of 2039)
********** TEST 'test-suite :: SingleSource/Regression/C/gcc-c-torture/execute/GCC-C-execute-pr88714.test' RESULTS **********
compile_time: 0.0000 
exec_time: 0.0006 
hash: "283be2011fc5ea91282a3aea8144f4a8" 
link_time: 0.0110 
**********
PASS: test-suite :: SingleSource/Regression/C/gcc-c-torture/execute/GCC-C-execute-pr88739.test (1737 of 2039)
********** TEST 'test-suite :: SingleSource/Regression/C/gcc-c-torture/execute/GCC-C-execute-pr88739.test' RESULTS **********
compile_time: 0.0000 
exec_time: 0.0006 
hash: "745210b478a5576e789415255874db12" 
link_time: 0.0104 
**********
PASS: test-suite :: SingleSource/Regression/C/gcc-c-torture/execute/GCC-C-execute-pr88904.test (1738 of 2039)
********** TEST 'test-suite :: SingleSource/Regression/C/gcc-c-torture/execute/GCC-C-execute-pr88904.test' RESULTS **********
compile_time: 0.0000 
exec_time: 0.0006 
hash: "1669b1a7d500dd280382e094778ace44" 
link_time: 0.0106 
**********
PASS: test-suite :: SingleSource/Regression/C/gcc-c-torture/execute/GCC-C-execute-pr89195.test (1739 of 2039)
********** TEST 'test-suite :: SingleSource/Regression/C/gcc-c-torture/execute/GCC-C-execute-pr89195.test' RESULTS **********
compile_time: 0.0000 
exec_time: 0.0006 
hash: "11e2b2a66003bcc0fe0c45b3eb7e8746" 
link_time: 0.0096 
**********
PASS: test-suite :: SingleSource/Regression/C/gcc-c-torture/execute/GCC-C-execute-pr89369.test (1740 of 2039)
********** TEST 'test-suite :: SingleSource/Regression/C/gcc-c-torture/execute/GCC-C-execute-pr89369.test' RESULTS **********
compile_time: 0.0000 
exec_time: 0.0006 
hash: "88249c83d9886d9c360ba06d9df89446" 
link_time: 0.0101 
**********
NOEXE: test-suite :: SingleSource/Regression/C/gcc-c-torture/execute/GCC-C-execute-pr89434.test (1741 of 2039)
******************** TEST 'test-suite :: SingleSource/Regression/C/gcc-c-torture/execute/GCC-C-execute-pr89434.test' FAILED ********************
Executable '/Users/buildslave/jenkins/workspace/Testsuite-Tester@5/sandbox/build/SingleSource/Regression/C/gcc-c-torture/execute/GCC-C-execute-pr89434' is missing
********************
PASS: test-suite :: SingleSource/Regression/C/gcc-c-torture/execute/GCC-C-execute-pr89634.test (1742 of 2039)
********** TEST 'test-suite :: SingleSource/Regression/C/gcc-c-torture/execute/GCC-C-execute-pr89634.test' RESULTS **********
compile_time: 0.0000 
exec_time: 0.0006 
hash: "26e34a8dc4367dbca62259f32ca7ef51" 
link_time: 0.0106 
**********
PASS: test-suite :: SingleSource/Regression/C/gcc-c-torture/execute/GCC-C-execute-pr89826.test (1743 of 2039)
********** TEST 'test-suite :: SingleSource/Regression/C/gcc-c-torture/execute/GCC-C-execute-pr89826.test' RESULTS **********
compile_time: 0.0000 
exec_time: 0.0006 
hash: "599dbc30b42e5ea3cc8d1a82d3f485c8" 
link_time: 0.0094 
**********
PASS: test-suite :: SingleSource/Regression/C/gcc-c-torture/execute/GCC-C-execute-pr90025.test (1744 of 2039)
********** TEST 'test-suite :: SingleSource/Regression/C/gcc-c-torture/execute/GCC-C-execute-pr90025.test' RESULTS **********
compile_time: 0.0000 
exec_time: 0.0006 
hash: "7154795896f9757cdcfba2ea4fad52ba" 
link_time: 0.0109 
**********
PASS: test-suite :: SingleSource/Regression/C/gcc-c-torture/execute/GCC-C-execute-pr90949.test (1745 of 2039)
********** TEST 'test-suite :: SingleSource/Regression/C/gcc-c-torture/execute/GCC-C-execute-pr90949.test' RESULTS **********
compile_time: 0.0000 
exec_time: 0.0005 
hash: "279af3af6d97024a552cc928f5e04a7e" 
link_time: 0.0104 
**********
PASS: test-suite :: SingleSource/Regression/C/gcc-c-torture/execute/GCC-C-execute-pr91137.test (1746 of 2039)
********** TEST 'test-suite :: SingleSource/Regression/C/gcc-c-torture/execute/GCC-C-execute-pr91137.test' RESULTS **********
compile_time: 0.0000 
exec_time: 0.0013 
hash: "12b73e300aff80eb85c11ae25722899f" 
link_time: 0.0099 
**********
PASS: test-suite :: SingleSource/Regression/C/gcc-c-torture/execute/GCC-C-execute-printf-1.test (1747 of 2039)
********** TEST 'test-suite :: SingleSource/Regression/C/gcc-c-torture/execute/GCC-C-execute-printf-1.test' RESULTS **********
compile_time: 0.0000 
exec_time: 0.0006 
hash: "fbdd7e16442082ef8b09c9ff7d8d79d7" 
link_time: 0.0097 
**********
PASS: test-suite :: SingleSource/Regression/C/gcc-c-torture/execute/GCC-C-execute-printf-2.test (1748 of 2039)
********** TEST 'test-suite :: SingleSource/Regression/C/gcc-c-torture/execute/GCC-C-execute-printf-2.test' RESULTS **********
compile_time: 0.0000 
exec_time: 0.0006 
hash: "a2ddde99c9b7c576e3240a8e555abfe8" 
link_time: 0.0101 
**********
PASS: test-suite :: SingleSource/Regression/C/gcc-c-torture/execute/GCC-C-execute-pta-field-1.test (1749 of 2039)
********** TEST 'test-suite :: SingleSource/Regression/C/gcc-c-torture/execute/GCC-C-execute-pta-field-1.test' RESULTS **********
compile_time: 0.0000 
exec_time: 0.0006 
hash: "f76c7cfd8f2a7a28bff67b5e4408cdb9" 
link_time: 0.0104 
**********
PASS: test-suite :: SingleSource/Regression/C/gcc-c-torture/execute/GCC-C-execute-pta-field-2.test (1750 of 2039)
********** TEST 'test-suite :: SingleSource/Regression/C/gcc-c-torture/execute/GCC-C-execute-pta-field-2.test' RESULTS **********
compile_time: 0.0000 
exec_time: 0.0006 
hash: "5b2e29e6a19f528abd12cf21968df39a" 
link_time: 0.0095 
**********
PASS: test-suite :: SingleSource/Regression/C/gcc-c-torture/execute/GCC-C-execute-ptr-arith-1.test (1751 of 2039)
********** TEST 'test-suite :: SingleSource/Regression/C/gcc-c-torture/execute/GCC-C-execute-ptr-arith-1.test' RESULTS **********
compile_time: 0.0000 
exec_time: 0.0006 
hash: "2b5ac5de7b1a0ed16bc0039143ea543f" 
link_time: 0.0096 
**********
PASS: test-suite :: SingleSource/Regression/C/gcc-c-torture/execute/GCC-C-execute-pure-1.test (1752 of 2039)
********** TEST 'test-suite :: SingleSource/Regression/C/gcc-c-torture/execute/GCC-C-execute-pure-1.test' RESULTS **********
compile_time: 0.0000 
exec_time: 0.0006 
hash: "6da8d748bf72ef5252b797751cba2011" 
link_time: 0.0089 
**********
PASS: test-suite :: SingleSource/Regression/C/gcc-c-torture/execute/GCC-C-execute-pushpop_macro.test (1753 of 2039)
********** TEST 'test-suite :: SingleSource/Regression/C/gcc-c-torture/execute/GCC-C-execute-pushpop_macro.test' RESULTS **********
compile_time: 0.0000 
exec_time: 0.0006 
hash: "d54875702e802c3ee0d1f19fa81f3b21" 
link_time: 0.0079 
**********
PASS: test-suite :: SingleSource/Regression/C/gcc-c-torture/execute/GCC-C-execute-regstack-1.test (1754 of 2039)
********** TEST 'test-suite :: SingleSource/Regression/C/gcc-c-torture/execute/GCC-C-execute-regstack-1.test' RESULTS **********
compile_time: 0.0000 
exec_time: 0.0006 
hash: "71aa155be2e7815d8c3963cd1c896577" 
link_time: 0.0106 
**********
NOEXE: test-suite :: SingleSource/Regression/C/gcc-c-torture/execute/GCC-C-execute-return-addr.test (1755 of 2039)
******************** TEST 'test-suite :: SingleSource/Regression/C/gcc-c-torture/execute/GCC-C-execute-return-addr.test' FAILED ********************
Executable '/Users/buildslave/jenkins/workspace/Testsuite-Tester@5/sandbox/build/SingleSource/Regression/C/gcc-c-torture/execute/GCC-C-execute-return-addr' is missing
********************
NOEXE: test-suite :: SingleSource/Regression/C/gcc-c-torture/execute/GCC-C-execute-scal-to-vec1.test (1756 of 2039)
******************** TEST 'test-suite :: SingleSource/Regression/C/gcc-c-torture/execute/GCC-C-execute-scal-to-vec1.test' FAILED ********************
Executable '/Users/buildslave/jenkins/workspace/Testsuite-Tester@5/sandbox/build/SingleSource/Regression/C/gcc-c-torture/execute/GCC-C-execute-scal-to-vec1' is missing
********************
NOEXE: test-suite :: SingleSource/Regression/C/gcc-c-torture/execute/GCC-C-execute-scal-to-vec2.test (1757 of 2039)
******************** TEST 'test-suite :: SingleSource/Regression/C/gcc-c-torture/execute/GCC-C-execute-scal-to-vec2.test' FAILED ********************
Executable '/Users/buildslave/jenkins/workspace/Testsuite-Tester@5/sandbox/build/SingleSource/Regression/C/gcc-c-torture/execute/GCC-C-execute-scal-to-vec2' is missing
********************
NOEXE: test-suite :: SingleSource/Regression/C/gcc-c-torture/execute/GCC-C-execute-scal-to-vec3.test (1758 of 2039)
******************** TEST 'test-suite :: SingleSource/Regression/C/gcc-c-torture/execute/GCC-C-execute-scal-to-vec3.test' FAILED ********************
Executable '/Users/buildslave/jenkins/workspace/Testsuite-Tester@5/sandbox/build/SingleSource/Regression/C/gcc-c-torture/execute/GCC-C-execute-scal-to-vec3' is missing
********************
PASS: test-suite :: SingleSource/Regression/C/gcc-c-torture/execute/GCC-C-execute-scope-1.test (1759 of 2039)
********** TEST 'test-suite :: SingleSource/Regression/C/gcc-c-torture/execute/GCC-C-execute-scope-1.test' RESULTS **********
compile_time: 0.0000 
exec_time: 0.0006 
hash: "e6323547f06f385e89ada79be160c0bf" 
link_time: 0.0108 
**********
PASS: test-suite :: SingleSource/Regression/C/gcc-c-torture/execute/GCC-C-execute-shiftdi-2.test (1760 of 2039)
********** TEST 'test-suite :: SingleSource/Regression/C/gcc-c-torture/execute/GCC-C-execute-shiftdi-2.test' RESULTS **********
compile_time: 0.0000 
exec_time: 0.0006 
hash: "d0e87e53ad1eb0e36345c8e3175587e5" 
link_time: 0.0104 
**********
PASS: test-suite :: SingleSource/Regression/C/gcc-c-torture/execute/GCC-C-execute-shiftdi.test (1761 of 2039)
********** TEST 'test-suite :: SingleSource/Regression/C/gcc-c-torture/execute/GCC-C-execute-shiftdi.test' RESULTS **********
compile_time: 0.0000 
exec_time: 0.0005 
hash: "3631d31faa7066031db2651b3e0fd518" 
link_time: 0.0094 
**********
PASS: test-suite :: SingleSource/Regression/C/gcc-c-torture/execute/GCC-C-execute-shiftopt-1.test (1762 of 2039)
********** TEST 'test-suite :: SingleSource/Regression/C/gcc-c-torture/execute/GCC-C-execute-shiftopt-1.test' RESULTS **********
compile_time: 0.0000 
exec_time: 0.0006 
hash: "aecb8ed23869d3d125989837b0991b3a" 
link_time: 0.0105 
**********
NOEXE: test-suite :: SingleSource/Regression/C/gcc-c-torture/execute/GCC-C-execute-simd-1.test (1763 of 2039)
******************** TEST 'test-suite :: SingleSource/Regression/C/gcc-c-torture/execute/GCC-C-execute-simd-1.test' FAILED ********************
Executable '/Users/buildslave/jenkins/workspace/Testsuite-Tester@5/sandbox/build/SingleSource/Regression/C/gcc-c-torture/execute/GCC-C-execute-simd-1' is missing
********************
PASS: test-suite :: SingleSource/Regression/C/gcc-c-torture/execute/GCC-C-execute-simd-2.test (1764 of 2039)
********** TEST 'test-suite :: SingleSource/Regression/C/gcc-c-torture/execute/GCC-C-execute-simd-2.test' RESULTS **********
compile_time: 0.0000 
exec_time: 0.0006 
hash: "2425a2a2ec67c0750b987149e964be4e" 
link_time: 0.0104 
**********
PASS: test-suite :: SingleSource/Regression/C/gcc-c-torture/execute/GCC-C-execute-simd-4.test (1765 of 2039)
********** TEST 'test-suite :: SingleSource/Regression/C/gcc-c-torture/execute/GCC-C-execute-simd-4.test' RESULTS **********
compile_time: 0.0000 
exec_time: 0.0006 
hash: "81c9a0dc8a367e5409a82b7c8fe24012" 
link_time: 0.0105 
**********
PASS: test-suite :: SingleSource/Regression/C/gcc-c-torture/execute/GCC-C-execute-simd-5.test (1766 of 2039)
********** TEST 'test-suite :: SingleSource/Regression/C/gcc-c-torture/execute/GCC-C-execute-simd-5.test' RESULTS **********
compile_time: 0.0000 
exec_time: 0.0006 
hash: "1b6d8b3a99f34213718251f524042b30" 
link_time: 0.0107 
**********
PASS: test-suite :: SingleSource/Regression/C/gcc-c-torture/execute/GCC-C-execute-simd-6.test (1767 of 2039)
********** TEST 'test-suite :: SingleSource/Regression/C/gcc-c-torture/execute/GCC-C-execute-simd-6.test' RESULTS **********
compile_time: 0.0000 
exec_time: 0.0006 
hash: "c24fd8a5b6b0b18f7e33ded96e59e22e" 
link_time: 0.0105 
**********
PASS: test-suite :: SingleSource/Regression/C/gcc-c-torture/execute/GCC-C-execute-ssad-run.test (1768 of 2039)
********** TEST 'test-suite :: SingleSource/Regression/C/gcc-c-torture/execute/GCC-C-execute-ssad-run.test' RESULTS **********
compile_time: 0.0000 
exec_time: 0.0006 
hash: "0771be31ed162603dabd306e5d6d6521" 
link_time: 0.0096 
**********
PASS: test-suite :: SingleSource/Regression/C/gcc-c-torture/execute/GCC-C-execute-stdarg-1.test (1769 of 2039)
********** TEST 'test-suite :: SingleSource/Regression/C/gcc-c-torture/execute/GCC-C-execute-stdarg-1.test' RESULTS **********
compile_time: 0.0000 
exec_time: 0.0006 
hash: "01b478c5fc3a16a12f26227124b564f2" 
link_time: 0.0110 
**********
PASS: test-suite :: SingleSource/Regression/C/gcc-c-torture/execute/GCC-C-execute-stdarg-2.test (1770 of 2039)
********** TEST 'test-suite :: SingleSource/Regression/C/gcc-c-torture/execute/GCC-C-execute-stdarg-2.test' RESULTS **********
compile_time: 0.0000 
exec_time: 0.0006 
hash: "db5d338df78e5fc1c50896843262b0ab" 
link_time: 0.0106 
**********
PASS: test-suite :: SingleSource/Regression/C/gcc-c-torture/execute/GCC-C-execute-stdarg-3.test (1771 of 2039)
********** TEST 'test-suite :: SingleSource/Regression/C/gcc-c-torture/execute/GCC-C-execute-stdarg-3.test' RESULTS **********
compile_time: 0.0000 
exec_time: 0.0006 
hash: "2d2f291e183c8755265a81a2e1d4e9c7" 
link_time: 0.0108 
**********
PASS: test-suite :: SingleSource/Regression/C/gcc-c-torture/execute/GCC-C-execute-stdarg-4.test (1772 of 2039)
********** TEST 'test-suite :: SingleSource/Regression/C/gcc-c-torture/execute/GCC-C-execute-stdarg-4.test' RESULTS **********
compile_time: 0.0000 
exec_time: 0.0006 
hash: "c34bdfa35e66ec016ab0377fe43779ad" 
link_time: 0.0097 
**********
PASS: test-suite :: SingleSource/Regression/C/gcc-c-torture/execute/GCC-C-execute-stkalign.test (1773 of 2039)
********** TEST 'test-suite :: SingleSource/Regression/C/gcc-c-torture/execute/GCC-C-execute-stkalign.test' RESULTS **********
compile_time: 0.0000 
exec_time: 0.0005 
hash: "3d07a52f44a3d976d3e884a3aa06fffa" 
link_time: 0.0102 
**********
PASS: test-suite :: SingleSource/Regression/C/gcc-c-torture/execute/GCC-C-execute-strcmp-1.test (1774 of 2039)
********** TEST 'test-suite :: SingleSource/Regression/C/gcc-c-torture/execute/GCC-C-execute-strcmp-1.test' RESULTS **********
compile_time: 0.0000 
exec_time: 0.0021 
hash: "c5d5bd068097e40af1f50384ae23c64c" 
link_time: 0.0095 
**********
PASS: test-suite :: SingleSource/Regression/C/gcc-c-torture/execute/GCC-C-execute-strcpy-1.test (1775 of 2039)
********** TEST 'test-suite :: SingleSource/Regression/C/gcc-c-torture/execute/GCC-C-execute-strcpy-1.test' RESULTS **********
compile_time: 0.0000 
exec_time: 0.0030 
hash: "9fb0e37a8ac34a6a62afe6465d230a9e" 
link_time: 0.0105 
**********
PASS: test-suite :: SingleSource/Regression/C/gcc-c-torture/execute/GCC-C-execute-strcpy-2.test (1776 of 2039)
********** TEST 'test-suite :: SingleSource/Regression/C/gcc-c-torture/execute/GCC-C-execute-strcpy-2.test' RESULTS **********
compile_time: 0.0000 
exec_time: 0.0006 
hash: "57361921833b9b1fdcee54caae40dffc" 
link_time: 0.0102 
**********
PASS: test-suite :: SingleSource/Regression/C/gcc-c-torture/execute/GCC-C-execute-strct-pack-1.test (1777 of 2039)
********** TEST 'test-suite :: SingleSource/Regression/C/gcc-c-torture/execute/GCC-C-execute-strct-pack-1.test' RESULTS **********
compile_time: 0.0000 
exec_time: 0.0006 
hash: "caf8ba7be39f42c6d213412aa02fa478" 
link_time: 0.0095 
**********
PASS: test-suite :: SingleSource/Regression/C/gcc-c-torture/execute/GCC-C-execute-strct-pack-2.test (1778 of 2039)
********** TEST 'test-suite :: SingleSource/Regression/C/gcc-c-torture/execute/GCC-C-execute-strct-pack-2.test' RESULTS **********
compile_time: 0.0000 
exec_time: 0.0006 
hash: "69c89150bb030e002dcd5efcfb306439" 
link_time: 0.0083 
**********
PASS: test-suite :: SingleSource/Regression/C/gcc-c-torture/execute/GCC-C-execute-strct-pack-3.test (1779 of 2039)
********** TEST 'test-suite :: SingleSource/Regression/C/gcc-c-torture/execute/GCC-C-execute-strct-pack-3.test' RESULTS **********
compile_time: 0.0000 
exec_time: 0.0006 
hash: "8896dd3a414e3659b019c50ce9344374" 
link_time: 0.0097 
**********
PASS: test-suite :: SingleSource/Regression/C/gcc-c-torture/execute/GCC-C-execute-strct-pack-4.test (1780 of 2039)
********** TEST 'test-suite :: SingleSource/Regression/C/gcc-c-torture/execute/GCC-C-execute-strct-pack-4.test' RESULTS **********
compile_time: 0.0000 
exec_time: 0.0006 
hash: "77bea8e0769d7d842184fd6510a28dfc" 
link_time: 0.0105 
**********
PASS: test-suite :: SingleSource/Regression/C/gcc-c-torture/execute/GCC-C-execute-strct-stdarg-1.test (1781 of 2039)
********** TEST 'test-suite :: SingleSource/Regression/C/gcc-c-torture/execute/GCC-C-execute-strct-stdarg-1.test' RESULTS **********
compile_time: 0.0000 
exec_time: 0.0006 
hash: "1ad076bfe75834cf0f6c090cb5e53f91" 
link_time: 0.0105 
**********
PASS: test-suite :: SingleSource/Regression/C/gcc-c-torture/execute/GCC-C-execute-strct-varg-1.test (1782 of 2039)
********** TEST 'test-suite :: SingleSource/Regression/C/gcc-c-torture/execute/GCC-C-execute-strct-varg-1.test' RESULTS **********
compile_time: 0.0000 
exec_time: 0.0006 
hash: "e6598c958f6c10884036dd15e749d991" 
link_time: 0.0107 
**********
PASS: test-suite :: SingleSource/Regression/C/gcc-c-torture/execute/GCC-C-execute-string-opt-17.test (1783 of 2039)
********** TEST 'test-suite :: SingleSource/Regression/C/gcc-c-torture/execute/GCC-C-execute-string-opt-17.test' RESULTS **********
compile_time: 0.0000 
exec_time: 0.0006 
hash: "3f09b86bc0cb0a498c46d2c27510130a" 
link_time: 0.0108 
**********
NOEXE: test-suite :: SingleSource/Regression/C/gcc-c-torture/execute/GCC-C-execute-string-opt-18.test (1784 of 2039)
******************** TEST 'test-suite :: SingleSource/Regression/C/gcc-c-torture/execute/GCC-C-execute-string-opt-18.test' FAILED ********************
Executable '/Users/buildslave/jenkins/workspace/Testsuite-Tester@5/sandbox/build/SingleSource/Regression/C/gcc-c-torture/execute/GCC-C-execute-string-opt-18' is missing
********************
PASS: test-suite :: SingleSource/Regression/C/gcc-c-torture/execute/GCC-C-execute-string-opt-5.test (1785 of 2039)
********** TEST 'test-suite :: SingleSource/Regression/C/gcc-c-torture/execute/GCC-C-execute-string-opt-5.test' RESULTS **********
compile_time: 0.0000 
exec_time: 0.0006 
hash: "04ee22ec73955977feabaa24a1f605cc" 
link_time: 0.0103 
**********
PASS: test-suite :: SingleSource/Regression/C/gcc-c-torture/execute/GCC-C-execute-strlen-1.test (1786 of 2039)
********** TEST 'test-suite :: SingleSource/Regression/C/gcc-c-torture/execute/GCC-C-execute-strlen-1.test' RESULTS **********
compile_time: 0.0000 
exec_time: 0.0006 
hash: "929502040dd3607125f74d64da900527" 
link_time: 0.0103 
**********
PASS: test-suite :: SingleSource/Regression/C/gcc-c-torture/execute/GCC-C-execute-strlen-2.test (1787 of 2039)
********** TEST 'test-suite :: SingleSource/Regression/C/gcc-c-torture/execute/GCC-C-execute-strlen-2.test' RESULTS **********
compile_time: 0.0000 
exec_time: 0.0006 
hash: "efeb6112f894a6fb1f7c6396770b3afe" 
link_time: 0.0109 
**********
PASS: test-suite :: SingleSource/Regression/C/gcc-c-torture/execute/GCC-C-execute-strlen-3.test (1788 of 2039)
********** TEST 'test-suite :: SingleSource/Regression/C/gcc-c-torture/execute/GCC-C-execute-strlen-3.test' RESULTS **********
compile_time: 0.0000 
exec_time: 0.0006 
hash: "0fb96bfeb82ebb8fb643b02bd96fb86a" 
link_time: 0.0111 
**********
PASS: test-suite :: SingleSource/Regression/C/gcc-c-torture/execute/GCC-C-execute-strlen-4.test (1789 of 2039)
********** TEST 'test-suite :: SingleSource/Regression/C/gcc-c-torture/execute/GCC-C-execute-strlen-4.test' RESULTS **********
compile_time: 0.0000 
exec_time: 0.0006 
hash: "eafc33013752bf641c124270832a3b3e" 
link_time: 0.0111 
**********
PASS: test-suite :: SingleSource/Regression/C/gcc-c-torture/execute/GCC-C-execute-strlen-5.test (1790 of 2039)
********** TEST 'test-suite :: SingleSource/Regression/C/gcc-c-torture/execute/GCC-C-execute-strlen-5.test' RESULTS **********
compile_time: 0.0000 
exec_time: 0.0006 
hash: "0718c9fb08c8d5aebb17e545236ddb04" 
link_time: 0.0100 
**********
PASS: test-suite :: SingleSource/Regression/C/gcc-c-torture/execute/GCC-C-execute-strlen-6.test (1791 of 2039)
********** TEST 'test-suite :: SingleSource/Regression/C/gcc-c-torture/execute/GCC-C-execute-strlen-6.test' RESULTS **********
compile_time: 0.0000 
exec_time: 0.0006 
hash: "956905ecb1a1d271565c97084c81aebd" 
link_time: 0.0110 
**********
PASS: test-suite :: SingleSource/Regression/C/gcc-c-torture/execute/GCC-C-execute-strncmp-1.test (1792 of 2039)
********** TEST 'test-suite :: SingleSource/Regression/C/gcc-c-torture/execute/GCC-C-execute-strncmp-1.test' RESULTS **********
compile_time: 0.0000 
exec_time: 0.0032 
hash: "0e840c5bda519f8b2404e5ac66818466" 
link_time: 0.0104 
**********
PASS: test-suite :: SingleSource/Regression/C/gcc-c-torture/execute/GCC-C-execute-struct-aliasing-1.test (1793 of 2039)
********** TEST 'test-suite :: SingleSource/Regression/C/gcc-c-torture/execute/GCC-C-execute-struct-aliasing-1.test' RESULTS **********
compile_time: 0.0000 
exec_time: 0.0006 
hash: "9cf24e7c8deb14356a9be133466ccb2d" 
link_time: 0.0105 
**********
PASS: test-suite :: SingleSource/Regression/C/gcc-c-torture/execute/GCC-C-execute-struct-cpy-1.test (1794 of 2039)
********** TEST 'test-suite :: SingleSource/Regression/C/gcc-c-torture/execute/GCC-C-execute-struct-cpy-1.test' RESULTS **********
compile_time: 0.0000 
exec_time: 0.0006 
hash: "f33642cc7645eecd036664bf12703607" 
link_time: 0.0095 
**********
PASS: test-suite :: SingleSource/Regression/C/gcc-c-torture/execute/GCC-C-execute-struct-ini-1.test (1795 of 2039)
********** TEST 'test-suite :: SingleSource/Regression/C/gcc-c-torture/execute/GCC-C-execute-struct-ini-1.test' RESULTS **********
compile_time: 0.0000 
exec_time: 0.0006 
hash: "903574a89ab494228a01059de3928d89" 
link_time: 0.0095 
**********
PASS: test-suite :: SingleSource/Regression/C/gcc-c-torture/execute/GCC-C-execute-struct-ini-2.test (1796 of 2039)
********** TEST 'test-suite :: SingleSource/Regression/C/gcc-c-torture/execute/GCC-C-execute-struct-ini-2.test' RESULTS **********
compile_time: 0.0000 
exec_time: 0.0006 
hash: "df2e801b78dbaf58ab2608e86c8a55b2" 
link_time: 0.0109 
**********
PASS: test-suite :: SingleSource/Regression/C/gcc-c-torture/execute/GCC-C-execute-struct-ini-3.test (1797 of 2039)
********** TEST 'test-suite :: SingleSource/Regression/C/gcc-c-torture/execute/GCC-C-execute-struct-ini-3.test' RESULTS **********
compile_time: 0.0000 
exec_time: 0.0006 
hash: "92f995250e418514f2a7545a925bf448" 
link_time: 0.0099 
**********
PASS: test-suite :: SingleSource/Regression/C/gcc-c-torture/execute/GCC-C-execute-struct-ini-4.test (1798 of 2039)
********** TEST 'test-suite :: SingleSource/Regression/C/gcc-c-torture/execute/GCC-C-execute-struct-ini-4.test' RESULTS **********
compile_time: 0.0000 
exec_time: 0.0006 
hash: "6bc206451b8b1a22d7d50242ea8ab013" 
link_time: 0.0109 
**********
PASS: test-suite :: SingleSource/Regression/C/gcc-c-torture/execute/GCC-C-execute-struct-ret-1.test (1799 of 2039)
********** TEST 'test-suite :: SingleSource/Regression/C/gcc-c-torture/execute/GCC-C-execute-struct-ret-1.test' RESULTS **********
compile_time: 0.0000 
exec_time: 0.0006 
hash: "8d7ac6801edd71df3fd53ea2252c8621" 
link_time: 0.0094 
**********
PASS: test-suite :: SingleSource/Regression/C/gcc-c-torture/execute/GCC-C-execute-struct-ret-2.test (1800 of 2039)
********** TEST 'test-suite :: SingleSource/Regression/C/gcc-c-torture/execute/GCC-C-execute-struct-ret-2.test' RESULTS **********
compile_time: 0.0000 
exec_time: 0.0006 
hash: "9a1f59214876e430f5f1e9449312c490" 
link_time: 0.0104 
**********
PASS: test-suite :: SingleSource/Regression/C/gcc-c-torture/execute/GCC-C-execute-switch-1.test (1801 of 2039)
********** TEST 'test-suite :: SingleSource/Regression/C/gcc-c-torture/execute/GCC-C-execute-switch-1.test' RESULTS **********
compile_time: 0.0000 
exec_time: 0.0006 
hash: "9ad9f4e44838c58893693aba32ff9d81" 
link_time: 0.0106 
**********
PASS: test-suite :: SingleSource/Regression/C/gcc-c-torture/execute/GCC-C-execute-tstdi-1.test (1802 of 2039)
********** TEST 'test-suite :: SingleSource/Regression/C/gcc-c-torture/execute/GCC-C-execute-tstdi-1.test' RESULTS **********
compile_time: 0.0000 
exec_time: 0.0007 
hash: "71518b6ba065584249b35e6e2a114745" 
link_time: 0.0092 
**********
PASS: test-suite :: SingleSource/Regression/C/gcc-c-torture/execute/GCC-C-execute-usad-run.test (1803 of 2039)
********** TEST 'test-suite :: SingleSource/Regression/C/gcc-c-torture/execute/GCC-C-execute-usad-run.test' RESULTS **********
compile_time: 0.0000 
exec_time: 0.0006 
hash: "1d2f5c951c3f9a045d6c8b42d4a661f0" 
link_time: 0.0104 
**********
PASS: test-suite :: SingleSource/Regression/C/gcc-c-torture/execute/GCC-C-execute-user-printf.test (1804 of 2039)
********** TEST 'test-suite :: SingleSource/Regression/C/gcc-c-torture/execute/GCC-C-execute-user-printf.test' RESULTS **********
compile_time: 0.0000 
exec_time: 0.0006 
hash: "1fd22f8bab0f9f373db516977fcc936f" 
link_time: 0.0100 
**********
PASS: test-suite :: SingleSource/Regression/C/gcc-c-torture/execute/GCC-C-execute-usmul.test (1805 of 2039)
********** TEST 'test-suite :: SingleSource/Regression/C/gcc-c-torture/execute/GCC-C-execute-usmul.test' RESULTS **********
compile_time: 0.0000 
exec_time: 0.0006 
hash: "ebf4ab7b922e895f32dfbf7c6040d4c5" 
link_time: 0.0100 
**********
PASS: test-suite :: SingleSource/Regression/C/gcc-c-torture/execute/GCC-C-execute-va-arg-1.test (1806 of 2039)
********** TEST 'test-suite :: SingleSource/Regression/C/gcc-c-torture/execute/GCC-C-execute-va-arg-1.test' RESULTS **********
compile_time: 0.0000 
exec_time: 0.0006 
hash: "885e90383582eb474741e40187f55505" 
link_time: 0.0104 
**********
PASS: test-suite :: SingleSource/Regression/C/gcc-c-torture/execute/GCC-C-execute-va-arg-10.test (1807 of 2039)
********** TEST 'test-suite :: SingleSource/Regression/C/gcc-c-torture/execute/GCC-C-execute-va-arg-10.test' RESULTS **********
compile_time: 0.0000 
exec_time: 0.0006 
hash: "32724b80f6385388a6edf8bab1dad2f6" 
link_time: 0.0094 
**********
PASS: test-suite :: SingleSource/Regression/C/gcc-c-torture/execute/GCC-C-execute-va-arg-11.test (1808 of 2039)
********** TEST 'test-suite :: SingleSource/Regression/C/gcc-c-torture/execute/GCC-C-execute-va-arg-11.test' RESULTS **********
compile_time: 0.0000 
exec_time: 0.0006 
hash: "7c3dc78fe43722ef3214c3ae213de7f5" 
link_time: 0.0099 
**********
PASS: test-suite :: SingleSource/Regression/C/gcc-c-torture/execute/GCC-C-execute-va-arg-12.test (1809 of 2039)
********** TEST 'test-suite :: SingleSource/Regression/C/gcc-c-torture/execute/GCC-C-execute-va-arg-12.test' RESULTS **********
compile_time: 0.0000 
exec_time: 0.0006 
hash: "69b00b35b4c84e91a2624c21abdd78b4" 
link_time: 0.0100 
**********
PASS: test-suite :: SingleSource/Regression/C/gcc-c-torture/execute/GCC-C-execute-va-arg-13.test (1810 of 2039)
********** TEST 'test-suite :: SingleSource/Regression/C/gcc-c-torture/execute/GCC-C-execute-va-arg-13.test' RESULTS **********
compile_time: 0.0000 
exec_time: 0.0006 
hash: "75ad00eca462fd35458822e44f3fb567" 
link_time: 0.0107 
**********
PASS: test-suite :: SingleSource/Regression/C/gcc-c-torture/execute/GCC-C-execute-va-arg-14.test (1811 of 2039)
********** TEST 'test-suite :: SingleSource/Regression/C/gcc-c-torture/execute/GCC-C-execute-va-arg-14.test' RESULTS **********
compile_time: 0.0000 
exec_time: 0.0006 
hash: "58e6c77198a6e49b8e0d0d3b6ccbb912" 
link_time: 0.0105 
**********
PASS: test-suite :: SingleSource/Regression/C/gcc-c-torture/execute/GCC-C-execute-va-arg-15.test (1812 of 2039)
********** TEST 'test-suite :: SingleSource/Regression/C/gcc-c-torture/execute/GCC-C-execute-va-arg-15.test' RESULTS **********
compile_time: 0.0000 
exec_time: 0.0006 
hash: "fbb9361eff3447e3e4c10e033530030a" 
link_time: 0.0102 
**********
PASS: test-suite :: SingleSource/Regression/C/gcc-c-torture/execute/GCC-C-execute-va-arg-16.test (1813 of 2039)
********** TEST 'test-suite :: SingleSource/Regression/C/gcc-c-torture/execute/GCC-C-execute-va-arg-16.test' RESULTS **********
compile_time: 0.0000 
exec_time: 0.0006 
hash: "d85be4c08b53d93a31ab7eb1075e84b6" 
link_time: 0.0096 
**********
PASS: test-suite :: SingleSource/Regression/C/gcc-c-torture/execute/GCC-C-execute-va-arg-17.test (1814 of 2039)
********** TEST 'test-suite :: SingleSource/Regression/C/gcc-c-torture/execute/GCC-C-execute-va-arg-17.test' RESULTS **********
compile_time: 0.0000 
exec_time: 0.0006 
hash: "ea35dd8f14c1f6a64b6b3180fcfe12a7" 
link_time: 0.0105 
**********
PASS: test-suite :: SingleSource/Regression/C/gcc-c-torture/execute/GCC-C-execute-va-arg-18.test (1815 of 2039)
********** TEST 'test-suite :: SingleSource/Regression/C/gcc-c-torture/execute/GCC-C-execute-va-arg-18.test' RESULTS **********
compile_time: 0.0000 
exec_time: 0.0006 
hash: "7b5f4ee139a74ce542f256d39436af17" 
link_time: 0.0107 
**********
PASS: test-suite :: SingleSource/Regression/C/gcc-c-torture/execute/GCC-C-execute-va-arg-19.test (1816 of 2039)
********** TEST 'test-suite :: SingleSource/Regression/C/gcc-c-torture/execute/GCC-C-execute-va-arg-19.test' RESULTS **********
compile_time: 0.0000 
exec_time: 0.0006 
hash: "f33455f0f360837552b851998e93da5e" 
link_time: 0.0111 
**********
PASS: test-suite :: SingleSource/Regression/C/gcc-c-torture/execute/GCC-C-execute-va-arg-2.test (1817 of 2039)
********** TEST 'test-suite :: SingleSource/Regression/C/gcc-c-torture/execute/GCC-C-execute-va-arg-2.test' RESULTS **********
compile_time: 0.0000 
exec_time: 0.0006 
hash: "cafc8f9f5fccfd3cccf5b3082d16c3fc" 
link_time: 0.0109 
**********
PASS: test-suite :: SingleSource/Regression/C/gcc-c-torture/execute/GCC-C-execute-va-arg-20.test (1818 of 2039)
********** TEST 'test-suite :: SingleSource/Regression/C/gcc-c-torture/execute/GCC-C-execute-va-arg-20.test' RESULTS **********
compile_time: 0.0000 
exec_time: 0.0006 
hash: "85f534c1703818920f24f6236b6a46ba" 
link_time: 0.0108 
**********
PASS: test-suite :: SingleSource/Regression/C/gcc-c-torture/execute/GCC-C-execute-va-arg-21.test (1819 of 2039)
********** TEST 'test-suite :: SingleSource/Regression/C/gcc-c-torture/execute/GCC-C-execute-va-arg-21.test' RESULTS **********
compile_time: 0.0000 
exec_time: 0.0007 
hash: "f18868c981462104e826e2ff44fd71be" 
link_time: 0.0095 
**********
PASS: test-suite :: SingleSource/Regression/C/gcc-c-torture/execute/GCC-C-execute-va-arg-22.test (1820 of 2039)
********** TEST 'test-suite :: SingleSource/Regression/C/gcc-c-torture/execute/GCC-C-execute-va-arg-22.test' RESULTS **********
compile_time: 0.0000 
exec_time: 0.0006 
hash: "a57e8874856c83cef1403ed200d1c423" 
link_time: 0.0108 
**********
PASS: test-suite :: SingleSource/Regression/C/gcc-c-torture/execute/GCC-C-execute-va-arg-23.test (1821 of 2039)
********** TEST 'test-suite :: SingleSource/Regression/C/gcc-c-torture/execute/GCC-C-execute-va-arg-23.test' RESULTS **********
compile_time: 0.0000 
exec_time: 0.0006 
hash: "03027e8d5fabe1699e5f14c9586ecdeb" 
link_time: 0.0107 
**********
PASS: test-suite :: SingleSource/Regression/C/gcc-c-torture/execute/GCC-C-execute-va-arg-24.test (1822 of 2039)
********** TEST 'test-suite :: SingleSource/Regression/C/gcc-c-torture/execute/GCC-C-execute-va-arg-24.test' RESULTS **********
compile_time: 0.0000 
exec_time: 0.0006 
hash: "18935c67ef5d173027982149ebad2b11" 
link_time: 0.0103 
**********
PASS: test-suite :: SingleSource/Regression/C/gcc-c-torture/execute/GCC-C-execute-va-arg-26.test (1823 of 2039)
********** TEST 'test-suite :: SingleSource/Regression/C/gcc-c-torture/execute/GCC-C-execute-va-arg-26.test' RESULTS **********
compile_time: 0.0000 
exec_time: 0.0006 
hash: "2f80b4b7b0c04b2442563f6ec1f6c9e9" 
link_time: 0.0102 
**********
PASS: test-suite :: SingleSource/Regression/C/gcc-c-torture/execute/GCC-C-execute-va-arg-4.test (1824 of 2039)
********** TEST 'test-suite :: SingleSource/Regression/C/gcc-c-torture/execute/GCC-C-execute-va-arg-4.test' RESULTS **********
compile_time: 0.0000 
exec_time: 0.0006 
hash: "ee8cfcb8a4b073e4ac56259181b7bce5" 
link_time: 0.0104 
**********
PASS: test-suite :: SingleSource/Regression/C/gcc-c-torture/execute/GCC-C-execute-va-arg-5.test (1825 of 2039)
********** TEST 'test-suite :: SingleSource/Regression/C/gcc-c-torture/execute/GCC-C-execute-va-arg-5.test' RESULTS **********
compile_time: 0.0000 
exec_time: 0.0006 
hash: "4bdc93c5218b83995a1982b66e8ec692" 
link_time: 0.0108 
**********
PASS: test-suite :: SingleSource/Regression/C/gcc-c-torture/execute/GCC-C-execute-va-arg-6.test (1826 of 2039)
********** TEST 'test-suite :: SingleSource/Regression/C/gcc-c-torture/execute/GCC-C-execute-va-arg-6.test' RESULTS **********
compile_time: 0.0000 
exec_time: 0.0006 
hash: "6802fd46bbc7dff4002f804f40f1bca1" 
link_time: 0.0089 
**********
PASS: test-suite :: SingleSource/Regression/C/gcc-c-torture/execute/GCC-C-execute-va-arg-9.test (1827 of 2039)
********** TEST 'test-suite :: SingleSource/Regression/C/gcc-c-torture/execute/GCC-C-execute-va-arg-9.test' RESULTS **********
compile_time: 0.0000 
exec_time: 0.0006 
hash: "ed12206c7de6e79e82be9174c15b0746" 
link_time: 0.0106 
**********
PASS: test-suite :: SingleSource/Regression/C/gcc-c-torture/execute/GCC-C-execute-va-arg-trap-1.test (1828 of 2039)
********** TEST 'test-suite :: SingleSource/Regression/C/gcc-c-torture/execute/GCC-C-execute-va-arg-trap-1.test' RESULTS **********
compile_time: 0.0000 
exec_time: 0.0006 
hash: "96167616767193d799dc51510423c9d4" 
link_time: 0.0107 
**********
PASS: test-suite :: SingleSource/Regression/C/gcc-c-torture/execute/GCC-C-execute-vfprintf-1.test (1829 of 2039)
********** TEST 'test-suite :: SingleSource/Regression/C/gcc-c-torture/execute/GCC-C-execute-vfprintf-1.test' RESULTS **********
compile_time: 0.0000 
exec_time: 0.0006 
hash: "961b694b97150335443f61b45a45eecf" 
link_time: 0.0105 
**********
PASS: test-suite :: SingleSource/Regression/C/gcc-c-torture/execute/GCC-C-execute-vla-dealloc-1.test (1830 of 2039)
********** TEST 'test-suite :: SingleSource/Regression/C/gcc-c-torture/execute/GCC-C-execute-vla-dealloc-1.test' RESULTS **********
compile_time: 0.0000 
exec_time: 0.0070 
hash: "277ee5f1e431f537018636b2ddd27cdb" 
link_time: 0.0105 
**********
PASS: test-suite :: SingleSource/Regression/C/gcc-c-torture/execute/GCC-C-execute-vprintf-1.test (1831 of 2039)
********** TEST 'test-suite :: SingleSource/Regression/C/gcc-c-torture/execute/GCC-C-execute-vprintf-1.test' RESULTS **********
compile_time: 0.0000 
exec_time: 0.0006 
hash: "a9017a01ef7b5824911be17731a13fc4" 
link_time: 0.0113 
**********
PASS: test-suite :: SingleSource/Regression/C/gcc-c-torture/execute/GCC-C-execute-vrp-1.test (1832 of 2039)
********** TEST 'test-suite :: SingleSource/Regression/C/gcc-c-torture/execute/GCC-C-execute-vrp-1.test' RESULTS **********
compile_time: 0.0000 
exec_time: 0.0006 
hash: "d4c7c3f1cebab7b627387932266030c6" 
link_time: 0.0098 
**********
PASS: test-suite :: SingleSource/Regression/C/gcc-c-torture/execute/GCC-C-execute-vrp-2.test (1833 of 2039)
********** TEST 'test-suite :: SingleSource/Regression/C/gcc-c-torture/execute/GCC-C-execute-vrp-2.test' RESULTS **********
compile_time: 0.0000 
exec_time: 0.0006 
hash: "c50cce5ed75f1cd58bf826ca876d0ed9" 
link_time: 0.0103 
**********
PASS: test-suite :: SingleSource/Regression/C/gcc-c-torture/execute/GCC-C-execute-vrp-3.test (1834 of 2039)
********** TEST 'test-suite :: SingleSource/Regression/C/gcc-c-torture/execute/GCC-C-execute-vrp-3.test' RESULTS **********
compile_time: 0.0000 
exec_time: 0.0006 
hash: "1e202f3c060766be53155e71bb0e2d1f" 
link_time: 0.0081 
**********
PASS: test-suite :: SingleSource/Regression/C/gcc-c-torture/execute/GCC-C-execute-vrp-4.test (1835 of 2039)
********** TEST 'test-suite :: SingleSource/Regression/C/gcc-c-torture/execute/GCC-C-execute-vrp-4.test' RESULTS **********
compile_time: 0.0000 
exec_time: 0.0006 
hash: "9b21ce95f74e7e4a064b74d43ca6f943" 
link_time: 0.0108 
**********
PASS: test-suite :: SingleSource/Regression/C/gcc-c-torture/execute/GCC-C-execute-vrp-5.test (1836 of 2039)
********** TEST 'test-suite :: SingleSource/Regression/C/gcc-c-torture/execute/GCC-C-execute-vrp-5.test' RESULTS **********
compile_time: 0.0000 
exec_time: 0.0006 
hash: "41d400aaf9645a1972c29802fedd7130" 
link_time: 0.0108 
**********
PASS: test-suite :: SingleSource/Regression/C/gcc-c-torture/execute/GCC-C-execute-vrp-6.test (1837 of 2039)
********** TEST 'test-suite :: SingleSource/Regression/C/gcc-c-torture/execute/GCC-C-execute-vrp-6.test' RESULTS **********
compile_time: 0.0000 
exec_time: 0.0006 
hash: "a4d1b599faae16a54adeec3840cc5996" 
link_time: 0.0106 
**********
PASS: test-suite :: SingleSource/Regression/C/gcc-c-torture/execute/GCC-C-execute-vrp-7.test (1838 of 2039)
********** TEST 'test-suite :: SingleSource/Regression/C/gcc-c-torture/execute/GCC-C-execute-vrp-7.test' RESULTS **********
compile_time: 0.0000 
exec_time: 0.0006 
hash: "b2fa4d6ec58d0100959d687642d015ee" 
link_time: 0.0083 
**********
NOEXE: test-suite :: SingleSource/Regression/C/gcc-c-torture/execute/GCC-C-execute-wchar_t-1.test (1839 of 2039)
******************** TEST 'test-suite :: SingleSource/Regression/C/gcc-c-torture/execute/GCC-C-execute-wchar_t-1.test' FAILED ********************
Executable '/Users/buildslave/jenkins/workspace/Testsuite-Tester@5/sandbox/build/SingleSource/Regression/C/gcc-c-torture/execute/GCC-C-execute-wchar_t-1' is missing
********************
PASS: test-suite :: SingleSource/Regression/C/gcc-c-torture/execute/GCC-C-execute-widechar-1.test (1840 of 2039)
********** TEST 'test-suite :: SingleSource/Regression/C/gcc-c-torture/execute/GCC-C-execute-widechar-1.test' RESULTS **********
compile_time: 0.0000 
exec_time: 0.0006 
hash: "2161f1cf98a7c266ad26b1ccf2a72af1" 
link_time: 0.0097 
**********
PASS: test-suite :: SingleSource/Regression/C/gcc-c-torture/execute/GCC-C-execute-widechar-2.test (1841 of 2039)
********** TEST 'test-suite :: SingleSource/Regression/C/gcc-c-torture/execute/GCC-C-execute-widechar-2.test' RESULTS **********
compile_time: 0.0000 
exec_time: 0.0006 
hash: "6a0f69f6bd1ead2f9df4c2750d08e472" 
link_time: 0.0104 
**********
PASS: test-suite :: SingleSource/Regression/C/gcc-c-torture/execute/GCC-C-execute-widechar-3.test (1842 of 2039)
********** TEST 'test-suite :: SingleSource/Regression/C/gcc-c-torture/execute/GCC-C-execute-widechar-3.test' RESULTS **********
compile_time: 0.0000 
exec_time: 0.0006 
hash: "0bc5ea704488c1ae98316e5e85410b1b" 
link_time: 0.0087 
**********
PASS: test-suite :: SingleSource/Regression/C/gcc-c-torture/execute/GCC-C-execute-zero-struct-1.test (1843 of 2039)
********** TEST 'test-suite :: SingleSource/Regression/C/gcc-c-torture/execute/GCC-C-execute-zero-struct-1.test' RESULTS **********
compile_time: 0.0000 
exec_time: 0.0006 
hash: "2d71719ed81eb4b8448dbca08360750e" 
link_time: 0.0102 
**********
PASS: test-suite :: SingleSource/Regression/C/gcc-c-torture/execute/GCC-C-execute-zero-struct-2.test (1844 of 2039)
********** TEST 'test-suite :: SingleSource/Regression/C/gcc-c-torture/execute/GCC-C-execute-zero-struct-2.test' RESULTS **********
compile_time: 0.0000 
exec_time: 0.0006 
hash: "3f625eb248beccd2f6aa5cb87b797478" 
link_time: 0.0081 
**********
PASS: test-suite :: SingleSource/Regression/C/gcc-c-torture/execute/GCC-C-execute-zerolen-1.test (1845 of 2039)
********** TEST 'test-suite :: SingleSource/Regression/C/gcc-c-torture/execute/GCC-C-execute-zerolen-1.test' RESULTS **********
compile_time: 0.0000 
exec_time: 0.0006 
hash: "c2bf2c6248d3052121ef2b86407ee868" 
link_time: 0.0079 
**********
PASS: test-suite :: SingleSource/Regression/C/gcc-c-torture/execute/GCC-C-execute-zerolen-2.test (1846 of 2039)
********** TEST 'test-suite :: SingleSource/Regression/C/gcc-c-torture/execute/GCC-C-execute-zerolen-2.test' RESULTS **********
compile_time: 0.0000 
exec_time: 0.0005 
hash: "e2c529fbba5d3ea80118d74aa2b5410b" 
link_time: 0.0104 
**********
PASS: test-suite :: SingleSource/Regression/C/gcc-c-torture/execute/ieee/GCC-C-execute-ieee-20000320-1.test (1847 of 2039)
********** TEST 'test-suite :: SingleSource/Regression/C/gcc-c-torture/execute/ieee/GCC-C-execute-ieee-20000320-1.test' RESULTS **********
compile_time: 0.0000 
exec_time: 0.0006 
hash: "9fc640c6c1326b94d5e89e2855d60e4b" 
link_time: 0.0106 
**********
PASS: test-suite :: SingleSource/Regression/C/gcc-c-torture/execute/ieee/GCC-C-execute-ieee-20001122-1.test (1848 of 2039)
********** TEST 'test-suite :: SingleSource/Regression/C/gcc-c-torture/execute/ieee/GCC-C-execute-ieee-20001122-1.test' RESULTS **********
compile_time: 0.0000 
exec_time: 0.0006 
hash: "44704a4f3649dd574d7adccdff3275cf" 
link_time: 0.0106 
**********
PASS: test-suite :: SingleSource/Regression/C/gcc-c-torture/execute/ieee/GCC-C-execute-ieee-20010114-2.test (1849 of 2039)
********** TEST 'test-suite :: SingleSource/Regression/C/gcc-c-torture/execute/ieee/GCC-C-execute-ieee-20010114-2.test' RESULTS **********
compile_time: 0.0000 
exec_time: 0.0005 
hash: "b4ef4c32e3c3037f0aa9f533c5f36fa5" 
link_time: 0.0105 
**********
PASS: test-suite :: SingleSource/Regression/C/gcc-c-torture/execute/ieee/GCC-C-execute-ieee-20010226-1.test (1850 of 2039)
********** TEST 'test-suite :: SingleSource/Regression/C/gcc-c-torture/execute/ieee/GCC-C-execute-ieee-20010226-1.test' RESULTS **********
compile_time: 0.0000 
exec_time: 0.0005 
hash: "aeae440b253c783547500d2c2f20f40c" 
link_time: 0.0096 
**********
PASS: test-suite :: SingleSource/Regression/C/gcc-c-torture/execute/ieee/GCC-C-execute-ieee-20011123-1.test (1851 of 2039)
********** TEST 'test-suite :: SingleSource/Regression/C/gcc-c-torture/execute/ieee/GCC-C-execute-ieee-20011123-1.test' RESULTS **********
compile_time: 0.0000 
exec_time: 0.0006 
hash: "440caf49a3bc31a5fe177a9ed6b78e41" 
link_time: 0.0100 
**********
PASS: test-suite :: SingleSource/Regression/C/gcc-c-torture/execute/ieee/GCC-C-execute-ieee-20030331-1.test (1852 of 2039)
********** TEST 'test-suite :: SingleSource/Regression/C/gcc-c-torture/execute/ieee/GCC-C-execute-ieee-20030331-1.test' RESULTS **********
compile_time: 0.0000 
exec_time: 0.0006 
hash: "6413b8ef3455131b895d336464dce16a" 
link_time: 0.0098 
**********
PASS: test-suite :: SingleSource/Regression/C/gcc-c-torture/execute/ieee/GCC-C-execute-ieee-20041213-1.test (1853 of 2039)
********** TEST 'test-suite :: SingleSource/Regression/C/gcc-c-torture/execute/ieee/GCC-C-execute-ieee-20041213-1.test' RESULTS **********
compile_time: 0.0000 
exec_time: 0.0005 
hash: "609e09f7a98e253b8a5fb997544cd080" 
link_time: 0.0101 
**********
PASS: test-suite :: SingleSource/Regression/C/gcc-c-torture/execute/ieee/GCC-C-execute-ieee-920518-1.test (1854 of 2039)
********** TEST 'test-suite :: SingleSource/Regression/C/gcc-c-torture/execute/ieee/GCC-C-execute-ieee-920518-1.test' RESULTS **********
compile_time: 0.0000 
exec_time: 0.0005 
hash: "d048a70ecec959ee7c95dea9c432990c" 
link_time: 0.0082 
**********
PASS: test-suite :: SingleSource/Regression/C/gcc-c-torture/execute/ieee/GCC-C-execute-ieee-920810-1.test (1855 of 2039)
********** TEST 'test-suite :: SingleSource/Regression/C/gcc-c-torture/execute/ieee/GCC-C-execute-ieee-920810-1.test' RESULTS **********
compile_time: 0.0000 
exec_time: 0.0006 
hash: "ed4f1bbb5a1a9bd59ce70b651d004548" 
link_time: 0.0098 
**********
PASS: test-suite :: SingleSource/Regression/C/gcc-c-torture/execute/ieee/GCC-C-execute-ieee-930529-1.test (1856 of 2039)
********** TEST 'test-suite :: SingleSource/Regression/C/gcc-c-torture/execute/ieee/GCC-C-execute-ieee-930529-1.test' RESULTS **********
compile_time: 0.0000 
exec_time: 0.0005 
hash: "541ba8581b1c148e061ef116224d3f05" 
link_time: 0.0098 
**********
PASS: test-suite :: SingleSource/Regression/C/gcc-c-torture/execute/ieee/GCC-C-execute-ieee-980619-1.test (1857 of 2039)
********** TEST 'test-suite :: SingleSource/Regression/C/gcc-c-torture/execute/ieee/GCC-C-execute-ieee-980619-1.test' RESULTS **********
compile_time: 0.0000 
exec_time: 0.0005 
hash: "970ae77490b0497097a5c66ec26000ea" 
link_time: 0.0101 
**********
PASS: test-suite :: SingleSource/Regression/C/gcc-c-torture/execute/ieee/GCC-C-execute-ieee-acc1.test (1858 of 2039)
********** TEST 'test-suite :: SingleSource/Regression/C/gcc-c-torture/execute/ieee/GCC-C-execute-ieee-acc1.test' RESULTS **********
compile_time: 0.0000 
exec_time: 0.0005 
hash: "9de43ca5e243ab59b5326cccb90aafc2" 
link_time: 0.0091 
**********
PASS: test-suite :: SingleSource/Regression/C/gcc-c-torture/execute/ieee/GCC-C-execute-ieee-acc2.test (1859 of 2039)
********** TEST 'test-suite :: SingleSource/Regression/C/gcc-c-torture/execute/ieee/GCC-C-execute-ieee-acc2.test' RESULTS **********
compile_time: 0.0000 
exec_time: 0.0005 
hash: "c1af5b3b1920568e9fdbffb3f1abec4d" 
link_time: 0.0103 
**********
NOEXE: test-suite :: SingleSource/Regression/C/gcc-c-torture/execute/ieee/GCC-C-execute-ieee-builtin-nan-1.test (1860 of 2039)
******************** TEST 'test-suite :: SingleSource/Regression/C/gcc-c-torture/execute/ieee/GCC-C-execute-ieee-builtin-nan-1.test' FAILED ********************
Executable '/Users/buildslave/jenkins/workspace/Testsuite-Tester@5/sandbox/build/SingleSource/Regression/C/gcc-c-torture/execute/ieee/GCC-C-execute-ieee-builtin-nan-1' is missing
********************
PASS: test-suite :: SingleSource/Regression/C/gcc-c-torture/execute/ieee/GCC-C-execute-ieee-compare-fp-1.test (1861 of 2039)
********** TEST 'test-suite :: SingleSource/Regression/C/gcc-c-torture/execute/ieee/GCC-C-execute-ieee-compare-fp-1.test' RESULTS **********
compile_time: 0.0000 
exec_time: 0.0005 
hash: "287b64d04987ae3bf5f0905274649a9c" 
link_time: 0.0100 
**********
PASS: test-suite :: SingleSource/Regression/C/gcc-c-torture/execute/ieee/GCC-C-execute-ieee-compare-fp-2.test (1862 of 2039)
********** TEST 'test-suite :: SingleSource/Regression/C/gcc-c-torture/execute/ieee/GCC-C-execute-ieee-compare-fp-2.test' RESULTS **********
compile_time: 0.0000 
exec_time: 0.0005 
hash: "f960b240ff293ba4b5f6f6c189e4ac3f" 
link_time: 0.0085 
**********
PASS: test-suite :: SingleSource/Regression/C/gcc-c-torture/execute/ieee/GCC-C-execute-ieee-compare-fp-3.test (1863 of 2039)
********** TEST 'test-suite :: SingleSource/Regression/C/gcc-c-torture/execute/ieee/GCC-C-execute-ieee-compare-fp-3.test' RESULTS **********
compile_time: 0.0000 
exec_time: 0.0005 
hash: "a9e81051cf7808f224788f63dc1c654d" 
link_time: 0.0102 
**********
PASS: test-suite :: SingleSource/Regression/C/gcc-c-torture/execute/ieee/GCC-C-execute-ieee-compare-fp-4.test (1864 of 2039)
********** TEST 'test-suite :: SingleSource/Regression/C/gcc-c-torture/execute/ieee/GCC-C-execute-ieee-compare-fp-4.test' RESULTS **********
compile_time: 0.0000 
exec_time: 0.0005 
hash: "8880c333be97b546769056d92b7b6357" 
link_time: 0.0107 
**********
PASS: test-suite :: SingleSource/Regression/C/gcc-c-torture/execute/ieee/GCC-C-execute-ieee-copysign1.test (1865 of 2039)
********** TEST 'test-suite :: SingleSource/Regression/C/gcc-c-torture/execute/ieee/GCC-C-execute-ieee-copysign1.test' RESULTS **********
compile_time: 0.0000 
exec_time: 0.0005 
hash: "7baff78e6c340c5d2149ff1c859e39d2" 
link_time: 0.0104 
**********
PASS: test-suite :: SingleSource/Regression/C/gcc-c-torture/execute/ieee/GCC-C-execute-ieee-copysign2.test (1866 of 2039)
********** TEST 'test-suite :: SingleSource/Regression/C/gcc-c-torture/execute/ieee/GCC-C-execute-ieee-copysign2.test' RESULTS **********
compile_time: 0.0000 
exec_time: 0.0006 
hash: "d9203d9c6243b0ff00dc89cddee702bc" 
link_time: 0.0085 
**********
PASS: test-suite :: SingleSource/Regression/C/gcc-c-torture/execute/ieee/GCC-C-execute-ieee-fp-cmp-1.test (1867 of 2039)
********** TEST 'test-suite :: SingleSource/Regression/C/gcc-c-torture/execute/ieee/GCC-C-execute-ieee-fp-cmp-1.test' RESULTS **********
compile_time: 0.0000 
exec_time: 0.0005 
hash: "5ebe0e23a15f8a7fcbc94e4cd15f8e73" 
link_time: 0.0100 
**********
PASS: test-suite :: SingleSource/Regression/C/gcc-c-torture/execute/ieee/GCC-C-execute-ieee-fp-cmp-2.test (1868 of 2039)
********** TEST 'test-suite :: SingleSource/Regression/C/gcc-c-torture/execute/ieee/GCC-C-execute-ieee-fp-cmp-2.test' RESULTS **********
compile_time: 0.0000 
exec_time: 0.0005 
hash: "f43b1802f1b49ade71c25813bc8b0a07" 
link_time: 0.0100 
**********
PASS: test-suite :: SingleSource/Regression/C/gcc-c-torture/execute/ieee/GCC-C-execute-ieee-fp-cmp-3.test (1869 of 2039)
********** TEST 'test-suite :: SingleSource/Regression/C/gcc-c-torture/execute/ieee/GCC-C-execute-ieee-fp-cmp-3.test' RESULTS **********
compile_time: 0.0000 
exec_time: 0.0005 
hash: "cf3b0f1a1d67c36c28726bf79f92c677" 
link_time: 0.0101 
**********
PASS: test-suite :: SingleSource/Regression/C/gcc-c-torture/execute/ieee/GCC-C-execute-ieee-fp-cmp-4.test (1870 of 2039)
********** TEST 'test-suite :: SingleSource/Regression/C/gcc-c-torture/execute/ieee/GCC-C-execute-ieee-fp-cmp-4.test' RESULTS **********
compile_time: 0.0000 
exec_time: 0.0005 
hash: "f413984671e7a823ed7a70acddfe243b" 
link_time: 0.0101 
**********
PASS: test-suite :: SingleSource/Regression/C/gcc-c-torture/execute/ieee/GCC-C-execute-ieee-fp-cmp-4e.test (1871 of 2039)
********** TEST 'test-suite :: SingleSource/Regression/C/gcc-c-torture/execute/ieee/GCC-C-execute-ieee-fp-cmp-4e.test' RESULTS **********
compile_time: 0.0000 
exec_time: 0.0005 
hash: "89b7b85214251e5d32c3b5b32f8fb783" 
link_time: 0.0087 
**********
PASS: test-suite :: SingleSource/Regression/C/gcc-c-torture/execute/ieee/GCC-C-execute-ieee-fp-cmp-4f.test (1872 of 2039)
********** TEST 'test-suite :: SingleSource/Regression/C/gcc-c-torture/execute/ieee/GCC-C-execute-ieee-fp-cmp-4f.test' RESULTS **********
compile_time: 0.0000 
exec_time: 0.0005 
hash: "2fb487fff8ef6399ca389e9d8e633248" 
link_time: 0.0097 
**********
PASS: test-suite :: SingleSource/Regression/C/gcc-c-torture/execute/ieee/GCC-C-execute-ieee-fp-cmp-4l.test (1873 of 2039)
********** TEST 'test-suite :: SingleSource/Regression/C/gcc-c-torture/execute/ieee/GCC-C-execute-ieee-fp-cmp-4l.test' RESULTS **********
compile_time: 0.0000 
exec_time: 0.0005 
hash: "86c5af4b1d2914d2e97d851c35ca051c" 
link_time: 0.0097 
**********
PASS: test-suite :: SingleSource/Regression/C/gcc-c-torture/execute/ieee/GCC-C-execute-ieee-fp-cmp-5.test (1874 of 2039)
********** TEST 'test-suite :: SingleSource/Regression/C/gcc-c-torture/execute/ieee/GCC-C-execute-ieee-fp-cmp-5.test' RESULTS **********
compile_time: 0.0000 
exec_time: 0.0005 
hash: "e12bacdf604d17cb2006df8c861aa91f" 
link_time: 0.0095 
**********
PASS: test-suite :: SingleSource/Regression/C/gcc-c-torture/execute/ieee/GCC-C-execute-ieee-fp-cmp-6.test (1875 of 2039)
********** TEST 'test-suite :: SingleSource/Regression/C/gcc-c-torture/execute/ieee/GCC-C-execute-ieee-fp-cmp-6.test' RESULTS **********
compile_time: 0.0000 
exec_time: 0.0005 
hash: "d1efd4aebaab82fff854da93dd2ebf99" 
link_time: 0.0099 
**********
PASS: test-suite :: SingleSource/Regression/C/gcc-c-torture/execute/ieee/GCC-C-execute-ieee-fp-cmp-8.test (1876 of 2039)
********** TEST 'test-suite :: SingleSource/Regression/C/gcc-c-torture/execute/ieee/GCC-C-execute-ieee-fp-cmp-8.test' RESULTS **********
compile_time: 0.0000 
exec_time: 0.0006 
hash: "6c318e4fe293448bd65422e8b224cf92" 
link_time: 0.0100 
**********
PASS: test-suite :: SingleSource/Regression/C/gcc-c-torture/execute/ieee/GCC-C-execute-ieee-fp-cmp-8e.test (1877 of 2039)
********** TEST 'test-suite :: SingleSource/Regression/C/gcc-c-torture/execute/ieee/GCC-C-execute-ieee-fp-cmp-8e.test' RESULTS **********
compile_time: 0.0000 
exec_time: 0.0005 
hash: "769b8924fc2610358314e30926731db6" 
link_time: 0.0095 
**********
PASS: test-suite :: SingleSource/Regression/C/gcc-c-torture/execute/ieee/GCC-C-execute-ieee-fp-cmp-8f.test (1878 of 2039)
********** TEST 'test-suite :: SingleSource/Regression/C/gcc-c-torture/execute/ieee/GCC-C-execute-ieee-fp-cmp-8f.test' RESULTS **********
compile_time: 0.0000 
exec_time: 0.0005 
hash: "352b158cd6c1d4ee79b34d97a4c5dca4" 
link_time: 0.0103 
**********
PASS: test-suite :: SingleSource/Regression/C/gcc-c-torture/execute/ieee/GCC-C-execute-ieee-fp-cmp-8l.test (1879 of 2039)
********** TEST 'test-suite :: SingleSource/Regression/C/gcc-c-torture/execute/ieee/GCC-C-execute-ieee-fp-cmp-8l.test' RESULTS **********
compile_time: 0.0000 
exec_time: 0.0005 
hash: "d26e6fc707fac515b0138e030f476b14" 
link_time: 0.0099 
**********
PASS: test-suite :: SingleSource/Regression/C/gcc-c-torture/execute/ieee/GCC-C-execute-ieee-hugeval.test (1880 of 2039)
********** TEST 'test-suite :: SingleSource/Regression/C/gcc-c-torture/execute/ieee/GCC-C-execute-ieee-hugeval.test' RESULTS **********
compile_time: 0.0000 
exec_time: 0.0005 
hash: "2429495edc0dfba8b532164ac4e16a42" 
link_time: 0.0099 
**********
PASS: test-suite :: SingleSource/Regression/C/gcc-c-torture/execute/ieee/GCC-C-execute-ieee-inf-1.test (1881 of 2039)
********** TEST 'test-suite :: SingleSource/Regression/C/gcc-c-torture/execute/ieee/GCC-C-execute-ieee-inf-1.test' RESULTS **********
compile_time: 0.0000 
exec_time: 0.0005 
hash: "6e498b82afb0ca9c00588c00e2b98357" 
link_time: 0.0080 
**********
PASS: test-suite :: SingleSource/Regression/C/gcc-c-torture/execute/ieee/GCC-C-execute-ieee-inf-2.test (1882 of 2039)
********** TEST 'test-suite :: SingleSource/Regression/C/gcc-c-torture/execute/ieee/GCC-C-execute-ieee-inf-2.test' RESULTS **********
compile_time: 0.0000 
exec_time: 0.0005 
hash: "478bc9842cab2d77d9ab76b6da498973" 
link_time: 0.0100 
**********
PASS: test-suite :: SingleSource/Regression/C/gcc-c-torture/execute/ieee/GCC-C-execute-ieee-inf-3.test (1883 of 2039)
********** TEST 'test-suite :: SingleSource/Regression/C/gcc-c-torture/execute/ieee/GCC-C-execute-ieee-inf-3.test' RESULTS **********
compile_time: 0.0000 
exec_time: 0.0005 
hash: "2a85308996d00eef5e0907d148643251" 
link_time: 0.0100 
**********
PASS: test-suite :: SingleSource/Regression/C/gcc-c-torture/execute/ieee/GCC-C-execute-ieee-minuszero.test (1884 of 2039)
********** TEST 'test-suite :: SingleSource/Regression/C/gcc-c-torture/execute/ieee/GCC-C-execute-ieee-minuszero.test' RESULTS **********
compile_time: 0.0000 
exec_time: 0.0005 
hash: "f3b092f470ac61f29523cf6657f76ca4" 
link_time: 0.0106 
**********
PASS: test-suite :: SingleSource/Regression/C/gcc-c-torture/execute/ieee/GCC-C-execute-ieee-mul-subnormal-single-1.test (1885 of 2039)
********** TEST 'test-suite :: SingleSource/Regression/C/gcc-c-torture/execute/ieee/GCC-C-execute-ieee-mul-subnormal-single-1.test' RESULTS **********
compile_time: 0.0000 
exec_time: 0.0005 
hash: "b7fcea919ffeadff183ae1f3483ead20" 
link_time: 0.0099 
**********
PASS: test-suite :: SingleSource/Regression/C/gcc-c-torture/execute/ieee/GCC-C-execute-ieee-mzero2.test (1886 of 2039)
********** TEST 'test-suite :: SingleSource/Regression/C/gcc-c-torture/execute/ieee/GCC-C-execute-ieee-mzero2.test' RESULTS **********
compile_time: 0.0000 
exec_time: 0.0006 
hash: "a505adc150ac100dd11c479e2c1c2d9d" 
link_time: 0.0081 
**********
PASS: test-suite :: SingleSource/Regression/C/gcc-c-torture/execute/ieee/GCC-C-execute-ieee-mzero3.test (1887 of 2039)
********** TEST 'test-suite :: SingleSource/Regression/C/gcc-c-torture/execute/ieee/GCC-C-execute-ieee-mzero3.test' RESULTS **********
compile_time: 0.0000 
exec_time: 0.0005 
hash: "3e038bad8810bd949daf6efee5c15657" 
link_time: 0.0096 
**********
PASS: test-suite :: SingleSource/Regression/C/gcc-c-torture/execute/ieee/GCC-C-execute-ieee-mzero4.test (1888 of 2039)
********** TEST 'test-suite :: SingleSource/Regression/C/gcc-c-torture/execute/ieee/GCC-C-execute-ieee-mzero4.test' RESULTS **********
compile_time: 0.0000 
exec_time: 0.0006 
hash: "3fed46da6135ea6ab896e91b125dd120" 
link_time: 0.0083 
**********
PASS: test-suite :: SingleSource/Regression/C/gcc-c-torture/execute/ieee/GCC-C-execute-ieee-mzero5.test (1889 of 2039)
********** TEST 'test-suite :: SingleSource/Regression/C/gcc-c-torture/execute/ieee/GCC-C-execute-ieee-mzero5.test' RESULTS **********
compile_time: 0.0000 
exec_time: 0.0005 
hash: "2b6a5e9314e20c9a9bf98227c2903dbc" 
link_time: 0.0095 
**********
PASS: test-suite :: SingleSource/Regression/C/gcc-c-torture/execute/ieee/GCC-C-execute-ieee-mzero6.test (1890 of 2039)
********** TEST 'test-suite :: SingleSource/Regression/C/gcc-c-torture/execute/ieee/GCC-C-execute-ieee-mzero6.test' RESULTS **********
compile_time: 0.0000 
exec_time: 0.0005 
hash: "4fe6f22cedae6368711e2597a1bfd284" 
link_time: 0.0107 
**********
PASS: test-suite :: SingleSource/Regression/C/gcc-c-torture/execute/ieee/GCC-C-execute-ieee-pr28634.test (1891 of 2039)
********** TEST 'test-suite :: SingleSource/Regression/C/gcc-c-torture/execute/ieee/GCC-C-execute-ieee-pr28634.test' RESULTS **********
compile_time: 0.0000 
exec_time: 0.0005 
hash: "b2bb74943aaa6d5e7a320eb14b232e47" 
link_time: 0.0080 
**********
PASS: test-suite :: SingleSource/Regression/C/gcc-c-torture/execute/ieee/GCC-C-execute-ieee-pr29302-1.test (1892 of 2039)
********** TEST 'test-suite :: SingleSource/Regression/C/gcc-c-torture/execute/ieee/GCC-C-execute-ieee-pr29302-1.test' RESULTS **********
compile_time: 0.0000 
exec_time: 0.0005 
hash: "355388f70c6957ff6249e848b87721cd" 
link_time: 0.0094 
**********
PASS: test-suite :: SingleSource/Regression/C/gcc-c-torture/execute/ieee/GCC-C-execute-ieee-pr30704.test (1893 of 2039)
********** TEST 'test-suite :: SingleSource/Regression/C/gcc-c-torture/execute/ieee/GCC-C-execute-ieee-pr30704.test' RESULTS **********
compile_time: 0.0000 
exec_time: 0.0005 
hash: "1291bb9b2bc4a92e397fcd2ad99d284e" 
link_time: 0.0094 
**********
PASS: test-suite :: SingleSource/Regression/C/gcc-c-torture/execute/ieee/GCC-C-execute-ieee-pr36332.test (1894 of 2039)
********** TEST 'test-suite :: SingleSource/Regression/C/gcc-c-torture/execute/ieee/GCC-C-execute-ieee-pr36332.test' RESULTS **********
compile_time: 0.0000 
exec_time: 0.0005 
hash: "c0504b9195c77c216ed85385ed4833f7" 
link_time: 0.0092 
**********
PASS: test-suite :: SingleSource/Regression/C/gcc-c-torture/execute/ieee/GCC-C-execute-ieee-pr38016.test (1895 of 2039)
********** TEST 'test-suite :: SingleSource/Regression/C/gcc-c-torture/execute/ieee/GCC-C-execute-ieee-pr38016.test' RESULTS **********
compile_time: 0.0000 
exec_time: 0.0006 
hash: "87c4faac2c020f476c0a4066f9ebc941" 
link_time: 0.0102 
**********
PASS: test-suite :: SingleSource/Regression/C/gcc-c-torture/execute/ieee/GCC-C-execute-ieee-pr50310.test (1896 of 2039)
********** TEST 'test-suite :: SingleSource/Regression/C/gcc-c-torture/execute/ieee/GCC-C-execute-ieee-pr50310.test' RESULTS **********
compile_time: 0.0000 
exec_time: 0.0005 
hash: "b69acfab8474519f74bb52418a4b6617" 
link_time: 0.0087 
**********
PASS: test-suite :: SingleSource/Regression/C/gcc-c-torture/execute/ieee/GCC-C-execute-ieee-pr67218.test (1897 of 2039)
********** TEST 'test-suite :: SingleSource/Regression/C/gcc-c-torture/execute/ieee/GCC-C-execute-ieee-pr67218.test' RESULTS **********
compile_time: 0.0000 
exec_time: 0.0005 
hash: "08355aed1e8e68e6b6ce73420a7e0445" 
link_time: 0.0099 
**********
PASS: test-suite :: SingleSource/Regression/C/gcc-c-torture/execute/ieee/GCC-C-execute-ieee-pr72824-2.test (1898 of 2039)
********** TEST 'test-suite :: SingleSource/Regression/C/gcc-c-torture/execute/ieee/GCC-C-execute-ieee-pr72824-2.test' RESULTS **********
compile_time: 0.0000 
exec_time: 0.0005 
hash: "adb608bfc07c952116c46f443dd77beb" 
link_time: 0.0099 
**********
PASS: test-suite :: SingleSource/Regression/C/gcc-c-torture/execute/ieee/GCC-C-execute-ieee-pr72824.test (1899 of 2039)
********** TEST 'test-suite :: SingleSource/Regression/C/gcc-c-torture/execute/ieee/GCC-C-execute-ieee-pr72824.test' RESULTS **********
compile_time: 0.0000 
exec_time: 0.0005 
hash: "1095acc98ba5837f25d0cf98d454a3b0" 
link_time: 0.0090 
**********
PASS: test-suite :: SingleSource/Regression/C/gcc-c-torture/execute/ieee/GCC-C-execute-ieee-pr84235.test (1900 of 2039)
********** TEST 'test-suite :: SingleSource/Regression/C/gcc-c-torture/execute/ieee/GCC-C-execute-ieee-pr84235.test' RESULTS **********
compile_time: 0.0000 
exec_time: 0.0006 
hash: "d36bcd66df2b65adb4d0808351d5a8e8" 
link_time: 0.0101 
**********
PASS: test-suite :: SingleSource/Regression/C/gcc-c-torture/execute/ieee/GCC-C-execute-ieee-rbug.test (1901 of 2039)
********** TEST 'test-suite :: SingleSource/Regression/C/gcc-c-torture/execute/ieee/GCC-C-execute-ieee-rbug.test' RESULTS **********
compile_time: 0.0000 
exec_time: 0.0005 
hash: "0661c889433a0d3b127040d0d0d2ae56" 
link_time: 0.0105 
**********
PASS: test-suite :: SingleSource/Regression/C/gcc-c-torture/execute/ieee/GCC-C-execute-ieee-unsafe-fp-assoc-1.test (1902 of 2039)
********** TEST 'test-suite :: SingleSource/Regression/C/gcc-c-torture/execute/ieee/GCC-C-execute-ieee-unsafe-fp-assoc-1.test' RESULTS **********
compile_time: 0.0000 
exec_time: 0.0005 
hash: "7ad306b12b7b951abc332915afe6e082" 
link_time: 0.0102 
**********
PASS: test-suite :: SingleSource/Regression/C/gcc-c-torture/execute/ieee/GCC-C-execute-ieee-unsafe-fp-assoc.test (1903 of 2039)
********** TEST 'test-suite :: SingleSource/Regression/C/gcc-c-torture/execute/ieee/GCC-C-execute-ieee-unsafe-fp-assoc.test' RESULTS **********
compile_time: 0.0000 
exec_time: 0.0005 
hash: "e53d0abc010f28faefe7a07e309003db" 
link_time: 0.0096 
**********
PASS: test-suite :: SingleSource/UnitTests/2002-04-17-PrintfChar.test (1904 of 2039)
********** TEST 'test-suite :: SingleSource/UnitTests/2002-04-17-PrintfChar.test' RESULTS **********
compile_time: 0.0070 
exec_time: 0.0006 
hash: "560217752850da25c7d7b89aa43d13ec" 
link_time: 0.0120 
**********
PASS: test-suite :: SingleSource/UnitTests/2002-05-02-ArgumentTest.test (1905 of 2039)
********** TEST 'test-suite :: SingleSource/UnitTests/2002-05-02-ArgumentTest.test' RESULTS **********
compile_time: 0.0074 
exec_time: 0.0006 
hash: "e0db7b8e622f90f907926eceb87dfb34" 
link_time: 0.0128 
**********
PASS: test-suite :: SingleSource/UnitTests/2002-05-02-CastTest.test (1906 of 2039)
********** TEST 'test-suite :: SingleSource/UnitTests/2002-05-02-CastTest.test' RESULTS **********
compile_time: 0.0160 
exec_time: 0.0006 
hash: "afd6f0a2b429d6bf5fd0ec353cbb80fb" 
link_time: 0.0105 
**********
PASS: test-suite :: SingleSource/UnitTests/2002-05-02-CastTest1.test (1907 of 2039)
********** TEST 'test-suite :: SingleSource/UnitTests/2002-05-02-CastTest1.test' RESULTS **********
compile_time: 0.0067 
exec_time: 0.0006 
hash: "3d1571a27e95c80bbdebf8011f4f97f5" 
link_time: 0.0106 
**********
PASS: test-suite :: SingleSource/UnitTests/2002-05-02-CastTest2.test (1908 of 2039)
********** TEST 'test-suite :: SingleSource/UnitTests/2002-05-02-CastTest2.test' RESULTS **********
compile_time: 0.0143 
exec_time: 0.0006 
hash: "7e9e0aba380a29b1be180f6414090977" 
link_time: 0.0120 
**********
PASS: test-suite :: SingleSource/UnitTests/2002-05-02-CastTest3.test (1909 of 2039)
********** TEST 'test-suite :: SingleSource/UnitTests/2002-05-02-CastTest3.test' RESULTS **********
compile_time: 0.0070 
exec_time: 0.0006 
hash: "d6aa1301e5732347fca937176a26e2f0" 
link_time: 0.0109 
**********
PASS: test-suite :: SingleSource/UnitTests/2002-05-02-ManyArguments.test (1910 of 2039)
********** TEST 'test-suite :: SingleSource/UnitTests/2002-05-02-ManyArguments.test' RESULTS **********
compile_time: 0.0128 
exec_time: 0.0006 
hash: "5754550f9052cf0578a0f2f49c95b273" 
link_time: 0.0101 
**********
PASS: test-suite :: SingleSource/UnitTests/2002-05-03-NotTest.test (1911 of 2039)
********** TEST 'test-suite :: SingleSource/UnitTests/2002-05-03-NotTest.test' RESULTS **********
compile_time: 0.0130 
exec_time: 0.0006 
hash: "201d17f560c38cb54560cad7e9cfe575" 
link_time: 0.0118 
**********
PASS: test-suite :: SingleSource/UnitTests/2002-05-19-DivTest.test (1912 of 2039)
********** TEST 'test-suite :: SingleSource/UnitTests/2002-05-19-DivTest.test' RESULTS **********
compile_time: 0.0100 
exec_time: 0.0006 
hash: "0c4a61aab2a62c2b3244340e0f41780c" 
link_time: 0.0109 
**********
PASS: test-suite :: SingleSource/UnitTests/2002-08-02-CastTest.test (1913 of 2039)
********** TEST 'test-suite :: SingleSource/UnitTests/2002-08-02-CastTest.test' RESULTS **********
compile_time: 0.0095 
exec_time: 0.0006 
hash: "37438b34948e2bfbebdd46b665b072ef" 
link_time: 0.0117 
**********
PASS: test-suite :: SingleSource/UnitTests/2002-08-02-CastTest2.test (1914 of 2039)
********** TEST 'test-suite :: SingleSource/UnitTests/2002-08-02-CastTest2.test' RESULTS **********
compile_time: 0.0074 
exec_time: 0.0006 
hash: "841aa9a7d5be886306877c450226ecae" 
link_time: 0.0100 
**********
PASS: test-suite :: SingleSource/UnitTests/2002-08-19-CodegenBug.test (1915 of 2039)
********** TEST 'test-suite :: SingleSource/UnitTests/2002-08-19-CodegenBug.test' RESULTS **********
compile_time: 0.0142 
exec_time: 0.0006 
hash: "abf92ca6f15dedfc908c70172f57a2f0" 
link_time: 0.0128 
**********
PASS: test-suite :: SingleSource/UnitTests/2002-10-09-ArrayResolution.test (1916 of 2039)
********** TEST 'test-suite :: SingleSource/UnitTests/2002-10-09-ArrayResolution.test' RESULTS **********
compile_time: 0.0115 
exec_time: 0.0006 
hash: "35fd342b3ced88b7aa0fd55e7e3255ce" 
link_time: 0.0117 
**********
PASS: test-suite :: SingleSource/UnitTests/2002-10-12-StructureArgs.test (1917 of 2039)
********** TEST 'test-suite :: SingleSource/UnitTests/2002-10-12-StructureArgs.test' RESULTS **********
compile_time: 0.0104 
exec_time: 0.0006 
hash: "e31a87f3d86d715ba6e22bdbe87451dc" 
link_time: 0.0113 
**********
PASS: test-suite :: SingleSource/UnitTests/2002-10-12-StructureArgsSimple.test (1918 of 2039)
********** TEST 'test-suite :: SingleSource/UnitTests/2002-10-12-StructureArgsSimple.test' RESULTS **********
compile_time: 0.0090 
exec_time: 0.0006 
hash: "d0a427b64923a94f2427dd2ee31407ba" 
link_time: 0.0095 
**********
PASS: test-suite :: SingleSource/UnitTests/2002-10-13-BadLoad.test (1919 of 2039)
********** TEST 'test-suite :: SingleSource/UnitTests/2002-10-13-BadLoad.test' RESULTS **********
compile_time: 0.0066 
exec_time: 0.0006 
hash: "09235e22a5d98fb939518836f033dfa9" 
link_time: 0.0102 
**********
PASS: test-suite :: SingleSource/UnitTests/2002-12-13-MishaTest.test (1920 of 2039)
********** TEST 'test-suite :: SingleSource/UnitTests/2002-12-13-MishaTest.test' RESULTS **********
compile_time: 0.0115 
exec_time: 0.0006 
hash: "7a4cadabb9796189f466f782617b01c6" 
link_time: 0.0112 
**********
PASS: test-suite :: SingleSource/UnitTests/2003-04-22-Switch.test (1921 of 2039)
********** TEST 'test-suite :: SingleSource/UnitTests/2003-04-22-Switch.test' RESULTS **********
compile_time: 0.0097 
exec_time: 0.0006 
hash: "d3a89f083a264989aaa11c3878c67367" 
link_time: 0.0088 
**********
PASS: test-suite :: SingleSource/UnitTests/2003-05-02-DependentPHI.test (1922 of 2039)
********** TEST 'test-suite :: SingleSource/UnitTests/2003-05-02-DependentPHI.test' RESULTS **********
compile_time: 0.0123 
exec_time: 0.0006 
hash: "7f06345a65e2222071482876cd7accf1" 
link_time: 0.0095 
**********
PASS: test-suite :: SingleSource/UnitTests/2003-05-07-VarArgs.test (1923 of 2039)
********** TEST 'test-suite :: SingleSource/UnitTests/2003-05-07-VarArgs.test' RESULTS **********
compile_time: 0.0149 
exec_time: 0.0006 
hash: "acae5a778bb80db621bb509b65b3c7df" 
link_time: 0.0113 
**********
PASS: test-suite :: SingleSource/UnitTests/2003-05-12-MinIntProblem.test (1924 of 2039)
********** TEST 'test-suite :: SingleSource/UnitTests/2003-05-12-MinIntProblem.test' RESULTS **********
compile_time: 0.0120 
exec_time: 0.0006 
hash: "70283f03545c54c7c4ac2a4c2c5d8317" 
link_time: 0.0124 
**********
PASS: test-suite :: SingleSource/UnitTests/2003-05-14-AtExit.test (1925 of 2039)
********** TEST 'test-suite :: SingleSource/UnitTests/2003-05-14-AtExit.test' RESULTS **********
compile_time: 0.0135 
exec_time: 0.0006 
hash: "b2de80755ced2bc5827649e6d5c7d7a1" 
link_time: 0.0103 
**********
PASS: test-suite :: SingleSource/UnitTests/2003-05-26-Shorts.test (1926 of 2039)
********** TEST 'test-suite :: SingleSource/UnitTests/2003-05-26-Shorts.test' RESULTS **********
compile_time: 0.0137 
exec_time: 0.0006 
hash: "db7e7f160381bb5d6b958aefe2709587" 
link_time: 0.0108 
**********
PASS: test-suite :: SingleSource/UnitTests/2003-05-31-CastToBool.test (1927 of 2039)
********** TEST 'test-suite :: SingleSource/UnitTests/2003-05-31-CastToBool.test' RESULTS **********
compile_time: 0.0130 
exec_time: 0.0006 
hash: "de465937ced0c6d404461f96eb6a92b8" 
link_time: 0.0117 
**********
PASS: test-suite :: SingleSource/UnitTests/2003-05-31-LongShifts.test (1928 of 2039)
********** TEST 'test-suite :: SingleSource/UnitTests/2003-05-31-LongShifts.test' RESULTS **********
compile_time: 0.0069 
exec_time: 0.0006 
hash: "43f72c7d09437af5a3158edc823aeccf" 
link_time: 0.0112 
**********
PASS: test-suite :: SingleSource/UnitTests/2003-07-06-IntOverflow.test (1929 of 2039)
********** TEST 'test-suite :: SingleSource/UnitTests/2003-07-06-IntOverflow.test' RESULTS **********
compile_time: 0.0136 
exec_time: 0.0006 
hash: "014be5f73f12c132192cf9d43e07c7cc" 
link_time: 0.0126 
**********
PASS: test-suite :: SingleSource/UnitTests/2003-07-08-BitOpsTest.test (1930 of 2039)
********** TEST 'test-suite :: SingleSource/UnitTests/2003-07-08-BitOpsTest.test' RESULTS **********
compile_time: 0.0097 
exec_time: 0.0006 
hash: "f55b65b5d23f74aff97050d281f18417" 
link_time: 0.0116 
**********
PASS: test-suite :: SingleSource/UnitTests/2003-07-09-LoadShorts.test (1931 of 2039)
********** TEST 'test-suite :: SingleSource/UnitTests/2003-07-09-LoadShorts.test' RESULTS **********
compile_time: 0.0152 
exec_time: 0.0006 
hash: "9a7ae939b08f61c63be0b5af64f2493e" 
link_time: 0.0120 
**********
PASS: test-suite :: SingleSource/UnitTests/2003-07-09-SignedArgs.test (1932 of 2039)
********** TEST 'test-suite :: SingleSource/UnitTests/2003-07-09-SignedArgs.test' RESULTS **********
compile_time: 0.0121 
exec_time: 0.0006 
hash: "dcfd4969a3340ad3ca7b13e8bfee3265" 
link_time: 0.0108 
**********
PASS: test-suite :: SingleSource/UnitTests/2003-07-10-SignConversions.test (1933 of 2039)
********** TEST 'test-suite :: SingleSource/UnitTests/2003-07-10-SignConversions.test' RESULTS **********
compile_time: 0.0113 
exec_time: 0.0006 
hash: "8883f446dac9aafabffcf8e7784771cd" 
link_time: 0.0115 
**********
PASS: test-suite :: SingleSource/UnitTests/2003-08-05-CastFPToUint.test (1934 of 2039)
********** TEST 'test-suite :: SingleSource/UnitTests/2003-08-05-CastFPToUint.test' RESULTS **********
compile_time: 0.0150 
exec_time: 0.0006 
hash: "7c3046be5747d4d63dc107e34193c20e" 
link_time: 0.0098 
**********
PASS: test-suite :: SingleSource/UnitTests/2003-08-11-VaListArg.test (1935 of 2039)
********** TEST 'test-suite :: SingleSource/UnitTests/2003-08-11-VaListArg.test' RESULTS **********
compile_time: 0.0141 
exec_time: 0.0006 
hash: "0ec690a9cb3968130818563a7f7ec40c" 
link_time: 0.0116 
**********
PASS: test-suite :: SingleSource/UnitTests/2003-08-20-FoldBug.test (1936 of 2039)
********** TEST 'test-suite :: SingleSource/UnitTests/2003-08-20-FoldBug.test' RESULTS **********
compile_time: 0.0092 
exec_time: 0.0006 
hash: "c60e9c1c61e3b1e4eb688794efee5ab5" 
link_time: 0.0119 
**********
PASS: test-suite :: SingleSource/UnitTests/2003-09-18-BitFieldTest.test (1937 of 2039)
********** TEST 'test-suite :: SingleSource/UnitTests/2003-09-18-BitFieldTest.test' RESULTS **********
compile_time: 0.0117 
exec_time: 0.0006 
hash: "dfb037484a506901344fdaecd4c96c27" 
link_time: 0.0109 
**********
PASS: test-suite :: SingleSource/UnitTests/2003-10-13-SwitchTest.test (1938 of 2039)
********** TEST 'test-suite :: SingleSource/UnitTests/2003-10-13-SwitchTest.test' RESULTS **********
compile_time: 0.0098 
exec_time: 0.0006 
hash: "fdeac857f6627773f39cf1c213eef1a9" 
link_time: 0.0120 
**********
PASS: test-suite :: SingleSource/UnitTests/2003-10-29-ScalarReplBug.test (1939 of 2039)
********** TEST 'test-suite :: SingleSource/UnitTests/2003-10-29-ScalarReplBug.test' RESULTS **********
compile_time: 0.0118 
exec_time: 0.0006 
hash: "4c12d473773ce3b92444ea7d49aadeba" 
link_time: 0.0108 
**********
PASS: test-suite :: SingleSource/UnitTests/2004-02-02-NegativeZero.test (1940 of 2039)
********** TEST 'test-suite :: SingleSource/UnitTests/2004-02-02-NegativeZero.test' RESULTS **********
compile_time: 0.0058 
exec_time: 0.0006 
hash: "45585c0858885c1eb089ba67c9a7e4af" 
link_time: 0.0117 
**********
PASS: test-suite :: SingleSource/UnitTests/2004-06-20-StaticBitfieldInit.test (1941 of 2039)
********** TEST 'test-suite :: SingleSource/UnitTests/2004-06-20-StaticBitfieldInit.test' RESULTS **********
compile_time: 0.0108 
exec_time: 0.0006 
hash: "e624739cf50e582e3466503d54a09933" 
link_time: 0.0098 
**********
PASS: test-suite :: SingleSource/UnitTests/2004-11-28-GlobalBoolLayout.test (1942 of 2039)
********** TEST 'test-suite :: SingleSource/UnitTests/2004-11-28-GlobalBoolLayout.test' RESULTS **********
compile_time: 0.0155 
exec_time: 0.0006 
hash: "8545fba3f6cc05fa8685f471bdf55ac2" 
link_time: 0.0123 
**********
PASS: test-suite :: SingleSource/UnitTests/2005-05-11-Popcount-ffs-fls.test (1943 of 2039)
********** TEST 'test-suite :: SingleSource/UnitTests/2005-05-11-Popcount-ffs-fls.test' RESULTS **********
compile_time: 0.0159 
exec_time: 0.0006 
hash: "7e26e79039a494f760b7412f1a4f6c52" 
link_time: 0.0110 
**********
PASS: test-suite :: SingleSource/UnitTests/2005-05-12-Int64ToFP.test (1944 of 2039)
********** TEST 'test-suite :: SingleSource/UnitTests/2005-05-12-Int64ToFP.test' RESULTS **********
compile_time: 0.0103 
exec_time: 0.0006 
hash: "9035c43c20630911bb739fed433a495c" 
link_time: 0.0112 
**********
PASS: test-suite :: SingleSource/UnitTests/2005-05-13-SDivTwo.test (1945 of 2039)
********** TEST 'test-suite :: SingleSource/UnitTests/2005-05-13-SDivTwo.test' RESULTS **********
compile_time: 0.0123 
exec_time: 0.0006 
hash: "caf990e046173f9be3a39dc546fc7ac4" 
link_time: 0.0099 
**********
PASS: test-suite :: SingleSource/UnitTests/2005-07-15-Bitfield-ABI.test (1946 of 2039)
********** TEST 'test-suite :: SingleSource/UnitTests/2005-07-15-Bitfield-ABI.test' RESULTS **********
compile_time: 0.0066 
exec_time: 0.0006 
hash: "70ebf82f7cf31e018a3dca4e97a31992" 
link_time: 0.0102 
**********
PASS: test-suite :: SingleSource/UnitTests/2005-07-17-INT-To-FP.test (1947 of 2039)
********** TEST 'test-suite :: SingleSource/UnitTests/2005-07-17-INT-To-FP.test' RESULTS **********
compile_time: 0.0102 
exec_time: 0.0008 
hash: "56a254f65460889cf87b2928380aad21" 
link_time: 0.0116 
**********
PASS: test-suite :: SingleSource/UnitTests/2005-11-29-LongSwitch.test (1948 of 2039)
********** TEST 'test-suite :: SingleSource/UnitTests/2005-11-29-LongSwitch.test' RESULTS **********
compile_time: 0.0114 
exec_time: 0.0006 
hash: "333e289924197447489bcc803c35eb73" 
link_time: 0.0116 
**********
PASS: test-suite :: SingleSource/UnitTests/2006-01-23-UnionInit.test (1949 of 2039)
********** TEST 'test-suite :: SingleSource/UnitTests/2006-01-23-UnionInit.test' RESULTS **********
compile_time: 0.0150 
exec_time: 0.0006 
hash: "447760e95643e654084c1d9a78538c8b" 
link_time: 0.0124 
**********
PASS: test-suite :: SingleSource/UnitTests/2006-01-29-SimpleIndirectCall.test (1950 of 2039)
********** TEST 'test-suite :: SingleSource/UnitTests/2006-01-29-SimpleIndirectCall.test' RESULTS **********
compile_time: 0.0119 
exec_time: 0.0006 
hash: "98fadce3cbbd47c71ca7c26b2d5eecf2" 
link_time: 0.0113 
**********
PASS: test-suite :: SingleSource/UnitTests/2006-02-04-DivRem.test (1951 of 2039)
********** TEST 'test-suite :: SingleSource/UnitTests/2006-02-04-DivRem.test' RESULTS **********
compile_time: 0.0102 
exec_time: 0.0006 
hash: "2b464d832760d55367c84df694355240" 
link_time: 0.0106 
**********
PASS: test-suite :: SingleSource/UnitTests/2006-12-01-float_varg.test (1952 of 2039)
********** TEST 'test-suite :: SingleSource/UnitTests/2006-12-01-float_varg.test' RESULTS **********
compile_time: 0.0094 
exec_time: 0.0006 
hash: "591819def46c37e954fdd0e1ea8eee23" 
link_time: 0.0126 
**********
PASS: test-suite :: SingleSource/UnitTests/2006-12-04-DynAllocAndRestore.test (1953 of 2039)
********** TEST 'test-suite :: SingleSource/UnitTests/2006-12-04-DynAllocAndRestore.test' RESULTS **********
compile_time: 0.0096 
exec_time: 0.0006 
hash: "7cf219ca0f9d930cff30dc1c2abac64a" 
link_time: 0.0120 
**********
PASS: test-suite :: SingleSource/UnitTests/2006-12-07-Compare64BitConstant.test (1954 of 2039)
********** TEST 'test-suite :: SingleSource/UnitTests/2006-12-07-Compare64BitConstant.test' RESULTS **********
compile_time: 0.0112 
exec_time: 0.0006 
hash: "939c0eb609148f7c5bddfc82005688a7" 
link_time: 0.0122 
**********
PASS: test-suite :: SingleSource/UnitTests/2006-12-11-LoadConstants.test (1955 of 2039)
********** TEST 'test-suite :: SingleSource/UnitTests/2006-12-11-LoadConstants.test' RESULTS **********
compile_time: 0.0379 
exec_time: 0.0006 
hash: "7d2dd76b970d6600e1b0508f192549de" 
link_time: 0.0129 
**********
PASS: test-suite :: SingleSource/UnitTests/2007-01-04-KNR-Args.test (1956 of 2039)
********** TEST 'test-suite :: SingleSource/UnitTests/2007-01-04-KNR-Args.test' RESULTS **********
compile_time: 0.0131 
exec_time: 0.0006 
hash: "10994ebe8c37a9b992af9dbc6ad17dc6" 
link_time: 0.0105 
**********
PASS: test-suite :: SingleSource/UnitTests/2007-03-02-VaCopy.test (1957 of 2039)
********** TEST 'test-suite :: SingleSource/UnitTests/2007-03-02-VaCopy.test' RESULTS **********
compile_time: 0.0119 
exec_time: 0.0006 
hash: "29cbc1d8c74d00ee8b25505b59e9b707" 
link_time: 0.0120 
**********
PASS: test-suite :: SingleSource/UnitTests/2007-04-10-BitfieldTest.test (1958 of 2039)
********** TEST 'test-suite :: SingleSource/UnitTests/2007-04-10-BitfieldTest.test' RESULTS **********
compile_time: 0.0147 
exec_time: 0.0006 
hash: "25681eabb0c69ae77a599f7c20e448e4" 
link_time: 0.0100 
**********
PASS: test-suite :: SingleSource/UnitTests/2008-04-18-LoopBug.test (1959 of 2039)
********** TEST 'test-suite :: SingleSource/UnitTests/2008-04-18-LoopBug.test' RESULTS **********
compile_time: 0.0062 
exec_time: 0.0006 
hash: "ccc34b524657041b4e7503f769f1108f" 
link_time: 0.0094 
**********
PASS: test-suite :: SingleSource/UnitTests/2008-04-20-LoopBug2.test (1960 of 2039)
********** TEST 'test-suite :: SingleSource/UnitTests/2008-04-20-LoopBug2.test' RESULTS **********
compile_time: 0.0073 
exec_time: 0.0006 
hash: "9e5188654812f8c1716b0d2f18d6efe0" 
link_time: 0.0105 
**********
PASS: test-suite :: SingleSource/UnitTests/2008-07-13-InlineSetjmp.test (1961 of 2039)
********** TEST 'test-suite :: SingleSource/UnitTests/2008-07-13-InlineSetjmp.test' RESULTS **********
compile_time: 0.0101 
exec_time: 0.0006 
hash: "bf48d67b6e6dfeafa660b60283927ea7" 
link_time: 0.0122 
**********
PASS: test-suite :: SingleSource/UnitTests/2009-04-16-BitfieldInitialization.test (1962 of 2039)
********** TEST 'test-suite :: SingleSource/UnitTests/2009-04-16-BitfieldInitialization.test' RESULTS **********
compile_time: 0.0154 
exec_time: 0.0006 
hash: "bea4b20027da1bc3c2641b62a56e2618" 
link_time: 0.0115 
**********
PASS: test-suite :: SingleSource/UnitTests/2009-12-07-StructReturn.test (1963 of 2039)
********** TEST 'test-suite :: SingleSource/UnitTests/2009-12-07-StructReturn.test' RESULTS **********
compile_time: 0.0072 
exec_time: 0.0005 
hash: "5bef956d52501bd4a06ba4810ab6657c" 
link_time: 0.0099 
**********
PASS: test-suite :: SingleSource/UnitTests/2010-05-24-BitfieldTest.test (1964 of 2039)
********** TEST 'test-suite :: SingleSource/UnitTests/2010-05-24-BitfieldTest.test' RESULTS **********
compile_time: 0.0067 
exec_time: 0.0005 
hash: "474f8827a2ee127c1b0f36277f087b09" 
link_time: 0.0093 
**********
PASS: test-suite :: SingleSource/UnitTests/AtomicOps.test (1965 of 2039)
********** TEST 'test-suite :: SingleSource/UnitTests/AtomicOps.test' RESULTS **********
compile_time: 0.0129 
exec_time: 0.0006 
hash: "1f3e49c6dc2859b4e1593206a1ddff0c" 
link_time: 0.0123 
**********
PASS: test-suite :: SingleSource/UnitTests/C++11/stdthreadbug.test (1966 of 2039)
********** TEST 'test-suite :: SingleSource/UnitTests/C++11/stdthreadbug.test' RESULTS **********
compile_time: 0.1882 
exec_time: 0.0006 
hash: "55c61df57a4d4e67cc334a5a322352d7" 
link_time: 0.0128 
**********
PASS: test-suite :: SingleSource/UnitTests/DefaultInitDynArrays.test (1967 of 2039)
********** TEST 'test-suite :: SingleSource/UnitTests/DefaultInitDynArrays.test' RESULTS **********
compile_time: 0.0150 
exec_time: 0.0006 
hash: "47499ab6504dacff2c633e615a08086d" 
link_time: 0.0094 
**********
PASS: test-suite :: SingleSource/UnitTests/FloatPrecision.test (1968 of 2039)
********** TEST 'test-suite :: SingleSource/UnitTests/FloatPrecision.test' RESULTS **********
compile_time: 0.0130 
exec_time: 0.0006 
hash: "a42d4c779f16a3a1b97ad4bb6d4248cd" 
link_time: 0.0097 
**********
PASS: test-suite :: SingleSource/UnitTests/ObjC++/Hello.test (1969 of 2039)
********** TEST 'test-suite :: SingleSource/UnitTests/ObjC++/Hello.test' RESULTS **********
compile_time: 0.4758 
exec_time: 0.0020 
hash: "77eab0d6b64bcba8ae4048b4baf2ce42" 
link_time: 0.0174 
**********
PASS: test-suite :: SingleSource/UnitTests/ObjC++/property-reference-object.test (1970 of 2039)
********** TEST 'test-suite :: SingleSource/UnitTests/ObjC++/property-reference-object.test' RESULTS **********
compile_time: 0.4335 
exec_time: 0.0020 
hash: "6403786fc1ac6940a9bf734a5513587a" 
link_time: 0.0179 
**********
PASS: test-suite :: SingleSource/UnitTests/ObjC++/property-reference.test (1971 of 2039)
********** TEST 'test-suite :: SingleSource/UnitTests/ObjC++/property-reference.test' RESULTS **********
compile_time: 0.5548 
exec_time: 0.0020 
hash: "4c762d578dbc4b92e73d39949237f93a" 
link_time: 0.0160 
**********
PASS: test-suite :: SingleSource/UnitTests/ObjC++/reference-in-block-args.test (1972 of 2039)
********** TEST 'test-suite :: SingleSource/UnitTests/ObjC++/reference-in-block-args.test' RESULTS **********
compile_time: 0.0086 
exec_time: 0.0019 
hash: "0ed911f527bacc125beb9de633c4b506" 
link_time: 0.0168 
**********
PASS: test-suite :: SingleSource/UnitTests/ObjC/BoolLiteralTest.test (1973 of 2039)
********** TEST 'test-suite :: SingleSource/UnitTests/ObjC/BoolLiteralTest.test' RESULTS **********
compile_time: 0.2725 
exec_time: 0.0019 
hash: "56d41fe3a2e365387727751654757fc1" 
link_time: 0.0143 
**********
PASS: test-suite :: SingleSource/UnitTests/ObjC/bitfield-access-2.test (1974 of 2039)
********** TEST 'test-suite :: SingleSource/UnitTests/ObjC/bitfield-access-2.test' RESULTS **********
compile_time: 0.0211 
exec_time: 0.0021 
hash: "7416c1784d3aeac5477e8154980c993f" 
link_time: 0.0126 
**********
PASS: test-suite :: SingleSource/UnitTests/ObjC/bitfield-access.test (1975 of 2039)
********** TEST 'test-suite :: SingleSource/UnitTests/ObjC/bitfield-access.test' RESULTS **********
compile_time: 0.0159 
exec_time: 0.0019 
hash: "0223c38e3d967e863f12f046fcc1b306" 
link_time: 0.0123 
**********
PASS: test-suite :: SingleSource/UnitTests/ObjC/block-byref-aggr.test (1976 of 2039)
********** TEST 'test-suite :: SingleSource/UnitTests/ObjC/block-byref-aggr.test' RESULTS **********
compile_time: 0.3181 
exec_time: 0.0019 
hash: "6e3b806cc277f562f37851b8579c83cd" 
link_time: 0.0151 
**********
PASS: test-suite :: SingleSource/UnitTests/ObjC/constant-strings.test (1977 of 2039)
********** TEST 'test-suite :: SingleSource/UnitTests/ObjC/constant-strings.test' RESULTS **********
compile_time: 0.0122 
exec_time: 0.0019 
hash: "864dc10645a8db13f2341bd95e1f9b80" 
link_time: 0.0143 
**********
PASS: test-suite :: SingleSource/UnitTests/ObjC/dot-syntax-1.test (1978 of 2039)
********** TEST 'test-suite :: SingleSource/UnitTests/ObjC/dot-syntax-1.test' RESULTS **********
compile_time: 0.0286 
exec_time: 0.0020 
hash: "6002be8151757cde48486ce5c5aeff89" 
link_time: 0.0124 
**********
PASS: test-suite :: SingleSource/UnitTests/ObjC/dot-syntax-2.test (1979 of 2039)
********** TEST 'test-suite :: SingleSource/UnitTests/ObjC/dot-syntax-2.test' RESULTS **********
compile_time: 0.0199 
exec_time: 0.0019 
hash: "03d6e2c8656937538011b4c047030f67" 
link_time: 0.0135 
**********
PASS: test-suite :: SingleSource/UnitTests/ObjC/dot-syntax.test (1980 of 2039)
********** TEST 'test-suite :: SingleSource/UnitTests/ObjC/dot-syntax.test' RESULTS **********
compile_time: 0.0208 
exec_time: 0.0019 
hash: "3202049034526e3715d00b13924511e1" 
link_time: 0.0108 
**********
PASS: test-suite :: SingleSource/UnitTests/ObjC/exceptions-2.test (1981 of 2039)
********** TEST 'test-suite :: SingleSource/UnitTests/ObjC/exceptions-2.test' RESULTS **********
compile_time: 0.2997 
exec_time: 0.0020 
hash: "11bb9ff656749a619f65c4037ed76146" 
link_time: 0.0112 
**********
PASS: test-suite :: SingleSource/UnitTests/ObjC/exceptions-3.test (1982 of 2039)
********** TEST 'test-suite :: SingleSource/UnitTests/ObjC/exceptions-3.test' RESULTS **********
compile_time: 0.2741 
exec_time: 0.0019 
hash: "5879e4f280f06ca7d82e7c8223f3521c" 
link_time: 0.0117 
**********
PASS: test-suite :: SingleSource/UnitTests/ObjC/exceptions-4.test (1983 of 2039)
********** TEST 'test-suite :: SingleSource/UnitTests/ObjC/exceptions-4.test' RESULTS **********
compile_time: 0.3132 
exec_time: 0.0028 
hash: "4e8d10eeb79ccbb3b106d40fa857a6d4" 
link_time: 0.0138 
**********
PASS: test-suite :: SingleSource/UnitTests/ObjC/exceptions.test (1984 of 2039)
********** TEST 'test-suite :: SingleSource/UnitTests/ObjC/exceptions.test' RESULTS **********
compile_time: 0.2793 
exec_time: 0.0020 
hash: "78f56a6d98bce32940029a23a8bc4890" 
link_time: 0.0124 
**********
PASS: test-suite :: SingleSource/UnitTests/ObjC/for-in.test (1985 of 2039)
********** TEST 'test-suite :: SingleSource/UnitTests/ObjC/for-in.test' RESULTS **********
compile_time: 0.2757 
exec_time: 0.0021 
hash: "5ed37300ed79760526b0b32126844a33" 
link_time: 0.0141 
**********
PASS: test-suite :: SingleSource/UnitTests/ObjC/instance-method-metadata.test (1986 of 2039)
********** TEST 'test-suite :: SingleSource/UnitTests/ObjC/instance-method-metadata.test' RESULTS **********
compile_time: 0.3360 
exec_time: 0.0019 
hash: "6445d8219154c201fb0381c6641bcfec" 
link_time: 0.0148 
**********
PASS: test-suite :: SingleSource/UnitTests/ObjC/messages-2.test (1987 of 2039)
********** TEST 'test-suite :: SingleSource/UnitTests/ObjC/messages-2.test' RESULTS **********
compile_time: 0.0338 
exec_time: 0.0019 
hash: "218c9e3e2af0ecf2c125299529e77ecf" 
link_time: 0.0131 
**********
PASS: test-suite :: SingleSource/UnitTests/ObjC/messages.test (1988 of 2039)
********** TEST 'test-suite :: SingleSource/UnitTests/ObjC/messages.test' RESULTS **********
compile_time: 0.0241 
exec_time: 0.0019 
hash: "85fde18cf017b3ef92fc46da0df32130" 
link_time: 0.0143 
**********
PASS: test-suite :: SingleSource/UnitTests/ObjC/parameter-passing.test (1989 of 2039)
********** TEST 'test-suite :: SingleSource/UnitTests/ObjC/parameter-passing.test' RESULTS **********
compile_time: 0.3103 
exec_time: 0.0019 
hash: "ca0db8b0cb82b3e9ab6e826a16630f9b" 
link_time: 0.0126 
**********
PASS: test-suite :: SingleSource/UnitTests/ObjC/predefined-expr-in-method.test (1990 of 2039)
********** TEST 'test-suite :: SingleSource/UnitTests/ObjC/predefined-expr-in-method.test' RESULTS **********
compile_time: 0.0183 
exec_time: 0.0019 
hash: "1ec42b6c380e3105b035174dcf90550d" 
link_time: 0.0117 
**********
PASS: test-suite :: SingleSource/UnitTests/ObjC/property.test (1991 of 2039)
********** TEST 'test-suite :: SingleSource/UnitTests/ObjC/property.test' RESULTS **********
compile_time: 0.2726 
exec_time: 0.0019 
hash: "a4323c09f3eb26ff5bbc0bcfedfce9fb" 
link_time: 0.0161 
**********
PASS: test-suite :: SingleSource/UnitTests/ObjC/protocols.test (1992 of 2039)
********** TEST 'test-suite :: SingleSource/UnitTests/ObjC/protocols.test' RESULTS **********
compile_time: 0.0243 
exec_time: 0.0019 
hash: "b325a3370656ba9148e2f6966f89be65" 
link_time: 0.0126 
**********
PASS: test-suite :: SingleSource/UnitTests/ObjC/synchronized.test (1993 of 2039)
********** TEST 'test-suite :: SingleSource/UnitTests/ObjC/synchronized.test' RESULTS **********
compile_time: 0.3230 
exec_time: 0.1265 
hash: "284b485148d3383b17ef8039ecc88dca" 
link_time: 0.0124 
**********
PASS: test-suite :: SingleSource/UnitTests/ObjC/trivial-interface.test (1994 of 2039)
********** TEST 'test-suite :: SingleSource/UnitTests/ObjC/trivial-interface.test' RESULTS **********
compile_time: 0.2723 
exec_time: 0.0019 
hash: "3c6dc79969b1149130bfa1a82d25481f" 
link_time: 0.0122 
**********
PASS: test-suite :: SingleSource/UnitTests/SignlessTypes/Large/cast.test (1995 of 2039)
********** TEST 'test-suite :: SingleSource/UnitTests/SignlessTypes/Large/cast.test' RESULTS **********
compile_time: 0.0385 
exec_time: 0.0093 
hash: "13559c78838550c9b51d4d0873416934" 
link_time: 0.0125 
**********
PASS: test-suite :: SingleSource/UnitTests/SignlessTypes/cast-bug.test (1996 of 2039)
********** TEST 'test-suite :: SingleSource/UnitTests/SignlessTypes/cast-bug.test' RESULTS **********
compile_time: 0.0067 
exec_time: 0.0006 
hash: "2908233b84b22ff8cd153f1de05f6703" 
link_time: 0.0099 
**********
PASS: test-suite :: SingleSource/UnitTests/SignlessTypes/cast2.test (1997 of 2039)
********** TEST 'test-suite :: SingleSource/UnitTests/SignlessTypes/cast2.test' RESULTS **********
compile_time: 0.0124 
exec_time: 0.0005 
hash: "db532d1092d424df8ec988143787c7c6" 
link_time: 0.0101 
**********
PASS: test-suite :: SingleSource/UnitTests/SignlessTypes/ccc.test (1998 of 2039)
********** TEST 'test-suite :: SingleSource/UnitTests/SignlessTypes/ccc.test' RESULTS **********
compile_time: 0.0188 
exec_time: 0.0005 
hash: "8013720a7fee06b366b684347e140a6f" 
link_time: 0.0111 
**********
PASS: test-suite :: SingleSource/UnitTests/SignlessTypes/div.test (1999 of 2039)
********** TEST 'test-suite :: SingleSource/UnitTests/SignlessTypes/div.test' RESULTS **********
compile_time: 0.0136 
exec_time: 0.0006 
hash: "8c30e508fbf031d16ea9babc0401292e" 
link_time: 0.0125 
**********
PASS: test-suite :: SingleSource/UnitTests/SignlessTypes/factor.test (2000 of 2039)
********** TEST 'test-suite :: SingleSource/UnitTests/SignlessTypes/factor.test' RESULTS **********
compile_time: 0.0145 
exec_time: 0.0006 
hash: "3d75fd89ca50629b9d91cad2523ba6f0" 
link_time: 0.0124 
**********
PASS: test-suite :: SingleSource/UnitTests/SignlessTypes/rem.test (2001 of 2039)
********** TEST 'test-suite :: SingleSource/UnitTests/SignlessTypes/rem.test' RESULTS **********
compile_time: 0.0292 
exec_time: 0.0012 
hash: "7a3d0be494f84028fc1d630edaa19e4b" 
link_time: 0.0127 
**********
PASS: test-suite :: SingleSource/UnitTests/SignlessTypes/shr.test (2002 of 2039)
********** TEST 'test-suite :: SingleSource/UnitTests/SignlessTypes/shr.test' RESULTS **********
compile_time: 0.0158 
exec_time: 0.0006 
hash: "dea58777d1a4cba241674e007a5fdc2a" 
link_time: 0.0124 
**********
PASS: test-suite :: SingleSource/UnitTests/StructModifyTest.test (2003 of 2039)
********** TEST 'test-suite :: SingleSource/UnitTests/StructModifyTest.test' RESULTS **********
compile_time: 0.0073 
exec_time: 0.0006 
hash: "068d1e6bbe4bedbdfb4d712a4c7aaa69" 
link_time: 0.0107 
**********
PASS: test-suite :: SingleSource/UnitTests/TestLoop.test (2004 of 2039)
********** TEST 'test-suite :: SingleSource/UnitTests/TestLoop.test' RESULTS **********
compile_time: 0.0092 
exec_time: 0.0006 
hash: "962d4e3874c4c41960e28745a514a802" 
link_time: 0.0098 
**********
PASS: test-suite :: SingleSource/UnitTests/Threads/2010-12-08-tls.test (2005 of 2039)
********** TEST 'test-suite :: SingleSource/UnitTests/Threads/2010-12-08-tls.test' RESULTS **********
compile_time: 0.0123 
exec_time: 0.0006 
hash: "1caa7f3dec6f2d33400f9a76488f58c0" 
link_time: 0.0102 
**********
PASS: test-suite :: SingleSource/UnitTests/Threads/tls.test (2006 of 2039)
********** TEST 'test-suite :: SingleSource/UnitTests/Threads/tls.test' RESULTS **********
compile_time: 0.0158 
exec_time: 0.0006 
hash: "7bff4eab05088591ea1ef690dec17de6" 
link_time: 0.0103 
**********
PASS: test-suite :: SingleSource/UnitTests/Vector/SSE/Vector-sse.expandfft.test (2007 of 2039)
********** TEST 'test-suite :: SingleSource/UnitTests/Vector/SSE/Vector-sse.expandfft.test' RESULTS **********
compile_time: 0.0000 
exec_time: 1.4459 
hash: "c22f1730a0df71912df72e125058a073" 
link_time: 0.0099 
**********
PASS: test-suite :: SingleSource/UnitTests/Vector/SSE/Vector-sse.isamax.test (2008 of 2039)
********** TEST 'test-suite :: SingleSource/UnitTests/Vector/SSE/Vector-sse.isamax.test' RESULTS **********
compile_time: 0.0000 
exec_time: 0.0006 
hash: "2c1fa6303de3abfe6232e9d4fc798d41" 
link_time: 0.0095 
**********
PASS: test-suite :: SingleSource/UnitTests/Vector/SSE/Vector-sse.shift.test (2009 of 2039)
********** TEST 'test-suite :: SingleSource/UnitTests/Vector/SSE/Vector-sse.shift.test' RESULTS **********
compile_time: 0.0000 
exec_time: 0.0006 
hash: "1cffed80fcc5875ec1dd0685d1155022" 
link_time: 0.0091 
**********
PASS: test-suite :: SingleSource/UnitTests/Vector/SSE/Vector-sse.stepfft.test (2010 of 2039)
********** TEST 'test-suite :: SingleSource/UnitTests/Vector/SSE/Vector-sse.stepfft.test' RESULTS **********
compile_time: 0.0000 
exec_time: 1.6375 
hash: "de582e11da047cf649c459da4668b42c" 
link_time: 0.0095 
**********
PASS: test-suite :: SingleSource/UnitTests/Vector/Vector-build.test (2011 of 2039)
********** TEST 'test-suite :: SingleSource/UnitTests/Vector/Vector-build.test' RESULTS **********
compile_time: 0.0000 
exec_time: 0.0006 
hash: "1e11348bfa7b8fa692c7a64b8a329d6e" 
link_time: 0.0083 
**********
PASS: test-suite :: SingleSource/UnitTests/Vector/Vector-build2.test (2012 of 2039)
********** TEST 'test-suite :: SingleSource/UnitTests/Vector/Vector-build2.test' RESULTS **********
compile_time: 0.0000 
exec_time: 6.6602 
hash: "c357e7892bffa16959b0070614031ec2" 
link_time: 0.0101 
**********
PASS: test-suite :: SingleSource/UnitTests/Vector/Vector-constpool.test (2013 of 2039)
********** TEST 'test-suite :: SingleSource/UnitTests/Vector/Vector-constpool.test' RESULTS **********
compile_time: 0.0000 
exec_time: 0.0008 
hash: "49cc344bc60b4a1a0fe7f840c15b0a16" 
link_time: 0.0140 
**********
PASS: test-suite :: SingleSource/UnitTests/Vector/Vector-divides.test (2014 of 2039)
********** TEST 'test-suite :: SingleSource/UnitTests/Vector/Vector-divides.test' RESULTS **********
compile_time: 0.0000 
exec_time: 0.0007 
hash: "b149ade39df62262defdfb9298b87d2f" 
link_time: 0.0093 
**********
PASS: test-suite :: SingleSource/UnitTests/Vector/Vector-multiplies.test (2015 of 2039)
********** TEST 'test-suite :: SingleSource/UnitTests/Vector/Vector-multiplies.test' RESULTS **********
compile_time: 0.0000 
exec_time: 1.7977 
hash: "88779af3393fb3d1359304cc65cb91e7" 
link_time: 0.0106 
**********
PASS: test-suite :: SingleSource/UnitTests/Vector/Vector-simple.test (2016 of 2039)
********** TEST 'test-suite :: SingleSource/UnitTests/Vector/Vector-simple.test' RESULTS **********
compile_time: 0.0000 
exec_time: 0.0038 
hash: "565a2c30bee9983344430c149c8c85ca" 
link_time: 0.0095 
**********
PASS: test-suite :: SingleSource/UnitTests/Vector/Vector-sumarray-dbl.test (2017 of 2039)
********** TEST 'test-suite :: SingleSource/UnitTests/Vector/Vector-sumarray-dbl.test' RESULTS **********
compile_time: 0.0000 
exec_time: 0.0006 
hash: "81eadcfbd86ef4de58ae8c89d46bdaab" 
link_time: 0.0107 
**********
PASS: test-suite :: SingleSource/UnitTests/Vector/Vector-sumarray.test (2018 of 2039)
********** TEST 'test-suite :: SingleSource/UnitTests/Vector/Vector-sumarray.test' RESULTS **********
compile_time: 0.0000 
exec_time: 0.0006 
hash: "5580f8ab0cd2e3ac145e2493672a1228" 
link_time: 0.0099 
**********
PASS: test-suite :: SingleSource/UnitTests/Vectorizer/gcc-loops.test (2019 of 2039)
********** TEST 'test-suite :: SingleSource/UnitTests/Vectorizer/gcc-loops.test' RESULTS **********
compile_time: 0.4099 
exec_time: 30.6638 
hash: "24cfdf0ebe39eddd8f078ebe6c345ac9" 
link_time: 0.0121 
**********
PASS: test-suite :: SingleSource/UnitTests/block-byref-cxxobj-test.test (2020 of 2039)
********** TEST 'test-suite :: SingleSource/UnitTests/block-byref-cxxobj-test.test' RESULTS **********
compile_time: 0.0149 
exec_time: 0.0006 
hash: "6bf3b14d2d3cc017235e7836448bb733" 
link_time: 0.0113 
**********
PASS: test-suite :: SingleSource/UnitTests/block-byref-test.test (2021 of 2039)
********** TEST 'test-suite :: SingleSource/UnitTests/block-byref-test.test' RESULTS **********
compile_time: 0.0083 
exec_time: 0.0006 
hash: "0d40c2d0776686b9173d8572c683416c" 
link_time: 0.0108 
**********
PASS: test-suite :: SingleSource/UnitTests/block-call-r7674133.test (2022 of 2039)
********** TEST 'test-suite :: SingleSource/UnitTests/block-call-r7674133.test' RESULTS **********
compile_time: 0.0095 
exec_time: 0.0006 
hash: "80d61aabe6466d086187f2b993d9b2f4" 
link_time: 0.0115 
**********
PASS: test-suite :: SingleSource/UnitTests/block-copied-in-cxxobj-1.test (2023 of 2039)
********** TEST 'test-suite :: SingleSource/UnitTests/block-copied-in-cxxobj-1.test' RESULTS **********
compile_time: 0.0215 
exec_time: 0.0006 
hash: "52b4dec760aa4fed357a80f29d8687b0" 
link_time: 0.0108 
**********
PASS: test-suite :: SingleSource/UnitTests/block-copied-in-cxxobj.test (2024 of 2039)
********** TEST 'test-suite :: SingleSource/UnitTests/block-copied-in-cxxobj.test' RESULTS **********
compile_time: 0.0180 
exec_time: 0.0006 
hash: "c6330df2bcf25bb29e3ff11c59825ee4" 
link_time: 0.0129 
**********
PASS: test-suite :: SingleSource/UnitTests/blockstret.test (2025 of 2039)
********** TEST 'test-suite :: SingleSource/UnitTests/blockstret.test' RESULTS **********
compile_time: 0.0103 
exec_time: 0.0006 
hash: "255e92237bcb51988a818807e41c03db" 
link_time: 0.0117 
**********
PASS: test-suite :: SingleSource/UnitTests/byval-alignment.test (2026 of 2039)
********** TEST 'test-suite :: SingleSource/UnitTests/byval-alignment.test' RESULTS **********
compile_time: 0.0129 
exec_time: 0.0006 
hash: "1548f76c97e1e2d0ffcfed825cb2896f" 
link_time: 0.0109 
**********
PASS: test-suite :: SingleSource/UnitTests/conditional-gnu-ext-cxx.test (2027 of 2039)
********** TEST 'test-suite :: SingleSource/UnitTests/conditional-gnu-ext-cxx.test' RESULTS **********
compile_time: 0.0085 
exec_time: 0.0006 
hash: "8d03c5916995f403936d36102795f877" 
link_time: 0.0099 
**********
PASS: test-suite :: SingleSource/UnitTests/conditional-gnu-ext.test (2028 of 2039)
********** TEST 'test-suite :: SingleSource/UnitTests/conditional-gnu-ext.test' RESULTS **********
compile_time: 0.0061 
exec_time: 0.0006 
hash: "3720666dcc7ff409cd474966fc1cc8fa" 
link_time: 0.0120 
**********
PASS: test-suite :: SingleSource/UnitTests/initp1.test (2029 of 2039)
********** TEST 'test-suite :: SingleSource/UnitTests/initp1.test' RESULTS **********
compile_time: 0.0213 
exec_time: 0.0006 
hash: "c8ec4c8ddbd7d30bba19bf55ab3cd116" 
link_time: 0.0104 
**********
PASS: test-suite :: SingleSource/UnitTests/member-function-pointers.test (2030 of 2039)
********** TEST 'test-suite :: SingleSource/UnitTests/member-function-pointers.test' RESULTS **********
compile_time: 0.0129 
exec_time: 0.0006 
hash: "b601623823c580a02fbfd82fb73d0adf" 
link_time: 0.0116 
**********
PASS: test-suite :: SingleSource/UnitTests/ms_struct-bitfield-1.test (2031 of 2039)
********** TEST 'test-suite :: SingleSource/UnitTests/ms_struct-bitfield-1.test' RESULTS **********
compile_time: 0.0067 
exec_time: 0.0006 
hash: "b1e5562f0d43627430f197c5a729fe84" 
link_time: 0.0109 
**********
PASS: test-suite :: SingleSource/UnitTests/ms_struct-bitfield-init-1.test (2032 of 2039)
********** TEST 'test-suite :: SingleSource/UnitTests/ms_struct-bitfield-init-1.test' RESULTS **********
compile_time: 0.0147 
exec_time: 0.0006 
hash: "81ead98f6314bd68a8aa004aded4abfa" 
link_time: 0.0114 
**********
PASS: test-suite :: SingleSource/UnitTests/ms_struct-bitfield-init.test (2033 of 2039)
********** TEST 'test-suite :: SingleSource/UnitTests/ms_struct-bitfield-init.test' RESULTS **********
compile_time: 0.0110 
exec_time: 0.0006 
hash: "0d85ef20b0fc76af56e6053f77843eaa" 
link_time: 0.0107 
**********
PASS: test-suite :: SingleSource/UnitTests/ms_struct-bitfield.test (2034 of 2039)
********** TEST 'test-suite :: SingleSource/UnitTests/ms_struct-bitfield.test' RESULTS **********
compile_time: 0.0070 
exec_time: 0.0005 
hash: "b66b29fc58ea04c4081decb0e2f5a90a" 
link_time: 0.0121 
**********
PASS: test-suite :: SingleSource/UnitTests/ms_struct_pack_layout-1.test (2035 of 2039)
********** TEST 'test-suite :: SingleSource/UnitTests/ms_struct_pack_layout-1.test' RESULTS **********
compile_time: 0.0058 
exec_time: 0.0005 
hash: "20198d2957968bd180431f0634a83bf0" 
link_time: 0.0101 
**********
PASS: test-suite :: SingleSource/UnitTests/ms_struct_pack_layout.test (2036 of 2039)
********** TEST 'test-suite :: SingleSource/UnitTests/ms_struct_pack_layout.test' RESULTS **********
compile_time: 0.0144 
exec_time: 0.0006 
hash: "fd5c76515d884ad91bb6bc0e5292e918" 
link_time: 0.0104 
**********
PASS: test-suite :: SingleSource/UnitTests/printargs.test (2037 of 2039)
********** TEST 'test-suite :: SingleSource/UnitTests/printargs.test' RESULTS **********
compile_time: 0.0124 
exec_time: 0.0006 
hash: "f3fc04222f20f720ab38bade92bf9759" 
link_time: 0.0090 
**********
PASS: test-suite :: SingleSource/UnitTests/stmtexpr.test (2038 of 2039)
********** TEST 'test-suite :: SingleSource/UnitTests/stmtexpr.test' RESULTS **********
compile_time: 0.0142 
exec_time: 0.0006 
hash: "11bbe9537935a71f7b954d8f26a7d018" 
link_time: 0.0112 
**********
PASS: test-suite :: SingleSource/UnitTests/vla.test (2039 of 2039)
********** TEST 'test-suite :: SingleSource/UnitTests/vla.test' RESULTS **********
compile_time: 0.0128 
exec_time: 0.0006 
hash: "129b38c4ba0aae82ec7d68070727db2d" 
link_time: 0.0109 
**********
Testing Time: 3547.46s
********************
Failing Tests (3):
    test-suite :: SingleSource/Regression/C/gcc-c-torture/execute/GCC-C-execute-alloca-1.test
    test-suite :: SingleSource/Regression/C/gcc-c-torture/execute/GCC-C-execute-pr44575.test
    test-suite :: SingleSource/Regression/C/gcc-c-torture/execute/GCC-C-execute-pr60960.test

Hide Details

Expected Passes : 2003 Unexpected Failures: 3 -- Cache values // Build a 32 bit version of the library. BENCHMARK_BUILD_32_BITS:BOOL=OFF

Hide Details

// Flags used by the C++ compiler during coverage builds. BENCHMARK_CXX_FLAGS_COVERAGE:STRING=-O0 -g

Hide Details

// Enable the use of exceptions in the benchmark library. BENCHMARK_ENABLE_EXCEPTIONS:BOOL=ON

Hide Details

// Enable installation of benchmark. (Projects embedding benchmark may want to turn this OFF.) BENCHMARK_ENABLE_INSTALL:BOOL=ON

Hide Details

// Enable link time optimisation of the benchmark library. BENCHMARK_ENABLE_LTO:BOOL=OFF

Hide Details

// Enable testing of the benchmark library. BENCHMARK_ENABLE_TESTING:BOOL=ON

Hide Details

// Flags used for linking binaries during coverage builds. BENCHMARK_EXE_LINKER_FLAGS_COVERAGE:STRING=

Hide Details

// Flags used by the shared libraries linker during coverage builds. BENCHMARK_SHARED_LINKER_FLAGS_COVERAGE:STRING=

Hide Details

// Build and test using libc++ as the standard library. BENCHMARK_USE_LIBCXX:BOOL=OFF

Hide Details

// Path to a program. CMAKE_AR:FILEPATH=/usr/bin/ar

Hide Details

// CMAKE_BUILD_TYPE:STRING=Debug

Hide Details

// Enable/Disable color output during build. CMAKE_COLOR_MAKEFILE:BOOL=ON

Hide Details

// No help, variable specified on the command line. CMAKE_CXX_COMPILER:FILEPATH=/usr/bin/clang++

Hide Details

// Flags used by the compiler during all build types. CMAKE_CXX_FLAGS:STRING=

Hide Details

// CMAKE_CXX_FLAGS_DEBUG:STRING=-O0 -g

Hide Details

// Flags used by the compiler during release builds for minimum size. CMAKE_CXX_FLAGS_MINSIZEREL:STRING=-Os -DNDEBUG

Hide Details

// Flags used by the compiler during release builds. CMAKE_CXX_FLAGS_RELEASE:STRING=-O3 -DNDEBUG

Hide Details

// Flags used by the compiler during release builds with debug info. CMAKE_CXX_FLAGS_RELWITHDEBINFO:STRING=-O2 -g -DNDEBUG

Hide Details

// No help, variable specified on the command line. CMAKE_C_COMPILER:FILEPATH=/usr/bin/clang

Hide Details

// Flags used by the compiler during all build types. CMAKE_C_FLAGS:STRING=

Hide Details

// CMAKE_C_FLAGS_DEBUG:STRING=-O0 -g

Hide Details

// Flags used by the compiler during release builds for minimum size. CMAKE_C_FLAGS_MINSIZEREL:STRING=-Os -DNDEBUG

Hide Details

// Flags used by the compiler during release builds. CMAKE_C_FLAGS_RELEASE:STRING=-O3 -DNDEBUG

Hide Details

// Flags used by the compiler during release builds with debug info. CMAKE_C_FLAGS_RELWITHDEBINFO:STRING=-O2 -g -DNDEBUG

Hide Details

// Flags used by the linker. CMAKE_EXE_LINKER_FLAGS:STRING=

Hide Details

// Flags used by the linker during debug builds. CMAKE_EXE_LINKER_FLAGS_DEBUG:STRING=

Hide Details

// Flags used by the linker during release minsize builds. CMAKE_EXE_LINKER_FLAGS_MINSIZEREL:STRING=

Hide Details

// Flags used by the linker during release builds. CMAKE_EXE_LINKER_FLAGS_RELEASE:STRING=

Hide Details

// Flags used by the linker during Release with Debug Info builds. CMAKE_EXE_LINKER_FLAGS_RELWITHDEBINFO:STRING=

Hide Details

// Enable/Disable output of compile commands during generation. CMAKE_EXPORT_COMPILE_COMMANDS:BOOL=OFF

Hide Details

// Path to a program. CMAKE_INSTALL_NAME_TOOL:FILEPATH=/usr/bin/install_name_tool

Hide Details

// Install path prefix, prepended onto install directories. CMAKE_INSTALL_PREFIX:PATH=/usr/local

Hide Details

// Path to a program. CMAKE_LINKER:FILEPATH=/usr/bin/ld

Hide Details

// Path to a program. CMAKE_MAKE_PROGRAM:FILEPATH=/usr/bin/make

Hide Details

// Flags used by the linker during the creation of modules. CMAKE_MODULE_LINKER_FLAGS:STRING=

Hide Details

// Flags used by the linker during debug builds. CMAKE_MODULE_LINKER_FLAGS_DEBUG:STRING=

Hide Details

// Flags used by the linker during release minsize builds. CMAKE_MODULE_LINKER_FLAGS_MINSIZEREL:STRING=

Hide Details

// Flags used by the linker during release builds. CMAKE_MODULE_LINKER_FLAGS_RELEASE:STRING=

Hide Details

// Flags used by the linker during Release with Debug Info builds. CMAKE_MODULE_LINKER_FLAGS_RELWITHDEBINFO:STRING=

Hide Details

// Path to a program. CMAKE_NM:FILEPATH=/usr/bin/nm

Hide Details

// Path to a program. CMAKE_OBJCOPY:FILEPATH=CMAKE_OBJCOPY-NOTFOUND

Hide Details

// Path to a program. CMAKE_OBJDUMP:FILEPATH=CMAKE_OBJDUMP-NOTFOUND

Hide Details

// Build architectures for OSX CMAKE_OSX_ARCHITECTURES:STRING=

Hide Details

// Minimum OS X version to target for deployment (at runtime); newer APIs weak linked. Set to empty string for default value. CMAKE_OSX_DEPLOYMENT_TARGET:STRING=

Hide Details

// The product will be built against the headers and libraries located inside the indicated SDK. CMAKE_OSX_SYSROOT:STRING=

Hide Details

// Path to a program. CMAKE_RANLIB:FILEPATH=/usr/bin/ranlib

Hide Details

// Flags used by the linker during the creation of dll's. CMAKE_SHARED_LINKER_FLAGS:STRING=

Hide Details

// Flags used by the linker during debug builds. CMAKE_SHARED_LINKER_FLAGS_DEBUG:STRING=

Hide Details

// Flags used by the linker during release minsize builds. CMAKE_SHARED_LINKER_FLAGS_MINSIZEREL:STRING=

Hide Details

// Flags used by the linker during release builds. CMAKE_SHARED_LINKER_FLAGS_RELEASE:STRING=

Hide Details

// Flags used by the linker during Release with Debug Info builds. CMAKE_SHARED_LINKER_FLAGS_RELWITHDEBINFO:STRING=

Hide Details

// If set, runtime paths are not added when installing shared libraries, but are added when building. CMAKE_SKIP_INSTALL_RPATH:BOOL=NO

Hide Details

// If set, runtime paths are not added when using shared libraries. CMAKE_SKIP_RPATH:BOOL=NO

Hide Details

// Flags used by the linker during the creation of static libraries. CMAKE_STATIC_LINKER_FLAGS:STRING=

Hide Details

// Flags used by the linker during debug builds. CMAKE_STATIC_LINKER_FLAGS_DEBUG:STRING=

Hide Details

// Flags used by the linker during release minsize builds. CMAKE_STATIC_LINKER_FLAGS_MINSIZEREL:STRING=

Hide Details

// Flags used by the linker during release builds. CMAKE_STATIC_LINKER_FLAGS_RELEASE:STRING=

Hide Details

// Flags used by the linker during Release with Debug Info builds. CMAKE_STATIC_LINKER_FLAGS_RELWITHDEBINFO:STRING=

Hide Details

// Path to a program. CMAKE_STRIP:FILEPATH=/usr/bin/strip

Hide Details

// If this value is on, makefiles will be generated without the .SILENT directive, and all commands will be echoed to the console during the make. This is useful for debugging only. With Visual Studio IDE projects all commands are done without /nologo. CMAKE_VERBOSE_MAKEFILE:BOOL=FALSE

Hide Details

// Git command line client GIT_EXECUTABLE:FILEPATH=/usr/bin/git

Hide Details

// Path to a library. LIBRT:FILEPATH=LIBRT-NOTFOUND

Hide Details

// Sign executables and dylibs with the given identity or skip if empty (Darwin Only) LLVM_CODESIGNING_IDENTITY:STRING=

Hide Details

// Path to a file. TCL_INCLUDE_PATH:PATH=/System/Library/Frameworks/Tcl.framework/Headers

Hide Details

// Path to a library. TCL_LIBRARY:FILEPATH=/System/Library/Frameworks/tcl.framework

Hide Details

// Path to a program. TCL_TCLSH:FILEPATH=/usr/bin/tclsh

Hide Details

// Extra flags to select target architecture. TEST_SUITE_ARCH_FLAGS:STRING=

Hide Details

// Only run the benchmarking only subset TEST_SUITE_BENCHMARKING_ONLY:BOOL=OFF

Hide Details

// Measure code size of binaries TEST_SUITE_COLLECT_CODE_SIZE:BOOL=Off

Hide Details

// Measure compile time by wrapping compiler invocations in timeit TEST_SUITE_COLLECT_COMPILE_TIME:BOOL=ON

Hide Details

// Collect LLVM statistics TEST_SUITE_COLLECT_STATS:BOOL=OFF

Hide Details

// Always copy benchmark data to builddir TEST_SUITE_COPY_DATA:BOOL=OFF

Hide Details

// Directory containing CUDA prerequisites sourcecode TEST_SUITE_CUDA_ROOT:PATH=

Hide Details

// Specify C++ ABI library to use. TEST_SUITE_CXX_ABI:STRING=default

Hide Details

// Extra flags appended to CMAKE_C_FLAGS + CMAKE_CXX_FLAGS TEST_SUITE_DIAGNOSE_FLAGS:STRING=

Hide Details

// Extra flags appended to CMAKE_EXE_LINKER_FLAGS TEST_SUITE_DIAGNOSE_LINKER_FLAGS:STRING=

Hide Details

// Disable position independent executables and ASLR TEST_SUITE_DISABLE_PIE:BOOL=ON

Hide Details

// Enable bitcode tests TEST_SUITE_ENABLE_BITCODE_TESTS:BOOL=

Hide Details

// Directory containing test-suite external benchmark sources TEST_SUITE_EXTERNALS_DIR:PATH=

Hide Details

// Extra flags for CMAKE_CXX_FLAGS TEST_SUITE_EXTRA_CXX_FLAGS:STRING=

Hide Details

// Extra flags for CMAKE_C_FLAGS TEST_SUITE_EXTRA_C_FLAGS:STRING=

Hide Details

// Extra flags for CMAKE_EXE_LINKER_FLAGS TEST_SUITE_EXTRA_EXE_LINKER_FLAGS:STRING=

Hide Details

// Semicolon separated list of extra lit modules in use TEST_SUITE_EXTRA_LIT_MODULES:STRING=

Hide Details

// Directory containing HMMER 2.3.2 sourcecode TEST_SUITE_HMMER_ROOT:PATH=

Hide Details

// C compiler targetting the host TEST_SUITE_HOST_CC:STRING=cc

Hide Details

// Path to a program. TEST_SUITE_LIT:FILEPATH=/Users/buildslave/jenkins/workspace/Testsuite-Tester@5/venv/bin/lit

Hide Details

// Flags used when running lit TEST_SUITE_LIT_FLAGS:STRING=-sv

Hide Details

// Directory containing Nurbs sourcecode TEST_SUITE_NURBS_ROOT:PATH=

Hide Details

// Directory containing POV-Ray 3.1 sourcecode TEST_SUITE_POVRAY_ROOT:PATH=

Hide Details

// Enable lit profile generate mode TEST_SUITE_PROFILE_GENERATE:BOOL=OFF

Hide Details

// Add apropriate -fprofile-instr-use to CFLAGS/CXXFLAGS for each benchmark TEST_SUITE_PROFILE_USE:BOOL=OFF

Hide Details

// Remote execution client TEST_SUITE_REMOTE_CLIENT:STRING=ssh

Hide Details

// Remote execution host TEST_SUITE_REMOTE_HOST:STRING=

Hide Details

// Actually run the benchmarks in lit TEST_SUITE_RUN_BENCHMARKS:BOOL=ON

Hide Details

// Type of benchmark inputs (may be test,train or ref) TEST_SUITE_RUN_TYPE:STRING=train

Hide Details

// RunSafely.sh run-under (-u) parameter TEST_SUITE_RUN_UNDER:STRING=

Hide Details

// Directory containing Skidmarks 10 sourcecode TEST_SUITE_SKIDMARKS10_ROOT:PATH=

Hide Details

// Directory containing SPEC CPU2000 sourcecode TEST_SUITE_SPEC2000_ROOT:PATH=

Hide Details

// Directory containing SPEC CPU2006 sourcecode TEST_SUITE_SPEC2006_ROOT:PATH=

Hide Details

// Directory containing SPEC CPU2017 sourcecode TEST_SUITE_SPEC2017_ROOT:PATH=

Hide Details

// Directory containing SPEC CPU95 sourcecode TEST_SUITE_SPEC95_ROOT:PATH=

Hide Details

// Semicolon separated list of directories with CMakeLists.txt to include TEST_SUITE_SUBDIRS:STRING=Bitcode;External;MicroBenchmarks;MultiSource;SingleSource

Hide Details

// Suppress all warnings TEST_SUITE_SUPPRESS_WARNINGS:BOOL=ON

Hide Details

// RUN_UNDER is used to run tests under emulation. TEST_SUITE_USER_MODE_EMULATION:BOOL=NO

Hide Details

// Use IR PGO instrumentation (requires TEST_SUITE_PROFILE_GENERATE) TEST_SUITE_USE_IR_PGO:BOOL=OFF

Hide Details

// Use perf (timeit.sh) instead of timeit.c TEST_SUITE_USE_PERF:BOOL=OFF

Hide Details

// Path to a file. TK_INCLUDE_PATH:PATH=/System/Library/Frameworks/Tk.framework/Headers

Hide Details

// Path to a library. TK_LIBRARY:FILEPATH=/System/Library/Frameworks/tk.framework

Hide Details

// Path to a program. TK_WISH:FILEPATH=/usr/bin/wish

Hide Details

Import succeeded.

Hide Details

+ cp sandbox/build/test-results.xunit.xml . + echo @@@@@@ @@@@@@ [WARNINGS] Parsing warnings in console log with parser AcuCobol Compiler Skipping warnings blame since Git is the only supported SCM up to now.%n [WARNINGS] Computing warning deltas based on reference build #5367 [WARNINGS] Ignore new warnings since this is the first valid build [WARNINGS] Plug-in Result: Success - no threshold has been exceeded Recording test results Build step 'Publish JUnit test result report' changed build result to UNSTABLE [BFA] Scanning build for known causes... [BFA] Found failure cause(s): [BFA] Compile Error from category Compile [BFA] Link error [BFA] Regression test failed from category Test [BFA] Done. 1s Extended Email Publisher is currently disabled in project settings Finished: UNSTABLE