FailedConsole Output

Skipping 11,430 KB.. Full Log
-rc/cpp-output.test (48821 of 49265)
PASS: LLVM :: tools/llvm-profdata/weight-sample.test (48822 of 49265)
PASS: LLVM :: tools/llvm-rc/helpmsg.test (48823 of 49265)
PASS: LLVM :: tools/llvm-rc/codepage.test (48824 of 49265)
PASS: LLVM :: tools/llvm-rc/include-paths.test (48825 of 49265)
PASS: LLVM :: tools/llvm-rc/not-expr.test (48826 of 49265)
PASS: LLVM :: tools/llvm-profdata/weight-instr.test (48827 of 49265)
PASS: LLVM :: tools/llvm-rc/memoryflags.test (48828 of 49265)
PASS: LLVM :: tools/llvm-rc/memoryflags-stringtable.test (48829 of 49265)
PASS: LLVM :: tools/llvm-rc/tag-html.test (48830 of 49265)
PASS: LLVM :: tools/llvm-rc/parser-expr.test (48831 of 49265)
PASS: LLVM :: tools/llvm-rc/tag-escape.test (48832 of 49265)
PASS: LLVM :: tools/llvm-rc/tag-menu.test (48833 of 49265)
PASS: LLVM :: tools/llvm-rc/tag-icon-cursor.test (48834 of 49265)
PASS: LLVM :: tools/llvm-rc/tag-accelerators.test (48835 of 49265)
PASS: LLVM :: tools/llvm-rc/tokenizer.test (48836 of 49265)
PASS: LLVM :: tools/llvm-rc/tag-dialog.test (48837 of 49265)
PASS: LLVM :: tools/llvm-rc/tag-user.test (48838 of 49265)
PASS: LLVM :: tools/llvm-rc/tag-stringtable.test (48839 of 49265)
PASS: LLVM :: tools/llvm-rc/versioninfo-padding.test (48840 of 49265)
PASS: LLVM :: tools/llvm-rc/tag-versioninfo.test (48841 of 49265)
PASS: LLVM :: tools/llvm-readobj/AArch64/dwarf-cfi.s (48842 of 49265)
PASS: LLVM :: tools/llvm-readobj/AArch64/aarch64-note-gnu-property.s (48843 of 49265)
PASS: LLVM :: tools/llvm-readobj/ARM/attribute-1.s (48844 of 49265)
PASS: LLVM :: tools/llvm-readobj/ARM/attribute-10.s (48845 of 49265)
PASS: LLVM :: tools/llvm-readobj/ARM/attribute-0.s (48846 of 49265)
PASS: LLVM :: tools/llvm-readobj/ARM/attribute-11.s (48847 of 49265)
PASS: LLVM :: tools/llvm-readobj/ARM/attribute-136.s (48848 of 49265)
PASS: LLVM :: tools/llvm-readobj/ARM/attribute-12.s (48849 of 49265)
PASS: LLVM :: tools/llvm-readobj/ARM/attribute-2.s (48850 of 49265)
PASS: LLVM :: tools/llvm-readobj/ARM/attribute-14.s (48851 of 49265)
PASS: LLVM :: tools/llvm-readobj/ARM/attribute-15.s (48852 of 49265)
PASS: LLVM :: tools/llvm-rc/parser.test (48853 of 49265)
PASS: LLVM :: tools/llvm-readobj/ARM/attribute-13.s (48854 of 49265)
PASS: LLVM :: tools/llvm-readobj/ARM/attribute-3.s (48855 of 49265)
PASS: LLVM :: tools/llvm-readobj/ARM/attribute-5.s (48856 of 49265)
PASS: LLVM :: tools/llvm-readobj/ARM/attribute-9.s (48857 of 49265)
PASS: LLVM :: tools/llvm-readobj/ARM/attribute-4.s (48858 of 49265)
PASS: LLVM :: tools/llvm-readobj/ARM/attribute-8.s (48859 of 49265)
PASS: LLVM :: tools/llvm-readobj/ARM/attribute-7.s (48860 of 49265)
PASS: LLVM :: tools/llvm-readobj/ARM/attribute-A.s (48861 of 49265)
PASS: LLVM :: tools/llvm-readobj/ARM/attribute-6.s (48862 of 49265)
PASS: LLVM :: tools/llvm-readobj/ARM/dwarf-cfi.s (48863 of 49265)
PASS: LLVM :: tools/llvm-readobj/ARM/attribute-conformance-1.s (48864 of 49265)
PASS: LLVM :: tools/llvm-readobj/ARM/attribute-R.s (48865 of 49265)
PASS: LLVM :: tools/llvm-readobj/ARM/attribute-M.s (48866 of 49265)
PASS: LLVM :: tools/llvm-readobj/all.test (48867 of 49265)
PASS: LLVM :: tools/llvm-readobj/ARM/attribute-S.s (48868 of 49265)
PASS: LLVM :: tools/llvm-readobj/ARM/attribute-conformance-2.s (48869 of 49265)
PASS: LLVM :: tools/llvm-readobj/amdgpu-elf-definitions.test (48870 of 49265)
PASS: LLVM :: tools/llvm-readobj/ARM/unwind.s (48871 of 49265)
PASS: LLVM :: tools/llvm-readobj/arm64-many-epilogs.s (48872 of 49265)
PASS: LLVM :: tools/llvm-readobj/arm64-win-error1.s (48873 of 49265)
PASS: LLVM :: tools/llvm-readobj/arm64-win-error2.s (48874 of 49265)
PASS: LLVM :: tools/llvm-readobj/arm64-win-error3.s (48875 of 49265)
PASS: LLVM :: tools/llvm-readobj/bigobj.test (48876 of 49265)
PASS: LLVM :: tools/llvm-readobj/codeview-inlinees.test (48877 of 49265)
PASS: LLVM :: tools/llvm-readobj/codeview-inlining.test (48878 of 49265)
PASS: LLVM :: tools/llvm-readobj/archive.test (48879 of 49265)
PASS: LLVM :: tools/llvm-readobj/broken-group.test (48880 of 49265)
PASS: LLVM :: tools/llvm-readobj/codeview-label.test (48881 of 49265)
PASS: LLVM :: tools/llvm-readobj/check-output-order.test (48882 of 49265)
PASS: LLVM :: tools/llvm-readobj/codeview-merging-cycle.test (48883 of 49265)
PASS: LLVM :: tools/llvm-readobj/codeview-merging-ghash.test (48884 of 49265)
PASS: LLVM :: tools/llvm-readobj/basic.test (48885 of 49265)
PASS: LLVM :: tools/llvm-readobj/codeview-merging-anon.test (48886 of 49265)
PASS: LLVM :: tools/llvm-readobj/codeview-merging-unsorted.test (48887 of 49265)
PASS: LLVM :: tools/llvm-readobj/codeview-vftable.test (48888 of 49265)
PASS: LLVM :: tools/llvm-readobj/coff-arm-baserelocs.test (48889 of 49265)
PASS: LLVM :: tools/llvm-readobj/codeview-merging.test (48890 of 49265)
PASS: LLVM :: tools/llvm-readobj/coff-basereloc.test (48891 of 49265)
PASS: LLVM :: tools/llvm-readobj/coff-const-import.test (48892 of 49265)
PASS: LLVM :: tools/llvm-readobj/coff-directives.test (48893 of 49265)
PASS: LLVM :: tools/llvm-readobj/codeview-linetables.test (48894 of 49265)
PASS: LLVM :: tools/llvm-readobj/coff-exports-implib.test (48895 of 49265)
PASS: LLVM :: tools/llvm-readobj/coff-debug-directory.test (48896 of 49265)
PASS: LLVM :: tools/llvm-readobj/coff-file-sections-reading.test (48897 of 49265)
PASS: LLVM :: tools/llvm-readobj/codeview-types.test (48898 of 49265)
PASS: LLVM :: tools/llvm-readobj/coff-exports.test (48899 of 49265)
PASS: LLVM :: tools/llvm-readobj/coff-non-null-terminated-file.test (48900 of 49265)
PASS: LLVM :: tools/llvm-readobj/coff-zero-string-table.test (48901 of 49265)
PASS: LLVM :: tools/llvm-readobj/coff-needed-libs.test (48902 of 49265)
PASS: LLVM :: tools/llvm-readobj/cxx-cli-aux.test (48903 of 49265)
PASS: LLVM :: tools/llvm-readobj/coff-resources.test (48904 of 49265)
PASS: LLVM :: tools/llvm-readobj/elf-dtflags.test (48905 of 49265)
PASS: LLVM :: tools/llvm-readobj/coff-load-config.test (48906 of 49265)
PASS: LLVM :: tools/llvm-readobj/dyn-symbols.test (48907 of 49265)
PASS: LLVM :: tools/llvm-readobj/elf-dynamic-empty.test (48908 of 49265)
PASS: LLVM :: tools/llvm-readobj/elf-broken-dynsym-link.test (48909 of 49265)
PASS: LLVM :: tools/llvm-readobj/elf-dynamic-table-dtnull.s (48910 of 49265)
PASS: LLVM :: tools/llvm-readobj/elf-dynamic-no-pt-dynamic.test (48911 of 49265)
PASS: LLVM :: tools/llvm-readobj/elf-dynamic-not-in-pt-dynamic.test (48912 of 49265)
PASS: LLVM :: tools/llvm-readobj/demangle.test (48913 of 49265)
PASS: LLVM :: tools/llvm-readobj/elf-dynamic-tags.test (48914 of 49265)
PASS: LLVM :: tools/llvm-readobj/elf-gnuhash.test (48915 of 49265)
PASS: LLVM :: tools/llvm-readobj/elf-hidden-versym.test (48916 of 49265)
PASS: LLVM :: tools/llvm-readobj/elf-dynamic-malformed.test (48917 of 49265)
PASS: LLVM :: tools/llvm-readobj/elf-invalid-shstrndx.test (48918 of 49265)
PASS: LLVM :: tools/llvm-readobj/elf-dynamic-tags-machine-specific.test (48919 of 49265)
PASS: LLVM :: tools/llvm-readobj/elf-linker-options.ll (48920 of 49265)
PASS: LLVM :: tools/llvm-readobj/elf-groups.test (48921 of 49265)
PASS: LLVM :: tools/llvm-readobj/elf-hash-histogram.test (48922 of 49265)
PASS: LLVM :: tools/llvm-readobj/elf-invalid-versioning.test (48923 of 49265)
PASS: LLVM :: tools/llvm-readobj/elf-no-phdrs.test (48924 of 49265)
PASS: LLVM :: tools/llvm-readobj/elf-no-shdrs.test (48925 of 49265)
PASS: LLVM :: tools/llvm-readobj/elf-malformed-pt-dynamic.test (48926 of 49265)
PASS: LLVM :: tools/llvm-readobj/elf-non-dynamic-in-pt-dynamic.test (48927 of 49265)
PASS: LLVM :: tools/llvm-readobj/elf-no-action.test (48928 of 49265)
PASS: LLVM :: tools/llvm-readobj/elf-machine-specific-section-types.test (48929 of 49265)
PASS: LLVM :: tools/llvm-readobj/elf-packed-relocs-empty.s (48930 of 49265)
PASS: LLVM :: tools/llvm-readobj/elf-no-relocs.test (48931 of 49265)
PASS: LLVM :: tools/llvm-readobj/elf-packed-relocs-error1.s (48932 of 49265)
PASS: LLVM :: tools/llvm-readobj/elf-packed-relocs-error2.s (48933 of 49265)
PASS: LLVM :: tools/llvm-readobj/elf-packed-relocs-error3.s (48934 of 49265)
PASS: LLVM :: tools/llvm-readobj/elf-packed-relocs-error5.s (48935 of 49265)
PASS: LLVM :: tools/llvm-readobj/elf-packed-relocs-error4.s (48936 of 49265)
PASS: LLVM :: tools/llvm-readobj/elf-sec-compressed.test (48937 of 49265)
PASS: LLVM :: tools/llvm-readobj/elf-reloc-symbol-with-versioning.test (48938 of 49265)
PASS: LLVM :: tools/llvm-readobj/elf-packed-relocs.test (48939 of 49265)
PASS: LLVM :: tools/llvm-readobj/elf-reloc-negative-addend-no-sym.test (48940 of 49265)
PASS: LLVM :: tools/llvm-readobj/elf-reloc-zero-name-or-value.test (48941 of 49265)
PASS: LLVM :: tools/llvm-readobj/elf-section-types.test (48942 of 49265)
PASS: LLVM :: tools/llvm-readobj/elf-sec-flags.test (48943 of 49265)
PASS: LLVM :: tools/llvm-readobj/elf-relr-relocs.test (48944 of 49265)
PASS: LLVM :: tools/llvm-readobj/elf-symbol-64bit.test (48945 of 49265)
PASS: LLVM :: tools/llvm-readobj/elf-symbol-types.test (48946 of 49265)
PASS: LLVM :: tools/llvm-readobj/elf-symbol-binding.test (48947 of 49265)
PASS: LLVM :: tools/llvm-readobj/elf-symbol-visibility.test (48948 of 49265)
PASS: LLVM :: tools/llvm-readobj/elf-symbol-shndx.test (48949 of 49265)
PASS: LLVM :: tools/llvm-readobj/elf-versioninfo.test (48950 of 49265)
PASS: LLVM :: tools/llvm-readobj/elf-wrong-shstrtab-type.test (48951 of 49265)
PASS: LLVM :: tools/llvm-readobj/gnu-hash-symbols.test (48952 of 49265)
PASS: LLVM :: tools/llvm-readobj/gnu-file-headers.test (48953 of 49265)
PASS: LLVM :: tools/llvm-readobj/gnu-section-mapping-no-phdrs.test (48954 of 49265)
PASS: LLVM :: tools/llvm-readobj/gnu-note-size.test (48955 of 49265)
PASS: LLVM :: tools/llvm-readobj/file-headers.test (48956 of 49265)
PASS: LLVM :: tools/llvm-readobj/headers.test (48957 of 49265)
PASS: LLVM :: tools/llvm-readobj/gnu-section-mapping-no-shdrs.test (48958 of 49265)
PASS: LLVM :: tools/llvm-readobj/gnu-phdrs.test (48959 of 49265)
PASS: LLVM :: tools/llvm-readobj/gnu-notes.test (48960 of 49265)
PASS: LLVM :: tools/llvm-readobj/elf-types.test (48961 of 49265)
PASS: LLVM :: tools/llvm-readobj/gnu-sections.test (48962 of 49265)
PASS: LLVM :: tools/llvm-readobj/macho-needed-libs.test (48963 of 49265)
PASS: LLVM :: tools/llvm-readobj/imports.test (48964 of 49265)
PASS: LLVM :: tools/llvm-readobj/gnu-symbols.test (48965 of 49265)
PASS: LLVM :: tools/llvm-readobj/hex-dump-multi.s (48966 of 49265)
PASS: LLVM :: tools/llvm-readobj/many-sections.s (48967 of 49265)
PASS: LLVM :: tools/llvm-readobj/macho-universal-x86_64.i386.test (48968 of 49265)
PASS: LLVM :: tools/llvm-readobj/mips-got-overlapped.test (48969 of 49265)
PASS: LLVM :: tools/llvm-readobj/mips-options-sec.test (48970 of 49265)
PASS: LLVM :: tools/llvm-readobj/mips-options.test (48971 of 49265)
PASS: LLVM :: tools/llvm-readobj/mips-abiflags.test (48972 of 49265)
PASS: LLVM :: tools/llvm-readobj/merged.test (48973 of 49265)
PASS: LLVM :: tools/llvm-readobj/mips-reginfo.test (48974 of 49265)
PASS: LLVM :: tools/llvm-readobj/mips-rld-map-rel.test (48975 of 49265)
PASS: LLVM :: tools/llvm-readobj/mips-st-other.test (48976 of 49265)
PASS: LLVM :: tools/llvm-readobj/mips-plt.test (48977 of 49265)
PASS: LLVM :: tools/llvm-readobj/hex-dump.test (48978 of 49265)
PASS: LLVM :: tools/llvm-readobj/mips-got.test (48979 of 49265)
PASS: LLVM :: tools/llvm-readobj/note-generic.s (48980 of 49265)
PASS: LLVM :: tools/llvm-readobj/peplus.test (48981 of 49265)
PASS: LLVM :: tools/llvm-readobj/ppc64-glink.test (48982 of 49265)
PASS: LLVM :: tools/llvm-readobj/note-gnu-property2.s (48983 of 49265)
PASS: LLVM :: tools/llvm-readobj/note-unknown.s (48984 of 49265)
PASS: LLVM :: tools/llvm-readobj/note-gnu-property.s (48985 of 49265)
PASS: LLVM :: tools/llvm-readobj/program-headers.test (48986 of 49265)
PASS: LLVM :: tools/llvm-readobj/reloc-types-coff-x64.test (48987 of 49265)
PASS: LLVM :: tools/llvm-readobj/reloc-types-coff-i386.test (48988 of 49265)
PASS: LLVM :: tools/llvm-readobj/readelf-s-alias.test (48989 of 49265)
PASS: LLVM :: tools/llvm-readobj/reloc-types-elf-aarch64.test (48990 of 49265)
PASS: LLVM :: tools/llvm-readobj/reloc-types-elf-arm.test (48991 of 49265)
PASS: LLVM :: tools/llvm-readobj/reloc-types-elf-i386.test (48992 of 49265)
PASS: LLVM :: tools/llvm-readobj/reloc-types-elf-mips.test (48993 of 49265)
PASS: LLVM :: tools/llvm-readobj/reloc-types-elf-ppc64.test (48994 of 49265)
PASS: LLVM :: tools/llvm-readobj/reloc-types-elf-lanai.test (48995 of 49265)
PASS: LLVM :: tools/llvm-readobj/reloc-types-elf-mips64.test (48996 of 49265)
PASS: LLVM :: tools/llvm-readobj/reloc-types-macho-arm.test (48997 of 49265)
PASS: LLVM :: tools/llvm-readobj/reloc-types-macho-i386.test (48998 of 49265)
PASS: LLVM :: tools/llvm-readobj/reloc-types-macho-x64.test (48999 of 49265)
PASS: LLVM :: tools/llvm-readobj/res-resources.test (49000 of 49265)
PASS: LLVM :: tools/llvm-readobj/rpath.test (49001 of 49265)
PASS: LLVM :: tools/llvm-readobj/reloc-types-elf-x64.test (49002 of 49265)
PASS: LLVM :: tools/llvm-readobj/string-dump-multi.s (49003 of 49265)
PASS: LLVM :: tools/llvm-readobj/relocations.test (49004 of 49265)
PASS: LLVM :: tools/llvm-readobj/sections.test (49005 of 49265)
PASS: LLVM :: tools/llvm-readobj/sections-ext.test (49006 of 49265)
PASS: LLVM :: tools/llvm-readobj/symbols.test (49007 of 49265)
PASS: LLVM :: tools/llvm-readobj/thin-archive-paths.test (49008 of 49265)
PASS: LLVM :: tools/llvm-readobj/unwind-arm64-windows.test (49009 of 49265)
PASS: LLVM :: tools/llvm-readobj/wasm-imports.test (49010 of 49265)
PASS: LLVM :: tools/llvm-readobj/unwind.test (49011 of 49265)
PASS: LLVM :: tools/llvm-readobj/wasm-invalid.test (49012 of 49265)
PASS: LLVM :: tools/llvm-readobj/thin-archive.test (49013 of 49265)
PASS: LLVM :: tools/llvm-readobj/xcoff-basic.test (49014 of 49265)
PASS: LLVM :: tools/llvm-readobj/xcoff-sections.test (49015 of 49265)
PASS: LLVM :: tools/llvm-size/X86/elf-sizes.test (49016 of 49265)
PASS: LLVM :: tools/llvm-size/X86/ignore-sections.s (49017 of 49265)
PASS: LLVM :: tools/llvm-size/X86/format-berkeley-tabs.s (49018 of 49265)
PASS: LLVM :: tools/llvm-readobj/string-dump.test (49019 of 49265)
PASS: LLVM :: tools/llvm-size/basic.test (49020 of 49265)
PASS: LLVM :: tools/llvm-size/darwin-m.test (49021 of 49265)
PASS: LLVM :: tools/llvm-size/X86/test-common.s (49022 of 49265)
PASS: LLVM :: tools/llvm-size/help.test (49023 of 49265)
PASS: LLVM :: tools/llvm-split/comdat.ll (49024 of 49265)
PASS: LLVM :: tools/llvm-split/global.ll (49025 of 49265)
PASS: LLVM :: tools/llvm-split/alias.ll (49026 of 49265)
PASS: LLVM :: tools/llvm-split/internal.ll (49027 of 49265)
PASS: LLVM :: tools/llvm-split/extern_linkage.ll (49028 of 49265)
PASS: LLVM :: tools/llvm-split/function.ll (49029 of 49265)
PASS: LLVM :: tools/llvm-split/blockaddress.ll (49030 of 49265)
PASS: LLVM :: tools/llvm-split/scc-comdat.ll (49031 of 49265)
PASS: LLVM :: tools/llvm-split/scc-callchain.ll (49032 of 49265)
PASS: LLVM :: tools/llvm-split/scc-const-alias.ll (49033 of 49265)
PASS: LLVM :: tools/llvm-split/personality.ll (49034 of 49265)
PASS: LLVM :: tools/llvm-split/preserve-locals.ll (49035 of 49265)
PASS: LLVM :: tools/llvm-split/scc-alias.ll (49036 of 49265)
PASS: LLVM :: tools/llvm-split/scc-constants.ll (49037 of 49265)
PASS: LLVM :: tools/llvm-split/unnamed.ll (49038 of 49265)
PASS: LLVM :: tools/llvm-strings/all-sections.test (49039 of 49265)
PASS: LLVM :: tools/llvm-split/scc-cycle.ll (49040 of 49265)
PASS: LLVM :: tools/llvm-split/scc-global2global.ll (49041 of 49265)
PASS: LLVM :: tools/llvm-split/scc-global-alias.ll (49042 of 49265)
PASS: LLVM :: tools/llvm-strings/archive-filename.test (49043 of 49265)
PASS: LLVM :: tools/llvm-strings/file-filename.test (49044 of 49265)
PASS: LLVM :: tools/llvm-strings/negative-char.test (49045 of 49265)
PASS: LLVM :: tools/llvm-strings/help.test (49046 of 49265)
PASS: LLVM :: tools/llvm-strings/nested-archives.test (49047 of 49265)
PASS: LLVM :: tools/llvm-strings/radix-filename.test (49048 of 49265)
PASS: LLVM :: tools/llvm-strings/length.test (49049 of 49265)
PASS: LLVM :: tools/llvm-strings/radix.test (49050 of 49265)
PASS: LLVM :: tools/llvm-strings/terminator-neg.test (49051 of 49265)
UNSUPPORTED: LLVM :: tools/llvm-symbolizer/coff-dwarf.test (49052 of 49265)
UNSUPPORTED: LLVM :: tools/llvm-symbolizer/coff-exports.test (49053 of 49265)
PASS: LLVM :: tools/llvm-strings/stdin-filename.test (49054 of 49265)
PASS: LLVM :: tools/llvm-strings/whitespace.test (49055 of 49265)
PASS: LLVM :: tools/llvm-strings/terminator.test (49056 of 49265)
PASS: LLVM :: tools/llvm-symbolizer/dwo.test (49057 of 49265)
PASS: LLVM :: tools/llvm-symbolizer/basenames.s (49058 of 49265)
PASS: LLVM :: tools/llvm-symbolizer/dsym.test (49059 of 49265)
PASS: LLVM :: tools/llvm-symbolizer/adjust-vma.s (49060 of 49265)
PASS: LLVM :: tools/llvm-symbolizer/basic.s (49061 of 49265)
PASS: LLVM :: tools/llvm-symbolizer/fission-ranges.test (49062 of 49265)
PASS: LLVM :: tools/llvm-symbolizer/frame-fortran.s (49063 of 49265)
PASS: LLVM :: tools/llvm-symbolizer/fat.test (49064 of 49265)
PASS: LLVM :: tools/llvm-symbolizer/flag-grouping.test (49065 of 49265)
PASS: LLVM :: tools/llvm-symbolizer/demangle.s (49066 of 49265)
PASS: LLVM :: tools/llvm-symbolizer/frame-types.s (49067 of 49265)
PASS: LLVM :: tools/llvm-symbolizer/help.test (49068 of 49265)
PASS: LLVM :: tools/llvm-symbolizer/flush-output.s (49069 of 49265)
PASS: LLVM :: tools/llvm-symbolizer/frame.s (49070 of 49265)
PASS: LLVM :: tools/llvm-symbolizer/invalid-input-address.test (49071 of 49265)
PASS: LLVM :: tools/llvm-symbolizer/ignore-undefined-symbols.s (49072 of 49265)
UNSUPPORTED: LLVM :: tools/llvm-symbolizer/pdb/missing_pdb.test (49073 of 49265)
UNSUPPORTED: LLVM :: tools/llvm-symbolizer/pdb/pdb.test (49074 of 49265)
UNSUPPORTED: LLVM :: tools/llvm-symbolizer/padding-x86_64.ll (49075 of 49265)
PASS: LLVM :: tools/llvm-symbolizer/only-empty-ranges.s (49076 of 49265)
PASS: LLVM :: tools/llvm-symbolizer/functions.s (49077 of 49265)
PASS: LLVM :: tools/llvm-symbolizer/ppc64.test (49078 of 49265)
PASS: LLVM :: tools/llvm-symbolizer/output-style-empty-line.test (49079 of 49265)
PASS: LLVM :: tools/llvm-symbolizer/output-style-inlined.test (49080 of 49265)
PASS: LLVM :: tools/llvm-symbolizer/output-style-column.test (49081 of 49265)
PASS: LLVM :: tools/llvm-symbolizer/print_context.c (49082 of 49265)
PASS: LLVM :: tools/llvm-symbolizer/split-debug.test (49083 of 49265)
PASS: LLVM :: tools/llvm-symbolizer/space-in-path.s (49084 of 49265)
PASS: LLVM :: tools/llvm-symbolizer/split-dwarf-addr-object-relocation.test (49085 of 49265)
PASS: LLVM :: tools/llvm-symbolizer/split-dwarf-dwp.test (49086 of 49265)
PASS: LLVM :: tools/llvm-symbolizer/sym-verbose.test (49087 of 49265)
PASS: LLVM :: tools/llvm-symbolizer/split-dwarf-multiple-cu.test (49088 of 49265)
PASS: LLVM :: tools/llvm-symbolizer/split-dwarf.test (49089 of 49265)
PASS: LLVM :: tools/llvm-xray/X86/bad-instrmap-sizes.txt (49090 of 49265)
PASS: LLVM :: tools/llvm-xray/X86/account-simple-case.yaml (49091 of 49265)
PASS: LLVM :: tools/llvm-xray/X86/account-keep-going.yaml (49092 of 49265)
PASS: LLVM :: tools/llvm-symbolizer/sym.test (49093 of 49265)
PASS: LLVM :: tools/llvm-xray/X86/account-deduce-tail-call.yaml (49094 of 49265)
PASS: LLVM :: tools/llvm-xray/X86/account-empty-stack-error.yaml (49095 of 49265)
PASS: LLVM :: tools/llvm-xray/X86/convert-fdr-arg1-to-yaml.txt (49096 of 49265)
PASS: LLVM :: tools/llvm-xray/X86/convert-fdr-log-arg1-version3-to-yaml.txt (49097 of 49265)
PASS: LLVM :: tools/llvm-xray/X86/convert-basic-arg1-to-yaml.txt (49098 of 49265)
PASS: LLVM :: tools/llvm-xray/X86/convert-basic-log-arg1-version3-to-yaml.txt (49099 of 49265)
PASS: LLVM :: tools/llvm-xray/X86/convert-fdr-log-version3-to-yaml.txt (49100 of 49265)
PASS: LLVM :: tools/llvm-xray/X86/account-simple-sorting.yaml (49101 of 49265)
PASS: LLVM :: tools/llvm-xray/X86/convert-basic-log-version3-to-yaml.txt (49102 of 49265)
PASS: LLVM :: tools/llvm-xray/X86/convert-fdr-to-yaml.txt (49103 of 49265)
PASS: LLVM :: tools/llvm-xray/X86/convert-to-yaml.txt (49104 of 49265)
PASS: LLVM :: tools/llvm-xray/X86/convert-roundtrip.yaml (49105 of 49265)
PASS: LLVM :: tools/llvm-xray/X86/convert-with-standalone-instrmap.txt (49106 of 49265)
PASS: LLVM :: tools/llvm-xray/X86/convert-with-yaml-instrmap.txt (49107 of 49265)
PASS: LLVM :: tools/llvm-xray/X86/convert-with-debug-syms.txt (49108 of 49265)
PASS: LLVM :: tools/llvm-xray/X86/extract-instrmap-macho.ll (49109 of 49265)
PASS: LLVM :: tools/llvm-xray/X86/empty.txt (49110 of 49265)
PASS: LLVM :: tools/llvm-xray/X86/extract-all-sledtypes.txt (49111 of 49265)
PASS: LLVM :: tools/llvm-xray/X86/extract-instrmap-pie.ll (49112 of 49265)
PASS: LLVM :: tools/llvm-xray/X86/extract-instrmap-symbolize.ll (49113 of 49265)
PASS: LLVM :: tools/llvm-xray/X86/extract-instrmap.ll (49114 of 49265)
PASS: LLVM :: tools/llvm-xray/X86/fdr-dump-arg1-version-3.txt (49115 of 49265)
PASS: LLVM :: tools/llvm-xray/X86/fdr-dump-arg1.txt (49116 of 49265)
PASS: LLVM :: tools/llvm-xray/X86/graph-zero-latency-calls.yaml (49117 of 49265)
PASS: LLVM :: tools/llvm-xray/X86/no-instr-map.txt (49118 of 49265)
PASS: LLVM :: tools/llvm-xray/X86/graph-color-simple-case.yaml (49119 of 49265)
PASS: LLVM :: tools/llvm-xray/X86/no-subcommand-noassert.txt (49120 of 49265)
PASS: LLVM :: tools/llvm-xray/X86/no-such-file.txt (49121 of 49265)
PASS: LLVM :: tools/llvm-xray/X86/graph-deduce-tail-call.yaml (49122 of 49265)
PASS: LLVM :: tools/llvm-xray/X86/stack-empty-case.yaml (49123 of 49265)
PASS: LLVM :: tools/llvm-xray/X86/stack-keep-going.yaml (49124 of 49265)
PASS: LLVM :: tools/llvm-xray/X86/graph-simple-case.yaml (49125 of 49265)
PASS: LLVM :: tools/llvm-xray/X86/stack-simple-case.yaml (49126 of 49265)
PASS: LLVM :: tools/llvm-xray/X86/unsupported-elf32.txt (49127 of 49265)
PASS: LLVM :: tools/llvm-xray/X86/stack-multithread.yaml (49128 of 49265)
PASS: LLVM :: tools/obj2yaml/aix_xcoff.test (49129 of 49265)
PASS: LLVM :: tools/obj2yaml/aix_xcoff_truncated_file_header.test (49130 of 49265)
PASS: LLVM :: tools/llvm-xray/X86/graph-diff-simple.txt (49131 of 49265)
PASS: LLVM :: tools/obj2yaml/basic-minidump.yaml (49132 of 49265)
PASS: LLVM :: tools/obj2yaml/coff-long-section-name.test (49133 of 49265)
PASS: LLVM :: tools/obj2yaml/coff-long-file-symbol.test (49134 of 49265)
PASS: LLVM :: tools/obj2yaml/coff-section-aux-symbol.test (49135 of 49265)
PASS: LLVM :: tools/obj2yaml/coff-weak-external.test (49136 of 49265)
PASS: LLVM :: tools/obj2yaml/dynamic-section.test (49137 of 49265)
PASS: LLVM :: tools/obj2yaml/duplicate-symbol-and-section-names.test (49138 of 49265)
PASS: LLVM :: tools/obj2yaml/elf-entsize.yaml (49139 of 49265)
PASS: LLVM :: tools/obj2yaml/elf-gnu-unique-symbols.yaml (49140 of 49265)
PASS: LLVM :: tools/obj2yaml/dynamic-section-arch-tags.test (49141 of 49265)
PASS: LLVM :: tools/obj2yaml/invalid_input_file.test (49142 of 49265)
PASS: LLVM :: tools/obj2yaml/elf-reladyn-section-shinfo.yaml (49143 of 49265)
PASS: LLVM :: tools/obj2yaml/elf-shinfo.yaml (49144 of 49265)
PASS: LLVM :: tools/obj2yaml/missing_symtab.test (49145 of 49265)
PASS: LLVM :: tools/obj2yaml/no-symbol-reloc.test (49146 of 49265)
PASS: LLVM :: tools/obj2yaml/section-group.test (49147 of 49265)
PASS: LLVM :: tools/obj2yaml/section-type.yaml (49148 of 49265)
PASS: LLVM :: tools/obj2yaml/sections-info.yaml (49149 of 49265)
PASS: LLVM :: tools/obj2yaml/symbol-type.yaml (49150 of 49265)
PASS: LLVM :: tools/obj2yaml/verdef-section.yaml (49151 of 49265)
PASS: LLVM :: tools/obj2yaml/special-symbol-indices.yaml (49152 of 49265)
UNSUPPORTED: LLVM :: tools/opt-viewer/basic.test (49153 of 49265)
UNSUPPORTED: LLVM :: tools/opt-viewer/filter.test (49154 of 49265)
UNSUPPORTED: LLVM :: tools/opt-viewer/suppress.test (49155 of 49265)
UNSUPPORTED: LLVM :: tools/opt-viewer/unicode-function-name.test (49156 of 49265)
PASS: LLVM :: tools/obj2yaml/verneed-section.yaml (49157 of 49265)
UNSUPPORTED: LLVM :: tools/sancov/blacklist.test (49158 of 49265)
UNSUPPORTED: LLVM :: tools/sancov/covered_functions.test (49159 of 49265)
UNSUPPORTED: LLVM :: tools/sancov/merge.test (49160 of 49265)
UNSUPPORTED: LLVM :: tools/sancov/not_covered_functions.test (49161 of 49265)
UNSUPPORTED: LLVM :: tools/sancov/print.test (49162 of 49265)
PASS: LLVM :: tools/obj2yaml/versym-section.yaml (49163 of 49265)
UNSUPPORTED: LLVM :: tools/sancov/stats.test (49164 of 49265)
UNSUPPORTED: LLVM :: tools/sancov/symbolize.test (49165 of 49265)
UNSUPPORTED: LLVM :: tools/sancov/symbolize_noskip_dead_files.test (49166 of 49265)
UNSUPPORTED: LLVM :: tools/sancov/validation.test (49167 of 49265)
PASS: LLVM :: tools/llvm-readobj/many-sections2.s (49168 of 49265)
PASS: LLVM :: tools/yaml2obj/coff-arm64.yaml (49169 of 49265)
PASS: LLVM :: tools/lto/no-bitcode.s (49170 of 49265)
PASS: LLVM :: tools/yaml2obj/coff-symbol-index.yaml (49171 of 49265)
PASS: LLVM :: tools/lto/print-stats.ll (49172 of 49265)
PASS: LLVM :: tools/yaml2obj/duplicate-section-names.test (49173 of 49265)
PASS: LLVM :: tools/yaml2obj/duplicate-symbol-names.test (49174 of 49265)
PASS: LLVM :: tools/yaml2obj/dynamic-section-i386.test (49175 of 49265)
PASS: LLVM :: tools/yaml2obj/dynamic-section.yaml (49176 of 49265)
PASS: LLVM :: tools/yaml2obj/dynamic-section-raw-content.yaml (49177 of 49265)
PASS: LLVM :: tools/lto/hide-linkonce-odr.ll (49178 of 49265)
PASS: LLVM :: tools/lto/opt-level.ll (49179 of 49265)
PASS: LLVM :: tools/sancov/AArch64/print_coverage_pcs.test (49180 of 49265)
PASS: LLVM :: tools/yaml2obj/dynamic-symbols.yaml (49181 of 49265)
PASS: LLVM :: tools/yaml2obj/elf-abiversion.yaml (49182 of 49265)
PASS: LLVM :: tools/yaml2obj/elf-comdat-broken-info.yaml (49183 of 49265)
PASS: LLVM :: tools/yaml2obj/dynsymtab-shlink.yaml (49184 of 49265)
PASS: LLVM :: tools/yaml2obj/elf-ent-size.yaml (49185 of 49265)
PASS: LLVM :: tools/yaml2obj/elf-comdat-broken.yaml (49186 of 49265)
PASS: LLVM :: tools/yaml2obj/elf-header-elfdatanone.yaml (49187 of 49265)
PASS: LLVM :: tools/yaml2obj/dynsymtab-implicit-sections-size-content.yaml (49188 of 49265)
PASS: LLVM :: tools/yaml2obj/elf-gnu-unique-symbols.yaml (49189 of 49265)
PASS: LLVM :: tools/sanstats/elf.test (49190 of 49265)
PASS: LLVM :: tools/yaml2obj/elf-symbols-binding-order.yaml (49191 of 49265)
PASS: LLVM :: tools/yaml2obj/elf-symtab-shtype.yaml (49192 of 49265)
PASS: LLVM :: tools/yaml2obj/elf-symtab-shinfo.yaml (49193 of 49265)
PASS: LLVM :: tools/yaml2obj/elf-header-sh-fields.yaml (49194 of 49265)
PASS: LLVM :: tools/yaml2obj/elf-override-shoffset.yaml (49195 of 49265)
PASS: LLVM :: tools/yaml2obj/elf-override-shsize.yaml (49196 of 49265)
PASS: LLVM :: tools/yaml2obj/empty-or-invalid-doc.yaml (49197 of 49265)
PASS: LLVM :: tools/yaml2obj/empty-symbols.yaml (49198 of 49265)
PASS: LLVM :: tools/yaml2obj/implicit-sections-addr.yaml (49199 of 49265)
PASS: LLVM :: tools/yaml2obj/invalid_output_file.test (49200 of 49265)
PASS: LLVM :: tools/yaml2obj/implicit-sections-info.yaml (49201 of 49265)
PASS: LLVM :: tools/yaml2obj/implicit-sections-types.test (49202 of 49265)
PASS: LLVM :: tools/yaml2obj/explicit-dynsym-no-dynstr.yaml (49203 of 49265)
PASS: LLVM :: tools/yaml2obj/invalid-symboless-relocation.yaml (49204 of 49265)
PASS: LLVM :: tools/yaml2obj/implicit-sections.test (49205 of 49265)
PASS: LLVM :: tools/yaml2obj/minidump-raw-stream-small-size.yaml (49206 of 49265)
PASS: LLVM :: tools/yaml2obj/minidump-systeminfo-other-long.yaml (49207 of 49265)
PASS: LLVM :: tools/yaml2obj/minidump-systeminfo-other-not-hex.yaml (49208 of 49265)
PASS: LLVM :: tools/yaml2obj/minidump-systeminfo-x86-long.yaml (49209 of 49265)
PASS: LLVM :: tools/yaml2obj/minidump-systeminfo-other-short.yaml (49210 of 49265)
PASS: LLVM :: tools/yaml2obj/local-symbols.yaml (49211 of 49265)
PASS: LLVM :: tools/yaml2obj/minidump-systeminfo-x86-short.yaml (49212 of 49265)
PASS: LLVM :: tools/yaml2obj/missing_document_tag.yaml (49213 of 49265)
PASS: LLVM :: tools/yaml2obj/reloc-sec-info.yaml (49214 of 49265)
PASS: LLVM :: tools/yaml2obj/program-header-align.yaml (49215 of 49265)
PASS: LLVM :: tools/yaml2obj/program-header-nobits.yaml (49216 of 49265)
PASS: LLVM :: tools/yaml2obj/program-header-size-offset.yaml (49217 of 49265)
PASS: LLVM :: tools/yaml2obj/relocation-missing-symbol.yaml (49218 of 49265)
PASS: LLVM :: tools/yaml2obj/program-header.yaml (49219 of 49265)
PASS: LLVM :: tools/yaml2obj/relocation-explicit-symbol-index.yaml (49220 of 49265)
PASS: LLVM :: tools/yaml2obj/section-ordering.yaml (49221 of 49265)
PASS: LLVM :: tools/yaml2obj/section-type.yaml (49222 of 49265)
PASS: LLVM :: tools/yaml2obj/section-link.yaml (49223 of 49265)
PASS: LLVM :: tools/yaml2obj/symbol-index-invalid.yaml (49224 of 49265)
PASS: LLVM :: tools/yaml2obj/symbol-type.yaml (49225 of 49265)
PASS: LLVM :: tools/yaml2obj/section-size-content.yaml (49226 of 49265)
PASS: LLVM :: tools/yaml2obj/symbol-index.yaml (49227 of 49265)
PASS: LLVM :: tools/yaml2obj/strtab-implicit-sections-flags.yaml (49228 of 49265)
PASS: LLVM :: tools/yaml2obj/strtab-implicit-sections-size-content.yaml (49229 of 49265)
PASS: LLVM :: tools/yaml2obj/symboless-relocation.yaml (49230 of 49265)
PASS: LLVM :: tools/yaml2obj/symbol-name.yaml (49231 of 49265)
PASS: LLVM :: tools/yaml2obj/unsupported_document_tag.yaml (49232 of 49265)
PASS: LLVM :: tools/yaml2obj/unnamed-section.yaml (49233 of 49265)
PASS: LLVM :: tools/yaml2obj/verneed-section.yaml (49234 of 49265)
PASS: LLVM :: tools/yaml2obj/verdef-section.yaml (49235 of 49265)
PASS: LLVM :: tools/yaml2obj/symtab-shlink.yaml (49236 of 49265)
PASS: LLVM :: tools/yaml2obj/symtab-implicit-sections-flags.yaml (49237 of 49265)
PASS: LLVM :: tools/yaml2obj/versym-section.yaml (49238 of 49265)
PASS: LLVM :: tools/yaml2obj/symtab-implicit-sections-size-content.yaml (49239 of 49265)
PASS: lit :: boolean-parsing.py (49240 of 49265)
PASS: LLVM :: tools/sancov/print_coverage_pcs.test (49241 of 49265)
PASS: lit :: googletest-upstream-format.py (49242 of 49265)
PASS: lit :: googletest-format.py (49243 of 49265)
PASS: lit :: parallelism-groups.py (49244 of 49265)
PASS: lit :: shtest-encoding.py (49245 of 49265)
PASS: lit :: progress-bar.py (49246 of 49265)
PASS: lit :: shell-parsing.py (49247 of 49265)
PASS: lit :: shtest-output-printing.py (49248 of 49265)
PASS: lit :: shtest-run-at-line.py (49249 of 49265)
PASS: lit :: shtest-format.py (49250 of 49265)
PASS: lit :: lit-opts.py (49251 of 49265)
PASS: lit :: test-data-micro.py (49252 of 49265)
PASS: lit :: test-data.py (49253 of 49265)
PASS: lit :: test-output-micro.py (49254 of 49265)
PASS: lit :: test-output.py (49255 of 49265)
PASS: lit :: unit/ShUtil.py (49256 of 49265)
PASS: lit :: unit/TestRunner.py (49257 of 49265)
PASS: lit :: usage.py (49258 of 49265)
PASS: lit :: discovery.py (49259 of 49265)
PASS: lit :: xunit-output.py (49260 of 49265)
PASS: lit :: max-failures.py (49261 of 49265)
PASS: lit :: shtest-shell.py (49262 of 49265)
PASS: lit :: selecting.py (49263 of 49265)
PASS: lit :: googletest-timeout.py (49264 of 49265)
PASS: lit :: shtest-timeout.py (49265 of 49265)
Testing Time: 2311.47s
  Expected Passes    : 48606
  Expected Failures  : 175
  Unsupported Tests  : 484
Completed at: 2019-11-15T22:55:46
@@@@@@
+ echo '@@@ IOSSIM @@@'
IOSSIM

Hide Details

@@@ IOSSIM @@@ + cd clang-build + export 'SANITIZER_IOSSIM_TEST_DEVICE_IDENTIFIER=iPhone 6' + SANITIZER_IOSSIM_TEST_DEVICE_IDENTIFIER='iPhone 6' + ./bin/llvm-lit -v --xunit-xml-output=asan-IOSSimX86_64Config.xunit.xml ./tools/clang/runtime/compiler-rt-bins/test/asan/IOSSimX86_64Config/ llvm-lit: /Users/buildslave/jenkins/workspace/clang-stage1-cmake-RA-expensive/llvm-project/llvm/utils/lit/lit/util.py:408: note: using SDKROOT: u'/Applications/Xcode.app/Contents/Developer/Platforms/MacOSX.platform/Developer/SDKs/MacOSX10.13.sdk' llvm-lit: /Users/buildslave/jenkins/workspace/clang-stage1-cmake-RA-expensive/llvm-project/compiler-rt/test/lit.common.cfg.py:427: warning: Throttling sanitizer tests that require shadow memory on Darwin 64bit {"env": {}} -- Testing: 478 tests, 8 threads -- UNSUPPORTED: AddressSanitizer-x86_64-iossim :: TestCases/Darwin/abort_on_error.cc (1 of 478) UNSUPPORTED: AddressSanitizer-x86_64-iossim :: TestCases/Darwin/asan-symbolize-partial-report-no-external-symbolizer.cc (2 of 478) UNSUPPORTED: AddressSanitizer-x86_64-iossim :: TestCases/Darwin/asan-symbolize-partial-report-with-module-map.cc (3 of 478) UNSUPPORTED: AddressSanitizer-x86_64-iossim :: TestCases/Darwin/asan-symbolize-with-module-map.cc (4 of 478) UNSUPPORTED: AddressSanitizer-x86_64-iossim :: TestCases/Darwin/address-range-limit.mm (5 of 478) UNSUPPORTED: AddressSanitizer-x86_64-iossim :: TestCases/Darwin/asan_gen_prefixes.cc (6 of 478) UNSUPPORTED: AddressSanitizer-x86_64-iossim :: TestCases/Darwin/atos-symbolizer-dyld-root-path.cc (7 of 478) UNSUPPORTED: AddressSanitizer-x86_64-iossim :: TestCases/Darwin/atos-symbolizer.cc (8 of 478) PASS: AddressSanitizer-x86_64-iossim :: TestCases/Darwin/cstring_section.c (9 of 478) UNSUPPORTED: AddressSanitizer-x86_64-iossim :: TestCases/Darwin/dead-strip.c (10 of 478) UNSUPPORTED: AddressSanitizer-x86_64-iossim :: TestCases/Darwin/dladdr-demangling.cc (11 of 478) PASS: AddressSanitizer-x86_64-iossim :: TestCases/Darwin/cstring_literals_regtest.mm (12 of 478) UNSUPPORTED: AddressSanitizer-x86_64-iossim :: TestCases/Darwin/dyld_insert_libraries_reexec.cc (13 of 478) PASS: AddressSanitizer-x86_64-iossim :: TestCases/Darwin/dump_registers.cc (14 of 478) UNSUPPORTED: AddressSanitizer-x86_64-iossim :: TestCases/Darwin/dyld_insert_libraries_remove.cc (15 of 478) PASS: AddressSanitizer-x86_64-iossim :: TestCases/Darwin/fclose.c (16 of 478) PASS: AddressSanitizer-x86_64-iossim :: TestCases/Darwin/empty-section.cc (17 of 478) UNSUPPORTED: AddressSanitizer-x86_64-iossim :: TestCases/Darwin/haswell-symbolication.cc (18 of 478) PASS: AddressSanitizer-x86_64-iossim :: TestCases/Darwin/crashlog-stacktraces.c (19 of 478) UNSUPPORTED: AddressSanitizer-x86_64-iossim :: TestCases/Darwin/interface_symbols_darwin.cc (20 of 478) PASS: AddressSanitizer-x86_64-iossim :: TestCases/Darwin/getpwnam.c (21 of 478) PASS: AddressSanitizer-x86_64-iossim :: TestCases/Darwin/init_for_dlopen.cc (22 of 478) PASS: AddressSanitizer-x86_64-iossim :: TestCases/Darwin/linked-only.cc (23 of 478) PASS: AddressSanitizer-x86_64-iossim :: TestCases/Darwin/malloc_destroy_zone.cc (24 of 478) PASS: AddressSanitizer-x86_64-iossim :: TestCases/Darwin/malloc_set_zone_name-mprotect.cc (25 of 478) PASS: AddressSanitizer-x86_64-iossim :: TestCases/Darwin/malloc_zone-protected.cc (26 of 478) PASS: AddressSanitizer-x86_64-iossim :: TestCases/Darwin/malloc_size_crash.mm (27 of 478) PASS: AddressSanitizer-x86_64-iossim :: TestCases/Darwin/mixing-global-constructors.cc (28 of 478) PASS: AddressSanitizer-x86_64-iossim :: TestCases/Darwin/nil-return-struct.mm (29 of 478) UNSUPPORTED: AddressSanitizer-x86_64-iossim :: TestCases/Darwin/reexec-insert-libraries-env.cc (30 of 478) UNSUPPORTED: AddressSanitizer-x86_64-iossim :: TestCases/Darwin/sandbox-symbolizer.cc (31 of 478) PASS: AddressSanitizer-x86_64-iossim :: TestCases/Darwin/odr-lto.cc (32 of 478) PASS: AddressSanitizer-x86_64-iossim :: TestCases/Darwin/objc-odr.mm (33 of 478) PASS: AddressSanitizer-x86_64-iossim :: TestCases/Darwin/segv_read_write.c (34 of 478) UNSUPPORTED: AddressSanitizer-x86_64-iossim :: TestCases/Darwin/suppressions-function.cc (35 of 478) UNSUPPORTED: AddressSanitizer-x86_64-iossim :: TestCases/Darwin/suppressions-sandbox.cc (36 of 478) UNSUPPORTED: AddressSanitizer-x86_64-iossim :: TestCases/Darwin/unset-insert-libraries-on-exec.cc (37 of 478) UNSUPPORTED: AddressSanitizer-x86_64-iossim :: TestCases/Darwin/uuid.cc (38 of 478) UNSUPPORTED: AddressSanitizer-x86_64-iossim :: TestCases/Linux/abort_on_error.cc (39 of 478) UNSUPPORTED: AddressSanitizer-x86_64-iossim :: TestCases/Linux/activation-options.cc (40 of 478) UNSUPPORTED: AddressSanitizer-x86_64-iossim :: TestCases/Linux/aligned_delete_test.cc (41 of 478) UNSUPPORTED: AddressSanitizer-x86_64-iossim :: TestCases/Linux/allocator_oom_test.cc (42 of 478) UNSUPPORTED: AddressSanitizer-x86_64-iossim :: TestCases/Linux/asan_default_suppressions.cc (43 of 478) UNSUPPORTED: AddressSanitizer-x86_64-iossim :: TestCases/Linux/asan_dlopen_test.cc (44 of 478) UNSUPPORTED: AddressSanitizer-x86_64-iossim :: TestCases/Linux/asan_prelink_test.cc (45 of 478) UNSUPPORTED: AddressSanitizer-x86_64-iossim :: TestCases/Linux/asan_preload_test-1.cc (46 of 478) UNSUPPORTED: AddressSanitizer-x86_64-iossim :: TestCases/Linux/asan_preload_test-2.cc (47 of 478) UNSUPPORTED: AddressSanitizer-x86_64-iossim :: TestCases/Linux/asan_preload_test-3.cc (48 of 478) UNSUPPORTED: AddressSanitizer-x86_64-iossim :: TestCases/Linux/asan_rt_confict_test-1.cc (49 of 478) UNSUPPORTED: AddressSanitizer-x86_64-iossim :: TestCases/Linux/asan_rt_confict_test-2.cc (50 of 478) UNSUPPORTED: AddressSanitizer-x86_64-iossim :: TestCases/Linux/auto_memory_profile_test.cc (51 of 478) UNSUPPORTED: AddressSanitizer-x86_64-iossim :: TestCases/Linux/bzero.cc (52 of 478) UNSUPPORTED: AddressSanitizer-x86_64-iossim :: TestCases/Linux/calloc-preload.c (53 of 478) UNSUPPORTED: AddressSanitizer-x86_64-iossim :: TestCases/Linux/clang_gcc_abi.cc (54 of 478) UNSUPPORTED: AddressSanitizer-x86_64-iossim :: TestCases/Linux/clone_test.cc (55 of 478) UNSUPPORTED: AddressSanitizer-x86_64-iossim :: TestCases/Linux/coverage-missing.cc (56 of 478) UNSUPPORTED: AddressSanitizer-x86_64-iossim :: TestCases/Linux/cuda_test.cc (57 of 478) UNSUPPORTED: AddressSanitizer-x86_64-iossim :: TestCases/Linux/function-sections-are-bad.cc (58 of 478) UNSUPPORTED: AddressSanitizer-x86_64-iossim :: TestCases/Linux/global-overflow-bfd.cc (59 of 478) UNSUPPORTED: AddressSanitizer-x86_64-iossim :: TestCases/Linux/global-overflow-lld.cc (60 of 478) UNSUPPORTED: AddressSanitizer-x86_64-iossim :: TestCases/Linux/globals-gc-sections-lld.cc (61 of 478) UNSUPPORTED: AddressSanitizer-x86_64-iossim :: TestCases/Linux/init-order-dlopen.cc (62 of 478) UNSUPPORTED: AddressSanitizer-x86_64-iossim :: TestCases/Linux/init_fini_sections.cc (63 of 478) UNSUPPORTED: AddressSanitizer-x86_64-iossim :: TestCases/Linux/initialization-bug-any-order.cc (64 of 478) UNSUPPORTED: AddressSanitizer-x86_64-iossim :: TestCases/Linux/interception_malloc_test.cc (65 of 478) UNSUPPORTED: AddressSanitizer-x86_64-iossim :: TestCases/Linux/interception_readdir_r_test.cc (66 of 478) UNSUPPORTED: AddressSanitizer-x86_64-iossim :: TestCases/Linux/interception_test.cc (67 of 478) UNSUPPORTED: AddressSanitizer-x86_64-iossim :: TestCases/Linux/interface_symbols_linux.cc (68 of 478) UNSUPPORTED: AddressSanitizer-x86_64-iossim :: TestCases/Linux/kernel-area.cc (69 of 478) UNSUPPORTED: AddressSanitizer-x86_64-iossim :: TestCases/Linux/leak.cc (70 of 478) UNSUPPORTED: AddressSanitizer-x86_64-iossim :: TestCases/Linux/leak_check_segv.cc (71 of 478) UNSUPPORTED: AddressSanitizer-x86_64-iossim :: TestCases/Linux/local_alias.cc (72 of 478) UNSUPPORTED: AddressSanitizer-x86_64-iossim :: TestCases/Linux/long-object-path.cc (73 of 478) UNSUPPORTED: AddressSanitizer-x86_64-iossim :: TestCases/Linux/longjmp_chk.c (74 of 478) UNSUPPORTED: AddressSanitizer-x86_64-iossim :: TestCases/Linux/malloc-in-qsort.cc (75 of 478) UNSUPPORTED: AddressSanitizer-x86_64-iossim :: TestCases/Linux/malloc_delete_mismatch.cc (76 of 478) UNSUPPORTED: AddressSanitizer-x86_64-iossim :: TestCases/Linux/memmem_test.cc (77 of 478) UNSUPPORTED: AddressSanitizer-x86_64-iossim :: TestCases/Linux/mincore.cc (78 of 478) UNSUPPORTED: AddressSanitizer-x86_64-iossim :: TestCases/Linux/new_delete_mismatch.cc (79 of 478) UNSUPPORTED: AddressSanitizer-x86_64-iossim :: TestCases/Linux/new_delete_mismatch_global.cc (80 of 478) UNSUPPORTED: AddressSanitizer-x86_64-iossim :: TestCases/Linux/new_delete_mismatch_stack.cc (81 of 478) UNSUPPORTED: AddressSanitizer-x86_64-iossim :: TestCases/Linux/nohugepage_test.cc (82 of 478) UNSUPPORTED: AddressSanitizer-x86_64-iossim :: TestCases/Linux/odr-violation.cc (83 of 478) UNSUPPORTED: AddressSanitizer-x86_64-iossim :: TestCases/Linux/odr-vtable.cc (84 of 478) UNSUPPORTED: AddressSanitizer-x86_64-iossim :: TestCases/Linux/odr_c_test.c (85 of 478) UNSUPPORTED: AddressSanitizer-x86_64-iossim :: TestCases/Linux/odr_indicators.cc (86 of 478) UNSUPPORTED: AddressSanitizer-x86_64-iossim :: TestCases/Linux/overflow-in-qsort.cc (87 of 478) UNSUPPORTED: AddressSanitizer-x86_64-iossim :: TestCases/Linux/preinit_test.cc (88 of 478) UNSUPPORTED: AddressSanitizer-x86_64-iossim :: TestCases/Linux/preinstalled_signal.cc (89 of 478) UNSUPPORTED: AddressSanitizer-x86_64-iossim :: TestCases/Linux/print_memory_profile_test.cc (90 of 478) UNSUPPORTED: AddressSanitizer-x86_64-iossim :: TestCases/Linux/printf-fortify-1.c (91 of 478) UNSUPPORTED: AddressSanitizer-x86_64-iossim :: TestCases/Linux/printf-fortify-2.c (92 of 478) UNSUPPORTED: AddressSanitizer-x86_64-iossim :: TestCases/Linux/printf-fortify-3.c (93 of 478) UNSUPPORTED: AddressSanitizer-x86_64-iossim :: TestCases/Linux/printf-fortify-4.c (94 of 478) UNSUPPORTED: AddressSanitizer-x86_64-iossim :: TestCases/Linux/printf-fortify-5.c (95 of 478) UNSUPPORTED: AddressSanitizer-x86_64-iossim :: TestCases/Linux/pthread_create_from_constructor.cc (96 of 478) UNSUPPORTED: AddressSanitizer-x86_64-iossim :: TestCases/Linux/pthread_create_version.cc (97 of 478) UNSUPPORTED: AddressSanitizer-x86_64-iossim :: TestCases/Linux/ptrace.cc (98 of 478) UNSUPPORTED: AddressSanitizer-x86_64-iossim :: TestCases/Linux/quarantine_size_mb.cc (99 of 478) UNSUPPORTED: AddressSanitizer-x86_64-iossim :: TestCases/Linux/read_binary_name_regtest.c (100 of 478) UNSUPPORTED: AddressSanitizer-x86_64-iossim :: TestCases/Linux/recoverable-lsan.cc (101 of 478) UNSUPPORTED: AddressSanitizer-x86_64-iossim :: TestCases/Linux/recvfrom.cc (102 of 478) UNSUPPORTED: AddressSanitizer-x86_64-iossim :: TestCases/Linux/release_to_os_test.cc (103 of 478) UNSUPPORTED: AddressSanitizer-x86_64-iossim :: TestCases/Linux/rlimit_mmap_test.cc (104 of 478) UNSUPPORTED: AddressSanitizer-x86_64-iossim :: TestCases/Linux/sanbox_read_proc_self_maps_test.cc (105 of 478) UNSUPPORTED: AddressSanitizer-x86_64-iossim :: TestCases/Linux/segv_read_write.c (106 of 478) UNSUPPORTED: AddressSanitizer-x86_64-iossim :: TestCases/Linux/shmctl.cc (107 of 478) UNSUPPORTED: AddressSanitizer-x86_64-iossim :: TestCases/Linux/signal_during_stop_the_world.cc (108 of 478) UNSUPPORTED: AddressSanitizer-x86_64-iossim :: TestCases/Linux/sized_delete_test.cc (109 of 478) UNSUPPORTED: AddressSanitizer-x86_64-iossim :: TestCases/Linux/stack-overflow-recovery-mode.cc (110 of 478) UNSUPPORTED: AddressSanitizer-x86_64-iossim :: TestCases/Linux/stack-overflow-sigbus.cc (111 of 478) UNSUPPORTED: AddressSanitizer-x86_64-iossim :: TestCases/Linux/stack-trace-dlclose.cc (112 of 478) UNSUPPORTED: AddressSanitizer-x86_64-iossim :: TestCases/Linux/static_tls.cc (113 of 478) UNSUPPORTED: AddressSanitizer-x86_64-iossim :: TestCases/Linux/stress_dtls.c (114 of 478) UNSUPPORTED: AddressSanitizer-x86_64-iossim :: TestCases/Linux/swapcontext_annotation.cc (115 of 478) UNSUPPORTED: AddressSanitizer-x86_64-iossim :: TestCases/Linux/swapcontext_test.cc (116 of 478) UNSUPPORTED: AddressSanitizer-x86_64-iossim :: TestCases/Linux/syscalls.cc (117 of 478) UNSUPPORTED: AddressSanitizer-x86_64-iossim :: TestCases/Linux/textdomain.c (118 of 478) UNSUPPORTED: AddressSanitizer-x86_64-iossim :: TestCases/Linux/thread_local_quarantine_pthread_join.cc (119 of 478) UNSUPPORTED: AddressSanitizer-x86_64-iossim :: TestCases/Linux/thread_local_quarantine_size_kb.cc (120 of 478) UNSUPPORTED: AddressSanitizer-x86_64-iossim :: TestCases/Linux/uar_signals.cc (121 of 478) UNSUPPORTED: AddressSanitizer-x86_64-iossim :: TestCases/Linux/unpoison_tls.cc (122 of 478) UNSUPPORTED: AddressSanitizer-x86_64-iossim :: TestCases/Linux/vfork.cc (123 of 478) UNSUPPORTED: AddressSanitizer-x86_64-iossim :: TestCases/Posix/asan-sigbus.cpp (124 of 478) PASS: AddressSanitizer-x86_64-iossim :: TestCases/Darwin/scribble.cc (125 of 478) UNSUPPORTED: AddressSanitizer-x86_64-iossim :: TestCases/Posix/asan-symbolize-sanity-test.cc (126 of 478) PASS: AddressSanitizer-x86_64-iossim :: TestCases/Posix/asan_symbolize_script/logging_options_in_help.cc (127 of 478) PASS: AddressSanitizer-x86_64-iossim :: TestCases/Posix/asan-symbolize-bad-path.cc (128 of 478) UNSUPPORTED: AddressSanitizer-x86_64-iossim :: TestCases/Posix/asan_symbolize_script/plugin_no_op_symbolicate.cc (129 of 478) PASS: AddressSanitizer-x86_64-iossim :: TestCases/Posix/asan_symbolize_script/plugin_no_op_help_output.cc (130 of 478) PASS: AddressSanitizer-x86_64-iossim :: TestCases/Posix/asan_symbolize_script/set_log_dest.cc (131 of 478) PASS: AddressSanitizer-x86_64-iossim :: TestCases/Posix/asan_symbolize_script/set_log_level.cc (132 of 478) PASS: AddressSanitizer-x86_64-iossim :: TestCases/Posix/assign_large_valloc_to_global.cc (133 of 478) UNSUPPORTED: AddressSanitizer-x86_64-iossim :: TestCases/Posix/bcmp_test.cc (134 of 478) UNSUPPORTED: AddressSanitizer-x86_64-iossim :: TestCases/Posix/closed-fds.cc (135 of 478) PASS: AddressSanitizer-x86_64-iossim :: TestCases/Posix/asprintf.cc (136 of 478) PASS: AddressSanitizer-x86_64-iossim :: TestCases/Darwin/suppressions-darwin.cc (137 of 478) UNSUPPORTED: AddressSanitizer-x86_64-iossim :: TestCases/Posix/coverage-module-unloaded.cc (138 of 478) UNSUPPORTED: AddressSanitizer-x86_64-iossim :: TestCases/Posix/coverage-reset.cc (139 of 478) UNSUPPORTED: AddressSanitizer-x86_64-iossim :: TestCases/Posix/coverage.cc (140 of 478) PASS: AddressSanitizer-x86_64-iossim :: TestCases/Posix/concurrent_overflow.cc (141 of 478) UNSUPPORTED: AddressSanitizer-x86_64-iossim :: TestCases/Posix/deep_call_stack.cc (142 of 478) PASS: AddressSanitizer-x86_64-iossim :: TestCases/Posix/coverage-fork.cc (143 of 478) PASS: AddressSanitizer-x86_64-iossim :: TestCases/Posix/current_allocated_bytes.cc (144 of 478) PASS: AddressSanitizer-x86_64-iossim :: TestCases/Posix/deep_thread_stack.cc (145 of 478) PASS: AddressSanitizer-x86_64-iossim :: TestCases/Posix/fgets_fputs.cc (146 of 478) PASS: AddressSanitizer-x86_64-iossim :: TestCases/Posix/fread_fwrite.cc (147 of 478) PASS: AddressSanitizer-x86_64-iossim :: TestCases/Posix/freopen.cc (148 of 478) PASS: AddressSanitizer-x86_64-iossim :: TestCases/Posix/free_hook_realloc.cc (149 of 478) UNSUPPORTED: AddressSanitizer-x86_64-iossim :: TestCases/Posix/glob.cc (150 of 478) PASS: AddressSanitizer-x86_64-iossim :: TestCases/Posix/global-registration.c (151 of 478) PASS: AddressSanitizer-x86_64-iossim :: TestCases/Posix/gc-test.cc (152 of 478) PASS: AddressSanitizer-x86_64-iossim :: TestCases/Posix/halt_on_error-signals.c (153 of 478) PASS: AddressSanitizer-x86_64-iossim :: TestCases/Posix/halt_on_error_suppress_equal_pcs.cc (154 of 478) UNSUPPORTED: AddressSanitizer-x86_64-iossim :: TestCases/Posix/handle_abort_on_error.cc (155 of 478) PASS: AddressSanitizer-x86_64-iossim :: TestCases/Posix/halt_on_error-torture.cc (156 of 478) PASS: AddressSanitizer-x86_64-iossim :: TestCases/Posix/init-order-pthread-create.cc (157 of 478) UNSUPPORTED: AddressSanitizer-x86_64-iossim :: TestCases/Posix/invalid-pointer-pairs-threads.cc (158 of 478) PASS: AddressSanitizer-x86_64-iossim :: TestCases/Posix/dlclose-test.cc (159 of 478) PASS: AddressSanitizer-x86_64-iossim :: TestCases/Posix/interception-in-shared-lib-test.cc (160 of 478) PASS: AddressSanitizer-x86_64-iossim :: TestCases/Posix/lto-constmerge-odr.cc (161 of 478) PASS: AddressSanitizer-x86_64-iossim :: TestCases/Posix/large_allocator_unpoisons_on_free.cc (162 of 478) UNSUPPORTED: AddressSanitizer-x86_64-iossim :: TestCases/Posix/new_array_cookie_test.cc (163 of 478) UNSUPPORTED: AddressSanitizer-x86_64-iossim :: TestCases/Posix/new_array_cookie_uaf_test.cc (164 of 478) UNSUPPORTED: AddressSanitizer-x86_64-iossim :: TestCases/Posix/new_array_cookie_with_new_from_class.cc (165 of 478) PASS: AddressSanitizer-x86_64-iossim :: TestCases/Posix/no-fd.cc (166 of 478) PASS: AddressSanitizer-x86_64-iossim :: TestCases/Posix/no_asan_gen_globals.c (167 of 478) PASS: AddressSanitizer-x86_64-iossim :: TestCases/Posix/ioctl.cc (168 of 478) PASS: AddressSanitizer-x86_64-iossim :: TestCases/Posix/print_cmdline.cc (169 of 478) PASS: AddressSanitizer-x86_64-iossim :: TestCases/Posix/readv.cc (170 of 478) UNSUPPORTED: AddressSanitizer-x86_64-iossim :: TestCases/Posix/stack-overflow.cc (171 of 478) PASS: AddressSanitizer-x86_64-iossim :: TestCases/Posix/mmap_limit_mb.cc (172 of 478) PASS: AddressSanitizer-x86_64-iossim :: TestCases/Posix/stack-use-after-return.cc (173 of 478) PASS: AddressSanitizer-x86_64-iossim :: TestCases/Posix/start-deactivated.cc (174 of 478) PASS: AddressSanitizer-x86_64-iossim :: TestCases/Posix/strerror_r_test.cc (175 of 478) PASS: AddressSanitizer-x86_64-iossim :: TestCases/Posix/strchr.c (176 of 478) PASS: AddressSanitizer-x86_64-iossim :: TestCases/Posix/shared-lib-test.cc (177 of 478) PASS: AddressSanitizer-x86_64-iossim :: TestCases/Posix/tsd_dtor_leak.cc (178 of 478) UNSUPPORTED: AddressSanitizer-x86_64-iossim :: TestCases/Posix/wait.cc (179 of 478) UNSUPPORTED: AddressSanitizer-x86_64-iossim :: TestCases/Posix/wait3.cc (180 of 478) UNSUPPORTED: AddressSanitizer-x86_64-iossim :: TestCases/Posix/wait4.cc (181 of 478) UNSUPPORTED: AddressSanitizer-x86_64-iossim :: TestCases/Posix/waitid.cc (182 of 478) PASS: AddressSanitizer-x86_64-iossim :: TestCases/Posix/wcrtomb.c (183 of 478) UNSUPPORTED: AddressSanitizer-x86_64-iossim :: TestCases/Windows/aligned_mallocs.cc (184 of 478) UNSUPPORTED: AddressSanitizer-x86_64-iossim :: TestCases/Windows/allocators_sanity.cc (185 of 478) UNSUPPORTED: AddressSanitizer-x86_64-iossim :: TestCases/Windows/beginthreadex.cc (186 of 478) UNSUPPORTED: AddressSanitizer-x86_64-iossim :: TestCases/Windows/bind_io_completion_callback.cc (187 of 478) UNSUPPORTED: AddressSanitizer-x86_64-iossim :: TestCases/Windows/bitfield.cc (188 of 478) UNSUPPORTED: AddressSanitizer-x86_64-iossim :: TestCases/Windows/bitfield_uaf.cc (189 of 478) UNSUPPORTED: AddressSanitizer-x86_64-iossim :: TestCases/Windows/calloc_left_oob.cc (190 of 478) UNSUPPORTED: AddressSanitizer-x86_64-iossim :: TestCases/Windows/calloc_right_oob.cc (191 of 478) UNSUPPORTED: AddressSanitizer-x86_64-iossim :: TestCases/Windows/calloc_uaf.cc (192 of 478) UNSUPPORTED: AddressSanitizer-x86_64-iossim :: TestCases/Windows/coverage-basic.cc (193 of 478) UNSUPPORTED: AddressSanitizer-x86_64-iossim :: TestCases/Windows/coverage-dll-stdio.cc (194 of 478) UNSUPPORTED: AddressSanitizer-x86_64-iossim :: TestCases/Windows/crash_read_write.cc (195 of 478) UNSUPPORTED: AddressSanitizer-x86_64-iossim :: TestCases/Windows/crt_initializers.cc (196 of 478) UNSUPPORTED: AddressSanitizer-x86_64-iossim :: TestCases/Windows/delay_dbghelp.cc (197 of 478) UNSUPPORTED: AddressSanitizer-x86_64-iossim :: TestCases/Windows/demangled_names.cc (198 of 478) UNSUPPORTED: AddressSanitizer-x86_64-iossim :: TestCases/Windows/dll_aligned_mallocs.cc (199 of 478) UNSUPPORTED: AddressSanitizer-x86_64-iossim :: TestCases/Windows/dll_allocators_sanity.cc (200 of 478) UNSUPPORTED: AddressSanitizer-x86_64-iossim :: TestCases/Windows/dll_and_lib.cc (201 of 478) UNSUPPORTED: AddressSanitizer-x86_64-iossim :: TestCases/Windows/dll_cerr.cc (202 of 478) UNSUPPORTED: AddressSanitizer-x86_64-iossim :: TestCases/Windows/dll_control_c.cc (203 of 478) UNSUPPORTED: AddressSanitizer-x86_64-iossim :: TestCases/Windows/dll_global_dead_strip.c (204 of 478) UNSUPPORTED: AddressSanitizer-x86_64-iossim :: TestCases/Windows/dll_heap_allocation.cc (205 of 478) UNSUPPORTED: AddressSanitizer-x86_64-iossim :: TestCases/Windows/dll_host.cc (206 of 478) UNSUPPORTED: AddressSanitizer-x86_64-iossim :: TestCases/Windows/dll_intercept_memchr.cc (207 of 478) UNSUPPORTED: AddressSanitizer-x86_64-iossim :: TestCases/Windows/dll_intercept_memcpy.cc (208 of 478) UNSUPPORTED: AddressSanitizer-x86_64-iossim :: TestCases/Windows/dll_intercept_memcpy_indirect.cc (209 of 478) UNSUPPORTED: AddressSanitizer-x86_64-iossim :: TestCases/Windows/dll_intercept_memset.cc (210 of 478) UNSUPPORTED: AddressSanitizer-x86_64-iossim :: TestCases/Windows/dll_intercept_strlen.cc (211 of 478) UNSUPPORTED: AddressSanitizer-x86_64-iossim :: TestCases/Windows/dll_large_function.cc (212 of 478) UNSUPPORTED: AddressSanitizer-x86_64-iossim :: TestCases/Windows/dll_malloc_left_oob.cc (213 of 478) UNSUPPORTED: AddressSanitizer-x86_64-iossim :: TestCases/Windows/dll_malloc_uaf.cc (214 of 478) UNSUPPORTED: AddressSanitizer-x86_64-iossim :: TestCases/Windows/dll_noreturn.cc (215 of 478) UNSUPPORTED: AddressSanitizer-x86_64-iossim :: TestCases/Windows/dll_null_deref.cc (216 of 478) UNSUPPORTED: AddressSanitizer-x86_64-iossim :: TestCases/Windows/dll_operator_array_new_left_oob.cc (217 of 478) UNSUPPORTED: AddressSanitizer-x86_64-iossim :: TestCases/Windows/dll_operator_array_new_with_dtor_left_oob.cc (218 of 478) UNSUPPORTED: AddressSanitizer-x86_64-iossim :: TestCases/Windows/dll_poison_unpoison.cc (219 of 478) UNSUPPORTED: AddressSanitizer-x86_64-iossim :: TestCases/Windows/dll_report_globals_symbolization_at_startup.cc (220 of 478) UNSUPPORTED: AddressSanitizer-x86_64-iossim :: TestCases/Windows/dll_seh.cc (221 of 478) UNSUPPORTED: AddressSanitizer-x86_64-iossim :: TestCases/Windows/dll_stack_use_after_return.cc (222 of 478) UNSUPPORTED: AddressSanitizer-x86_64-iossim :: TestCases/Windows/dll_thread_stack_array_left_oob.cc (223 of 478) UNSUPPORTED: AddressSanitizer-x86_64-iossim :: TestCases/Windows/dll_unload.cc (224 of 478) UNSUPPORTED: AddressSanitizer-x86_64-iossim :: TestCases/Windows/double_free.cc (225 of 478) UNSUPPORTED: AddressSanitizer-x86_64-iossim :: TestCases/Windows/double_operator_delete.cc (226 of 478) UNSUPPORTED: AddressSanitizer-x86_64-iossim :: TestCases/Windows/free_hook_realloc.cc (227 of 478) UNSUPPORTED: AddressSanitizer-x86_64-iossim :: TestCases/Windows/fuse-lld-globals.cc (228 of 478) UNSUPPORTED: AddressSanitizer-x86_64-iossim :: TestCases/Windows/fuse-lld.cc (229 of 478) UNSUPPORTED: AddressSanitizer-x86_64-iossim :: TestCases/Windows/global_const_string.cc (230 of 478) UNSUPPORTED: AddressSanitizer-x86_64-iossim :: TestCases/Windows/global_const_string_oob.cc (231 of 478) UNSUPPORTED: AddressSanitizer-x86_64-iossim :: TestCases/Windows/global_dead_strip.c (232 of 478) UNSUPPORTED: AddressSanitizer-x86_64-iossim :: TestCases/Windows/heapalloc.cc (233 of 478) UNSUPPORTED: AddressSanitizer-x86_64-iossim :: TestCases/Windows/heapalloc_dll_double_free.cc (234 of 478) UNSUPPORTED: AddressSanitizer-x86_64-iossim :: TestCases/Windows/heapalloc_dll_unload_realloc_uaf.cc (235 of 478) UNSUPPORTED: AddressSanitizer-x86_64-iossim :: TestCases/Windows/heapalloc_doublefree.cc (236 of 478) UNSUPPORTED: AddressSanitizer-x86_64-iossim :: TestCases/Windows/heapalloc_flags_fallback.cc (237 of 478) UNSUPPORTED: AddressSanitizer-x86_64-iossim :: TestCases/Windows/heapalloc_huge.cc (238 of 478) UNSUPPORTED: AddressSanitizer-x86_64-iossim :: TestCases/Windows/heapalloc_rtl_transfer.cc (239 of 478) UNSUPPORTED: AddressSanitizer-x86_64-iossim :: TestCases/Windows/heapalloc_sanity.cc (240 of 478) UNSUPPORTED: AddressSanitizer-x86_64-iossim :: TestCases/Windows/heapalloc_transfer.cc (241 of 478) UNSUPPORTED: AddressSanitizer-x86_64-iossim :: TestCases/Windows/heapalloc_uaf.cc (242 of 478) UNSUPPORTED: AddressSanitizer-x86_64-iossim :: TestCases/Windows/heapalloc_zero_size.cc (243 of 478) UNSUPPORTED: AddressSanitizer-x86_64-iossim :: TestCases/Windows/heaprealloc.cc (244 of 478) UNSUPPORTED: AddressSanitizer-x86_64-iossim :: TestCases/Windows/heaprealloc_alloc_zero.cc (245 of 478) UNSUPPORTED: AddressSanitizer-x86_64-iossim :: TestCases/Windows/heaprealloc_zero_size.cc (246 of 478) UNSUPPORTED: AddressSanitizer-x86_64-iossim :: TestCases/Windows/hello_world.cc (247 of 478) UNSUPPORTED: AddressSanitizer-x86_64-iossim :: TestCases/Windows/intercept_memcpy.cc (248 of 478) UNSUPPORTED: AddressSanitizer-x86_64-iossim :: TestCases/Windows/intercept_strdup.cc (249 of 478) UNSUPPORTED: AddressSanitizer-x86_64-iossim :: TestCases/Windows/intercept_strlen.cc (250 of 478) UNSUPPORTED: AddressSanitizer-x86_64-iossim :: TestCases/Windows/interface_symbols_windows.cc (251 of 478) UNSUPPORTED: AddressSanitizer-x86_64-iossim :: TestCases/Windows/iostream_sbo.cc (252 of 478) UNSUPPORTED: AddressSanitizer-x86_64-iossim :: TestCases/Windows/longjmp.cc (253 of 478) UNSUPPORTED: AddressSanitizer-x86_64-iossim :: TestCases/Windows/malloc_left_oob.cc (254 of 478) UNSUPPORTED: AddressSanitizer-x86_64-iossim :: TestCases/Windows/malloc_right_oob.cc (255 of 478) UNSUPPORTED: AddressSanitizer-x86_64-iossim :: TestCases/Windows/malloc_uaf.cc (256 of 478) UNSUPPORTED: AddressSanitizer-x86_64-iossim :: TestCases/Windows/null_deref.cc (257 of 478) UNSUPPORTED: AddressSanitizer-x86_64-iossim :: TestCases/Windows/null_deref_multiple_dlls.cc (258 of 478) UNSUPPORTED: AddressSanitizer-x86_64-iossim :: TestCases/Windows/oom.cc (259 of 478) UNSUPPORTED: AddressSanitizer-x86_64-iossim :: TestCases/Windows/operator_array_new_left_oob.cc (260 of 478) UNSUPPORTED: AddressSanitizer-x86_64-iossim :: TestCases/Windows/operator_array_new_right_oob.cc (261 of 478) UNSUPPORTED: AddressSanitizer-x86_64-iossim :: TestCases/Windows/operator_array_new_uaf.cc (262 of 478) UNSUPPORTED: AddressSanitizer-x86_64-iossim :: TestCases/Windows/operator_array_new_with_dtor_left_oob.cc (263 of 478) UNSUPPORTED: AddressSanitizer-x86_64-iossim :: TestCases/Windows/operator_delete_wrong_argument.cc (264 of 478) UNSUPPORTED: AddressSanitizer-x86_64-iossim :: TestCases/Windows/operator_new_left_oob.cc (265 of 478) UNSUPPORTED: AddressSanitizer-x86_64-iossim :: TestCases/Windows/operator_new_right_oob.cc (266 of 478) UNSUPPORTED: AddressSanitizer-x86_64-iossim :: TestCases/Windows/operator_new_uaf.cc (267 of 478) UNSUPPORTED: AddressSanitizer-x86_64-iossim :: TestCases/Windows/queue_user_work_item.cc (268 of 478) UNSUPPORTED: AddressSanitizer-x86_64-iossim :: TestCases/Windows/queue_user_work_item_report.cc (269 of 478) UNSUPPORTED: AddressSanitizer-x86_64-iossim :: TestCases/Windows/realloc_left_oob.cc (270 of 478) UNSUPPORTED: AddressSanitizer-x86_64-iossim :: TestCases/Windows/realloc_right_oob.cc (271 of 478) UNSUPPORTED: AddressSanitizer-x86_64-iossim :: TestCases/Windows/realloc_uaf.cc (272 of 478) UNSUPPORTED: AddressSanitizer-x86_64-iossim :: TestCases/Windows/recalloc_sanity.cc (273 of 478) UNSUPPORTED: AddressSanitizer-x86_64-iossim :: TestCases/Windows/report_after_syminitialize.cc (274 of 478) UNSUPPORTED: AddressSanitizer-x86_64-iossim :: TestCases/Windows/report_globals_reload_dll.cc (275 of 478) UNSUPPORTED: AddressSanitizer-x86_64-iossim :: TestCases/Windows/report_globals_vs_freelibrary.cc (276 of 478) UNSUPPORTED: AddressSanitizer-x86_64-iossim :: TestCases/Windows/rtlallocateheap.cc (277 of 478) UNSUPPORTED: AddressSanitizer-x86_64-iossim :: TestCases/Windows/rtlallocateheap_dll_unload_double_free.cc (278 of 478) UNSUPPORTED: AddressSanitizer-x86_64-iossim :: TestCases/Windows/rtlallocateheap_dll_unload_realloc.cc (279 of 478) UNSUPPORTED: AddressSanitizer-x86_64-iossim :: TestCases/Windows/rtlallocateheap_flags_fallback.cc (280 of 478) UNSUPPORTED: AddressSanitizer-x86_64-iossim :: TestCases/Windows/rtlallocateheap_zero.cc (281 of 478) UNSUPPORTED: AddressSanitizer-x86_64-iossim :: TestCases/Windows/seh.cc (282 of 478) UNSUPPORTED: AddressSanitizer-x86_64-iossim :: TestCases/Windows/shadow_conflict_32.cc (283 of 478) UNSUPPORTED: AddressSanitizer-x86_64-iossim :: TestCases/Windows/shadow_mapping_failure.cc (284 of 478) UNSUPPORTED: AddressSanitizer-x86_64-iossim :: TestCases/Windows/stack_array_left_oob.cc (285 of 478) UNSUPPORTED: AddressSanitizer-x86_64-iossim :: TestCases/Windows/stack_array_right_oob.cc (286 of 478) UNSUPPORTED: AddressSanitizer-x86_64-iossim :: TestCases/Windows/stack_array_sanity.cc (287 of 478) UNSUPPORTED: AddressSanitizer-x86_64-iossim :: TestCases/Windows/stack_use_after_return.cc (288 of 478) UNSUPPORTED: AddressSanitizer-x86_64-iossim :: TestCases/Windows/symbols_path.cc (289 of 478) UNSUPPORTED: AddressSanitizer-x86_64-iossim :: TestCases/Windows/thread_simple.cc (290 of 478) UNSUPPORTED: AddressSanitizer-x86_64-iossim :: TestCases/Windows/thread_stack_array_left_oob.cc (291 of 478) UNSUPPORTED: AddressSanitizer-x86_64-iossim :: TestCases/Windows/thread_stack_array_right_oob.cc (292 of 478) UNSUPPORTED: AddressSanitizer-x86_64-iossim :: TestCases/Windows/thread_stack_reuse.cc (293 of 478) UNSUPPORTED: AddressSanitizer-x86_64-iossim :: TestCases/Windows/thread_stress.cc (294 of 478) UNSUPPORTED: AddressSanitizer-x86_64-iossim :: TestCases/Windows/thread_suspended.cc (295 of 478) UNSUPPORTED: AddressSanitizer-x86_64-iossim :: TestCases/Windows/tls_init.cc (296 of 478) UNSUPPORTED: AddressSanitizer-x86_64-iossim :: TestCases/Windows/unsymbolized.cc (297 of 478) UNSUPPORTED: AddressSanitizer-x86_64-iossim :: TestCases/Windows/use_after_realloc.cc (298 of 478) UNSUPPORTED: AddressSanitizer-x86_64-iossim :: TestCases/Windows/use_after_return_linkage.cc (299 of 478) UNSUPPORTED: AddressSanitizer-x86_64-iossim :: TestCases/Windows/user-exception.cc (300 of 478) UNSUPPORTED: AddressSanitizer-x86_64-iossim :: TestCases/Windows/windows_h.cc (301 of 478) UNSUPPORTED: AddressSanitizer-x86_64-iossim :: TestCases/Windows/wrong_downcast_on_heap.cc (302 of 478) UNSUPPORTED: AddressSanitizer-x86_64-iossim :: TestCases/Windows/wrong_downcast_on_stack.cc (303 of 478) PASS: AddressSanitizer-x86_64-iossim :: TestCases/Posix/strndup_oob_test.cc (304 of 478) PASS: AddressSanitizer-x86_64-iossim :: TestCases/Posix/strndup_oob_test2.cc (305 of 478) PASS: AddressSanitizer-x86_64-iossim :: TestCases/alloca_big_alignment.cc (306 of 478) PASS: AddressSanitizer-x86_64-iossim :: TestCases/alloca_detect_custom_size_.cc (307 of 478) PASS: AddressSanitizer-x86_64-iossim :: TestCases/alloca_constant_size.cc (308 of 478) PASS: AddressSanitizer-x86_64-iossim :: TestCases/alloca_instruments_all_paddings.cc (309 of 478) PASS: AddressSanitizer-x86_64-iossim :: TestCases/alloca_loop_unpoisoning.cc (310 of 478) PASS: AddressSanitizer-x86_64-iossim :: TestCases/alloca_overflow_partial.cc (311 of 478) PASS: AddressSanitizer-x86_64-iossim :: TestCases/alloca_overflow_right.cc (312 of 478) PASS: AddressSanitizer-x86_64-iossim :: TestCases/alloca_safe_access.cc (313 of 478) PASS: AddressSanitizer-x86_64-iossim :: TestCases/alloca_underflow_left.cc (314 of 478) PASS: AddressSanitizer-x86_64-iossim :: TestCases/asan_and_llvm_coverage_test.cc (315 of 478) PASS: AddressSanitizer-x86_64-iossim :: TestCases/alloca_vla_interact.cc (316 of 478) PASS: AddressSanitizer-x86_64-iossim :: TestCases/asan_options-help.cc (317 of 478) PASS: AddressSanitizer-x86_64-iossim :: TestCases/atexit_stats.cc (318 of 478) PASS: AddressSanitizer-x86_64-iossim :: TestCases/atoi_strict.c (319 of 478) PASS: AddressSanitizer-x86_64-iossim :: TestCases/atol_strict.c (320 of 478) PASS: AddressSanitizer-x86_64-iossim :: TestCases/atoll_strict.c (321 of 478) PASS: AddressSanitizer-x86_64-iossim :: TestCases/calloc-overflow.cc (322 of 478) PASS: AddressSanitizer-x86_64-iossim :: TestCases/blacklist.cc (323 of 478) PASS: AddressSanitizer-x86_64-iossim :: TestCases/contiguous_container.cc (324 of 478) PASS: AddressSanitizer-x86_64-iossim :: TestCases/coverage-and-lsan.cc (325 of 478) PASS: AddressSanitizer-x86_64-iossim :: TestCases/coverage-disabled.cc (326 of 478) PASS: AddressSanitizer-x86_64-iossim :: TestCases/contiguous_container_crash.cc (327 of 478) PASS: AddressSanitizer-x86_64-iossim :: TestCases/coverage-trace-pc.cc (328 of 478) PASS: AddressSanitizer-x86_64-iossim :: TestCases/debug_double_free.cc (329 of 478) UNSUPPORTED: AddressSanitizer-x86_64-iossim :: TestCases/debug_ppc64_mapping.cc (330 of 478) PASS: AddressSanitizer-x86_64-iossim :: TestCases/debug_locate.cc (331 of 478) PASS: AddressSanitizer-x86_64-iossim :: TestCases/debug_mapping.cc (332 of 478) PASS: AddressSanitizer-x86_64-iossim :: TestCases/debug_report.cc (333 of 478) PASS: AddressSanitizer-x86_64-iossim :: TestCases/debug_stacks.cc (334 of 478) UNSUPPORTED: AddressSanitizer-x86_64-iossim :: TestCases/default_blacklist.cc (335 of 478) PASS: AddressSanitizer-x86_64-iossim :: TestCases/deep_stack_uaf.cc (336 of 478) PASS: AddressSanitizer-x86_64-iossim :: TestCases/default_options.cc (337 of 478) PASS: AddressSanitizer-x86_64-iossim :: TestCases/describe_address.cc (338 of 478) PASS: AddressSanitizer-x86_64-iossim :: TestCases/error_report_callback.cc (339 of 478) PASS: AddressSanitizer-x86_64-iossim :: TestCases/deep_tail_call.cc (340 of 478) PASS: AddressSanitizer-x86_64-iossim :: TestCases/exitcode.cc (341 of 478) PASS: AddressSanitizer-x86_64-iossim :: TestCases/double-free.cc (342 of 478) PASS: AddressSanitizer-x86_64-iossim :: TestCases/force_inline_opt0.cc (343 of 478) PASS: AddressSanitizer-x86_64-iossim :: TestCases/frexp_interceptor.cc (344 of 478) PASS: AddressSanitizer-x86_64-iossim :: TestCases/global-demangle.cc (345 of 478) PASS: AddressSanitizer-x86_64-iossim :: TestCases/global-address.cpp (346 of 478) PASS: AddressSanitizer-x86_64-iossim :: TestCases/global-location.cc (347 of 478) PASS: AddressSanitizer-x86_64-iossim :: TestCases/global-overflow.cc (348 of 478) PASS: AddressSanitizer-x86_64-iossim :: TestCases/global-underflow.cc (349 of 478) PASS: AddressSanitizer-x86_64-iossim :: TestCases/halt_on_error-1.c (350 of 478) PASS: AddressSanitizer-x86_64-iossim :: TestCases/handle_noreturn_bug.cc (351 of 478) UNSUPPORTED: AddressSanitizer-x86_64-iossim :: TestCases/heavy_uar_test.cc (352 of 478) PASS: AddressSanitizer-x86_64-iossim :: TestCases/heap-overflow-large.cc (353 of 478) PASS: AddressSanitizer-x86_64-iossim :: TestCases/huge_negative_hea_oob.cc (354 of 478) PASS: AddressSanitizer-x86_64-iossim :: TestCases/ill.cc (355 of 478) PASS: AddressSanitizer-x86_64-iossim :: TestCases/init-order-atexit.cc (356 of 478) UNSUPPORTED: AddressSanitizer-x86_64-iossim :: TestCases/initialization-bug.cc (357 of 478) PASS: AddressSanitizer-x86_64-iossim :: TestCases/initialization-blacklist.cc (358 of 478) PASS: AddressSanitizer-x86_64-iossim :: TestCases/heap-overflow.cc (359 of 478) PASS: AddressSanitizer-x86_64-iossim :: TestCases/initialization-constexpr.cc (360 of 478) PASS: AddressSanitizer-x86_64-iossim :: TestCases/inline.cc (361 of 478) PASS: AddressSanitizer-x86_64-iossim :: TestCases/intercept-rethrow-exception.cc (362 of 478) PASS: AddressSanitizer-x86_64-iossim :: TestCases/initialization-nobug.cc (363 of 478) PASS: AddressSanitizer-x86_64-iossim :: TestCases/interface_test.cc (364 of 478) PASS: AddressSanitizer-x86_64-iossim :: TestCases/intra-object-overflow.cc (365 of 478) PASS: AddressSanitizer-x86_64-iossim :: TestCases/interception_failure_test.cc (366 of 478) PASS: AddressSanitizer-x86_64-iossim :: TestCases/invalid-pointer-pairs-compare-errors.cc (367 of 478) PASS: AddressSanitizer-x86_64-iossim :: TestCases/invalid-pointer-pairs-compare-null.cc (368 of 478) PASS: AddressSanitizer-x86_64-iossim :: TestCases/invalid-free.cc (369 of 478) PASS: AddressSanitizer-x86_64-iossim :: TestCases/invalid-pointer-pairs-compare-success.cc (370 of 478) PASS: AddressSanitizer-x86_64-iossim :: TestCases/invalid-pointer-pairs-subtract-success.cc (371 of 478) PASS: AddressSanitizer-x86_64-iossim :: TestCases/invalid-pointer-pairs-subtract-errors.cc (372 of 478) UNSUPPORTED: AddressSanitizer-x86_64-iossim :: TestCases/log-path_test.cc (373 of 478) PASS: AddressSanitizer-x86_64-iossim :: TestCases/longjmp.cc (374 of 478) PASS: AddressSanitizer-x86_64-iossim :: TestCases/invalid-pointer-pairs.cc (375 of 478) PASS: AddressSanitizer-x86_64-iossim :: TestCases/malloc-no-intercept.c (376 of 478) PASS: AddressSanitizer-x86_64-iossim :: TestCases/lsan_annotations.cc (377 of 478) PASS: AddressSanitizer-x86_64-iossim :: TestCases/malloc-size-too-big.cc (378 of 478) PASS: AddressSanitizer-x86_64-iossim :: TestCases/large_func_test.cc (379 of 478) PASS: AddressSanitizer-x86_64-iossim :: TestCases/malloc_fill.cc (380 of 478) PASS: AddressSanitizer-x86_64-iossim :: TestCases/malloc_context_size.cc (381 of 478) PASS: AddressSanitizer-x86_64-iossim :: TestCases/memcmp_strict_test.cc (382 of 478) PASS: AddressSanitizer-x86_64-iossim :: TestCases/max_redzone.cc (383 of 478) UNSUPPORTED: AddressSanitizer-x86_64-iossim :: TestCases/non-executable-pc.cpp (384 of 478) PASS: AddressSanitizer-x86_64-iossim :: TestCases/memcmp_test.cc (385 of 478) PASS: AddressSanitizer-x86_64-iossim :: TestCases/on_error_callback.cc (386 of 478) PASS: AddressSanitizer-x86_64-iossim :: TestCases/null_deref.cc (387 of 478) PASS: AddressSanitizer-x86_64-iossim :: TestCases/pass-object-byval.cc (388 of 478) UNSUPPORTED: AddressSanitizer-x86_64-iossim :: TestCases/pass-struct-byval-uar.cc (389 of 478) PASS: AddressSanitizer-x86_64-iossim :: TestCases/pass-struct-byval.cc (390 of 478) PASS: AddressSanitizer-x86_64-iossim :: TestCases/partial_right.cc (391 of 478) PASS: AddressSanitizer-x86_64-iossim :: TestCases/poison_partial.cc (392 of 478) PASS: AddressSanitizer-x86_64-iossim :: TestCases/pr33372.cc (393 of 478) PASS: AddressSanitizer-x86_64-iossim :: TestCases/print_summary.cc (394 of 478) PASS: AddressSanitizer-x86_64-iossim :: TestCases/printf-1.c (395 of 478) PASS: AddressSanitizer-x86_64-iossim :: TestCases/printf-2.c (396 of 478) PASS: AddressSanitizer-x86_64-iossim :: TestCases/printf-3.c (397 of 478) PASS: AddressSanitizer-x86_64-iossim :: TestCases/printf-4.c (398 of 478) PASS: AddressSanitizer-x86_64-iossim :: TestCases/printf-m.c (399 of 478) PASS: AddressSanitizer-x86_64-iossim :: TestCases/printf-5.c (400 of 478) PASS: AddressSanitizer-x86_64-iossim :: TestCases/realloc.cc (401 of 478) PASS: AddressSanitizer-x86_64-iossim :: TestCases/memset_test.cc (402 of 478) PASS: AddressSanitizer-x86_64-iossim :: TestCases/sanity_check_pure_c.c (403 of 478) PASS: AddressSanitizer-x86_64-iossim :: TestCases/sleep_after_init.c (404 of 478) PASS: AddressSanitizer-x86_64-iossim :: TestCases/set_shadow_test.c (405 of 478) PASS: AddressSanitizer-x86_64-iossim :: TestCases/sleep_before_dying.c (406 of 478) PASS: AddressSanitizer-x86_64-iossim :: TestCases/speculative_load.cc (407 of 478) PASS: AddressSanitizer-x86_64-iossim :: TestCases/small_memcpy_test.cc (408 of 478) PASS: AddressSanitizer-x86_64-iossim :: TestCases/speculative_load2.cc (409 of 478) PASS: AddressSanitizer-x86_64-iossim :: TestCases/stack-buffer-overflow.cc (410 of 478) PASS: AddressSanitizer-x86_64-iossim :: TestCases/stack-frame-demangle.cc (411 of 478) PASS: AddressSanitizer-x86_64-iossim :: TestCases/stack-buffer-overflow-with-position.cc (412 of 478) PASS: AddressSanitizer-x86_64-iossim :: TestCases/stack-oob-frames.cc (413 of 478) PASS: AddressSanitizer-x86_64-iossim :: TestCases/scariness_score_test.cc (414 of 478) PASS: AddressSanitizer-x86_64-iossim :: TestCases/strcasestr-1.c (415 of 478) PASS: AddressSanitizer-x86_64-iossim :: TestCases/strcasestr-2.c (416 of 478) PASS: AddressSanitizer-x86_64-iossim :: TestCases/strcasestr_strict.c (417 of 478) PASS: AddressSanitizer-x86_64-iossim :: TestCases/strchr_strict.c (418 of 478) PASS: AddressSanitizer-x86_64-iossim :: TestCases/strcmp_strict.c (419 of 478) PASS: AddressSanitizer-x86_64-iossim :: TestCases/strcat_strict.c (420 of 478) PASS: AddressSanitizer-x86_64-iossim :: TestCases/strcspn-1.c (421 of 478) PASS: AddressSanitizer-x86_64-iossim :: TestCases/strcspn-2.c (422 of 478) PASS: AddressSanitizer-x86_64-iossim :: TestCases/strcat-overlap.cc (423 of 478) UNSUPPORTED: AddressSanitizer-x86_64-iossim :: TestCases/strdup_oob_test.cc (424 of 478) PASS: AddressSanitizer-x86_64-iossim :: TestCases/strip_path_prefix.c (425 of 478) PASS: AddressSanitizer-x86_64-iossim :: TestCases/strcspn_strict.c (426 of 478) PASS: AddressSanitizer-x86_64-iossim :: TestCases/strcpy-overlap.cc (427 of 478) PASS: AddressSanitizer-x86_64-iossim :: TestCases/strncasecmp_strict.c (428 of 478) PASS: AddressSanitizer-x86_64-iossim :: TestCases/strncat_strict.c (429 of 478) PASS: AddressSanitizer-x86_64-iossim :: TestCases/strncat-overlap.cc (430 of 478) PASS: AddressSanitizer-x86_64-iossim :: TestCases/strncpy-overflow.cc (431 of 478) PASS: AddressSanitizer-x86_64-iossim :: TestCases/strncmp_strict.c (432 of 478) PASS: AddressSanitizer-x86_64-iossim :: TestCases/strpbrk-1.c (433 of 478) PASS: AddressSanitizer-x86_64-iossim :: TestCases/strpbrk-2.c (434 of 478) PASS: AddressSanitizer-x86_64-iossim :: TestCases/strpbrk_strict.c (435 of 478) PASS: AddressSanitizer-x86_64-iossim :: TestCases/strncpy-overlap.cc (436 of 478) PASS: AddressSanitizer-x86_64-iossim :: TestCases/strspn-1.c (437 of 478) PASS: AddressSanitizer-x86_64-iossim :: TestCases/strspn-2.c (438 of 478) PASS: AddressSanitizer-x86_64-iossim :: TestCases/strstr-1.c (439 of 478) PASS: AddressSanitizer-x86_64-iossim :: TestCases/strspn_strict.c (440 of 478) PASS: AddressSanitizer-x86_64-iossim :: TestCases/strstr-2.c (441 of 478) PASS: AddressSanitizer-x86_64-iossim :: TestCases/strstr_strict.c (442 of 478) PASS: AddressSanitizer-x86_64-iossim :: TestCases/strtok.c (443 of 478) UNSUPPORTED: AddressSanitizer-x86_64-iossim :: TestCases/suppressions-exec-relative-location.cc (444 of 478) UNSUPPORTED: AddressSanitizer-x86_64-iossim :: TestCases/suppressions-function.cc (445 of 478) PASS: AddressSanitizer-x86_64-iossim :: TestCases/suppressions-interceptor.cc (446 of 478) PASS: AddressSanitizer-x86_64-iossim :: TestCases/suppressions-library.cc (447 of 478) PASS: AddressSanitizer-x86_64-iossim :: TestCases/strtol_strict.c (448 of 478) PASS: AddressSanitizer-x86_64-iossim :: TestCases/throw_call_test.cc (449 of 478) PASS: AddressSanitizer-x86_64-iossim :: TestCases/strtoll_strict.c (450 of 478) PASS: AddressSanitizer-x86_64-iossim :: TestCases/throw_catch.cc (451 of 478) PASS: AddressSanitizer-x86_64-iossim :: TestCases/throw_invoke_test.cc (452 of 478) PASS: AddressSanitizer-x86_64-iossim :: TestCases/time_interceptor.cc (453 of 478) PASS: AddressSanitizer-x86_64-iossim :: TestCases/uar_and_exceptions.cc (454 of 478) PASS: AddressSanitizer-x86_64-iossim :: TestCases/use-after-delete.cc (455 of 478) PASS: AddressSanitizer-x86_64-iossim :: TestCases/use-after-free-right.cc (456 of 478) PASS: AddressSanitizer-x86_64-iossim :: TestCases/unaligned_loads_and_stores.cc (457 of 478) PASS: AddressSanitizer-x86_64-iossim :: TestCases/use-after-poison.cc (458 of 478) XFAIL: AddressSanitizer-x86_64-iossim :: TestCases/use-after-scope-conversion.cc (459 of 478) PASS: AddressSanitizer-x86_64-iossim :: TestCases/use-after-scope-dtor-order.cc (460 of 478) PASS: AddressSanitizer-x86_64-iossim :: TestCases/use-after-scope-goto.cc (461 of 478) PASS: AddressSanitizer-x86_64-iossim :: TestCases/use-after-free.cc (462 of 478) PASS: AddressSanitizer-x86_64-iossim :: TestCases/use-after-scope-if.cc (463 of 478) PASS: AddressSanitizer-x86_64-iossim :: TestCases/use-after-scope-loop-bug.cc (464 of 478) PASS: AddressSanitizer-x86_64-iossim :: TestCases/use-after-scope-capture.cc (465 of 478) PASS: AddressSanitizer-x86_64-iossim :: TestCases/use-after-scope-inlined.cc (466 of 478) PASS: AddressSanitizer-x86_64-iossim :: TestCases/use-after-scope-loop.cc (467 of 478) PASS: AddressSanitizer-x86_64-iossim :: TestCases/use-after-scope-nobug.cc (468 of 478) PASS: AddressSanitizer-x86_64-iossim :: TestCases/use-after-scope-loop-removed.cc (469 of 478) PASS: AddressSanitizer-x86_64-iossim :: TestCases/use-after-scope-temp.cc (470 of 478) PASS: AddressSanitizer-x86_64-iossim :: TestCases/use-after-scope-temp2.cc (471 of 478) UNSUPPORTED: AddressSanitizer-x86_64-iossim :: TestCases/verbose-log-path_test.cc (472 of 478) PASS: AddressSanitizer-x86_64-iossim :: TestCases/vla_chrome_testcase.cc (473 of 478) PASS: AddressSanitizer-x86_64-iossim :: TestCases/use-after-scope.cc (474 of 478) PASS: AddressSanitizer-x86_64-iossim :: TestCases/vla_condition_overflow.cc (475 of 478) PASS: AddressSanitizer-x86_64-iossim :: TestCases/vla_loop_overfow.cc (476 of 478) PASS: AddressSanitizer-x86_64-iossim :: TestCases/zero_page_pc.cc (477 of 478) PASS: AddressSanitizer-x86_64-iossim :: TestCases/use-after-scope-types.cc (478 of 478)

Hide Details

1 warning(s) in tests. Testing Time: 230.53s Expected Passes : 221 Expected Failures : 1 Unsupported Tests : 256 + ./bin/llvm-lit -v --xunit-xml-output=asan-IOSSimI386Config.xunit.xml ./tools/clang/runtime/compiler-rt-bins/test/asan/IOSSimI386Config/ llvm-lit: /Users/buildslave/jenkins/workspace/clang-stage1-cmake-RA-expensive/llvm-project/llvm/utils/lit/lit/util.py:408: note: using SDKROOT: u'/Applications/Xcode.app/Contents/Developer/Platforms/MacOSX.platform/Developer/SDKs/MacOSX10.13.sdk' {"env": {}} -- Testing: 478 tests, 8 threads -- UNSUPPORTED: AddressSanitizer-i386-iossim :: TestCases/Darwin/abort_on_error.cc (1 of 478) UNSUPPORTED: AddressSanitizer-i386-iossim :: TestCases/Darwin/address-range-limit.mm (2 of 478) UNSUPPORTED: AddressSanitizer-i386-iossim :: TestCases/Darwin/asan-symbolize-partial-report-no-external-symbolizer.cc (3 of 478) UNSUPPORTED: AddressSanitizer-i386-iossim :: TestCases/Darwin/asan-symbolize-partial-report-with-module-map.cc (4 of 478) UNSUPPORTED: AddressSanitizer-i386-iossim :: TestCases/Darwin/asan-symbolize-with-module-map.cc (5 of 478) UNSUPPORTED: AddressSanitizer-i386-iossim :: TestCases/Darwin/asan_gen_prefixes.cc (6 of 478) UNSUPPORTED: AddressSanitizer-i386-iossim :: TestCases/Darwin/atos-symbolizer-dyld-root-path.cc (7 of 478) UNSUPPORTED: AddressSanitizer-i386-iossim :: TestCases/Darwin/atos-symbolizer.cc (8 of 478) UNSUPPORTED: AddressSanitizer-i386-iossim :: TestCases/Darwin/crashlog-stacktraces.c (9 of 478) UNSUPPORTED: AddressSanitizer-i386-iossim :: TestCases/Darwin/cstring_literals_regtest.mm (10 of 478) UNSUPPORTED: AddressSanitizer-i386-iossim :: TestCases/Darwin/cstring_section.c (11 of 478) UNSUPPORTED: AddressSanitizer-i386-iossim :: TestCases/Darwin/dead-strip.c (12 of 478) UNSUPPORTED: AddressSanitizer-i386-iossim :: TestCases/Darwin/dladdr-demangling.cc (13 of 478) UNSUPPORTED: AddressSanitizer-i386-iossim :: TestCases/Darwin/dump_registers.cc (14 of 478) UNSUPPORTED: AddressSanitizer-i386-iossim :: TestCases/Darwin/dyld_insert_libraries_reexec.cc (15 of 478) UNSUPPORTED: AddressSanitizer-i386-iossim :: TestCases/Darwin/dyld_insert_libraries_remove.cc (16 of 478) UNSUPPORTED: AddressSanitizer-i386-iossim :: TestCases/Darwin/empty-section.cc (17 of 478) UNSUPPORTED: AddressSanitizer-i386-iossim :: TestCases/Darwin/fclose.c (18 of 478) UNSUPPORTED: AddressSanitizer-i386-iossim :: TestCases/Darwin/getpwnam.c (19 of 478) UNSUPPORTED: AddressSanitizer-i386-iossim :: TestCases/Darwin/haswell-symbolication.cc (20 of 478) UNSUPPORTED: AddressSanitizer-i386-iossim :: TestCases/Darwin/init_for_dlopen.cc (21 of 478) UNSUPPORTED: AddressSanitizer-i386-iossim :: TestCases/Darwin/interface_symbols_darwin.cc (22 of 478) UNSUPPORTED: AddressSanitizer-i386-iossim :: TestCases/Darwin/linked-only.cc (23 of 478) UNSUPPORTED: AddressSanitizer-i386-iossim :: TestCases/Darwin/malloc_destroy_zone.cc (24 of 478) UNSUPPORTED: AddressSanitizer-i386-iossim :: TestCases/Darwin/malloc_set_zone_name-mprotect.cc (25 of 478) UNSUPPORTED: AddressSanitizer-i386-iossim :: TestCases/Darwin/malloc_size_crash.mm (26 of 478) UNSUPPORTED: AddressSanitizer-i386-iossim :: TestCases/Darwin/malloc_zone-protected.cc (27 of 478) UNSUPPORTED: AddressSanitizer-i386-iossim :: TestCases/Darwin/mixing-global-constructors.cc (28 of 478) UNSUPPORTED: AddressSanitizer-i386-iossim :: TestCases/Darwin/nil-return-struct.mm (29 of 478) UNSUPPORTED: AddressSanitizer-i386-iossim :: TestCases/Darwin/objc-odr.mm (30 of 478) UNSUPPORTED: AddressSanitizer-i386-iossim :: TestCases/Darwin/odr-lto.cc (31 of 478) UNSUPPORTED: AddressSanitizer-i386-iossim :: TestCases/Darwin/reexec-insert-libraries-env.cc (32 of 478) UNSUPPORTED: AddressSanitizer-i386-iossim :: TestCases/Darwin/sandbox-symbolizer.cc (33 of 478) UNSUPPORTED: AddressSanitizer-i386-iossim :: TestCases/Darwin/scribble.cc (34 of 478) UNSUPPORTED: AddressSanitizer-i386-iossim :: TestCases/Darwin/segv_read_write.c (35 of 478) UNSUPPORTED: AddressSanitizer-i386-iossim :: TestCases/Darwin/suppressions-darwin.cc (36 of 478) UNSUPPORTED: AddressSanitizer-i386-iossim :: TestCases/Darwin/suppressions-function.cc (37 of 478) UNSUPPORTED: AddressSanitizer-i386-iossim :: TestCases/Darwin/suppressions-sandbox.cc (38 of 478) UNSUPPORTED: AddressSanitizer-i386-iossim :: TestCases/Darwin/unset-insert-libraries-on-exec.cc (39 of 478) UNSUPPORTED: AddressSanitizer-i386-iossim :: TestCases/Darwin/uuid.cc (40 of 478) UNSUPPORTED: AddressSanitizer-i386-iossim :: TestCases/Linux/abort_on_error.cc (41 of 478) UNSUPPORTED: AddressSanitizer-i386-iossim :: TestCases/Linux/activation-options.cc (42 of 478) UNSUPPORTED: AddressSanitizer-i386-iossim :: TestCases/Linux/aligned_delete_test.cc (43 of 478) UNSUPPORTED: AddressSanitizer-i386-iossim :: TestCases/Linux/allocator_oom_test.cc (44 of 478) UNSUPPORTED: AddressSanitizer-i386-iossim :: TestCases/Linux/asan_default_suppressions.cc (45 of 478) UNSUPPORTED: AddressSanitizer-i386-iossim :: TestCases/Linux/asan_dlopen_test.cc (46 of 478) UNSUPPORTED: AddressSanitizer-i386-iossim :: TestCases/Linux/asan_prelink_test.cc (47 of 478) UNSUPPORTED: AddressSanitizer-i386-iossim :: TestCases/Linux/asan_preload_test-1.cc (48 of 478) UNSUPPORTED: AddressSanitizer-i386-iossim :: TestCases/Linux/asan_preload_test-2.cc (49 of 478) UNSUPPORTED: AddressSanitizer-i386-iossim :: TestCases/Linux/asan_preload_test-3.cc (50 of 478) UNSUPPORTED: AddressSanitizer-i386-iossim :: TestCases/Linux/asan_rt_confict_test-1.cc (51 of 478) UNSUPPORTED: AddressSanitizer-i386-iossim :: TestCases/Linux/asan_rt_confict_test-2.cc (52 of 478) UNSUPPORTED: AddressSanitizer-i386-iossim :: TestCases/Linux/auto_memory_profile_test.cc (53 of 478) UNSUPPORTED: AddressSanitizer-i386-iossim :: TestCases/Linux/bzero.cc (54 of 478) UNSUPPORTED: AddressSanitizer-i386-iossim :: TestCases/Linux/calloc-preload.c (55 of 478) UNSUPPORTED: AddressSanitizer-i386-iossim :: TestCases/Linux/clang_gcc_abi.cc (56 of 478) UNSUPPORTED: AddressSanitizer-i386-iossim :: TestCases/Linux/clone_test.cc (57 of 478) UNSUPPORTED: AddressSanitizer-i386-iossim :: TestCases/Linux/coverage-missing.cc (58 of 478) UNSUPPORTED: AddressSanitizer-i386-iossim :: TestCases/Linux/cuda_test.cc (59 of 478) UNSUPPORTED: AddressSanitizer-i386-iossim :: TestCases/Linux/function-sections-are-bad.cc (60 of 478) UNSUPPORTED: AddressSanitizer-i386-iossim :: TestCases/Linux/global-overflow-bfd.cc (61 of 478) UNSUPPORTED: AddressSanitizer-i386-iossim :: TestCases/Linux/global-overflow-lld.cc (62 of 478) UNSUPPORTED: AddressSanitizer-i386-iossim :: TestCases/Linux/globals-gc-sections-lld.cc (63 of 478) UNSUPPORTED: AddressSanitizer-i386-iossim :: TestCases/Linux/init-order-dlopen.cc (64 of 478) UNSUPPORTED: AddressSanitizer-i386-iossim :: TestCases/Linux/init_fini_sections.cc (65 of 478) UNSUPPORTED: AddressSanitizer-i386-iossim :: TestCases/Linux/initialization-bug-any-order.cc (66 of 478) UNSUPPORTED: AddressSanitizer-i386-iossim :: TestCases/Linux/interception_malloc_test.cc (67 of 478) UNSUPPORTED: AddressSanitizer-i386-iossim :: TestCases/Linux/interception_readdir_r_test.cc (68 of 478) UNSUPPORTED: AddressSanitizer-i386-iossim :: TestCases/Linux/interception_test.cc (69 of 478) UNSUPPORTED: AddressSanitizer-i386-iossim :: TestCases/Linux/interface_symbols_linux.cc (70 of 478) UNSUPPORTED: AddressSanitizer-i386-iossim :: TestCases/Linux/kernel-area.cc (71 of 478) UNSUPPORTED: AddressSanitizer-i386-iossim :: TestCases/Linux/leak.cc (72 of 478) UNSUPPORTED: AddressSanitizer-i386-iossim :: TestCases/Linux/leak_check_segv.cc (73 of 478) UNSUPPORTED: AddressSanitizer-i386-iossim :: TestCases/Linux/local_alias.cc (74 of 478) UNSUPPORTED: AddressSanitizer-i386-iossim :: TestCases/Linux/long-object-path.cc (75 of 478) UNSUPPORTED: AddressSanitizer-i386-iossim :: TestCases/Linux/longjmp_chk.c (76 of 478) UNSUPPORTED: AddressSanitizer-i386-iossim :: TestCases/Linux/malloc-in-qsort.cc (77 of 478) UNSUPPORTED: AddressSanitizer-i386-iossim :: TestCases/Linux/malloc_delete_mismatch.cc (78 of 478) UNSUPPORTED: AddressSanitizer-i386-iossim :: TestCases/Linux/memmem_test.cc (79 of 478) UNSUPPORTED: AddressSanitizer-i386-iossim :: TestCases/Linux/mincore.cc (80 of 478) UNSUPPORTED: AddressSanitizer-i386-iossim :: TestCases/Linux/new_delete_mismatch.cc (81 of 478) UNSUPPORTED: AddressSanitizer-i386-iossim :: TestCases/Linux/new_delete_mismatch_global.cc (82 of 478) UNSUPPORTED: AddressSanitizer-i386-iossim :: TestCases/Linux/new_delete_mismatch_stack.cc (83 of 478) UNSUPPORTED: AddressSanitizer-i386-iossim :: TestCases/Linux/nohugepage_test.cc (84 of 478) UNSUPPORTED: AddressSanitizer-i386-iossim :: TestCases/Linux/odr-violation.cc (85 of 478) UNSUPPORTED: AddressSanitizer-i386-iossim :: TestCases/Linux/odr-vtable.cc (86 of 478) UNSUPPORTED: AddressSanitizer-i386-iossim :: TestCases/Linux/odr_c_test.c (87 of 478) UNSUPPORTED: AddressSanitizer-i386-iossim :: TestCases/Linux/odr_indicators.cc (88 of 478) UNSUPPORTED: AddressSanitizer-i386-iossim :: TestCases/Linux/overflow-in-qsort.cc (89 of 478) UNSUPPORTED: AddressSanitizer-i386-iossim :: TestCases/Linux/preinit_test.cc (90 of 478) UNSUPPORTED: AddressSanitizer-i386-iossim :: TestCases/Linux/preinstalled_signal.cc (91 of 478) UNSUPPORTED: AddressSanitizer-i386-iossim :: TestCases/Linux/print_memory_profile_test.cc (92 of 478) UNSUPPORTED: AddressSanitizer-i386-iossim :: TestCases/Linux/printf-fortify-1.c (93 of 478) UNSUPPORTED: AddressSanitizer-i386-iossim :: TestCases/Linux/printf-fortify-2.c (94 of 478) UNSUPPORTED: AddressSanitizer-i386-iossim :: TestCases/Linux/printf-fortify-3.c (95 of 478) UNSUPPORTED: AddressSanitizer-i386-iossim :: TestCases/Linux/printf-fortify-4.c (96 of 478) UNSUPPORTED: AddressSanitizer-i386-iossim :: TestCases/Linux/printf-fortify-5.c (97 of 478) UNSUPPORTED: AddressSanitizer-i386-iossim :: TestCases/Linux/pthread_create_from_constructor.cc (98 of 478) UNSUPPORTED: AddressSanitizer-i386-iossim :: TestCases/Linux/pthread_create_version.cc (99 of 478) UNSUPPORTED: AddressSanitizer-i386-iossim :: TestCases/Linux/ptrace.cc (100 of 478) UNSUPPORTED: AddressSanitizer-i386-iossim :: TestCases/Linux/quarantine_size_mb.cc (101 of 478) UNSUPPORTED: AddressSanitizer-i386-iossim :: TestCases/Linux/read_binary_name_regtest.c (102 of 478) UNSUPPORTED: AddressSanitizer-i386-iossim :: TestCases/Linux/recoverable-lsan.cc (103 of 478) UNSUPPORTED: AddressSanitizer-i386-iossim :: TestCases/Linux/recvfrom.cc (104 of 478) UNSUPPORTED: AddressSanitizer-i386-iossim :: TestCases/Linux/release_to_os_test.cc (105 of 478) UNSUPPORTED: AddressSanitizer-i386-iossim :: TestCases/Linux/rlimit_mmap_test.cc (106 of 478) UNSUPPORTED: AddressSanitizer-i386-iossim :: TestCases/Linux/sanbox_read_proc_self_maps_test.cc (107 of 478) UNSUPPORTED: AddressSanitizer-i386-iossim :: TestCases/Linux/segv_read_write.c (108 of 478) UNSUPPORTED: AddressSanitizer-i386-iossim :: TestCases/Linux/shmctl.cc (109 of 478) UNSUPPORTED: AddressSanitizer-i386-iossim :: TestCases/Linux/signal_during_stop_the_world.cc (110 of 478) UNSUPPORTED: AddressSanitizer-i386-iossim :: TestCases/Linux/sized_delete_test.cc (111 of 478) UNSUPPORTED: AddressSanitizer-i386-iossim :: TestCases/Linux/stack-overflow-recovery-mode.cc (112 of 478) UNSUPPORTED: AddressSanitizer-i386-iossim :: TestCases/Linux/stack-overflow-sigbus.cc (113 of 478) UNSUPPORTED: AddressSanitizer-i386-iossim :: TestCases/Linux/stack-trace-dlclose.cc (114 of 478) UNSUPPORTED: AddressSanitizer-i386-iossim :: TestCases/Linux/static_tls.cc (115 of 478) UNSUPPORTED: AddressSanitizer-i386-iossim :: TestCases/Linux/stress_dtls.c (116 of 478) UNSUPPORTED: AddressSanitizer-i386-iossim :: TestCases/Linux/swapcontext_annotation.cc (117 of 478) UNSUPPORTED: AddressSanitizer-i386-iossim :: TestCases/Linux/swapcontext_test.cc (118 of 478) UNSUPPORTED: AddressSanitizer-i386-iossim :: TestCases/Linux/syscalls.cc (119 of 478) UNSUPPORTED: AddressSanitizer-i386-iossim :: TestCases/Linux/textdomain.c (120 of 478) UNSUPPORTED: AddressSanitizer-i386-iossim :: TestCases/Linux/thread_local_quarantine_pthread_join.cc (121 of 478) UNSUPPORTED: AddressSanitizer-i386-iossim :: TestCases/Linux/thread_local_quarantine_size_kb.cc (122 of 478) UNSUPPORTED: AddressSanitizer-i386-iossim :: TestCases/Linux/uar_signals.cc (123 of 478) UNSUPPORTED: AddressSanitizer-i386-iossim :: TestCases/Linux/unpoison_tls.cc (124 of 478) UNSUPPORTED: AddressSanitizer-i386-iossim :: TestCases/Linux/vfork.cc (125 of 478) UNSUPPORTED: AddressSanitizer-i386-iossim :: TestCases/Posix/asan-sigbus.cpp (126 of 478) UNSUPPORTED: AddressSanitizer-i386-iossim :: TestCases/Posix/asan-symbolize-bad-path.cc (127 of 478) UNSUPPORTED: AddressSanitizer-i386-iossim :: TestCases/Posix/asan-symbolize-sanity-test.cc (128 of 478) UNSUPPORTED: AddressSanitizer-i386-iossim :: TestCases/Posix/asan_symbolize_script/logging_options_in_help.cc (129 of 478) UNSUPPORTED: AddressSanitizer-i386-iossim :: TestCases/Posix/asan_symbolize_script/plugin_no_op_help_output.cc (130 of 478) UNSUPPORTED: AddressSanitizer-i386-iossim :: TestCases/Posix/asan_symbolize_script/plugin_no_op_symbolicate.cc (131 of 478) UNSUPPORTED: AddressSanitizer-i386-iossim :: TestCases/Posix/asan_symbolize_script/set_log_dest.cc (132 of 478) UNSUPPORTED: AddressSanitizer-i386-iossim :: TestCases/Posix/asan_symbolize_script/set_log_level.cc (133 of 478) UNSUPPORTED: AddressSanitizer-i386-iossim :: TestCases/Posix/asprintf.cc (134 of 478) UNSUPPORTED: AddressSanitizer-i386-iossim :: TestCases/Posix/assign_large_valloc_to_global.cc (135 of 478) UNSUPPORTED: AddressSanitizer-i386-iossim :: TestCases/Posix/bcmp_test.cc (136 of 478) UNSUPPORTED: AddressSanitizer-i386-iossim :: TestCases/Posix/closed-fds.cc (137 of 478) UNSUPPORTED: AddressSanitizer-i386-iossim :: TestCases/Posix/concurrent_overflow.cc (138 of 478) UNSUPPORTED: AddressSanitizer-i386-iossim :: TestCases/Posix/coverage-fork.cc (139 of 478) UNSUPPORTED: AddressSanitizer-i386-iossim :: TestCases/Posix/coverage-module-unloaded.cc (140 of 478) UNSUPPORTED: AddressSanitizer-i386-iossim :: TestCases/Posix/coverage-reset.cc (141 of 478) UNSUPPORTED: AddressSanitizer-i386-iossim :: TestCases/Posix/coverage.cc (142 of 478) UNSUPPORTED: AddressSanitizer-i386-iossim :: TestCases/Posix/current_allocated_bytes.cc (143 of 478) UNSUPPORTED: AddressSanitizer-i386-iossim :: TestCases/Posix/deep_call_stack.cc (144 of 478) UNSUPPORTED: AddressSanitizer-i386-iossim :: TestCases/Posix/deep_thread_stack.cc (145 of 478) UNSUPPORTED: AddressSanitizer-i386-iossim :: TestCases/Posix/dlclose-test.cc (146 of 478) UNSUPPORTED: AddressSanitizer-i386-iossim :: TestCases/Posix/fgets_fputs.cc (147 of 478) UNSUPPORTED: AddressSanitizer-i386-iossim :: TestCases/Posix/fread_fwrite.cc (148 of 478) UNSUPPORTED: AddressSanitizer-i386-iossim :: TestCases/Posix/free_hook_realloc.cc (149 of 478) UNSUPPORTED: AddressSanitizer-i386-iossim :: TestCases/Posix/freopen.cc (150 of 478) UNSUPPORTED: AddressSanitizer-i386-iossim :: TestCases/Posix/gc-test.cc (151 of 478) UNSUPPORTED: AddressSanitizer-i386-iossim :: TestCases/Posix/glob.cc (152 of 478) UNSUPPORTED: AddressSanitizer-i386-iossim :: TestCases/Posix/global-registration.c (153 of 478) UNSUPPORTED: AddressSanitizer-i386-iossim :: TestCases/Posix/halt_on_error-signals.c (154 of 478) UNSUPPORTED: AddressSanitizer-i386-iossim :: TestCases/Posix/halt_on_error-torture.cc (155 of 478) UNSUPPORTED: AddressSanitizer-i386-iossim :: TestCases/Posix/halt_on_error_suppress_equal_pcs.cc (156 of 478) UNSUPPORTED: AddressSanitizer-i386-iossim :: TestCases/Posix/handle_abort_on_error.cc (157 of 478) UNSUPPORTED: AddressSanitizer-i386-iossim :: TestCases/Posix/init-order-pthread-create.cc (158 of 478) UNSUPPORTED: AddressSanitizer-i386-iossim :: TestCases/Posix/interception-in-shared-lib-test.cc (159 of 478) UNSUPPORTED: AddressSanitizer-i386-iossim :: TestCases/Posix/invalid-pointer-pairs-threads.cc (160 of 478) UNSUPPORTED: AddressSanitizer-i386-iossim :: TestCases/Posix/ioctl.cc (161 of 478) UNSUPPORTED: AddressSanitizer-i386-iossim :: TestCases/Posix/large_allocator_unpoisons_on_free.cc (162 of 478) UNSUPPORTED: AddressSanitizer-i386-iossim :: TestCases/Posix/lto-constmerge-odr.cc (163 of 478) UNSUPPORTED: AddressSanitizer-i386-iossim :: TestCases/Posix/mmap_limit_mb.cc (164 of 478) UNSUPPORTED: AddressSanitizer-i386-iossim :: TestCases/Posix/new_array_cookie_test.cc (165 of 478) UNSUPPORTED: AddressSanitizer-i386-iossim :: TestCases/Posix/new_array_cookie_uaf_test.cc (166 of 478) UNSUPPORTED: AddressSanitizer-i386-iossim :: TestCases/Posix/new_array_cookie_with_new_from_class.cc (167 of 478) UNSUPPORTED: AddressSanitizer-i386-iossim :: TestCases/Posix/no-fd.cc (168 of 478) UNSUPPORTED: AddressSanitizer-i386-iossim :: TestCases/Posix/no_asan_gen_globals.c (169 of 478) UNSUPPORTED: AddressSanitizer-i386-iossim :: TestCases/Posix/print_cmdline.cc (170 of 478) UNSUPPORTED: AddressSanitizer-i386-iossim :: TestCases/Posix/readv.cc (171 of 478) UNSUPPORTED: AddressSanitizer-i386-iossim :: TestCases/Posix/shared-lib-test.cc (172 of 478) UNSUPPORTED: AddressSanitizer-i386-iossim :: TestCases/Posix/stack-overflow.cc (173 of 478) UNSUPPORTED: AddressSanitizer-i386-iossim :: TestCases/Posix/stack-use-after-return.cc (174 of 478) UNSUPPORTED: AddressSanitizer-i386-iossim :: TestCases/Posix/start-deactivated.cc (175 of 478) UNSUPPORTED: AddressSanitizer-i386-iossim :: TestCases/Posix/strchr.c (176 of 478) UNSUPPORTED: AddressSanitizer-i386-iossim :: TestCases/Posix/strerror_r_test.cc (177 of 478) UNSUPPORTED: AddressSanitizer-i386-iossim :: TestCases/Posix/strndup_oob_test.cc (178 of 478) UNSUPPORTED: AddressSanitizer-i386-iossim :: TestCases/Posix/strndup_oob_test2.cc (179 of 478) UNSUPPORTED: AddressSanitizer-i386-iossim :: TestCases/Posix/tsd_dtor_leak.cc (180 of 478) UNSUPPORTED: AddressSanitizer-i386-iossim :: TestCases/Posix/wait.cc (181 of 478) UNSUPPORTED: AddressSanitizer-i386-iossim :: TestCases/Posix/wait3.cc (182 of 478) UNSUPPORTED: AddressSanitizer-i386-iossim :: TestCases/Posix/wait4.cc (183 of 478) UNSUPPORTED: AddressSanitizer-i386-iossim :: TestCases/Posix/waitid.cc (184 of 478) UNSUPPORTED: AddressSanitizer-i386-iossim :: TestCases/Posix/wcrtomb.c (185 of 478) UNSUPPORTED: AddressSanitizer-i386-iossim :: TestCases/Windows/aligned_mallocs.cc (186 of 478) UNSUPPORTED: AddressSanitizer-i386-iossim :: TestCases/Windows/allocators_sanity.cc (187 of 478) UNSUPPORTED: AddressSanitizer-i386-iossim :: TestCases/Windows/beginthreadex.cc (188 of 478) UNSUPPORTED: AddressSanitizer-i386-iossim :: TestCases/Windows/bind_io_completion_callback.cc (189 of 478) UNSUPPORTED: AddressSanitizer-i386-iossim :: TestCases/Windows/bitfield.cc (190 of 478) UNSUPPORTED: AddressSanitizer-i386-iossim :: TestCases/Windows/bitfield_uaf.cc (191 of 478) UNSUPPORTED: AddressSanitizer-i386-iossim :: TestCases/Windows/calloc_left_oob.cc (192 of 478) UNSUPPORTED: AddressSanitizer-i386-iossim :: TestCases/Windows/calloc_right_oob.cc (193 of 478) UNSUPPORTED: AddressSanitizer-i386-iossim :: TestCases/Windows/calloc_uaf.cc (194 of 478) UNSUPPORTED: AddressSanitizer-i386-iossim :: TestCases/Windows/coverage-basic.cc (195 of 478) UNSUPPORTED: AddressSanitizer-i386-iossim :: TestCases/Windows/coverage-dll-stdio.cc (196 of 478) UNSUPPORTED: AddressSanitizer-i386-iossim :: TestCases/Windows/crash_read_write.cc (197 of 478) UNSUPPORTED: AddressSanitizer-i386-iossim :: TestCases/Windows/crt_initializers.cc (198 of 478) UNSUPPORTED: AddressSanitizer-i386-iossim :: TestCases/Windows/delay_dbghelp.cc (199 of 478) UNSUPPORTED: AddressSanitizer-i386-iossim :: TestCases/Windows/demangled_names.cc (200 of 478) UNSUPPORTED: AddressSanitizer-i386-iossim :: TestCases/Windows/dll_aligned_mallocs.cc (201 of 478) UNSUPPORTED: AddressSanitizer-i386-iossim :: TestCases/Windows/dll_allocators_sanity.cc (202 of 478) UNSUPPORTED: AddressSanitizer-i386-iossim :: TestCases/Windows/dll_and_lib.cc (203 of 478) UNSUPPORTED: AddressSanitizer-i386-iossim :: TestCases/Windows/dll_cerr.cc (204 of 478) UNSUPPORTED: AddressSanitizer-i386-iossim :: TestCases/Windows/dll_control_c.cc (205 of 478) UNSUPPORTED: AddressSanitizer-i386-iossim :: TestCases/Windows/dll_global_dead_strip.c (206 of 478) UNSUPPORTED: AddressSanitizer-i386-iossim :: TestCases/Windows/dll_heap_allocation.cc (207 of 478) UNSUPPORTED: AddressSanitizer-i386-iossim :: TestCases/Windows/dll_host.cc (208 of 478) UNSUPPORTED: AddressSanitizer-i386-iossim :: TestCases/Windows/dll_intercept_memchr.cc (209 of 478) UNSUPPORTED: AddressSanitizer-i386-iossim :: TestCases/Windows/dll_intercept_memcpy.cc (210 of 478) UNSUPPORTED: AddressSanitizer-i386-iossim :: TestCases/Windows/dll_intercept_memcpy_indirect.cc (211 of 478) UNSUPPORTED: AddressSanitizer-i386-iossim :: TestCases/Windows/dll_intercept_memset.cc (212 of 478) UNSUPPORTED: AddressSanitizer-i386-iossim :: TestCases/Windows/dll_intercept_strlen.cc (213 of 478) UNSUPPORTED: AddressSanitizer-i386-iossim :: TestCases/Windows/dll_large_function.cc (214 of 478) UNSUPPORTED: AddressSanitizer-i386-iossim :: TestCases/Windows/dll_malloc_left_oob.cc (215 of 478) UNSUPPORTED: AddressSanitizer-i386-iossim :: TestCases/Windows/dll_malloc_uaf.cc (216 of 478) UNSUPPORTED: AddressSanitizer-i386-iossim :: TestCases/Windows/dll_noreturn.cc (217 of 478) UNSUPPORTED: AddressSanitizer-i386-iossim :: TestCases/Windows/dll_null_deref.cc (218 of 478) UNSUPPORTED: AddressSanitizer-i386-iossim :: TestCases/Windows/dll_operator_array_new_left_oob.cc (219 of 478) UNSUPPORTED: AddressSanitizer-i386-iossim :: TestCases/Windows/dll_operator_array_new_with_dtor_left_oob.cc (220 of 478) UNSUPPORTED: AddressSanitizer-i386-iossim :: TestCases/Windows/dll_poison_unpoison.cc (221 of 478) UNSUPPORTED: AddressSanitizer-i386-iossim :: TestCases/Windows/dll_report_globals_symbolization_at_startup.cc (222 of 478) UNSUPPORTED: AddressSanitizer-i386-iossim :: TestCases/Windows/dll_seh.cc (223 of 478) UNSUPPORTED: AddressSanitizer-i386-iossim :: TestCases/Windows/dll_stack_use_after_return.cc (224 of 478) UNSUPPORTED: AddressSanitizer-i386-iossim :: TestCases/Windows/dll_thread_stack_array_left_oob.cc (225 of 478) UNSUPPORTED: AddressSanitizer-i386-iossim :: TestCases/Windows/dll_unload.cc (226 of 478) UNSUPPORTED: AddressSanitizer-i386-iossim :: TestCases/Windows/double_free.cc (227 of 478) UNSUPPORTED: AddressSanitizer-i386-iossim :: TestCases/Windows/double_operator_delete.cc (228 of 478) UNSUPPORTED: AddressSanitizer-i386-iossim :: TestCases/Windows/free_hook_realloc.cc (229 of 478) UNSUPPORTED: AddressSanitizer-i386-iossim :: TestCases/Windows/fuse-lld-globals.cc (230 of 478) UNSUPPORTED: AddressSanitizer-i386-iossim :: TestCases/Windows/fuse-lld.cc (231 of 478) UNSUPPORTED: AddressSanitizer-i386-iossim :: TestCases/Windows/global_const_string.cc (232 of 478) UNSUPPORTED: AddressSanitizer-i386-iossim :: TestCases/Windows/global_const_string_oob.cc (233 of 478) UNSUPPORTED: AddressSanitizer-i386-iossim :: TestCases/Windows/global_dead_strip.c (234 of 478) UNSUPPORTED: AddressSanitizer-i386-iossim :: TestCases/Windows/heapalloc.cc (235 of 478) UNSUPPORTED: AddressSanitizer-i386-iossim :: TestCases/Windows/heapalloc_dll_double_free.cc (236 of 478) UNSUPPORTED: AddressSanitizer-i386-iossim :: TestCases/Windows/heapalloc_dll_unload_realloc_uaf.cc (237 of 478) UNSUPPORTED: AddressSanitizer-i386-iossim :: TestCases/Windows/heapalloc_doublefree.cc (238 of 478) UNSUPPORTED: AddressSanitizer-i386-iossim :: TestCases/Windows/heapalloc_flags_fallback.cc (239 of 478) UNSUPPORTED: AddressSanitizer-i386-iossim :: TestCases/Windows/heapalloc_huge.cc (240 of 478) UNSUPPORTED: AddressSanitizer-i386-iossim :: TestCases/Windows/heapalloc_rtl_transfer.cc (241 of 478) UNSUPPORTED: AddressSanitizer-i386-iossim :: TestCases/Windows/heapalloc_sanity.cc (242 of 478) UNSUPPORTED: AddressSanitizer-i386-iossim :: TestCases/Windows/heapalloc_transfer.cc (243 of 478) UNSUPPORTED: AddressSanitizer-i386-iossim :: TestCases/Windows/heapalloc_uaf.cc (244 of 478) UNSUPPORTED: AddressSanitizer-i386-iossim :: TestCases/Windows/heapalloc_zero_size.cc (245 of 478) UNSUPPORTED: AddressSanitizer-i386-iossim :: TestCases/Windows/heaprealloc.cc (246 of 478) UNSUPPORTED: AddressSanitizer-i386-iossim :: TestCases/Windows/heaprealloc_alloc_zero.cc (247 of 478) UNSUPPORTED: AddressSanitizer-i386-iossim :: TestCases/Windows/heaprealloc_zero_size.cc (248 of 478) UNSUPPORTED: AddressSanitizer-i386-iossim :: TestCases/Windows/hello_world.cc (249 of 478) UNSUPPORTED: AddressSanitizer-i386-iossim :: TestCases/Windows/intercept_memcpy.cc (250 of 478) UNSUPPORTED: AddressSanitizer-i386-iossim :: TestCases/Windows/intercept_strdup.cc (251 of 478) UNSUPPORTED: AddressSanitizer-i386-iossim :: TestCases/Windows/intercept_strlen.cc (252 of 478) UNSUPPORTED: AddressSanitizer-i386-iossim :: TestCases/Windows/interface_symbols_windows.cc (253 of 478) UNSUPPORTED: AddressSanitizer-i386-iossim :: TestCases/Windows/iostream_sbo.cc (254 of 478) UNSUPPORTED: AddressSanitizer-i386-iossim :: TestCases/Windows/longjmp.cc (255 of 478) UNSUPPORTED: AddressSanitizer-i386-iossim :: TestCases/Windows/malloc_left_oob.cc (256 of 478) UNSUPPORTED: AddressSanitizer-i386-iossim :: TestCases/Windows/malloc_right_oob.cc (257 of 478) UNSUPPORTED: AddressSanitizer-i386-iossim :: TestCases/Windows/malloc_uaf.cc (258 of 478) UNSUPPORTED: AddressSanitizer-i386-iossim :: TestCases/Windows/null_deref.cc (259 of 478) UNSUPPORTED: AddressSanitizer-i386-iossim :: TestCases/Windows/null_deref_multiple_dlls.cc (260 of 478) UNSUPPORTED: AddressSanitizer-i386-iossim :: TestCases/Windows/oom.cc (261 of 478) UNSUPPORTED: AddressSanitizer-i386-iossim :: TestCases/Windows/operator_array_new_left_oob.cc (262 of 478) UNSUPPORTED: AddressSanitizer-i386-iossim :: TestCases/Windows/operator_array_new_right_oob.cc (263 of 478) UNSUPPORTED: AddressSanitizer-i386-iossim :: TestCases/Windows/operator_array_new_uaf.cc (264 of 478) UNSUPPORTED: AddressSanitizer-i386-iossim :: TestCases/Windows/operator_array_new_with_dtor_left_oob.cc (265 of 478) UNSUPPORTED: AddressSanitizer-i386-iossim :: TestCases/Windows/operator_delete_wrong_argument.cc (266 of 478) UNSUPPORTED: AddressSanitizer-i386-iossim :: TestCases/Windows/operator_new_left_oob.cc (267 of 478) UNSUPPORTED: AddressSanitizer-i386-iossim :: TestCases/Windows/operator_new_right_oob.cc (268 of 478) UNSUPPORTED: AddressSanitizer-i386-iossim :: TestCases/Windows/operator_new_uaf.cc (269 of 478) UNSUPPORTED: AddressSanitizer-i386-iossim :: TestCases/Windows/queue_user_work_item.cc (270 of 478) UNSUPPORTED: AddressSanitizer-i386-iossim :: TestCases/Windows/queue_user_work_item_report.cc (271 of 478) UNSUPPORTED: AddressSanitizer-i386-iossim :: TestCases/Windows/realloc_left_oob.cc (272 of 478) UNSUPPORTED: AddressSanitizer-i386-iossim :: TestCases/Windows/realloc_right_oob.cc (273 of 478) UNSUPPORTED: AddressSanitizer-i386-iossim :: TestCases/Windows/realloc_uaf.cc (274 of 478) UNSUPPORTED: AddressSanitizer-i386-iossim :: TestCases/Windows/recalloc_sanity.cc (275 of 478) UNSUPPORTED: AddressSanitizer-i386-iossim :: TestCases/Windows/report_after_syminitialize.cc (276 of 478) UNSUPPORTED: AddressSanitizer-i386-iossim :: TestCases/Windows/report_globals_reload_dll.cc (277 of 478) UNSUPPORTED: AddressSanitizer-i386-iossim :: TestCases/Windows/report_globals_vs_freelibrary.cc (278 of 478) UNSUPPORTED: AddressSanitizer-i386-iossim :: TestCases/Windows/rtlallocateheap.cc (279 of 478) UNSUPPORTED: AddressSanitizer-i386-iossim :: TestCases/Windows/rtlallocateheap_dll_unload_double_free.cc (280 of 478) UNSUPPORTED: AddressSanitizer-i386-iossim :: TestCases/Windows/rtlallocateheap_dll_unload_realloc.cc (281 of 478) UNSUPPORTED: AddressSanitizer-i386-iossim :: TestCases/Windows/rtlallocateheap_flags_fallback.cc (282 of 478) UNSUPPORTED: AddressSanitizer-i386-iossim :: TestCases/Windows/rtlallocateheap_zero.cc (283 of 478) UNSUPPORTED: AddressSanitizer-i386-iossim :: TestCases/Windows/seh.cc (284 of 478) UNSUPPORTED: AddressSanitizer-i386-iossim :: TestCases/Windows/shadow_conflict_32.cc (285 of 478) UNSUPPORTED: AddressSanitizer-i386-iossim :: TestCases/Windows/shadow_mapping_failure.cc (286 of 478) UNSUPPORTED: AddressSanitizer-i386-iossim :: TestCases/Windows/stack_array_left_oob.cc (287 of 478) UNSUPPORTED: AddressSanitizer-i386-iossim :: TestCases/Windows/stack_array_right_oob.cc (288 of 478) UNSUPPORTED: AddressSanitizer-i386-iossim :: TestCases/Windows/stack_array_sanity.cc (289 of 478) UNSUPPORTED: AddressSanitizer-i386-iossim :: TestCases/Windows/stack_use_after_return.cc (290 of 478) UNSUPPORTED: AddressSanitizer-i386-iossim :: TestCases/Windows/symbols_path.cc (291 of 478) UNSUPPORTED: AddressSanitizer-i386-iossim :: TestCases/Windows/thread_simple.cc (292 of 478) UNSUPPORTED: AddressSanitizer-i386-iossim :: TestCases/Windows/thread_stack_array_left_oob.cc (293 of 478) UNSUPPORTED: AddressSanitizer-i386-iossim :: TestCases/Windows/thread_stack_array_right_oob.cc (294 of 478) UNSUPPORTED: AddressSanitizer-i386-iossim :: TestCases/Windows/thread_stack_reuse.cc (295 of 478) UNSUPPORTED: AddressSanitizer-i386-iossim :: TestCases/Windows/thread_stress.cc (296 of 478) UNSUPPORTED: AddressSanitizer-i386-iossim :: TestCases/Windows/thread_suspended.cc (297 of 478) UNSUPPORTED: AddressSanitizer-i386-iossim :: TestCases/Windows/tls_init.cc (298 of 478) UNSUPPORTED: AddressSanitizer-i386-iossim :: TestCases/Windows/unsymbolized.cc (299 of 478) UNSUPPORTED: AddressSanitizer-i386-iossim :: TestCases/Windows/use_after_realloc.cc (300 of 478) UNSUPPORTED: AddressSanitizer-i386-iossim :: TestCases/Windows/use_after_return_linkage.cc (301 of 478) UNSUPPORTED: AddressSanitizer-i386-iossim :: TestCases/Windows/user-exception.cc (302 of 478) UNSUPPORTED: AddressSanitizer-i386-iossim :: TestCases/Windows/windows_h.cc (303 of 478) UNSUPPORTED: AddressSanitizer-i386-iossim :: TestCases/Windows/wrong_downcast_on_heap.cc (304 of 478) UNSUPPORTED: AddressSanitizer-i386-iossim :: TestCases/Windows/wrong_downcast_on_stack.cc (305 of 478) UNSUPPORTED: AddressSanitizer-i386-iossim :: TestCases/alloca_big_alignment.cc (306 of 478) UNSUPPORTED: AddressSanitizer-i386-iossim :: TestCases/alloca_constant_size.cc (307 of 478) UNSUPPORTED: AddressSanitizer-i386-iossim :: TestCases/alloca_detect_custom_size_.cc (308 of 478) UNSUPPORTED: AddressSanitizer-i386-iossim :: TestCases/alloca_instruments_all_paddings.cc (309 of 478) UNSUPPORTED: AddressSanitizer-i386-iossim :: TestCases/alloca_loop_unpoisoning.cc (310 of 478) UNSUPPORTED: AddressSanitizer-i386-iossim :: TestCases/alloca_overflow_partial.cc (311 of 478) UNSUPPORTED: AddressSanitizer-i386-iossim :: TestCases/alloca_overflow_right.cc (312 of 478) UNSUPPORTED: AddressSanitizer-i386-iossim :: TestCases/alloca_safe_access.cc (313 of 478) UNSUPPORTED: AddressSanitizer-i386-iossim :: TestCases/alloca_underflow_left.cc (314 of 478) UNSUPPORTED: AddressSanitizer-i386-iossim :: TestCases/alloca_vla_interact.cc (315 of 478) UNSUPPORTED: AddressSanitizer-i386-iossim :: TestCases/asan_and_llvm_coverage_test.cc (316 of 478) UNSUPPORTED: AddressSanitizer-i386-iossim :: TestCases/asan_options-help.cc (317 of 478) UNSUPPORTED: AddressSanitizer-i386-iossim :: TestCases/atexit_stats.cc (318 of 478) UNSUPPORTED: AddressSanitizer-i386-iossim :: TestCases/atoi_strict.c (319 of 478) UNSUPPORTED: AddressSanitizer-i386-iossim :: TestCases/atol_strict.c (320 of 478) UNSUPPORTED: AddressSanitizer-i386-iossim :: TestCases/atoll_strict.c (321 of 478) UNSUPPORTED: AddressSanitizer-i386-iossim :: TestCases/blacklist.cc (322 of 478) UNSUPPORTED: AddressSanitizer-i386-iossim :: TestCases/calloc-overflow.cc (323 of 478) UNSUPPORTED: AddressSanitizer-i386-iossim :: TestCases/contiguous_container.cc (324 of 478) UNSUPPORTED: AddressSanitizer-i386-iossim :: TestCases/contiguous_container_crash.cc (325 of 478) UNSUPPORTED: AddressSanitizer-i386-iossim :: TestCases/coverage-and-lsan.cc (326 of 478) UNSUPPORTED: AddressSanitizer-i386-iossim :: TestCases/coverage-disabled.cc (327 of 478) UNSUPPORTED: AddressSanitizer-i386-iossim :: TestCases/coverage-trace-pc.cc (328 of 478) UNSUPPORTED: AddressSanitizer-i386-iossim :: TestCases/debug_double_free.cc (329 of 478) UNSUPPORTED: AddressSanitizer-i386-iossim :: TestCases/debug_locate.cc (330 of 478) UNSUPPORTED: AddressSanitizer-i386-iossim :: TestCases/debug_mapping.cc (331 of 478) UNSUPPORTED: AddressSanitizer-i386-iossim :: TestCases/debug_ppc64_mapping.cc (332 of 478) UNSUPPORTED: AddressSanitizer-i386-iossim :: TestCases/debug_report.cc (333 of 478) UNSUPPORTED: AddressSanitizer-i386-iossim :: TestCases/debug_stacks.cc (334 of 478) UNSUPPORTED: AddressSanitizer-i386-iossim :: TestCases/deep_stack_uaf.cc (335 of 478) UNSUPPORTED: AddressSanitizer-i386-iossim :: TestCases/deep_tail_call.cc (336 of 478) UNSUPPORTED: AddressSanitizer-i386-iossim :: TestCases/default_blacklist.cc (337 of 478) UNSUPPORTED: AddressSanitizer-i386-iossim :: TestCases/default_options.cc (338 of 478) UNSUPPORTED: AddressSanitizer-i386-iossim :: TestCases/describe_address.cc (339 of 478) UNSUPPORTED: AddressSanitizer-i386-iossim :: TestCases/double-free.cc (340 of 478) UNSUPPORTED: AddressSanitizer-i386-iossim :: TestCases/error_report_callback.cc (341 of 478) UNSUPPORTED: AddressSanitizer-i386-iossim :: TestCases/exitcode.cc (342 of 478) UNSUPPORTED: AddressSanitizer-i386-iossim :: TestCases/force_inline_opt0.cc (343 of 478) UNSUPPORTED: AddressSanitizer-i386-iossim :: TestCases/frexp_interceptor.cc (344 of 478) UNSUPPORTED: AddressSanitizer-i386-iossim :: TestCases/global-address.cpp (345 of 478) UNSUPPORTED: AddressSanitizer-i386-iossim :: TestCases/global-demangle.cc (346 of 478) UNSUPPORTED: AddressSanitizer-i386-iossim :: TestCases/global-location.cc (347 of 478) UNSUPPORTED: AddressSanitizer-i386-iossim :: TestCases/global-overflow.cc (348 of 478) UNSUPPORTED: AddressSanitizer-i386-iossim :: TestCases/global-underflow.cc (349 of 478) UNSUPPORTED: AddressSanitizer-i386-iossim :: TestCases/halt_on_error-1.c (350 of 478) UNSUPPORTED: AddressSanitizer-i386-iossim :: TestCases/handle_noreturn_bug.cc (351 of 478) UNSUPPORTED: AddressSanitizer-i386-iossim :: TestCases/heap-overflow-large.cc (352 of 478) UNSUPPORTED: AddressSanitizer-i386-iossim :: TestCases/heap-overflow.cc (353 of 478) UNSUPPORTED: AddressSanitizer-i386-iossim :: TestCases/heavy_uar_test.cc (354 of 478) UNSUPPORTED: AddressSanitizer-i386-iossim :: TestCases/huge_negative_hea_oob.cc (355 of 478) UNSUPPORTED: AddressSanitizer-i386-iossim :: TestCases/ill.cc (356 of 478) UNSUPPORTED: AddressSanitizer-i386-iossim :: TestCases/init-order-atexit.cc (357 of 478) UNSUPPORTED: AddressSanitizer-i386-iossim :: TestCases/initialization-blacklist.cc (358 of 478) UNSUPPORTED: AddressSanitizer-i386-iossim :: TestCases/initialization-bug.cc (359 of 478) UNSUPPORTED: AddressSanitizer-i386-iossim :: TestCases/initialization-constexpr.cc (360 of 478) UNSUPPORTED: AddressSanitizer-i386-iossim :: TestCases/initialization-nobug.cc (361 of 478) UNSUPPORTED: AddressSanitizer-i386-iossim :: TestCases/inline.cc (362 of 478) UNSUPPORTED: AddressSanitizer-i386-iossim :: TestCases/intercept-rethrow-exception.cc (363 of 478) UNSUPPORTED: AddressSanitizer-i386-iossim :: TestCases/interception_failure_test.cc (364 of 478) UNSUPPORTED: AddressSanitizer-i386-iossim :: TestCases/interface_test.cc (365 of 478) UNSUPPORTED: AddressSanitizer-i386-iossim :: TestCases/intra-object-overflow.cc (366 of 478) UNSUPPORTED: AddressSanitizer-i386-iossim :: TestCases/invalid-free.cc (367 of 478) UNSUPPORTED: AddressSanitizer-i386-iossim :: TestCases/invalid-pointer-pairs-compare-errors.cc (368 of 478) UNSUPPORTED: AddressSanitizer-i386-iossim :: TestCases/invalid-pointer-pairs-compare-null.cc (369 of 478) UNSUPPORTED: AddressSanitizer-i386-iossim :: TestCases/invalid-pointer-pairs-compare-success.cc (370 of 478) UNSUPPORTED: AddressSanitizer-i386-iossim :: TestCases/invalid-pointer-pairs-subtract-errors.cc (371 of 478) UNSUPPORTED: AddressSanitizer-i386-iossim :: TestCases/invalid-pointer-pairs-subtract-success.cc (372 of 478) UNSUPPORTED: AddressSanitizer-i386-iossim :: TestCases/invalid-pointer-pairs.cc (373 of 478) UNSUPPORTED: AddressSanitizer-i386-iossim :: TestCases/large_func_test.cc (374 of 478) UNSUPPORTED: AddressSanitizer-i386-iossim :: TestCases/log-path_test.cc (375 of 478) UNSUPPORTED: AddressSanitizer-i386-iossim :: TestCases/longjmp.cc (376 of 478) UNSUPPORTED: AddressSanitizer-i386-iossim :: TestCases/lsan_annotations.cc (377 of 478) UNSUPPORTED: AddressSanitizer-i386-iossim :: TestCases/malloc-no-intercept.c (378 of 478) UNSUPPORTED: AddressSanitizer-i386-iossim :: TestCases/malloc-size-too-big.cc (379 of 478) UNSUPPORTED: AddressSanitizer-i386-iossim :: TestCases/malloc_context_size.cc (380 of 478) UNSUPPORTED: AddressSanitizer-i386-iossim :: TestCases/malloc_fill.cc (381 of 478) UNSUPPORTED: AddressSanitizer-i386-iossim :: TestCases/max_redzone.cc (382 of 478) UNSUPPORTED: AddressSanitizer-i386-iossim :: TestCases/memcmp_strict_test.cc (383 of 478) UNSUPPORTED: AddressSanitizer-i386-iossim :: TestCases/memcmp_test.cc (384 of 478) UNSUPPORTED: AddressSanitizer-i386-iossim :: TestCases/memset_test.cc (385 of 478) UNSUPPORTED: AddressSanitizer-i386-iossim :: TestCases/non-executable-pc.cpp (386 of 478) UNSUPPORTED: AddressSanitizer-i386-iossim :: TestCases/null_deref.cc (387 of 478) UNSUPPORTED: AddressSanitizer-i386-iossim :: TestCases/on_error_callback.cc (388 of 478) UNSUPPORTED: AddressSanitizer-i386-iossim :: TestCases/partial_right.cc (389 of 478) UNSUPPORTED: AddressSanitizer-i386-iossim :: TestCases/pass-object-byval.cc (390 of 478) UNSUPPORTED: AddressSanitizer-i386-iossim :: TestCases/pass-struct-byval-uar.cc (391 of 478) UNSUPPORTED: AddressSanitizer-i386-iossim :: TestCases/pass-struct-byval.cc (392 of 478) UNSUPPORTED: AddressSanitizer-i386-iossim :: TestCases/poison_partial.cc (393 of 478) UNSUPPORTED: AddressSanitizer-i386-iossim :: TestCases/pr33372.cc (394 of 478) UNSUPPORTED: AddressSanitizer-i386-iossim :: TestCases/print_summary.cc (395 of 478) UNSUPPORTED: AddressSanitizer-i386-iossim :: TestCases/printf-1.c (396 of 478) UNSUPPORTED: AddressSanitizer-i386-iossim :: TestCases/printf-2.c (397 of 478) UNSUPPORTED: AddressSanitizer-i386-iossim :: TestCases/printf-3.c (398 of 478) UNSUPPORTED: AddressSanitizer-i386-iossim :: TestCases/printf-4.c (399 of 478) UNSUPPORTED: AddressSanitizer-i386-iossim :: TestCases/printf-5.c (400 of 478) UNSUPPORTED: AddressSanitizer-i386-iossim :: TestCases/printf-m.c (401 of 478) UNSUPPORTED: AddressSanitizer-i386-iossim :: TestCases/realloc.cc (402 of 478) UNSUPPORTED: AddressSanitizer-i386-iossim :: TestCases/sanity_check_pure_c.c (403 of 478) UNSUPPORTED: AddressSanitizer-i386-iossim :: TestCases/scariness_score_test.cc (404 of 478) UNSUPPORTED: AddressSanitizer-i386-iossim :: TestCases/set_shadow_test.c (405 of 478) UNSUPPORTED: AddressSanitizer-i386-iossim :: TestCases/sleep_after_init.c (406 of 478) UNSUPPORTED: AddressSanitizer-i386-iossim :: TestCases/sleep_before_dying.c (407 of 478) UNSUPPORTED: AddressSanitizer-i386-iossim :: TestCases/small_memcpy_test.cc (408 of 478) UNSUPPORTED: AddressSanitizer-i386-iossim :: TestCases/speculative_load.cc (409 of 478) UNSUPPORTED: AddressSanitizer-i386-iossim :: TestCases/speculative_load2.cc (410 of 478) UNSUPPORTED: AddressSanitizer-i386-iossim :: TestCases/stack-buffer-overflow-with-position.cc (411 of 478) UNSUPPORTED: AddressSanitizer-i386-iossim :: TestCases/stack-buffer-overflow.cc (412 of 478) UNSUPPORTED: AddressSanitizer-i386-iossim :: TestCases/stack-frame-demangle.cc (413 of 478) UNSUPPORTED: AddressSanitizer-i386-iossim :: TestCases/stack-oob-frames.cc (414 of 478) UNSUPPORTED: AddressSanitizer-i386-iossim :: TestCases/strcasestr-1.c (415 of 478) UNSUPPORTED: AddressSanitizer-i386-iossim :: TestCases/strcasestr-2.c (416 of 478) UNSUPPORTED: AddressSanitizer-i386-iossim :: TestCases/strcasestr_strict.c (417 of 478) UNSUPPORTED: AddressSanitizer-i386-iossim :: TestCases/strcat-overlap.cc (418 of 478) UNSUPPORTED: AddressSanitizer-i386-iossim :: TestCases/strcat_strict.c (419 of 478) UNSUPPORTED: AddressSanitizer-i386-iossim :: TestCases/strchr_strict.c (420 of 478) UNSUPPORTED: AddressSanitizer-i386-iossim :: TestCases/strcmp_strict.c (421 of 478) UNSUPPORTED: AddressSanitizer-i386-iossim :: TestCases/strcpy-overlap.cc (422 of 478) UNSUPPORTED: AddressSanitizer-i386-iossim :: TestCases/strcspn-1.c (423 of 478) UNSUPPORTED: AddressSanitizer-i386-iossim :: TestCases/strcspn-2.c (424 of 478) UNSUPPORTED: AddressSanitizer-i386-iossim :: TestCases/strcspn_strict.c (425 of 478) UNSUPPORTED: AddressSanitizer-i386-iossim :: TestCases/strdup_oob_test.cc (426 of 478) UNSUPPORTED: AddressSanitizer-i386-iossim :: TestCases/strip_path_prefix.c (427 of 478) UNSUPPORTED: AddressSanitizer-i386-iossim :: TestCases/strncasecmp_strict.c (428 of 478) UNSUPPORTED: AddressSanitizer-i386-iossim :: TestCases/strncat-overlap.cc (429 of 478) UNSUPPORTED: AddressSanitizer-i386-iossim :: TestCases/strncat_strict.c (430 of 478) UNSUPPORTED: AddressSanitizer-i386-iossim :: TestCases/strncmp_strict.c (431 of 478) UNSUPPORTED: AddressSanitizer-i386-iossim :: TestCases/strncpy-overflow.cc (432 of 478) UNSUPPORTED: AddressSanitizer-i386-iossim :: TestCases/strncpy-overlap.cc (433 of 478) UNSUPPORTED: AddressSanitizer-i386-iossim :: TestCases/strpbrk-1.c (434 of 478) UNSUPPORTED: AddressSanitizer-i386-iossim :: TestCases/strpbrk-2.c (435 of 478) UNSUPPORTED: AddressSanitizer-i386-iossim :: TestCases/strpbrk_strict.c (436 of 478) UNSUPPORTED: AddressSanitizer-i386-iossim :: TestCases/strspn-1.c (437 of 478) UNSUPPORTED: AddressSanitizer-i386-iossim :: TestCases/strspn-2.c (438 of 478) UNSUPPORTED: AddressSanitizer-i386-iossim :: TestCases/strspn_strict.c (439 of 478) UNSUPPORTED: AddressSanitizer-i386-iossim :: TestCases/strstr-1.c (440 of 478) UNSUPPORTED: AddressSanitizer-i386-iossim :: TestCases/strstr-2.c (441 of 478) UNSUPPORTED: AddressSanitizer-i386-iossim :: TestCases/strstr_strict.c (442 of 478) UNSUPPORTED: AddressSanitizer-i386-iossim :: TestCases/strtok.c (443 of 478) UNSUPPORTED: AddressSanitizer-i386-iossim :: TestCases/strtol_strict.c (444 of 478) UNSUPPORTED: AddressSanitizer-i386-iossim :: TestCases/strtoll_strict.c (445 of 478) UNSUPPORTED: AddressSanitizer-i386-iossim :: TestCases/suppressions-exec-relative-location.cc (446 of 478) UNSUPPORTED: AddressSanitizer-i386-iossim :: TestCases/suppressions-function.cc (447 of 478) UNSUPPORTED: AddressSanitizer-i386-iossim :: TestCases/suppressions-interceptor.cc (448 of 478) UNSUPPORTED: AddressSanitizer-i386-iossim :: TestCases/suppressions-library.cc (449 of 478) UNSUPPORTED: AddressSanitizer-i386-iossim :: TestCases/throw_call_test.cc (450 of 478) UNSUPPORTED: AddressSanitizer-i386-iossim :: TestCases/throw_catch.cc (451 of 478) UNSUPPORTED: AddressSanitizer-i386-iossim :: TestCases/throw_invoke_test.cc (452 of 478) UNSUPPORTED: AddressSanitizer-i386-iossim :: TestCases/time_interceptor.cc (453 of 478) UNSUPPORTED: AddressSanitizer-i386-iossim :: TestCases/uar_and_exceptions.cc (454 of 478) UNSUPPORTED: AddressSanitizer-i386-iossim :: TestCases/unaligned_loads_and_stores.cc (455 of 478) UNSUPPORTED: AddressSanitizer-i386-iossim :: TestCases/use-after-delete.cc (456 of 478) UNSUPPORTED: AddressSanitizer-i386-iossim :: TestCases/use-after-free-right.cc (457 of 478) UNSUPPORTED: AddressSanitizer-i386-iossim :: TestCases/use-after-free.cc (458 of 478) UNSUPPORTED: AddressSanitizer-i386-iossim :: TestCases/use-after-poison.cc (459 of 478) UNSUPPORTED: AddressSanitizer-i386-iossim :: TestCases/use-after-scope-capture.cc (460 of 478) UNSUPPORTED: AddressSanitizer-i386-iossim :: TestCases/use-after-scope-conversion.cc (461 of 478) UNSUPPORTED: AddressSanitizer-i386-iossim :: TestCases/use-after-scope-dtor-order.cc (462 of 478) UNSUPPORTED: AddressSanitizer-i386-iossim :: TestCases/use-after-scope-goto.cc (463 of 478) UNSUPPORTED: AddressSanitizer-i386-iossim :: TestCases/use-after-scope-if.cc (464 of 478) UNSUPPORTED: AddressSanitizer-i386-iossim :: TestCases/use-after-scope-inlined.cc (465 of 478) UNSUPPORTED: AddressSanitizer-i386-iossim :: TestCases/use-after-scope-loop-bug.cc (466 of 478) UNSUPPORTED: AddressSanitizer-i386-iossim :: TestCases/use-after-scope-loop-removed.cc (467 of 478) UNSUPPORTED: AddressSanitizer-i386-iossim :: TestCases/use-after-scope-loop.cc (468 of 478) UNSUPPORTED: AddressSanitizer-i386-iossim :: TestCases/use-after-scope-nobug.cc (469 of 478) UNSUPPORTED: AddressSanitizer-i386-iossim :: TestCases/use-after-scope-temp.cc (470 of 478) UNSUPPORTED: AddressSanitizer-i386-iossim :: TestCases/use-after-scope-temp2.cc (471 of 478) UNSUPPORTED: AddressSanitizer-i386-iossim :: TestCases/use-after-scope-types.cc (472 of 478) UNSUPPORTED: AddressSanitizer-i386-iossim :: TestCases/use-after-scope.cc (473 of 478) UNSUPPORTED: AddressSanitizer-i386-iossim :: TestCases/verbose-log-path_test.cc (474 of 478) UNSUPPORTED: AddressSanitizer-i386-iossim :: TestCases/vla_chrome_testcase.cc (475 of 478) UNSUPPORTED: AddressSanitizer-i386-iossim :: TestCases/vla_condition_overflow.cc (476 of 478) UNSUPPORTED: AddressSanitizer-i386-iossim :: TestCases/vla_loop_overfow.cc (477 of 478) UNSUPPORTED: AddressSanitizer-i386-iossim :: TestCases/zero_page_pc.cc (478 of 478) Testing Time: 0.43s Unsupported Tests : 478 + ./bin/llvm-lit -v --xunit-xml-output=tsan-IOSSimX86_64Config.xunit.xml ./tools/clang/runtime/compiler-rt-bins/test/tsan/IOSSimX86_64Config/ llvm-lit: /Users/buildslave/jenkins/workspace/clang-stage1-cmake-RA-expensive/llvm-project/llvm/utils/lit/lit/util.py:408: note: using SDKROOT: u'/Applications/Xcode.app/Contents/Developer/Platforms/MacOSX.platform/Developer/SDKs/MacOSX10.13.sdk' llvm-lit: /Users/buildslave/jenkins/workspace/clang-stage1-cmake-RA-expensive/llvm-project/compiler-rt/test/lit.common.cfg.py:427: warning: Throttling sanitizer tests that require shadow memory on Darwin 64bit {"env": {}} -- Testing: 319 tests, 8 threads -- XFAIL: ThreadSanitizer-x86_64-iossim :: Darwin/dlopen.cc (1 of 319) PASS: ThreadSanitizer-x86_64-iossim :: Darwin/debug_external.cc (2 of 319) PASS: ThreadSanitizer-x86_64-iossim :: Darwin/deadlock.mm (3 of 319) PASS: ThreadSanitizer-x86_64-iossim :: Darwin/external-lib.cc (4 of 319) PASS: ThreadSanitizer-x86_64-iossim :: Darwin/external-noninstrumented-module.cc (5 of 319) PASS: ThreadSanitizer-x86_64-iossim :: Darwin/external-dups.cc (6 of 319) PASS: ThreadSanitizer-x86_64-iossim :: Darwin/external-ignore-noninstrumented.cc (7 of 319) PASS: ThreadSanitizer-x86_64-iossim :: Darwin/external-swift-debugging.cc (8 of 319) PASS: ThreadSanitizer-x86_64-iossim :: Darwin/external-swift.cc (9 of 319) PASS: ThreadSanitizer-x86_64-iossim :: Darwin/gcd-sync-block-copy.mm (10 of 319) PASS: ThreadSanitizer-x86_64-iossim :: Darwin/ignore-noninstrumented.mm (11 of 319) PASS: ThreadSanitizer-x86_64-iossim :: Darwin/libcxx-call-once.mm (12 of 319) PASS: ThreadSanitizer-x86_64-iossim :: Darwin/libcxx-future.mm (13 of 319) PASS: ThreadSanitizer-x86_64-iossim :: Darwin/external.cc (14 of 319) PASS: ThreadSanitizer-x86_64-iossim :: Darwin/libcxx-shared-ptr-recursive.mm (15 of 319) PASS: ThreadSanitizer-x86_64-iossim :: Darwin/main_tid.mm (16 of 319) PASS: ThreadSanitizer-x86_64-iossim :: Darwin/libcxx-shared-ptr-stress.mm (17 of 319) PASS: ThreadSanitizer-x86_64-iossim :: Darwin/libcxx-shared-ptr.mm (18 of 319) PASS: ThreadSanitizer-x86_64-iossim :: Darwin/malloc-stack-logging.cc (19 of 319) PASS: ThreadSanitizer-x86_64-iossim :: Darwin/malloc_size.mm (20 of 319) PASS: ThreadSanitizer-x86_64-iossim :: Darwin/norace-objcxx-run-time.mm (21 of 319) PASS: ThreadSanitizer-x86_64-iossim :: Darwin/objc-race.mm (22 of 319) PASS: ThreadSanitizer-x86_64-iossim :: Darwin/objc-simple.mm (23 of 319) PASS: ThreadSanitizer-x86_64-iossim :: Darwin/objc-synchronize-cycle-tagged.mm (24 of 319) PASS: ThreadSanitizer-x86_64-iossim :: Darwin/objc-double-property.mm (25 of 319) PASS: ThreadSanitizer-x86_64-iossim :: Darwin/objc-synchronize-nested-recursive.mm (26 of 319) PASS: ThreadSanitizer-x86_64-iossim :: Darwin/objc-synchronize-cycle.mm (27 of 319) PASS: ThreadSanitizer-x86_64-iossim :: Darwin/objc-synchronize-tagged.mm (28 of 319) PASS: ThreadSanitizer-x86_64-iossim :: Darwin/objc-synchronize.mm (29 of 319) PASS: ThreadSanitizer-x86_64-iossim :: Darwin/osatomics-add.mm (30 of 319) PASS: ThreadSanitizer-x86_64-iossim :: Darwin/osatomics-bitops.mm (31 of 319) PASS: ThreadSanitizer-x86_64-iossim :: Darwin/osspinlock-norace.cc (32 of 319) PASS: ThreadSanitizer-x86_64-iossim :: Darwin/realloc-zero.cc (33 of 319) PASS: ThreadSanitizer-x86_64-iossim :: Darwin/signals-blocked.cc (34 of 319) PASS: ThreadSanitizer-x86_64-iossim :: Darwin/osatomics-list.mm (35 of 319) PASS: ThreadSanitizer-x86_64-iossim :: Darwin/symbolizer-dladdr.cc (36 of 319) UNSUPPORTED: ThreadSanitizer-x86_64-iossim :: Darwin/xpc-cancel.mm (37 of 319) UNSUPPORTED: ThreadSanitizer-x86_64-iossim :: Darwin/xpc-race.mm (38 of 319) UNSUPPORTED: ThreadSanitizer-x86_64-iossim :: Darwin/xpc.mm (39 of 319) UNSUPPORTED: ThreadSanitizer-x86_64-iossim :: Linux/check_memcpy.c (40 of 319) UNSUPPORTED: ThreadSanitizer-x86_64-iossim :: Linux/check_preinit.cc (41 of 319) UNSUPPORTED: ThreadSanitizer-x86_64-iossim :: Linux/double_race.cc (42 of 319) UNSUPPORTED: ThreadSanitizer-x86_64-iossim :: Linux/mutex_robust.cc (43 of 319) UNSUPPORTED: ThreadSanitizer-x86_64-iossim :: Linux/mutex_robust2.cc (44 of 319) UNSUPPORTED: ThreadSanitizer-x86_64-iossim :: Linux/pie_no_aslr.cc (45 of 319) UNSUPPORTED: ThreadSanitizer-x86_64-iossim :: Linux/thread_timedjoin.c (46 of 319) UNSUPPORTED: ThreadSanitizer-x86_64-iossim :: Linux/thread_tryjoin.c (47 of 319) UNSUPPORTED: ThreadSanitizer-x86_64-iossim :: Linux/user_fopen.cc (48 of 319) UNSUPPORTED: ThreadSanitizer-x86_64-iossim :: Linux/user_malloc.cc (49 of 319) PASS: ThreadSanitizer-x86_64-iossim :: Darwin/workerthreads.mm (50 of 319) PASS: ThreadSanitizer-x86_64-iossim :: aligned_vs_unaligned_race.cc (51 of 319) PASS: ThreadSanitizer-x86_64-iossim :: Darwin/symbolizer-atos.cc (52 of 319) PASS: ThreadSanitizer-x86_64-iossim :: annotate_happens_before.cc (53 of 319) PASS: ThreadSanitizer-x86_64-iossim :: atexit.cc (54 of 319) PASS: ThreadSanitizer-x86_64-iossim :: atexit2.cc (55 of 319) PASS: ThreadSanitizer-x86_64-iossim :: atexit3.cc (56 of 319) PASS: ThreadSanitizer-x86_64-iossim :: atomic_free2.cc (57 of 319) PASS: ThreadSanitizer-x86_64-iossim :: atomic_free3.cc (58 of 319) PASS: ThreadSanitizer-x86_64-iossim :: atomic_hle.cc (59 of 319) PASS: ThreadSanitizer-x86_64-iossim :: atomic_norace.cc (60 of 319) PASS: ThreadSanitizer-x86_64-iossim :: atomic_race.cc (61 of 319) PASS: ThreadSanitizer-x86_64-iossim :: atomic_stack.cc (62 of 319) UNSUPPORTED: ThreadSanitizer-x86_64-iossim :: barrier.cc (63 of 319) UNSUPPORTED: ThreadSanitizer-x86_64-iossim :: bench_acquire_only.cc (64 of 319) UNSUPPORTED: ThreadSanitizer-x86_64-iossim :: bench_acquire_release.cc (65 of 319) UNSUPPORTED: ThreadSanitizer-x86_64-iossim :: bench_local_mutex.cc (66 of 319) UNSUPPORTED: ThreadSanitizer-x86_64-iossim :: bench_mutex.cc (67 of 319) UNSUPPORTED: ThreadSanitizer-x86_64-iossim :: bench_release_only.cc (68 of 319) UNSUPPORTED: ThreadSanitizer-x86_64-iossim :: bench_rwmutex.cc (69 of 319) PASS: ThreadSanitizer-x86_64-iossim :: bench_shadow_flush.cc (70 of 319) UNSUPPORTED: ThreadSanitizer-x86_64-iossim :: bench_single_writer.cc (71 of 319) UNSUPPORTED: ThreadSanitizer-x86_64-iossim :: bench_ten_mutexes.cc (72 of 319) PASS: ThreadSanitizer-x86_64-iossim :: atomic_store.cc (73 of 319) PASS: ThreadSanitizer-x86_64-iossim :: benign_race.cc (74 of 319) PASS: ThreadSanitizer-x86_64-iossim :: blacklist.cc (75 of 319) PASS: ThreadSanitizer-x86_64-iossim :: cond.c (76 of 319) PASS: ThreadSanitizer-x86_64-iossim :: blacklist2.cc (77 of 319) PASS: ThreadSanitizer-x86_64-iossim :: cond_cancel.c (78 of 319) PASS: ThreadSanitizer-x86_64-iossim :: cond_destruction.cc (79 of 319) UNSUPPORTED: ThreadSanitizer-x86_64-iossim :: cond_version.c (80 of 319) PASS: ThreadSanitizer-x86_64-iossim :: cond_race.cc (81 of 319) PASS: ThreadSanitizer-x86_64-iossim :: custom_mutex0.cc (82 of 319) PASS: ThreadSanitizer-x86_64-iossim :: custom_mutex1.cc (83 of 319) PASS: ThreadSanitizer-x86_64-iossim :: atomic_free.cc (84 of 319) PASS: ThreadSanitizer-x86_64-iossim :: custom_mutex2.cc (85 of 319) PASS: ThreadSanitizer-x86_64-iossim :: custom_mutex3.cc (86 of 319) PASS: ThreadSanitizer-x86_64-iossim :: custom_mutex4.cc (87 of 319) PASS: ThreadSanitizer-x86_64-iossim :: cxa_guard_acquire.cc (88 of 319) UNSUPPORTED: ThreadSanitizer-x86_64-iossim :: debug_alloc_stack.cc (89 of 319) PASS: ThreadSanitizer-x86_64-iossim :: custom_mutex5.cc (90 of 319) PASS: ThreadSanitizer-x86_64-iossim :: debug_locate.cc (91 of 319) PASS: ThreadSanitizer-x86_64-iossim :: debugging.cc (92 of 319) PASS: ThreadSanitizer-x86_64-iossim :: default_options.cc (93 of 319) UNSUPPORTED: ThreadSanitizer-x86_64-iossim :: dl_iterate_phdr.cc (94 of 319) PASS: ThreadSanitizer-x86_64-iossim :: deep_stack1.cc (95 of 319) PASS: ThreadSanitizer-x86_64-iossim :: dlclose.cc (96 of 319) PASS: ThreadSanitizer-x86_64-iossim :: dtls.c (97 of 319) PASS: ThreadSanitizer-x86_64-iossim :: fd_close_norace.cc (98 of 319) PASS: ThreadSanitizer-x86_64-iossim :: exceptions.cc (99 of 319) PASS: ThreadSanitizer-x86_64-iossim :: fd_close_norace2.cc (100 of 319) PASS: ThreadSanitizer-x86_64-iossim :: fd_dup_norace.cc (101 of 319) PASS: ThreadSanitizer-x86_64-iossim :: fd_dup_norace2.cc (102 of 319) PASS: ThreadSanitizer-x86_64-iossim :: fd_dup_race.cc (103 of 319) PASS: ThreadSanitizer-x86_64-iossim :: fd_location.cc (104 of 319) PASS: ThreadSanitizer-x86_64-iossim :: fd_pipe_norace.cc (105 of 319) PASS: ThreadSanitizer-x86_64-iossim :: fd_socket_connect_norace.cc (106 of 319) PASS: ThreadSanitizer-x86_64-iossim :: fd_pipe_race.cc (107 of 319) PASS: ThreadSanitizer-x86_64-iossim :: deadlock_detector_stress_test.cc (108 of 319) PASS: ThreadSanitizer-x86_64-iossim :: fd_socketpair_norace.cc (109 of 319) PASS: ThreadSanitizer-x86_64-iossim :: fd_socket_norace.cc (110 of 319) PASS: ThreadSanitizer-x86_64-iossim :: fiber_asm.cc (111 of 319) PASS: ThreadSanitizer-x86_64-iossim :: fd_stdout_race.cc (112 of 319) PASS: ThreadSanitizer-x86_64-iossim :: fd_tid_recycled.cc (113 of 319) XPASS: ThreadSanitizer-x86_64-iossim :: fiber_from_thread.cc (114 of 319) ******************** TEST 'ThreadSanitizer-x86_64-iossim :: fiber_from_thread.cc' FAILED ******************** Script: -- : 'RUN: at line 1'; /Users/buildslave/jenkins/workspace/clang-stage1-cmake-RA-expensive/llvm-project/compiler-rt/test/sanitizer_common/ios_commands/iossim_compile.py /Users/buildslave/jenkins/workspace/clang-stage1-cmake-RA-expensive/clang-build/./bin/clang -fsanitize=thread -Wall -arch x86_64 -isysroot /Applications/Xcode.app/Contents/Developer/Platforms/iPhoneSimulator.platform/Developer/SDKs/iPhoneSimulator11.4.sdk -gline-tables-only -I/Users/buildslave/jenkins/workspace/clang-stage1-cmake-RA-expensive/llvm-project/compiler-rt/test/tsan/../ -O1 /Users/buildslave/jenkins/workspace/clang-stage1-cmake-RA-expensive/llvm-project/compiler-rt/test/tsan/fiber_from_thread.cc -o /Users/buildslave/jenkins/workspace/clang-stage1-cmake-RA-expensive/clang-build/tools/clang/runtime/compiler-rt-bins/test/tsan/IOSSimX86_64Config/Output/fiber_from_thread.cc.tmp && /Users/buildslave/jenkins/workspace/clang-stage1-cmake-RA-expensive/llvm-project/compiler-rt/test/sanitizer_common/ios_commands/iossim_run.py /Users/buildslave/jenkins/workspace/clang-stage1-cmake-RA-expensive/clang-build/tools/clang/runtime/compiler-rt-bins/test/tsan/IOSSimX86_64Config/Output/fiber_from_thread.cc.tmp 2>&1 | FileCheck /Users/buildslave/jenkins/workspace/clang-stage1-cmake-RA-expensive/llvm-project/compiler-rt/test/tsan/fiber_from_thread.cc -- Exit Code: 0

Hide Details

Hide Details

******************** XPASS: ThreadSanitizer-x86_64-iossim :: fiber_longjmp.cc (115 of 319) ******************** TEST 'ThreadSanitizer-x86_64-iossim :: fiber_longjmp.cc' FAILED ******************** Script: -- : 'RUN: at line 1'; /Users/buildslave/jenkins/workspace/clang-stage1-cmake-RA-expensive/llvm-project/compiler-rt/test/sanitizer_common/ios_commands/iossim_compile.py /Users/buildslave/jenkins/workspace/clang-stage1-cmake-RA-expensive/clang-build/./bin/clang -fsanitize=thread -Wall -arch x86_64 -isysroot /Applications/Xcode.app/Contents/Developer/Platforms/iPhoneSimulator.platform/Developer/SDKs/iPhoneSimulator11.4.sdk -gline-tables-only -I/Users/buildslave/jenkins/workspace/clang-stage1-cmake-RA-expensive/llvm-project/compiler-rt/test/tsan/../ -O1 /Users/buildslave/jenkins/workspace/clang-stage1-cmake-RA-expensive/llvm-project/compiler-rt/test/tsan/fiber_longjmp.cc -o /Users/buildslave/jenkins/workspace/clang-stage1-cmake-RA-expensive/clang-build/tools/clang/runtime/compiler-rt-bins/test/tsan/IOSSimX86_64Config/Output/fiber_longjmp.cc.tmp && /Users/buildslave/jenkins/workspace/clang-stage1-cmake-RA-expensive/llvm-project/compiler-rt/test/sanitizer_common/ios_commands/iossim_run.py /Users/buildslave/jenkins/workspace/clang-stage1-cmake-RA-expensive/clang-build/tools/clang/runtime/compiler-rt-bins/test/tsan/IOSSimX86_64Config/Output/fiber_longjmp.cc.tmp 2>&1 | FileCheck /Users/buildslave/jenkins/workspace/clang-stage1-cmake-RA-expensive/llvm-project/compiler-rt/test/tsan/fiber_longjmp.cc -- Exit Code: 0

Hide Details

Hide Details

******************** XPASS: ThreadSanitizer-x86_64-iossim :: fiber_simple.cc (116 of 319) ******************** TEST 'ThreadSanitizer-x86_64-iossim :: fiber_simple.cc' FAILED ******************** Script: -- : 'RUN: at line 1'; /Users/buildslave/jenkins/workspace/clang-stage1-cmake-RA-expensive/llvm-project/compiler-rt/test/sanitizer_common/ios_commands/iossim_compile.py /Users/buildslave/jenkins/workspace/clang-stage1-cmake-RA-expensive/clang-build/./bin/clang -fsanitize=thread -Wall -arch x86_64 -isysroot /Applications/Xcode.app/Contents/Developer/Platforms/iPhoneSimulator.platform/Developer/SDKs/iPhoneSimulator11.4.sdk -gline-tables-only -I/Users/buildslave/jenkins/workspace/clang-stage1-cmake-RA-expensive/llvm-project/compiler-rt/test/tsan/../ -O1 /Users/buildslave/jenkins/workspace/clang-stage1-cmake-RA-expensive/llvm-project/compiler-rt/test/tsan/fiber_simple.cc -o /Users/buildslave/jenkins/workspace/clang-stage1-cmake-RA-expensive/clang-build/tools/clang/runtime/compiler-rt-bins/test/tsan/IOSSimX86_64Config/Output/fiber_simple.cc.tmp && /Users/buildslave/jenkins/workspace/clang-stage1-cmake-RA-expensive/llvm-project/compiler-rt/test/sanitizer_common/ios_commands/iossim_run.py /Users/buildslave/jenkins/workspace/clang-stage1-cmake-RA-expensive/clang-build/tools/clang/runtime/compiler-rt-bins/test/tsan/IOSSimX86_64Config/Output/fiber_simple.cc.tmp 2>&1 | FileCheck /Users/buildslave/jenkins/workspace/clang-stage1-cmake-RA-expensive/llvm-project/compiler-rt/test/tsan/fiber_simple.cc -- Exit Code: 0

Hide Details

Hide Details

******************** XPASS: ThreadSanitizer-x86_64-iossim :: fiber_race.cc (117 of 319) ******************** TEST 'ThreadSanitizer-x86_64-iossim :: fiber_race.cc' FAILED ******************** Script: -- : 'RUN: at line 1'; /Users/buildslave/jenkins/workspace/clang-stage1-cmake-RA-expensive/llvm-project/compiler-rt/test/sanitizer_common/ios_commands/iossim_compile.py /Users/buildslave/jenkins/workspace/clang-stage1-cmake-RA-expensive/clang-build/./bin/clang -fsanitize=thread -Wall -arch x86_64 -isysroot /Applications/Xcode.app/Contents/Developer/Platforms/iPhoneSimulator.platform/Developer/SDKs/iPhoneSimulator11.4.sdk -gline-tables-only -I/Users/buildslave/jenkins/workspace/clang-stage1-cmake-RA-expensive/llvm-project/compiler-rt/test/tsan/../ -O1 /Users/buildslave/jenkins/workspace/clang-stage1-cmake-RA-expensive/llvm-project/compiler-rt/test/tsan/fiber_race.cc -o /Users/buildslave/jenkins/workspace/clang-stage1-cmake-RA-expensive/clang-build/tools/clang/runtime/compiler-rt-bins/test/tsan/IOSSimX86_64Config/Output/fiber_race.cc.tmp && /Users/buildslave/jenkins/workspace/clang-stage1-cmake-RA-expensive/llvm-project/compiler-rt/test/tsan/deflake.bash /Users/buildslave/jenkins/workspace/clang-stage1-cmake-RA-expensive/llvm-project/compiler-rt/test/sanitizer_common/ios_commands/iossim_run.py /Users/buildslave/jenkins/workspace/clang-stage1-cmake-RA-expensive/clang-build/tools/clang/runtime/compiler-rt-bins/test/tsan/IOSSimX86_64Config/Output/fiber_race.cc.tmp 2>&1 | FileCheck /Users/buildslave/jenkins/workspace/clang-stage1-cmake-RA-expensive/llvm-project/compiler-rt/test/tsan/fiber_race.cc -- Exit Code: 0

Hide Details

Hide Details

******************** XPASS: ThreadSanitizer-x86_64-iossim :: fiber_two_threads.cc (118 of 319) ******************** TEST 'ThreadSanitizer-x86_64-iossim :: fiber_two_threads.cc' FAILED ******************** Script: -- : 'RUN: at line 1'; /Users/buildslave/jenkins/workspace/clang-stage1-cmake-RA-expensive/llvm-project/compiler-rt/test/sanitizer_common/ios_commands/iossim_compile.py /Users/buildslave/jenkins/workspace/clang-stage1-cmake-RA-expensive/clang-build/./bin/clang -fsanitize=thread -Wall -arch x86_64 -isysroot /Applications/Xcode.app/Contents/Developer/Platforms/iPhoneSimulator.platform/Developer/SDKs/iPhoneSimulator11.4.sdk -gline-tables-only -I/Users/buildslave/jenkins/workspace/clang-stage1-cmake-RA-expensive/llvm-project/compiler-rt/test/tsan/../ -O1 /Users/buildslave/jenkins/workspace/clang-stage1-cmake-RA-expensive/llvm-project/compiler-rt/test/tsan/fiber_two_threads.cc -o /Users/buildslave/jenkins/workspace/clang-stage1-cmake-RA-expensive/clang-build/tools/clang/runtime/compiler-rt-bins/test/tsan/IOSSimX86_64Config/Output/fiber_two_threads.cc.tmp && /Users/buildslave/jenkins/workspace/clang-stage1-cmake-RA-expensive/llvm-project/compiler-rt/test/sanitizer_common/ios_commands/iossim_run.py /Users/buildslave/jenkins/workspace/clang-stage1-cmake-RA-expensive/clang-build/tools/clang/runtime/compiler-rt-bins/test/tsan/IOSSimX86_64Config/Output/fiber_two_threads.cc.tmp 2>&1 | FileCheck /Users/buildslave/jenkins/workspace/clang-stage1-cmake-RA-expensive/llvm-project/compiler-rt/test/tsan/fiber_two_threads.cc -- Exit Code: 0

Hide Details

Hide Details

******************** PASS: ThreadSanitizer-x86_64-iossim :: fork_atexit.cc (119 of 319) PASS: ThreadSanitizer-x86_64-iossim :: fork_multithreaded3.cc (120 of 319) PASS: ThreadSanitizer-x86_64-iossim :: fork_multithreaded.cc (121 of 319) PASS: ThreadSanitizer-x86_64-iossim :: free_race2.c (122 of 319) PASS: ThreadSanitizer-x86_64-iossim :: free_race.c (123 of 319) PASS: ThreadSanitizer-x86_64-iossim :: getline_nohang.cc (124 of 319) PASS: ThreadSanitizer-x86_64-iossim :: fork_deadlock.cc (125 of 319) PASS: ThreadSanitizer-x86_64-iossim :: global_race2.cc (126 of 319) PASS: ThreadSanitizer-x86_64-iossim :: global_race3.cc (127 of 319) PASS: ThreadSanitizer-x86_64-iossim :: halt_on_error.cc (128 of 319) PASS: ThreadSanitizer-x86_64-iossim :: heap_race.cc (129 of 319) UNSUPPORTED: ThreadSanitizer-x86_64-iossim :: ignore_lib0.cc (130 of 319) PASS: ThreadSanitizer-x86_64-iossim :: ignore_free.cc (131 of 319) PASS: ThreadSanitizer-x86_64-iossim :: ignore_lib2.cc (132 of 319) PASS: ThreadSanitizer-x86_64-iossim :: ignore_lib1.cc (133 of 319) PASS: ThreadSanitizer-x86_64-iossim :: ignore_lib3.cc (134 of 319) PASS: ThreadSanitizer-x86_64-iossim :: ignore_lib5.cc (135 of 319) PASS: ThreadSanitizer-x86_64-iossim :: ignore_lib4.cc (136 of 319) PASS: ThreadSanitizer-x86_64-iossim :: global_race.cc (137 of 319) PASS: ThreadSanitizer-x86_64-iossim :: ignore_malloc.cc (138 of 319) PASS: ThreadSanitizer-x86_64-iossim :: ignore_race.cc (139 of 319) PASS: ThreadSanitizer-x86_64-iossim :: ignore_sync.cc (140 of 319) PASS: ThreadSanitizer-x86_64-iossim :: ignored-interceptors-mmap.cc (141 of 319) PASS: ThreadSanitizer-x86_64-iossim :: inlined_memcpy_race.cc (142 of 319) PASS: ThreadSanitizer-x86_64-iossim :: inlined_memcpy_race2.cc (143 of 319) PASS: ThreadSanitizer-x86_64-iossim :: interface_atomic_test.c (144 of 319) PASS: ThreadSanitizer-x86_64-iossim :: java_alloc.cc (145 of 319) PASS: ThreadSanitizer-x86_64-iossim :: java_finalizer.cc (146 of 319) PASS: ThreadSanitizer-x86_64-iossim :: java_find.cc (147 of 319) PASS: ThreadSanitizer-x86_64-iossim :: java_heap_init.cc (148 of 319) PASS: ThreadSanitizer-x86_64-iossim :: java_lock.cc (149 of 319) PASS: ThreadSanitizer-x86_64-iossim :: java_lock_move.cc (150 of 319) PASS: ThreadSanitizer-x86_64-iossim :: java_lock_rec.cc (151 of 319) PASS: ThreadSanitizer-x86_64-iossim :: java_lock_rec_race.cc (152 of 319) PASS: ThreadSanitizer-x86_64-iossim :: java_move_overlap.cc (153 of 319) PASS: ThreadSanitizer-x86_64-iossim :: java_move_overlap_race.cc (154 of 319) PASS: ThreadSanitizer-x86_64-iossim :: java_race.cc (155 of 319) PASS: ThreadSanitizer-x86_64-iossim :: java_race_move.cc (156 of 319) PASS: ThreadSanitizer-x86_64-iossim :: java_rwlock.cc (157 of 319) PASS: ThreadSanitizer-x86_64-iossim :: java_race_pc.cc (158 of 319) PASS: ThreadSanitizer-x86_64-iossim :: java_symbolization.cc (159 of 319) UNSUPPORTED: ThreadSanitizer-x86_64-iossim :: large_malloc_meta.cc (160 of 319) PASS: ThreadSanitizer-x86_64-iossim :: java_volatile.cc (161 of 319) PASS: ThreadSanitizer-x86_64-iossim :: java_symbolization_legacy.cc (162 of 319) PASS: ThreadSanitizer-x86_64-iossim :: libdispatch/after.c (163 of 319) PASS: ThreadSanitizer-x86_64-iossim :: libdispatch/apply-race.c (164 of 319) PASS: ThreadSanitizer-x86_64-iossim :: libdispatch/apply.c (165 of 319) PASS: ThreadSanitizer-x86_64-iossim :: libdispatch/async-norace.c (166 of 319) PASS: ThreadSanitizer-x86_64-iossim :: libcxx/std_shared_ptr.cc (167 of 319) PASS: ThreadSanitizer-x86_64-iossim :: libdispatch/async-race.c (168 of 319) PASS: ThreadSanitizer-x86_64-iossim :: libdispatch/barrier.c (169 of 319) PASS: ThreadSanitizer-x86_64-iossim :: libdispatch/barrier-race.c (170 of 319) PASS: ThreadSanitizer-x86_64-iossim :: libdispatch/blocks.c (171 of 319) PASS: ThreadSanitizer-x86_64-iossim :: libdispatch/data.c (172 of 319) PASS: ThreadSanitizer-x86_64-iossim :: libdispatch/fd.c (173 of 319) PASS: ThreadSanitizer-x86_64-iossim :: libdispatch/dispatch_main.c (174 of 319) PASS: ThreadSanitizer-x86_64-iossim :: libdispatch/dispatch_once_deadlock.c (175 of 319) PASS: ThreadSanitizer-x86_64-iossim :: libdispatch/groups-norace.c (176 of 319) PASS: ThreadSanitizer-x86_64-iossim :: libdispatch/groups-leave.c (177 of 319) PASS: ThreadSanitizer-x86_64-iossim :: libdispatch/groups-destructor.cc (178 of 319) PASS: ThreadSanitizer-x86_64-iossim :: libdispatch/io-barrier.c (179 of 319) PASS: ThreadSanitizer-x86_64-iossim :: libdispatch/io-barrier-race.c (180 of 319) PASS: ThreadSanitizer-x86_64-iossim :: libdispatch/io-cleanup.c (181 of 319) PASS: ThreadSanitizer-x86_64-iossim :: libdispatch/groups-stress.c (182 of 319) PASS: ThreadSanitizer-x86_64-iossim :: libdispatch/io.c (183 of 319) PASS: ThreadSanitizer-x86_64-iossim :: libdispatch/io-race.c (184 of 319) PASS: ThreadSanitizer-x86_64-iossim :: libdispatch/once.c (185 of 319) PASS: ThreadSanitizer-x86_64-iossim :: libdispatch/semaphore-norace.c (186 of 319) PASS: ThreadSanitizer-x86_64-iossim :: libdispatch/serial-queue-norace.c (187 of 319) PASS: ThreadSanitizer-x86_64-iossim :: libdispatch/source-cancel.c (188 of 319) PASS: ThreadSanitizer-x86_64-iossim :: libdispatch/source-cancel2.c (189 of 319) PASS: ThreadSanitizer-x86_64-iossim :: libdispatch/source-event.c (190 of 319) PASS: ThreadSanitizer-x86_64-iossim :: libdispatch/source-event2.c (191 of 319) PASS: ThreadSanitizer-x86_64-iossim :: libdispatch/source-registration.c (192 of 319) PASS: ThreadSanitizer-x86_64-iossim :: libdispatch/source-registration2.c (193 of 319) PASS: ThreadSanitizer-x86_64-iossim :: libdispatch/suspend.c (194 of 319) PASS: ThreadSanitizer-x86_64-iossim :: libdispatch/source-serial.c (195 of 319) PASS: ThreadSanitizer-x86_64-iossim :: libdispatch/sync-norace.c (196 of 319) PASS: ThreadSanitizer-x86_64-iossim :: libdispatch/sync-block-copy.cc (197 of 319) PASS: ThreadSanitizer-x86_64-iossim :: libdispatch/sync-race.c (198 of 319) PASS: ThreadSanitizer-x86_64-iossim :: libdispatch/target-queue-norace.c (199 of 319) PASS: ThreadSanitizer-x86_64-iossim :: longjmp.cc (200 of 319) PASS: ThreadSanitizer-x86_64-iossim :: longjmp2.cc (201 of 319) PASS: ThreadSanitizer-x86_64-iossim :: longjmp3.cc (202 of 319) PASS: ThreadSanitizer-x86_64-iossim :: load_shared_lib.cc (203 of 319) PASS: ThreadSanitizer-x86_64-iossim :: longjmp4.cc (204 of 319) PASS: ThreadSanitizer-x86_64-iossim :: malloc_overflow.cc (205 of 319) UNSUPPORTED: ThreadSanitizer-x86_64-iossim :: map32bit.cc (206 of 319) PASS: ThreadSanitizer-x86_64-iossim :: lots_of_threads.c (207 of 319) PASS: ThreadSanitizer-x86_64-iossim :: malloc_stack.cc (208 of 319) UNSUPPORTED: ThreadSanitizer-x86_64-iossim :: mmap_large.cc (209 of 319) PASS: ThreadSanitizer-x86_64-iossim :: mmap_stress.cc (210 of 319) PASS: ThreadSanitizer-x86_64-iossim :: memcpy_race.cc (211 of 319) PASS: ThreadSanitizer-x86_64-iossim :: memcmp_race.cc (212 of 319) PASS: ThreadSanitizer-x86_64-iossim :: mop1.c (213 of 319) XFAIL: ThreadSanitizer-x86_64-iossim :: must_deadlock.cc (214 of 319) PASS: ThreadSanitizer-x86_64-iossim :: mop_with_offset.cc (215 of 319) PASS: ThreadSanitizer-x86_64-iossim :: mop_with_offset2.cc (216 of 319) PASS: ThreadSanitizer-x86_64-iossim :: mutex_annotations.cc (217 of 319) PASS: ThreadSanitizer-x86_64-iossim :: mutex_bad_read_unlock.cc (218 of 319) PASS: ThreadSanitizer-x86_64-iossim :: mutex_bad_read_lock.cc (219 of 319) PASS: ThreadSanitizer-x86_64-iossim :: mutex_bad_unlock.cc (220 of 319) PASS: ThreadSanitizer-x86_64-iossim :: mutex_destroy_locked.cc (221 of 319) PASS: ThreadSanitizer-x86_64-iossim :: mutex_destroy_locked2.cc (222 of 319) PASS: ThreadSanitizer-x86_64-iossim :: mutex_double_lock.cc (223 of 319) PASS: ThreadSanitizer-x86_64-iossim :: mutex_cycle2.c (224 of 319) PASS: ThreadSanitizer-x86_64-iossim :: mutex_cycle_long.c (225 of 319) PASS: ThreadSanitizer-x86_64-iossim :: mutexset1.cc (226 of 319) PASS: ThreadSanitizer-x86_64-iossim :: mutexset2.cc (227 of 319) PASS: ThreadSanitizer-x86_64-iossim :: mutex_lock_destroyed.cc (228 of 319) PASS: ThreadSanitizer-x86_64-iossim :: mutexset3.cc (229 of 319) PASS: ThreadSanitizer-x86_64-iossim :: mutexset4.cc (230 of 319) PASS: ThreadSanitizer-x86_64-iossim :: mutexset5.cc (231 of 319) PASS: ThreadSanitizer-x86_64-iossim :: mutexset6.cc (232 of 319) PASS: ThreadSanitizer-x86_64-iossim :: mutexset7.cc (233 of 319) PASS: ThreadSanitizer-x86_64-iossim :: mutexset8.cc (234 of 319) PASS: ThreadSanitizer-x86_64-iossim :: pie_test.cc (235 of 319) PASS: ThreadSanitizer-x86_64-iossim :: pthread_atfork_deadlock.c (236 of 319) UNSUPPORTED: ThreadSanitizer-x86_64-iossim :: race_on_barrier.c (237 of 319) UNSUPPORTED: ThreadSanitizer-x86_64-iossim :: race_on_barrier2.c (238 of 319) PASS: ThreadSanitizer-x86_64-iossim :: printf-1.c (239 of 319) PASS: ThreadSanitizer-x86_64-iossim :: pthread_key.cc (240 of 319) PASS: ThreadSanitizer-x86_64-iossim :: race_on_fputs.cc (241 of 319) PASS: ThreadSanitizer-x86_64-iossim :: race_on_mutex.c (242 of 319) PASS: ThreadSanitizer-x86_64-iossim :: race_on_heap.cc (243 of 319) PASS: ThreadSanitizer-x86_64-iossim :: race_on_mutex2.c (244 of 319) PASS: ThreadSanitizer-x86_64-iossim :: race_on_puts.cc (245 of 319) PASS: ThreadSanitizer-x86_64-iossim :: race_on_read.cc (246 of 319) PASS: ThreadSanitizer-x86_64-iossim :: race_on_speculative_load.cc (247 of 319) PASS: ThreadSanitizer-x86_64-iossim :: race_on_write.cc (248 of 319) PASS: ThreadSanitizer-x86_64-iossim :: race_stress.cc (249 of 319) PASS: ThreadSanitizer-x86_64-iossim :: race_top_suppression.cc (250 of 319) PASS: ThreadSanitizer-x86_64-iossim :: race_top_suppression1.cc (251 of 319) PASS: ThreadSanitizer-x86_64-iossim :: race_with_finished_thread.cc (252 of 319) PASS: ThreadSanitizer-x86_64-iossim :: setuid.c (253 of 319) PASS: ThreadSanitizer-x86_64-iossim :: real_deadlock_detector_stress_test.cc (254 of 319) PASS: ThreadSanitizer-x86_64-iossim :: signal_block.cc (255 of 319) PASS: ThreadSanitizer-x86_64-iossim :: restore_stack.cc (256 of 319) PASS: ThreadSanitizer-x86_64-iossim :: setuid2.c (257 of 319) PASS: ThreadSanitizer-x86_64-iossim :: signal_longjmp.cc (258 of 319) PASS: ThreadSanitizer-x86_64-iossim :: signal_cond.cc (259 of 319) PASS: ThreadSanitizer-x86_64-iossim :: signal_errno.cc (260 of 319) UNSUPPORTED: ThreadSanitizer-x86_64-iossim :: signal_recursive.cc (261 of 319) UNSUPPORTED: ThreadSanitizer-x86_64-iossim :: signal_reset.cc (262 of 319) UNSUPPORTED: ThreadSanitizer-x86_64-iossim :: signal_sync.cc (263 of 319) UNSUPPORTED: ThreadSanitizer-x86_64-iossim :: signal_sync2.cc (264 of 319) UNSUPPORTED: ThreadSanitizer-x86_64-iossim :: signal_thread.cc (265 of 319) PASS: ThreadSanitizer-x86_64-iossim :: signal_pause.cc (266 of 319) PASS: ThreadSanitizer-x86_64-iossim :: signal_write.cc (267 of 319) PASS: ThreadSanitizer-x86_64-iossim :: signal_malloc.cc (268 of 319) PASS: ThreadSanitizer-x86_64-iossim :: sigsuspend.cc (269 of 319) PASS: ThreadSanitizer-x86_64-iossim :: simple_race.c (270 of 319) PASS: ThreadSanitizer-x86_64-iossim :: simple_race.cc (271 of 319) PASS: ThreadSanitizer-x86_64-iossim :: simple_stack2.cc (272 of 319) PASS: ThreadSanitizer-x86_64-iossim :: sleep_sync.cc (273 of 319) PASS: ThreadSanitizer-x86_64-iossim :: simple_stack.c (274 of 319) PASS: ThreadSanitizer-x86_64-iossim :: sleep_sync2.cc (275 of 319) PASS: ThreadSanitizer-x86_64-iossim :: stack_race.cc (276 of 319) PASS: ThreadSanitizer-x86_64-iossim :: stack_sync_reuse.cc (277 of 319) PASS: ThreadSanitizer-x86_64-iossim :: static_init1.cc (278 of 319) PASS: ThreadSanitizer-x86_64-iossim :: stack_race2.cc (279 of 319) PASS: ThreadSanitizer-x86_64-iossim :: static_init2.cc (280 of 319) PASS: ThreadSanitizer-x86_64-iossim :: static_init4.cc (281 of 319) PASS: ThreadSanitizer-x86_64-iossim :: static_init3.cc (282 of 319) UNSUPPORTED: ThreadSanitizer-x86_64-iossim :: strerror_r.cc (283 of 319) UNSUPPORTED: ThreadSanitizer-x86_64-iossim :: sunrpc.cc (284 of 319) PASS: ThreadSanitizer-x86_64-iossim :: static_init5.cc (285 of 319) PASS: ThreadSanitizer-x86_64-iossim :: static_init6.cc (286 of 319) PASS: ThreadSanitizer-x86_64-iossim :: suppress_same_stacks.cc (287 of 319) PASS: ThreadSanitizer-x86_64-iossim :: suppress_same_address.cc (288 of 319) PASS: ThreadSanitizer-x86_64-iossim :: suppressions_global.cc (289 of 319) PASS: ThreadSanitizer-x86_64-iossim :: suppressions_mutex.cc (290 of 319) PASS: ThreadSanitizer-x86_64-iossim :: suppressions_race.cc (291 of 319) PASS: ThreadSanitizer-x86_64-iossim :: suppressions_race2.cc (292 of 319) PASS: ThreadSanitizer-x86_64-iossim :: thread_detach.c (293 of 319) PASS: ThreadSanitizer-x86_64-iossim :: thread_detach2.c (294 of 319) PASS: ThreadSanitizer-x86_64-iossim :: thread_end_with_ignore.cc (295 of 319) PASS: ThreadSanitizer-x86_64-iossim :: thread_end_with_ignore2.cc (296 of 319) PASS: ThreadSanitizer-x86_64-iossim :: thread_exit.c (297 of 319) PASS: ThreadSanitizer-x86_64-iossim :: thread_end_with_ignore3.cc (298 of 319) PASS: ThreadSanitizer-x86_64-iossim :: thread_leak.c (299 of 319) PASS: ThreadSanitizer-x86_64-iossim :: thread_leak2.c (300 of 319) PASS: ThreadSanitizer-x86_64-iossim :: thread_leak4.c (301 of 319) PASS: ThreadSanitizer-x86_64-iossim :: thread_leak3.c (302 of 319) UNSUPPORTED: ThreadSanitizer-x86_64-iossim :: thread_name2.cc (303 of 319) PASS: ThreadSanitizer-x86_64-iossim :: thread_leak5.c (304 of 319) PASS: ThreadSanitizer-x86_64-iossim :: thread_name.cc (305 of 319) PASS: ThreadSanitizer-x86_64-iossim :: tiny_race.c (306 of 319) PASS: ThreadSanitizer-x86_64-iossim :: tls_race.cc (307 of 319) PASS: ThreadSanitizer-x86_64-iossim :: tls_race2.cc (308 of 319) PASS: ThreadSanitizer-x86_64-iossim :: unaligned_norace.cc (309 of 319) PASS: ThreadSanitizer-x86_64-iossim :: tsan-vs-gvn.cc (310 of 319) PASS: ThreadSanitizer-x86_64-iossim :: virtual_inheritance_compile_bug.cc (311 of 319) PASS: ThreadSanitizer-x86_64-iossim :: vfork.cc (312 of 319) PASS: ThreadSanitizer-x86_64-iossim :: vptr_benign_race.cc (313 of 319) PASS: ThreadSanitizer-x86_64-iossim :: unaligned_race.cc (314 of 319) PASS: ThreadSanitizer-x86_64-iossim :: vptr_harmful_race.cc (315 of 319) PASS: ThreadSanitizer-x86_64-iossim :: vptr_harmful_race2.cc (316 of 319) PASS: ThreadSanitizer-x86_64-iossim :: vptr_harmful_race3.cc (317 of 319) PASS: ThreadSanitizer-x86_64-iossim :: vptr_harmful_race4.cc (318 of 319) PASS: ThreadSanitizer-x86_64-iossim :: write_in_reader_lock.cc (319 of 319)

Hide Details

1 warning(s) in tests. Testing Time: 345.92s ******************** Unexpected Passing Tests (5): ThreadSanitizer-x86_64-iossim :: fiber_from_thread.cc ThreadSanitizer-x86_64-iossim :: fiber_longjmp.cc ThreadSanitizer-x86_64-iossim :: fiber_race.cc ThreadSanitizer-x86_64-iossim :: fiber_simple.cc ThreadSanitizer-x86_64-iossim :: fiber_two_threads.cc

Hide Details

Expected Passes : 273 Expected Failures : 2 Unsupported Tests : 39 Unexpected Passes : 5 Build step 'Execute shell' marked build as failure Recording test results [BFA] Scanning build for known causes... [BFA] Found failure cause(s): [BFA] Regression test failed from category Test [BFA] Unexpected pass from category Tests [BFA] Done. 2s No emails were triggered. Finished: FAILURE