FailedConsole Output

Skipping 11,264 KB.. Full Log
cpp.o lib/Transforms/Instrumentation/CMakeFiles/LLVMInstrumentation.dir/MemorySanitizer.cpp.o lib/Transforms/Instrumentation/CMakeFiles/LLVMInstrumentation.dir/IndirectCallPromotion.cpp.o lib/Transforms/Instrumentation/CMakeFiles/LLVMInstrumentation.dir/Instrumentation.cpp.o lib/Transforms/Instrumentation/CMakeFiles/LLVMInstrumentation.dir/InstrProfiling.cpp.o lib/Transforms/Instrumentation/CMakeFiles/LLVMInstrumentation.dir/PGOInstrumentation.cpp.o lib/Transforms/Instrumentation/CMakeFiles/LLVMInstrumentation.dir/PGOMemOPSizeOpt.cpp.o lib/Transforms/Instrumentation/CMakeFiles/LLVMInstrumentation.dir/SanitizerCoverage.cpp.o lib/Transforms/Instrumentation/CMakeFiles/LLVMInstrumentation.dir/ThreadSanitizer.cpp.o lib/Transforms/Instrumentation/CMakeFiles/LLVMInstrumentation.dir/EfficiencySanitizer.cpp.o lib/Transforms/Instrumentation/CMakeFiles/LLVMInstrumentation.dir/HWAddressSanitizer.cpp.o  && :
[3132/3408] : && DYLD_LIBRARY_PATH=/Users/buildslave/jenkins/workspace/clang-stage2-Rthinlto-release_70/host-compiler/lib/ "/Applications/Xcode.app/Contents/Developer/Toolchains/XcodeDefault.xctoolchain/usr/bin/libtool" -static -no_warning_for_no_symbols -o lib/libLLVMAggressiveInstCombine.a          lib/Transforms/AggressiveInstCombine/CMakeFiles/LLVMAggressiveInstCombine.dir/AggressiveInstCombine.cpp.o lib/Transforms/AggressiveInstCombine/CMakeFiles/LLVMAggressiveInstCombine.dir/TruncInstCombine.cpp.o  && :
[3133/3408] : && DYLD_LIBRARY_PATH=/Users/buildslave/jenkins/workspace/clang-stage2-Rthinlto-release_70/host-compiler/lib/ "/Applications/Xcode.app/Contents/Developer/Toolchains/XcodeDefault.xctoolchain/usr/bin/libtool" -static -no_warning_for_no_symbols -o lib/libLLVMInstCombine.a          lib/Transforms/InstCombine/CMakeFiles/LLVMInstCombine.dir/InstructionCombining.cpp.o lib/Transforms/InstCombine/CMakeFiles/LLVMInstCombine.dir/InstCombineAddSub.cpp.o lib/Transforms/InstCombine/CMakeFiles/LLVMInstCombine.dir/InstCombineAndOrXor.cpp.o lib/Transforms/InstCombine/CMakeFiles/LLVMInstCombine.dir/InstCombineCalls.cpp.o lib/Transforms/InstCombine/CMakeFiles/LLVMInstCombine.dir/InstCombineCasts.cpp.o lib/Transforms/InstCombine/CMakeFiles/LLVMInstCombine.dir/InstCombineCompares.cpp.o lib/Transforms/InstCombine/CMakeFiles/LLVMInstCombine.dir/InstCombineLoadStoreAlloca.cpp.o lib/Transforms/InstCombine/CMakeFiles/LLVMInstCombine.dir/InstCombineMulDivRem.cpp.o lib/Transforms/InstCombine/CMakeFiles/LLVMInstCombine.dir/InstCombinePHI.cpp.o lib/Transforms/InstCombine/CMakeFiles/LLVMInstCombine.dir/InstCombineSelect.cpp.o lib/Transforms/InstCombine/CMakeFiles/LLVMInstCombine.dir/InstCombineShifts.cpp.o lib/Transforms/InstCombine/CMakeFiles/LLVMInstCombine.dir/InstCombineSimplifyDemanded.cpp.o lib/Transforms/InstCombine/CMakeFiles/LLVMInstCombine.dir/InstCombineVectorOps.cpp.o  && :
[3134/3408] : && DYLD_LIBRARY_PATH=/Users/buildslave/jenkins/workspace/clang-stage2-Rthinlto-release_70/host-compiler/lib/ "/Applications/Xcode.app/Contents/Developer/Toolchains/XcodeDefault.xctoolchain/usr/bin/libtool" -static -no_warning_for_no_symbols -o lib/libLLVMScalarOpts.a          lib/Transforms/Scalar/CMakeFiles/LLVMScalarOpts.dir/ADCE.cpp.o lib/Transforms/Scalar/CMakeFiles/LLVMScalarOpts.dir/AlignmentFromAssumptions.cpp.o lib/Transforms/Scalar/CMakeFiles/LLVMScalarOpts.dir/BDCE.cpp.o lib/Transforms/Scalar/CMakeFiles/LLVMScalarOpts.dir/CallSiteSplitting.cpp.o lib/Transforms/Scalar/CMakeFiles/LLVMScalarOpts.dir/ConstantHoisting.cpp.o lib/Transforms/Scalar/CMakeFiles/LLVMScalarOpts.dir/ConstantProp.cpp.o lib/Transforms/Scalar/CMakeFiles/LLVMScalarOpts.dir/CorrelatedValuePropagation.cpp.o lib/Transforms/Scalar/CMakeFiles/LLVMScalarOpts.dir/DCE.cpp.o lib/Transforms/Scalar/CMakeFiles/LLVMScalarOpts.dir/DeadStoreElimination.cpp.o lib/Transforms/Scalar/CMakeFiles/LLVMScalarOpts.dir/DivRemPairs.cpp.o lib/Transforms/Scalar/CMakeFiles/LLVMScalarOpts.dir/EarlyCSE.cpp.o lib/Transforms/Scalar/CMakeFiles/LLVMScalarOpts.dir/FlattenCFGPass.cpp.o lib/Transforms/Scalar/CMakeFiles/LLVMScalarOpts.dir/Float2Int.cpp.o lib/Transforms/Scalar/CMakeFiles/LLVMScalarOpts.dir/GuardWidening.cpp.o lib/Transforms/Scalar/CMakeFiles/LLVMScalarOpts.dir/GVN.cpp.o lib/Transforms/Scalar/CMakeFiles/LLVMScalarOpts.dir/GVNHoist.cpp.o lib/Transforms/Scalar/CMakeFiles/LLVMScalarOpts.dir/GVNSink.cpp.o lib/Transforms/Scalar/CMakeFiles/LLVMScalarOpts.dir/IVUsersPrinter.cpp.o lib/Transforms/Scalar/CMakeFiles/LLVMScalarOpts.dir/InductiveRangeCheckElimination.cpp.o lib/Transforms/Scalar/CMakeFiles/LLVMScalarOpts.dir/IndVarSimplify.cpp.o lib/Transforms/Scalar/CMakeFiles/LLVMScalarOpts.dir/InferAddressSpaces.cpp.o lib/Transforms/Scalar/CMakeFiles/LLVMScalarOpts.dir/InstSimplifyPass.cpp.o lib/Transforms/Scalar/CMakeFiles/LLVMScalarOpts.dir/JumpThreading.cpp.o lib/Transforms/Scalar/CMakeFiles/LLVMScalarOpts.dir/LICM.cpp.o lib/Transforms/Scalar/CMakeFiles/LLVMScalarOpts.dir/LoopAccessAnalysisPrinter.cpp.o lib/Transforms/Scalar/CMakeFiles/LLVMScalarOpts.dir/LoopSink.cpp.o lib/Transforms/Scalar/CMakeFiles/LLVMScalarOpts.dir/LoopDeletion.cpp.o lib/Transforms/Scalar/CMakeFiles/LLVMScalarOpts.dir/LoopDataPrefetch.cpp.o lib/Transforms/Scalar/CMakeFiles/LLVMScalarOpts.dir/LoopDistribute.cpp.o lib/Transforms/Scalar/CMakeFiles/LLVMScalarOpts.dir/LoopIdiomRecognize.cpp.o lib/Transforms/Scalar/CMakeFiles/LLVMScalarOpts.dir/LoopInstSimplify.cpp.o lib/Transforms/Scalar/CMakeFiles/LLVMScalarOpts.dir/LoopInterchange.cpp.o lib/Transforms/Scalar/CMakeFiles/LLVMScalarOpts.dir/LoopLoadElimination.cpp.o lib/Transforms/Scalar/CMakeFiles/LLVMScalarOpts.dir/LoopPassManager.cpp.o lib/Transforms/Scalar/CMakeFiles/LLVMScalarOpts.dir/LoopPredication.cpp.o lib/Transforms/Scalar/CMakeFiles/LLVMScalarOpts.dir/LoopRerollPass.cpp.o lib/Transforms/Scalar/CMakeFiles/LLVMScalarOpts.dir/LoopRotation.cpp.o lib/Transforms/Scalar/CMakeFiles/LLVMScalarOpts.dir/LoopSimplifyCFG.cpp.o lib/Transforms/Scalar/CMakeFiles/LLVMScalarOpts.dir/LoopStrengthReduce.cpp.o lib/Transforms/Scalar/CMakeFiles/LLVMScalarOpts.dir/LoopUnrollPass.cpp.o lib/Transforms/Scalar/CMakeFiles/LLVMScalarOpts.dir/LoopUnrollAndJamPass.cpp.o lib/Transforms/Scalar/CMakeFiles/LLVMScalarOpts.dir/LoopUnswitch.cpp.o lib/Transforms/Scalar/CMakeFiles/LLVMScalarOpts.dir/LoopVersioningLICM.cpp.o lib/Transforms/Scalar/CMakeFiles/LLVMScalarOpts.dir/LowerAtomic.cpp.o lib/Transforms/Scalar/CMakeFiles/LLVMScalarOpts.dir/LowerExpectIntrinsic.cpp.o lib/Transforms/Scalar/CMakeFiles/LLVMScalarOpts.dir/LowerGuardIntrinsic.cpp.o lib/Transforms/Scalar/CMakeFiles/LLVMScalarOpts.dir/MemCpyOptimizer.cpp.o lib/Transforms/Scalar/CMakeFiles/LLVMScalarOpts.dir/MergeICmps.cpp.o lib/Transforms/Scalar/CMakeFiles/LLVMScalarOpts.dir/MergedLoadStoreMotion.cpp.o lib/Transforms/Scalar/CMakeFiles/LLVMScalarOpts.dir/NaryReassociate.cpp.o lib/Transforms/Scalar/CMakeFiles/LLVMScalarOpts.dir/NewGVN.cpp.o lib/Transforms/Scalar/CMakeFiles/LLVMScalarOpts.dir/PartiallyInlineLibCalls.cpp.o lib/Transforms/Scalar/CMakeFiles/LLVMScalarOpts.dir/PlaceSafepoints.cpp.o lib/Transforms/Scalar/CMakeFiles/LLVMScalarOpts.dir/Reassociate.cpp.o lib/Transforms/Scalar/CMakeFiles/LLVMScalarOpts.dir/Reg2Mem.cpp.o lib/Transforms/Scalar/CMakeFiles/LLVMScalarOpts.dir/RewriteStatepointsForGC.cpp.o lib/Transforms/Scalar/CMakeFiles/LLVMScalarOpts.dir/SCCP.cpp.o lib/Transforms/Scalar/CMakeFiles/LLVMScalarOpts.dir/SROA.cpp.o lib/Transforms/Scalar/CMakeFiles/LLVMScalarOpts.dir/Scalar.cpp.o lib/Transforms/Scalar/CMakeFiles/LLVMScalarOpts.dir/Scalarizer.cpp.o lib/Transforms/Scalar/CMakeFiles/LLVMScalarOpts.dir/SeparateConstOffsetFromGEP.cpp.o lib/Transforms/Scalar/CMakeFiles/LLVMScalarOpts.dir/SimpleLoopUnswitch.cpp.o lib/Transforms/Scalar/CMakeFiles/LLVMScalarOpts.dir/SimplifyCFGPass.cpp.o lib/Transforms/Scalar/CMakeFiles/LLVMScalarOpts.dir/Sink.cpp.o lib/Transforms/Scalar/CMakeFiles/LLVMScalarOpts.dir/SpeculativeExecution.cpp.o lib/Transforms/Scalar/CMakeFiles/LLVMScalarOpts.dir/SpeculateAroundPHIs.cpp.o lib/Transforms/Scalar/CMakeFiles/LLVMScalarOpts.dir/StraightLineStrengthReduce.cpp.o lib/Transforms/Scalar/CMakeFiles/LLVMScalarOpts.dir/StructurizeCFG.cpp.o lib/Transforms/Scalar/CMakeFiles/LLVMScalarOpts.dir/TailRecursionElimination.cpp.o  && :
[3135/3408] : && DYLD_LIBRARY_PATH=/Users/buildslave/jenkins/workspace/clang-stage2-Rthinlto-release_70/host-compiler/lib/ "/Applications/Xcode.app/Contents/Developer/Toolchains/XcodeDefault.xctoolchain/usr/bin/libtool" -static -no_warning_for_no_symbols -o lib/libLLVMipo.a          lib/Transforms/IPO/CMakeFiles/LLVMipo.dir/AlwaysInliner.cpp.o lib/Transforms/IPO/CMakeFiles/LLVMipo.dir/ArgumentPromotion.cpp.o lib/Transforms/IPO/CMakeFiles/LLVMipo.dir/BarrierNoopPass.cpp.o lib/Transforms/IPO/CMakeFiles/LLVMipo.dir/BlockExtractor.cpp.o lib/Transforms/IPO/CMakeFiles/LLVMipo.dir/CalledValuePropagation.cpp.o lib/Transforms/IPO/CMakeFiles/LLVMipo.dir/ConstantMerge.cpp.o lib/Transforms/IPO/CMakeFiles/LLVMipo.dir/CrossDSOCFI.cpp.o lib/Transforms/IPO/CMakeFiles/LLVMipo.dir/DeadArgumentElimination.cpp.o lib/Transforms/IPO/CMakeFiles/LLVMipo.dir/ElimAvailExtern.cpp.o lib/Transforms/IPO/CMakeFiles/LLVMipo.dir/ExtractGV.cpp.o lib/Transforms/IPO/CMakeFiles/LLVMipo.dir/ForceFunctionAttrs.cpp.o lib/Transforms/IPO/CMakeFiles/LLVMipo.dir/FunctionAttrs.cpp.o lib/Transforms/IPO/CMakeFiles/LLVMipo.dir/FunctionImport.cpp.o lib/Transforms/IPO/CMakeFiles/LLVMipo.dir/GlobalDCE.cpp.o lib/Transforms/IPO/CMakeFiles/LLVMipo.dir/GlobalOpt.cpp.o lib/Transforms/IPO/CMakeFiles/LLVMipo.dir/GlobalSplit.cpp.o lib/Transforms/IPO/CMakeFiles/LLVMipo.dir/IPConstantPropagation.cpp.o lib/Transforms/IPO/CMakeFiles/LLVMipo.dir/IPO.cpp.o lib/Transforms/IPO/CMakeFiles/LLVMipo.dir/InferFunctionAttrs.cpp.o lib/Transforms/IPO/CMakeFiles/LLVMipo.dir/InlineSimple.cpp.o lib/Transforms/IPO/CMakeFiles/LLVMipo.dir/Inliner.cpp.o lib/Transforms/IPO/CMakeFiles/LLVMipo.dir/Internalize.cpp.o lib/Transforms/IPO/CMakeFiles/LLVMipo.dir/LoopExtractor.cpp.o lib/Transforms/IPO/CMakeFiles/LLVMipo.dir/LowerTypeTests.cpp.o lib/Transforms/IPO/CMakeFiles/LLVMipo.dir/MergeFunctions.cpp.o lib/Transforms/IPO/CMakeFiles/LLVMipo.dir/PartialInlining.cpp.o lib/Transforms/IPO/CMakeFiles/LLVMipo.dir/PassManagerBuilder.cpp.o lib/Transforms/IPO/CMakeFiles/LLVMipo.dir/PruneEH.cpp.o lib/Transforms/IPO/CMakeFiles/LLVMipo.dir/SampleProfile.cpp.o lib/Transforms/IPO/CMakeFiles/LLVMipo.dir/SCCP.cpp.o lib/Transforms/IPO/CMakeFiles/LLVMipo.dir/StripDeadPrototypes.cpp.o lib/Transforms/IPO/CMakeFiles/LLVMipo.dir/StripSymbols.cpp.o lib/Transforms/IPO/CMakeFiles/LLVMipo.dir/SyntheticCountsPropagation.cpp.o lib/Transforms/IPO/CMakeFiles/LLVMipo.dir/ThinLTOBitcodeWriter.cpp.o lib/Transforms/IPO/CMakeFiles/LLVMipo.dir/WholeProgramDevirt.cpp.o  && :
[3136/3408] : && DYLD_LIBRARY_PATH=/Users/buildslave/jenkins/workspace/clang-stage2-Rthinlto-release_70/host-compiler/lib/ "/Applications/Xcode.app/Contents/Developer/Toolchains/XcodeDefault.xctoolchain/usr/bin/libtool" -static -no_warning_for_no_symbols -o lib/libLLVMVectorize.a          lib/Transforms/Vectorize/CMakeFiles/LLVMVectorize.dir/LoadStoreVectorizer.cpp.o lib/Transforms/Vectorize/CMakeFiles/LLVMVectorize.dir/LoopVectorizationLegality.cpp.o lib/Transforms/Vectorize/CMakeFiles/LLVMVectorize.dir/LoopVectorize.cpp.o lib/Transforms/Vectorize/CMakeFiles/LLVMVectorize.dir/SLPVectorizer.cpp.o lib/Transforms/Vectorize/CMakeFiles/LLVMVectorize.dir/Vectorize.cpp.o lib/Transforms/Vectorize/CMakeFiles/LLVMVectorize.dir/VPlan.cpp.o lib/Transforms/Vectorize/CMakeFiles/LLVMVectorize.dir/VPlanHCFGBuilder.cpp.o lib/Transforms/Vectorize/CMakeFiles/LLVMVectorize.dir/VPlanHCFGTransforms.cpp.o lib/Transforms/Vectorize/CMakeFiles/LLVMVectorize.dir/VPlanVerifier.cpp.o  && :
[3137/3408] : && /Users/buildslave/jenkins/workspace/clang-stage2-Rthinlto-release_70/host-compiler/bin/clang++ -fno-stack-protector -fno-common -Wno-profile-instr-unprofiled -fPIC -fvisibility-inlines-hidden -Werror=date-time -Werror=unguarded-availability-new -std=c++11 -fmodules -fmodules-cache-path=/Users/buildslave/jenkins/workspace/clang-stage2-Rthinlto-release_70/clang-build/Build/module.cache -fcxx-modules -gmodules -Wall -Wextra -Wno-unused-parameter -Wwrite-strings -Wcast-qual -Wmissing-field-initializers -pedantic -Wno-long-long -Wcovered-switch-default -Wnon-virtual-dtor -Wdelete-non-virtual-dtor -Wstring-conversion -fdiagnostics-color -flto=thin -O2 -g -DNDEBUG -isysroot /Applications/Xcode.app/Contents/Developer/Platforms/MacOSX.platform/Developer/SDKs/MacOSX10.14.sdk -bundle -Wl,-headerpad_max_install_names -Wl,-flat_namespace -Wl,-undefined -Wl,suppress   -Wl,-dead_strip -Wl,-exported_symbols_list,/Users/buildslave/jenkins/workspace/clang-stage2-Rthinlto-release_70/clang-build/Build/lib/Transforms/Hello/LLVMHello.exports -Wl,-object_path_lto,/Users/buildslave/jenkins/workspace/clang-stage2-Rthinlto-release_70/clang-build/Build/lib/Transforms/Hello/./LLVMHello-lto.o -o lib/LLVMHello.dylib lib/Transforms/Hello/CMakeFiles/LLVMHello.dir/Hello.cpp.o  -Wl,-rpath,@loader_path/../lib && cd /Users/buildslave/jenkins/workspace/clang-stage2-Rthinlto-release_70/clang-build/Build/lib/Transforms/Hello && xcrun dsymutil /Users/buildslave/jenkins/workspace/clang-stage2-Rthinlto-release_70/clang-build/Build/lib/LLVMHello.dylib && /usr/bin/strip -Sxl /Users/buildslave/jenkins/workspace/clang-stage2-Rthinlto-release_70/clang-build/Build/lib/LLVMHello.dylib
[3138/3408] : && DYLD_LIBRARY_PATH=/Users/buildslave/jenkins/workspace/clang-stage2-Rthinlto-release_70/host-compiler/lib/ "/Applications/Xcode.app/Contents/Developer/Toolchains/XcodeDefault.xctoolchain/usr/bin/libtool" -static -no_warning_for_no_symbols -o lib/libLLVMObjCARCOpts.a          lib/Transforms/ObjCARC/CMakeFiles/LLVMObjCARCOpts.dir/ObjCARC.cpp.o lib/Transforms/ObjCARC/CMakeFiles/LLVMObjCARCOpts.dir/ObjCARCOpts.cpp.o lib/Transforms/ObjCARC/CMakeFiles/LLVMObjCARCOpts.dir/ObjCARCExpand.cpp.o lib/Transforms/ObjCARC/CMakeFiles/LLVMObjCARCOpts.dir/ObjCARCAPElim.cpp.o lib/Transforms/ObjCARC/CMakeFiles/LLVMObjCARCOpts.dir/ObjCARCContract.cpp.o lib/Transforms/ObjCARC/CMakeFiles/LLVMObjCARCOpts.dir/DependencyAnalysis.cpp.o lib/Transforms/ObjCARC/CMakeFiles/LLVMObjCARCOpts.dir/ProvenanceAnalysis.cpp.o lib/Transforms/ObjCARC/CMakeFiles/LLVMObjCARCOpts.dir/ProvenanceAnalysisEvaluator.cpp.o lib/Transforms/ObjCARC/CMakeFiles/LLVMObjCARCOpts.dir/PtrState.cpp.o  && :
[3139/3408] : && DYLD_LIBRARY_PATH=/Users/buildslave/jenkins/workspace/clang-stage2-Rthinlto-release_70/host-compiler/lib/ "/Applications/Xcode.app/Contents/Developer/Toolchains/XcodeDefault.xctoolchain/usr/bin/libtool" -static -no_warning_for_no_symbols -o lib/libLLVMCoroutines.a          lib/Transforms/Coroutines/CMakeFiles/LLVMCoroutines.dir/Coroutines.cpp.o lib/Transforms/Coroutines/CMakeFiles/LLVMCoroutines.dir/CoroCleanup.cpp.o lib/Transforms/Coroutines/CMakeFiles/LLVMCoroutines.dir/CoroEarly.cpp.o lib/Transforms/Coroutines/CMakeFiles/LLVMCoroutines.dir/CoroElide.cpp.o lib/Transforms/Coroutines/CMakeFiles/LLVMCoroutines.dir/CoroFrame.cpp.o lib/Transforms/Coroutines/CMakeFiles/LLVMCoroutines.dir/CoroSplit.cpp.o  && :
[3140/3408] : && DYLD_LIBRARY_PATH=/Users/buildslave/jenkins/workspace/clang-stage2-Rthinlto-release_70/host-compiler/lib/ "/Applications/Xcode.app/Contents/Developer/Toolchains/XcodeDefault.xctoolchain/usr/bin/libtool" -static -no_warning_for_no_symbols -o lib/libLLVMLinker.a          lib/Linker/CMakeFiles/LLVMLinker.dir/IRMover.cpp.o lib/Linker/CMakeFiles/LLVMLinker.dir/LinkModules.cpp.o  && :
[3141/3408] : && DYLD_LIBRARY_PATH=/Users/buildslave/jenkins/workspace/clang-stage2-Rthinlto-release_70/host-compiler/lib/ "/Applications/Xcode.app/Contents/Developer/Toolchains/XcodeDefault.xctoolchain/usr/bin/libtool" -static -no_warning_for_no_symbols -o lib/libLLVMAnalysis.a          lib/Analysis/CMakeFiles/LLVMAnalysis.dir/AliasAnalysis.cpp.o lib/Analysis/CMakeFiles/LLVMAnalysis.dir/AliasAnalysisEvaluator.cpp.o lib/Analysis/CMakeFiles/LLVMAnalysis.dir/AliasAnalysisSummary.cpp.o lib/Analysis/CMakeFiles/LLVMAnalysis.dir/AliasSetTracker.cpp.o lib/Analysis/CMakeFiles/LLVMAnalysis.dir/Analysis.cpp.o lib/Analysis/CMakeFiles/LLVMAnalysis.dir/AssumptionCache.cpp.o lib/Analysis/CMakeFiles/LLVMAnalysis.dir/BasicAliasAnalysis.cpp.o lib/Analysis/CMakeFiles/LLVMAnalysis.dir/BlockFrequencyInfo.cpp.o lib/Analysis/CMakeFiles/LLVMAnalysis.dir/BlockFrequencyInfoImpl.cpp.o lib/Analysis/CMakeFiles/LLVMAnalysis.dir/BranchProbabilityInfo.cpp.o lib/Analysis/CMakeFiles/LLVMAnalysis.dir/CFG.cpp.o lib/Analysis/CMakeFiles/LLVMAnalysis.dir/CFGPrinter.cpp.o lib/Analysis/CMakeFiles/LLVMAnalysis.dir/CFLAndersAliasAnalysis.cpp.o lib/Analysis/CMakeFiles/LLVMAnalysis.dir/CFLSteensAliasAnalysis.cpp.o lib/Analysis/CMakeFiles/LLVMAnalysis.dir/CGSCCPassManager.cpp.o lib/Analysis/CMakeFiles/LLVMAnalysis.dir/CallGraph.cpp.o lib/Analysis/CMakeFiles/LLVMAnalysis.dir/CallGraphSCCPass.cpp.o lib/Analysis/CMakeFiles/LLVMAnalysis.dir/CallPrinter.cpp.o lib/Analysis/CMakeFiles/LLVMAnalysis.dir/CaptureTracking.cpp.o lib/Analysis/CMakeFiles/LLVMAnalysis.dir/CmpInstAnalysis.cpp.o lib/Analysis/CMakeFiles/LLVMAnalysis.dir/CostModel.cpp.o lib/Analysis/CMakeFiles/LLVMAnalysis.dir/CodeMetrics.cpp.o lib/Analysis/CMakeFiles/LLVMAnalysis.dir/ConstantFolding.cpp.o lib/Analysis/CMakeFiles/LLVMAnalysis.dir/Delinearization.cpp.o lib/Analysis/CMakeFiles/LLVMAnalysis.dir/DemandedBits.cpp.o lib/Analysis/CMakeFiles/LLVMAnalysis.dir/DependenceAnalysis.cpp.o lib/Analysis/CMakeFiles/LLVMAnalysis.dir/DivergenceAnalysis.cpp.o lib/Analysis/CMakeFiles/LLVMAnalysis.dir/DomPrinter.cpp.o lib/Analysis/CMakeFiles/LLVMAnalysis.dir/DominanceFrontier.cpp.o lib/Analysis/CMakeFiles/LLVMAnalysis.dir/EHPersonalities.cpp.o lib/Analysis/CMakeFiles/LLVMAnalysis.dir/GlobalsModRef.cpp.o lib/Analysis/CMakeFiles/LLVMAnalysis.dir/IVUsers.cpp.o lib/Analysis/CMakeFiles/LLVMAnalysis.dir/IndirectCallPromotionAnalysis.cpp.o lib/Analysis/CMakeFiles/LLVMAnalysis.dir/InlineCost.cpp.o lib/Analysis/CMakeFiles/LLVMAnalysis.dir/InstCount.cpp.o lib/Analysis/CMakeFiles/LLVMAnalysis.dir/InstructionSimplify.cpp.o lib/Analysis/CMakeFiles/LLVMAnalysis.dir/Interval.cpp.o lib/Analysis/CMakeFiles/LLVMAnalysis.dir/IntervalPartition.cpp.o lib/Analysis/CMakeFiles/LLVMAnalysis.dir/IteratedDominanceFrontier.cpp.o lib/Analysis/CMakeFiles/LLVMAnalysis.dir/LazyBranchProbabilityInfo.cpp.o lib/Analysis/CMakeFiles/LLVMAnalysis.dir/LazyBlockFrequencyInfo.cpp.o lib/Analysis/CMakeFiles/LLVMAnalysis.dir/LazyCallGraph.cpp.o lib/Analysis/CMakeFiles/LLVMAnalysis.dir/LazyValueInfo.cpp.o lib/Analysis/CMakeFiles/LLVMAnalysis.dir/Lint.cpp.o lib/Analysis/CMakeFiles/LLVMAnalysis.dir/Loads.cpp.o lib/Analysis/CMakeFiles/LLVMAnalysis.dir/LoopAccessAnalysis.cpp.o lib/Analysis/CMakeFiles/LLVMAnalysis.dir/LoopAnalysisManager.cpp.o lib/Analysis/CMakeFiles/LLVMAnalysis.dir/LoopUnrollAnalyzer.cpp.o lib/Analysis/CMakeFiles/LLVMAnalysis.dir/LoopInfo.cpp.o lib/Analysis/CMakeFiles/LLVMAnalysis.dir/LoopPass.cpp.o lib/Analysis/CMakeFiles/LLVMAnalysis.dir/MemDepPrinter.cpp.o lib/Analysis/CMakeFiles/LLVMAnalysis.dir/MemDerefPrinter.cpp.o lib/Analysis/CMakeFiles/LLVMAnalysis.dir/MemoryBuiltins.cpp.o lib/Analysis/CMakeFiles/LLVMAnalysis.dir/MemoryDependenceAnalysis.cpp.o lib/Analysis/CMakeFiles/LLVMAnalysis.dir/MemoryLocation.cpp.o lib/Analysis/CMakeFiles/LLVMAnalysis.dir/MemorySSA.cpp.o lib/Analysis/CMakeFiles/LLVMAnalysis.dir/MemorySSAUpdater.cpp.o lib/Analysis/CMakeFiles/LLVMAnalysis.dir/ModuleDebugInfoPrinter.cpp.o lib/Analysis/CMakeFiles/LLVMAnalysis.dir/ModuleSummaryAnalysis.cpp.o lib/Analysis/CMakeFiles/LLVMAnalysis.dir/MustExecute.cpp.o lib/Analysis/CMakeFiles/LLVMAnalysis.dir/ObjCARCAliasAnalysis.cpp.o lib/Analysis/CMakeFiles/LLVMAnalysis.dir/ObjCARCAnalysisUtils.cpp.o lib/Analysis/CMakeFiles/LLVMAnalysis.dir/ObjCARCInstKind.cpp.o lib/Analysis/CMakeFiles/LLVMAnalysis.dir/OptimizationRemarkEmitter.cpp.o lib/Analysis/CMakeFiles/LLVMAnalysis.dir/OrderedBasicBlock.cpp.o lib/Analysis/CMakeFiles/LLVMAnalysis.dir/PHITransAddr.cpp.o lib/Analysis/CMakeFiles/LLVMAnalysis.dir/PhiValues.cpp.o lib/Analysis/CMakeFiles/LLVMAnalysis.dir/PostDominators.cpp.o lib/Analysis/CMakeFiles/LLVMAnalysis.dir/ProfileSummaryInfo.cpp.o lib/Analysis/CMakeFiles/LLVMAnalysis.dir/PtrUseVisitor.cpp.o lib/Analysis/CMakeFiles/LLVMAnalysis.dir/RegionInfo.cpp.o lib/Analysis/CMakeFiles/LLVMAnalysis.dir/RegionPass.cpp.o lib/Analysis/CMakeFiles/LLVMAnalysis.dir/RegionPrinter.cpp.o lib/Analysis/CMakeFiles/LLVMAnalysis.dir/ScalarEvolution.cpp.o lib/Analysis/CMakeFiles/LLVMAnalysis.dir/ScalarEvolutionAliasAnalysis.cpp.o lib/Analysis/CMakeFiles/LLVMAnalysis.dir/ScalarEvolutionExpander.cpp.o lib/Analysis/CMakeFiles/LLVMAnalysis.dir/ScalarEvolutionNormalization.cpp.o lib/Analysis/CMakeFiles/LLVMAnalysis.dir/SyntheticCountsUtils.cpp.o lib/Analysis/CMakeFiles/LLVMAnalysis.dir/TargetLibraryInfo.cpp.o lib/Analysis/CMakeFiles/LLVMAnalysis.dir/TargetTransformInfo.cpp.o lib/Analysis/CMakeFiles/LLVMAnalysis.dir/Trace.cpp.o lib/Analysis/CMakeFiles/LLVMAnalysis.dir/TypeBasedAliasAnalysis.cpp.o lib/Analysis/CMakeFiles/LLVMAnalysis.dir/TypeMetadataUtils.cpp.o lib/Analysis/CMakeFiles/LLVMAnalysis.dir/ScopedNoAliasAA.cpp.o lib/Analysis/CMakeFiles/LLVMAnalysis.dir/ValueLattice.cpp.o lib/Analysis/CMakeFiles/LLVMAnalysis.dir/ValueLatticeUtils.cpp.o lib/Analysis/CMakeFiles/LLVMAnalysis.dir/ValueTracking.cpp.o lib/Analysis/CMakeFiles/LLVMAnalysis.dir/VectorUtils.cpp.o  && :
[3142/3408] : && DYLD_LIBRARY_PATH=/Users/buildslave/jenkins/workspace/clang-stage2-Rthinlto-release_70/host-compiler/lib/ "/Applications/Xcode.app/Contents/Developer/Toolchains/XcodeDefault.xctoolchain/usr/bin/libtool" -static -no_warning_for_no_symbols -o lib/libLLVMLTO.a          lib/LTO/CMakeFiles/LLVMLTO.dir/Caching.cpp.o lib/LTO/CMakeFiles/LLVMLTO.dir/LTO.cpp.o lib/LTO/CMakeFiles/LLVMLTO.dir/LTOBackend.cpp.o lib/LTO/CMakeFiles/LLVMLTO.dir/LTOModule.cpp.o lib/LTO/CMakeFiles/LLVMLTO.dir/LTOCodeGenerator.cpp.o lib/LTO/CMakeFiles/LLVMLTO.dir/UpdateCompilerUsed.cpp.o lib/LTO/CMakeFiles/LLVMLTO.dir/ThinLTOCodeGenerator.cpp.o  && :
[3143/3408] : && DYLD_LIBRARY_PATH=/Users/buildslave/jenkins/workspace/clang-stage2-Rthinlto-release_70/host-compiler/lib/ "/Applications/Xcode.app/Contents/Developer/Toolchains/XcodeDefault.xctoolchain/usr/bin/libtool" -static -no_warning_for_no_symbols -o lib/libLLVMObject.a          lib/Object/CMakeFiles/LLVMObject.dir/Archive.cpp.o lib/Object/CMakeFiles/LLVMObject.dir/ArchiveWriter.cpp.o lib/Object/CMakeFiles/LLVMObject.dir/Binary.cpp.o lib/Object/CMakeFiles/LLVMObject.dir/COFFImportFile.cpp.o lib/Object/CMakeFiles/LLVMObject.dir/COFFModuleDefinition.cpp.o lib/Object/CMakeFiles/LLVMObject.dir/COFFObjectFile.cpp.o lib/Object/CMakeFiles/LLVMObject.dir/Decompressor.cpp.o lib/Object/CMakeFiles/LLVMObject.dir/ELF.cpp.o lib/Object/CMakeFiles/LLVMObject.dir/ELFObjectFile.cpp.o lib/Object/CMakeFiles/LLVMObject.dir/Error.cpp.o lib/Object/CMakeFiles/LLVMObject.dir/IRObjectFile.cpp.o lib/Object/CMakeFiles/LLVMObject.dir/IRSymtab.cpp.o lib/Object/CMakeFiles/LLVMObject.dir/MachOObjectFile.cpp.o lib/Object/CMakeFiles/LLVMObject.dir/MachOUniversal.cpp.o lib/Object/CMakeFiles/LLVMObject.dir/ModuleSymbolTable.cpp.o lib/Object/CMakeFiles/LLVMObject.dir/Object.cpp.o lib/Object/CMakeFiles/LLVMObject.dir/ObjectFile.cpp.o lib/Object/CMakeFiles/LLVMObject.dir/RecordStreamer.cpp.o lib/Object/CMakeFiles/LLVMObject.dir/SymbolicFile.cpp.o lib/Object/CMakeFiles/LLVMObject.dir/SymbolSize.cpp.o lib/Object/CMakeFiles/LLVMObject.dir/WasmObjectFile.cpp.o lib/Object/CMakeFiles/LLVMObject.dir/WindowsResource.cpp.o  && :
[3144/3408] : && DYLD_LIBRARY_PATH=/Users/buildslave/jenkins/workspace/clang-stage2-Rthinlto-release_70/host-compiler/lib/ "/Applications/Xcode.app/Contents/Developer/Toolchains/XcodeDefault.xctoolchain/usr/bin/libtool" -static -no_warning_for_no_symbols -o lib/libLLVMExecutionEngine.a          lib/ExecutionEngine/CMakeFiles/LLVMExecutionEngine.dir/ExecutionEngine.cpp.o lib/ExecutionEngine/CMakeFiles/LLVMExecutionEngine.dir/ExecutionEngineBindings.cpp.o lib/ExecutionEngine/CMakeFiles/LLVMExecutionEngine.dir/GDBRegistrationListener.cpp.o lib/ExecutionEngine/CMakeFiles/LLVMExecutionEngine.dir/SectionMemoryManager.cpp.o lib/ExecutionEngine/CMakeFiles/LLVMExecutionEngine.dir/TargetSelect.cpp.o  && :
[3145/3408] : && DYLD_LIBRARY_PATH=/Users/buildslave/jenkins/workspace/clang-stage2-Rthinlto-release_70/host-compiler/lib/ "/Applications/Xcode.app/Contents/Developer/Toolchains/XcodeDefault.xctoolchain/usr/bin/libtool" -static -no_warning_for_no_symbols -o lib/libLLVMInterpreter.a          lib/ExecutionEngine/Interpreter/CMakeFiles/LLVMInterpreter.dir/Execution.cpp.o lib/ExecutionEngine/Interpreter/CMakeFiles/LLVMInterpreter.dir/ExternalFunctions.cpp.o lib/ExecutionEngine/Interpreter/CMakeFiles/LLVMInterpreter.dir/Interpreter.cpp.o  && :
[3146/3408] : && DYLD_LIBRARY_PATH=/Users/buildslave/jenkins/workspace/clang-stage2-Rthinlto-release_70/host-compiler/lib/ "/Applications/Xcode.app/Contents/Developer/Toolchains/XcodeDefault.xctoolchain/usr/bin/libtool" -static -no_warning_for_no_symbols -o lib/libLLVMMCJIT.a          lib/ExecutionEngine/MCJIT/CMakeFiles/LLVMMCJIT.dir/MCJIT.cpp.o  && :
[3147/3408] : && DYLD_LIBRARY_PATH=/Users/buildslave/jenkins/workspace/clang-stage2-Rthinlto-release_70/host-compiler/lib/ "/Applications/Xcode.app/Contents/Developer/Toolchains/XcodeDefault.xctoolchain/usr/bin/libtool" -static -no_warning_for_no_symbols -o lib/libLLVMRuntimeDyld.a          lib/ExecutionEngine/RuntimeDyld/CMakeFiles/LLVMRuntimeDyld.dir/JITSymbol.cpp.o lib/ExecutionEngine/RuntimeDyld/CMakeFiles/LLVMRuntimeDyld.dir/RTDyldMemoryManager.cpp.o lib/ExecutionEngine/RuntimeDyld/CMakeFiles/LLVMRuntimeDyld.dir/RuntimeDyld.cpp.o lib/ExecutionEngine/RuntimeDyld/CMakeFiles/LLVMRuntimeDyld.dir/RuntimeDyldChecker.cpp.o lib/ExecutionEngine/RuntimeDyld/CMakeFiles/LLVMRuntimeDyld.dir/RuntimeDyldCOFF.cpp.o lib/ExecutionEngine/RuntimeDyld/CMakeFiles/LLVMRuntimeDyld.dir/RuntimeDyldELF.cpp.o lib/ExecutionEngine/RuntimeDyld/CMakeFiles/LLVMRuntimeDyld.dir/RuntimeDyldMachO.cpp.o lib/ExecutionEngine/RuntimeDyld/CMakeFiles/LLVMRuntimeDyld.dir/Targets/RuntimeDyldELFMips.cpp.o  && :
[3148/3408] : && DYLD_LIBRARY_PATH=/Users/buildslave/jenkins/workspace/clang-stage2-Rthinlto-release_70/host-compiler/lib/ "/Applications/Xcode.app/Contents/Developer/Toolchains/XcodeDefault.xctoolchain/usr/bin/libtool" -static -no_warning_for_no_symbols -o lib/libLLVMTarget.a          lib/Target/CMakeFiles/LLVMTarget.dir/Target.cpp.o lib/Target/CMakeFiles/LLVMTarget.dir/TargetIntrinsicInfo.cpp.o lib/Target/CMakeFiles/LLVMTarget.dir/TargetLoweringObjectFile.cpp.o lib/Target/CMakeFiles/LLVMTarget.dir/TargetMachine.cpp.o lib/Target/CMakeFiles/LLVMTarget.dir/TargetMachineC.cpp.o  && :
[3149/3408] : && DYLD_LIBRARY_PATH=/Users/buildslave/jenkins/workspace/clang-stage2-Rthinlto-release_70/host-compiler/lib/ "/Applications/Xcode.app/Contents/Developer/Toolchains/XcodeDefault.xctoolchain/usr/bin/libtool" -static -no_warning_for_no_symbols -o lib/libLLVMX86CodeGen.a          lib/Target/X86/CMakeFiles/LLVMX86CodeGen.dir/ShadowCallStack.cpp.o lib/Target/X86/CMakeFiles/LLVMX86CodeGen.dir/X86AsmPrinter.cpp.o lib/Target/X86/CMakeFiles/LLVMX86CodeGen.dir/X86CallFrameOptimization.cpp.o lib/Target/X86/CMakeFiles/LLVMX86CodeGen.dir/X86CallingConv.cpp.o lib/Target/X86/CMakeFiles/LLVMX86CodeGen.dir/X86CallLowering.cpp.o lib/Target/X86/CMakeFiles/LLVMX86CodeGen.dir/X86CmovConversion.cpp.o lib/Target/X86/CMakeFiles/LLVMX86CodeGen.dir/X86DomainReassignment.cpp.o lib/Target/X86/CMakeFiles/LLVMX86CodeGen.dir/X86ExpandPseudo.cpp.o lib/Target/X86/CMakeFiles/LLVMX86CodeGen.dir/X86FastISel.cpp.o lib/Target/X86/CMakeFiles/LLVMX86CodeGen.dir/X86FixupBWInsts.cpp.o lib/Target/X86/CMakeFiles/LLVMX86CodeGen.dir/X86FixupLEAs.cpp.o lib/Target/X86/CMakeFiles/LLVMX86CodeGen.dir/X86AvoidStoreForwardingBlocks.cpp.o lib/Target/X86/CMakeFiles/LLVMX86CodeGen.dir/X86FixupSetCC.cpp.o lib/Target/X86/CMakeFiles/LLVMX86CodeGen.dir/X86FlagsCopyLowering.cpp.o lib/Target/X86/CMakeFiles/LLVMX86CodeGen.dir/X86FloatingPoint.cpp.o lib/Target/X86/CMakeFiles/LLVMX86CodeGen.dir/X86FrameLowering.cpp.o lib/Target/X86/CMakeFiles/LLVMX86CodeGen.dir/X86InstructionSelector.cpp.o lib/Target/X86/CMakeFiles/LLVMX86CodeGen.dir/X86ISelDAGToDAG.cpp.o lib/Target/X86/CMakeFiles/LLVMX86CodeGen.dir/X86ISelLowering.cpp.o lib/Target/X86/CMakeFiles/LLVMX86CodeGen.dir/X86IndirectBranchTracking.cpp.o lib/Target/X86/CMakeFiles/LLVMX86CodeGen.dir/X86InterleavedAccess.cpp.o lib/Target/X86/CMakeFiles/LLVMX86CodeGen.dir/X86InstrFMA3Info.cpp.o lib/Target/X86/CMakeFiles/LLVMX86CodeGen.dir/X86InstrFoldTables.cpp.o lib/Target/X86/CMakeFiles/LLVMX86CodeGen.dir/X86InstrInfo.cpp.o lib/Target/X86/CMakeFiles/LLVMX86CodeGen.dir/X86EvexToVex.cpp.o lib/Target/X86/CMakeFiles/LLVMX86CodeGen.dir/X86LegalizerInfo.cpp.o lib/Target/X86/CMakeFiles/LLVMX86CodeGen.dir/X86MCInstLower.cpp.o lib/Target/X86/CMakeFiles/LLVMX86CodeGen.dir/X86MachineFunctionInfo.cpp.o lib/Target/X86/CMakeFiles/LLVMX86CodeGen.dir/X86MacroFusion.cpp.o lib/Target/X86/CMakeFiles/LLVMX86CodeGen.dir/X86OptimizeLEAs.cpp.o lib/Target/X86/CMakeFiles/LLVMX86CodeGen.dir/X86PadShortFunction.cpp.o lib/Target/X86/CMakeFiles/LLVMX86CodeGen.dir/X86RegisterBankInfo.cpp.o lib/Target/X86/CMakeFiles/LLVMX86CodeGen.dir/X86RegisterInfo.cpp.o lib/Target/X86/CMakeFiles/LLVMX86CodeGen.dir/X86RetpolineThunks.cpp.o lib/Target/X86/CMakeFiles/LLVMX86CodeGen.dir/X86SelectionDAGInfo.cpp.o lib/Target/X86/CMakeFiles/LLVMX86CodeGen.dir/X86ShuffleDecodeConstantPool.cpp.o lib/Target/X86/CMakeFiles/LLVMX86CodeGen.dir/X86SpeculativeLoadHardening.cpp.o lib/Target/X86/CMakeFiles/LLVMX86CodeGen.dir/X86Subtarget.cpp.o lib/Target/X86/CMakeFiles/LLVMX86CodeGen.dir/X86TargetMachine.cpp.o lib/Target/X86/CMakeFiles/LLVMX86CodeGen.dir/X86TargetObjectFile.cpp.o lib/Target/X86/CMakeFiles/LLVMX86CodeGen.dir/X86TargetTransformInfo.cpp.o lib/Target/X86/CMakeFiles/LLVMX86CodeGen.dir/X86VZeroUpper.cpp.o lib/Target/X86/CMakeFiles/LLVMX86CodeGen.dir/X86WinAllocaExpander.cpp.o lib/Target/X86/CMakeFiles/LLVMX86CodeGen.dir/X86WinEHState.cpp.o  && :
[3150/3408] : && DYLD_LIBRARY_PATH=/Users/buildslave/jenkins/workspace/clang-stage2-Rthinlto-release_70/host-compiler/lib/ "/Applications/Xcode.app/Contents/Developer/Toolchains/XcodeDefault.xctoolchain/usr/bin/libtool" -static -no_warning_for_no_symbols -o lib/libLLVMX86AsmParser.a          lib/Target/X86/AsmParser/CMakeFiles/LLVMX86AsmParser.dir/X86AsmInstrumentation.cpp.o lib/Target/X86/AsmParser/CMakeFiles/LLVMX86AsmParser.dir/X86AsmParser.cpp.o  && :
[3151/3408] : && DYLD_LIBRARY_PATH=/Users/buildslave/jenkins/workspace/clang-stage2-Rthinlto-release_70/host-compiler/lib/ "/Applications/Xcode.app/Contents/Developer/Toolchains/XcodeDefault.xctoolchain/usr/bin/libtool" -static -no_warning_for_no_symbols -o lib/libLLVMX86Disassembler.a          lib/Target/X86/Disassembler/CMakeFiles/LLVMX86Disassembler.dir/X86Disassembler.cpp.o lib/Target/X86/Disassembler/CMakeFiles/LLVMX86Disassembler.dir/X86DisassemblerDecoder.cpp.o  && :
[3152/3408] : && DYLD_LIBRARY_PATH=/Users/buildslave/jenkins/workspace/clang-stage2-Rthinlto-release_70/host-compiler/lib/ "/Applications/Xcode.app/Contents/Developer/Toolchains/XcodeDefault.xctoolchain/usr/bin/libtool" -static -no_warning_for_no_symbols -o lib/libLLVMX86AsmPrinter.a          lib/Target/X86/InstPrinter/CMakeFiles/LLVMX86AsmPrinter.dir/X86ATTInstPrinter.cpp.o lib/Target/X86/InstPrinter/CMakeFiles/LLVMX86AsmPrinter.dir/X86IntelInstPrinter.cpp.o lib/Target/X86/InstPrinter/CMakeFiles/LLVMX86AsmPrinter.dir/X86InstComments.cpp.o lib/Target/X86/InstPrinter/CMakeFiles/LLVMX86AsmPrinter.dir/X86InstPrinterCommon.cpp.o  && :
[3153/3408] : && DYLD_LIBRARY_PATH=/Users/buildslave/jenkins/workspace/clang-stage2-Rthinlto-release_70/host-compiler/lib/ "/Applications/Xcode.app/Contents/Developer/Toolchains/XcodeDefault.xctoolchain/usr/bin/libtool" -static -no_warning_for_no_symbols -o lib/libLLVMX86Desc.a          lib/Target/X86/MCTargetDesc/CMakeFiles/LLVMX86Desc.dir/X86AsmBackend.cpp.o lib/Target/X86/MCTargetDesc/CMakeFiles/LLVMX86Desc.dir/X86MCTargetDesc.cpp.o lib/Target/X86/MCTargetDesc/CMakeFiles/LLVMX86Desc.dir/X86MCAsmInfo.cpp.o lib/Target/X86/MCTargetDesc/CMakeFiles/LLVMX86Desc.dir/X86MCCodeEmitter.cpp.o lib/Target/X86/MCTargetDesc/CMakeFiles/LLVMX86Desc.dir/X86MachObjectWriter.cpp.o lib/Target/X86/MCTargetDesc/CMakeFiles/LLVMX86Desc.dir/X86ELFObjectWriter.cpp.o lib/Target/X86/MCTargetDesc/CMakeFiles/LLVMX86Desc.dir/X86WinCOFFObjectWriter.cpp.o lib/Target/X86/MCTargetDesc/CMakeFiles/LLVMX86Desc.dir/X86WinCOFFStreamer.cpp.o lib/Target/X86/MCTargetDesc/CMakeFiles/LLVMX86Desc.dir/X86WinCOFFTargetStreamer.cpp.o  && :
[3154/3408] : && DYLD_LIBRARY_PATH=/Users/buildslave/jenkins/workspace/clang-stage2-Rthinlto-release_70/host-compiler/lib/ "/Applications/Xcode.app/Contents/Developer/Toolchains/XcodeDefault.xctoolchain/usr/bin/libtool" -static -no_warning_for_no_symbols -o lib/libLLVMX86Info.a          lib/Target/X86/TargetInfo/CMakeFiles/LLVMX86Info.dir/X86TargetInfo.cpp.o  && :
[3155/3408] : && DYLD_LIBRARY_PATH=/Users/buildslave/jenkins/workspace/clang-stage2-Rthinlto-release_70/host-compiler/lib/ "/Applications/Xcode.app/Contents/Developer/Toolchains/XcodeDefault.xctoolchain/usr/bin/libtool" -static -no_warning_for_no_symbols -o lib/libLLVMX86Utils.a          lib/Target/X86/Utils/CMakeFiles/LLVMX86Utils.dir/X86ShuffleDecode.cpp.o  && :
[3156/3408] /Users/buildslave/jenkins/workspace/clang-stage2-Rthinlto-release_70/host-compiler/bin/clang++  -DGTEST_HAS_RTTI=0 -DGTEST_HAS_TR1_TUPLE=0 -DGTEST_LANG_CXX11=1 -D__STDC_CONSTANT_MACROS -D__STDC_FORMAT_MACROS -D__STDC_LIMIT_MACROS -Iunittests/Target/AArch64 -I/Users/buildslave/jenkins/workspace/clang-stage2-Rthinlto-release_70/llvm/unittests/Target/AArch64 -I/Applications/Xcode.app/Contents/Developer/Platforms/MacOSX.platform/Developer/SDKs/MacOSX10.14.sdk/usr/include/libxml2 -Iinclude -I/Users/buildslave/jenkins/workspace/clang-stage2-Rthinlto-release_70/llvm/include -I/Users/buildslave/jenkins/workspace/clang-stage2-Rthinlto-release_70/llvm/lib/Target/AArch64 -Ilib/Target/AArch64 -I/Users/buildslave/jenkins/workspace/clang-stage2-Rthinlto-release_70/llvm/utils/unittest/googletest/include -I/Users/buildslave/jenkins/workspace/clang-stage2-Rthinlto-release_70/llvm/utils/unittest/googlemock/include -fno-stack-protector -fno-common -Wno-profile-instr-unprofiled -fPIC -fvisibility-inlines-hidden -Werror=date-time -Werror=unguarded-availability-new -std=c++11 -fmodules -fmodules-cache-path=/Users/buildslave/jenkins/workspace/clang-stage2-Rthinlto-release_70/clang-build/Build/module.cache -fcxx-modules -gmodules -Wall -Wextra -Wno-unused-parameter -Wwrite-strings -Wcast-qual -Wmissing-field-initializers -pedantic -Wno-long-long -Wcovered-switch-default -Wnon-virtual-dtor -Wdelete-non-virtual-dtor -Wstring-conversion -fdiagnostics-color -flto=thin -O2 -g -DNDEBUG -isysroot /Applications/Xcode.app/Contents/Developer/Platforms/MacOSX.platform/Developer/SDKs/MacOSX10.14.sdk    -Wno-variadic-macros -Wno-gnu-zero-variadic-macro-arguments -fno-exceptions -fno-rtti -MD -MT unittests/Target/AArch64/CMakeFiles/AArch64Tests.dir/InstSizes.cpp.o -MF unittests/Target/AArch64/CMakeFiles/AArch64Tests.dir/InstSizes.cpp.o.d -o unittests/Target/AArch64/CMakeFiles/AArch64Tests.dir/InstSizes.cpp.o -c /Users/buildslave/jenkins/workspace/clang-stage2-Rthinlto-release_70/llvm/unittests/Target/AArch64/InstSizes.cpp
[3157/3408] : && DYLD_LIBRARY_PATH=/Users/buildslave/jenkins/workspace/clang-stage2-Rthinlto-release_70/host-compiler/lib/ "/Applications/Xcode.app/Contents/Developer/Toolchains/XcodeDefault.xctoolchain/usr/bin/libtool" -static -no_warning_for_no_symbols -o lib/libLLVMARMCodeGen.a          lib/Target/ARM/CMakeFiles/LLVMARMCodeGen.dir/A15SDOptimizer.cpp.o lib/Target/ARM/CMakeFiles/LLVMARMCodeGen.dir/ARMAsmPrinter.cpp.o lib/Target/ARM/CMakeFiles/LLVMARMCodeGen.dir/ARMBaseInstrInfo.cpp.o lib/Target/ARM/CMakeFiles/LLVMARMCodeGen.dir/ARMBaseRegisterInfo.cpp.o lib/Target/ARM/CMakeFiles/LLVMARMCodeGen.dir/ARMCallLowering.cpp.o lib/Target/ARM/CMakeFiles/LLVMARMCodeGen.dir/ARMCodeGenPrepare.cpp.o lib/Target/ARM/CMakeFiles/LLVMARMCodeGen.dir/ARMConstantIslandPass.cpp.o lib/Target/ARM/CMakeFiles/LLVMARMCodeGen.dir/ARMConstantPoolValue.cpp.o lib/Target/ARM/CMakeFiles/LLVMARMCodeGen.dir/ARMExpandPseudoInsts.cpp.o lib/Target/ARM/CMakeFiles/LLVMARMCodeGen.dir/ARMFastISel.cpp.o lib/Target/ARM/CMakeFiles/LLVMARMCodeGen.dir/ARMFrameLowering.cpp.o lib/Target/ARM/CMakeFiles/LLVMARMCodeGen.dir/ARMHazardRecognizer.cpp.o lib/Target/ARM/CMakeFiles/LLVMARMCodeGen.dir/ARMInstructionSelector.cpp.o lib/Target/ARM/CMakeFiles/LLVMARMCodeGen.dir/ARMISelDAGToDAG.cpp.o lib/Target/ARM/CMakeFiles/LLVMARMCodeGen.dir/ARMISelLowering.cpp.o lib/Target/ARM/CMakeFiles/LLVMARMCodeGen.dir/ARMInstrInfo.cpp.o lib/Target/ARM/CMakeFiles/LLVMARMCodeGen.dir/ARMLegalizerInfo.cpp.o lib/Target/ARM/CMakeFiles/LLVMARMCodeGen.dir/ARMParallelDSP.cpp.o lib/Target/ARM/CMakeFiles/LLVMARMCodeGen.dir/ARMLoadStoreOptimizer.cpp.o lib/Target/ARM/CMakeFiles/LLVMARMCodeGen.dir/ARMMCInstLower.cpp.o lib/Target/ARM/CMakeFiles/LLVMARMCodeGen.dir/ARMMachineFunctionInfo.cpp.o lib/Target/ARM/CMakeFiles/LLVMARMCodeGen.dir/ARMMacroFusion.cpp.o lib/Target/ARM/CMakeFiles/LLVMARMCodeGen.dir/ARMRegisterInfo.cpp.o lib/Target/ARM/CMakeFiles/LLVMARMCodeGen.dir/ARMOptimizeBarriersPass.cpp.o lib/Target/ARM/CMakeFiles/LLVMARMCodeGen.dir/ARMRegisterBankInfo.cpp.o lib/Target/ARM/CMakeFiles/LLVMARMCodeGen.dir/ARMSelectionDAGInfo.cpp.o lib/Target/ARM/CMakeFiles/LLVMARMCodeGen.dir/ARMSubtarget.cpp.o lib/Target/ARM/CMakeFiles/LLVMARMCodeGen.dir/ARMTargetMachine.cpp.o lib/Target/ARM/CMakeFiles/LLVMARMCodeGen.dir/ARMTargetObjectFile.cpp.o lib/Target/ARM/CMakeFiles/LLVMARMCodeGen.dir/ARMTargetTransformInfo.cpp.o lib/Target/ARM/CMakeFiles/LLVMARMCodeGen.dir/MLxExpansionPass.cpp.o lib/Target/ARM/CMakeFiles/LLVMARMCodeGen.dir/Thumb1FrameLowering.cpp.o lib/Target/ARM/CMakeFiles/LLVMARMCodeGen.dir/Thumb1InstrInfo.cpp.o lib/Target/ARM/CMakeFiles/LLVMARMCodeGen.dir/ThumbRegisterInfo.cpp.o lib/Target/ARM/CMakeFiles/LLVMARMCodeGen.dir/Thumb2ITBlockPass.cpp.o lib/Target/ARM/CMakeFiles/LLVMARMCodeGen.dir/Thumb2InstrInfo.cpp.o lib/Target/ARM/CMakeFiles/LLVMARMCodeGen.dir/Thumb2SizeReduction.cpp.o lib/Target/ARM/CMakeFiles/LLVMARMCodeGen.dir/ARMComputeBlockSize.cpp.o  && :
[3158/3408] : && DYLD_LIBRARY_PATH=/Users/buildslave/jenkins/workspace/clang-stage2-Rthinlto-release_70/host-compiler/lib/ "/Applications/Xcode.app/Contents/Developer/Toolchains/XcodeDefault.xctoolchain/usr/bin/libtool" -static -no_warning_for_no_symbols -o lib/libLLVMARMAsmParser.a          lib/Target/ARM/AsmParser/CMakeFiles/LLVMARMAsmParser.dir/ARMAsmParser.cpp.o  && :
[3159/3408] : && DYLD_LIBRARY_PATH=/Users/buildslave/jenkins/workspace/clang-stage2-Rthinlto-release_70/host-compiler/lib/ "/Applications/Xcode.app/Contents/Developer/Toolchains/XcodeDefault.xctoolchain/usr/bin/libtool" -static -no_warning_for_no_symbols -o lib/libLLVMARMDisassembler.a          lib/Target/ARM/Disassembler/CMakeFiles/LLVMARMDisassembler.dir/ARMDisassembler.cpp.o  && :
[3160/3408] : && DYLD_LIBRARY_PATH=/Users/buildslave/jenkins/workspace/clang-stage2-Rthinlto-release_70/host-compiler/lib/ "/Applications/Xcode.app/Contents/Developer/Toolchains/XcodeDefault.xctoolchain/usr/bin/libtool" -static -no_warning_for_no_symbols -o lib/libLLVMARMAsmPrinter.a          lib/Target/ARM/InstPrinter/CMakeFiles/LLVMARMAsmPrinter.dir/ARMInstPrinter.cpp.o  && :
[3161/3408] : && DYLD_LIBRARY_PATH=/Users/buildslave/jenkins/workspace/clang-stage2-Rthinlto-release_70/host-compiler/lib/ "/Applications/Xcode.app/Contents/Developer/Toolchains/XcodeDefault.xctoolchain/usr/bin/libtool" -static -no_warning_for_no_symbols -o lib/libLLVMARMDesc.a          lib/Target/ARM/MCTargetDesc/CMakeFiles/LLVMARMDesc.dir/ARMAsmBackend.cpp.o lib/Target/ARM/MCTargetDesc/CMakeFiles/LLVMARMDesc.dir/ARMELFObjectWriter.cpp.o lib/Target/ARM/MCTargetDesc/CMakeFiles/LLVMARMDesc.dir/ARMELFStreamer.cpp.o lib/Target/ARM/MCTargetDesc/CMakeFiles/LLVMARMDesc.dir/ARMMachObjectWriter.cpp.o lib/Target/ARM/MCTargetDesc/CMakeFiles/LLVMARMDesc.dir/ARMMachORelocationInfo.cpp.o lib/Target/ARM/MCTargetDesc/CMakeFiles/LLVMARMDesc.dir/ARMMCAsmInfo.cpp.o lib/Target/ARM/MCTargetDesc/CMakeFiles/LLVMARMDesc.dir/ARMMCCodeEmitter.cpp.o lib/Target/ARM/MCTargetDesc/CMakeFiles/LLVMARMDesc.dir/ARMMCExpr.cpp.o lib/Target/ARM/MCTargetDesc/CMakeFiles/LLVMARMDesc.dir/ARMMCTargetDesc.cpp.o lib/Target/ARM/MCTargetDesc/CMakeFiles/LLVMARMDesc.dir/ARMTargetStreamer.cpp.o lib/Target/ARM/MCTargetDesc/CMakeFiles/LLVMARMDesc.dir/ARMUnwindOpAsm.cpp.o lib/Target/ARM/MCTargetDesc/CMakeFiles/LLVMARMDesc.dir/ARMWinCOFFObjectWriter.cpp.o lib/Target/ARM/MCTargetDesc/CMakeFiles/LLVMARMDesc.dir/ARMWinCOFFStreamer.cpp.o  && :
[3162/3408] : && DYLD_LIBRARY_PATH=/Users/buildslave/jenkins/workspace/clang-stage2-Rthinlto-release_70/host-compiler/lib/ "/Applications/Xcode.app/Contents/Developer/Toolchains/XcodeDefault.xctoolchain/usr/bin/libtool" -static -no_warning_for_no_symbols -o lib/libLLVMARMInfo.a          lib/Target/ARM/TargetInfo/CMakeFiles/LLVMARMInfo.dir/ARMTargetInfo.cpp.o  && :
[3163/3408] : && DYLD_LIBRARY_PATH=/Users/buildslave/jenkins/workspace/clang-stage2-Rthinlto-release_70/host-compiler/lib/ "/Applications/Xcode.app/Contents/Developer/Toolchains/XcodeDefault.xctoolchain/usr/bin/libtool" -static -no_warning_for_no_symbols -o lib/libLLVMARMUtils.a          lib/Target/ARM/Utils/CMakeFiles/LLVMARMUtils.dir/ARMBaseInfo.cpp.o  && :
[3164/3408] : && DYLD_LIBRARY_PATH=/Users/buildslave/jenkins/workspace/clang-stage2-Rthinlto-release_70/host-compiler/lib/ "/Applications/Xcode.app/Contents/Developer/Toolchains/XcodeDefault.xctoolchain/usr/bin/libtool" -static -no_warning_for_no_symbols -o lib/libLLVMAArch64CodeGen.a          lib/Target/AArch64/CMakeFiles/LLVMAArch64CodeGen.dir/AArch64A57FPLoadBalancing.cpp.o lib/Target/AArch64/CMakeFiles/LLVMAArch64CodeGen.dir/AArch64AdvSIMDScalarPass.cpp.o lib/Target/AArch64/CMakeFiles/LLVMAArch64CodeGen.dir/AArch64AsmPrinter.cpp.o lib/Target/AArch64/CMakeFiles/LLVMAArch64CodeGen.dir/AArch64CallLowering.cpp.o lib/Target/AArch64/CMakeFiles/LLVMAArch64CodeGen.dir/AArch64CleanupLocalDynamicTLSPass.cpp.o lib/Target/AArch64/CMakeFiles/LLVMAArch64CodeGen.dir/AArch64CollectLOH.cpp.o lib/Target/AArch64/CMakeFiles/LLVMAArch64CodeGen.dir/AArch64CondBrTuning.cpp.o lib/Target/AArch64/CMakeFiles/LLVMAArch64CodeGen.dir/AArch64ConditionalCompares.cpp.o lib/Target/AArch64/CMakeFiles/LLVMAArch64CodeGen.dir/AArch64DeadRegisterDefinitionsPass.cpp.o lib/Target/AArch64/CMakeFiles/LLVMAArch64CodeGen.dir/AArch64ExpandPseudoInsts.cpp.o lib/Target/AArch64/CMakeFiles/LLVMAArch64CodeGen.dir/AArch64FalkorHWPFFix.cpp.o lib/Target/AArch64/CMakeFiles/LLVMAArch64CodeGen.dir/AArch64FastISel.cpp.o lib/Target/AArch64/CMakeFiles/LLVMAArch64CodeGen.dir/AArch64A53Fix835769.cpp.o lib/Target/AArch64/CMakeFiles/LLVMAArch64CodeGen.dir/AArch64FrameLowering.cpp.o lib/Target/AArch64/CMakeFiles/LLVMAArch64CodeGen.dir/AArch64ConditionOptimizer.cpp.o lib/Target/AArch64/CMakeFiles/LLVMAArch64CodeGen.dir/AArch64RedundantCopyElimination.cpp.o lib/Target/AArch64/CMakeFiles/LLVMAArch64CodeGen.dir/AArch64ISelDAGToDAG.cpp.o lib/Target/AArch64/CMakeFiles/LLVMAArch64CodeGen.dir/AArch64ISelLowering.cpp.o lib/Target/AArch64/CMakeFiles/LLVMAArch64CodeGen.dir/AArch64InstrInfo.cpp.o lib/Target/AArch64/CMakeFiles/LLVMAArch64CodeGen.dir/AArch64InstructionSelector.cpp.o lib/Target/AArch64/CMakeFiles/LLVMAArch64CodeGen.dir/AArch64LegalizerInfo.cpp.o lib/Target/AArch64/CMakeFiles/LLVMAArch64CodeGen.dir/AArch64LoadStoreOptimizer.cpp.o lib/Target/AArch64/CMakeFiles/LLVMAArch64CodeGen.dir/AArch64MacroFusion.cpp.o lib/Target/AArch64/CMakeFiles/LLVMAArch64CodeGen.dir/AArch64MCInstLower.cpp.o lib/Target/AArch64/CMakeFiles/LLVMAArch64CodeGen.dir/AArch64PromoteConstant.cpp.o lib/Target/AArch64/CMakeFiles/LLVMAArch64CodeGen.dir/AArch64PBQPRegAlloc.cpp.o lib/Target/AArch64/CMakeFiles/LLVMAArch64CodeGen.dir/AArch64RegisterBankInfo.cpp.o lib/Target/AArch64/CMakeFiles/LLVMAArch64CodeGen.dir/AArch64RegisterInfo.cpp.o lib/Target/AArch64/CMakeFiles/LLVMAArch64CodeGen.dir/AArch64SelectionDAGInfo.cpp.o lib/Target/AArch64/CMakeFiles/LLVMAArch64CodeGen.dir/AArch64StorePairSuppress.cpp.o lib/Target/AArch64/CMakeFiles/LLVMAArch64CodeGen.dir/AArch64Subtarget.cpp.o lib/Target/AArch64/CMakeFiles/LLVMAArch64CodeGen.dir/AArch64TargetMachine.cpp.o lib/Target/AArch64/CMakeFiles/LLVMAArch64CodeGen.dir/AArch64TargetObjectFile.cpp.o lib/Target/AArch64/CMakeFiles/LLVMAArch64CodeGen.dir/AArch64TargetTransformInfo.cpp.o lib/Target/AArch64/CMakeFiles/LLVMAArch64CodeGen.dir/AArch64SIMDInstrOpt.cpp.o  && :
[3165/3408] : && DYLD_LIBRARY_PATH=/Users/buildslave/jenkins/workspace/clang-stage2-Rthinlto-release_70/host-compiler/lib/ "/Applications/Xcode.app/Contents/Developer/Toolchains/XcodeDefault.xctoolchain/usr/bin/libtool" -static -no_warning_for_no_symbols -o lib/libLLVMAArch64AsmParser.a          lib/Target/AArch64/AsmParser/CMakeFiles/LLVMAArch64AsmParser.dir/AArch64AsmParser.cpp.o  && :
[3166/3408] : && DYLD_LIBRARY_PATH=/Users/buildslave/jenkins/workspace/clang-stage2-Rthinlto-release_70/host-compiler/lib/ "/Applications/Xcode.app/Contents/Developer/Toolchains/XcodeDefault.xctoolchain/usr/bin/libtool" -static -no_warning_for_no_symbols -o lib/libLLVMAArch64Disassembler.a          lib/Target/AArch64/Disassembler/CMakeFiles/LLVMAArch64Disassembler.dir/AArch64Disassembler.cpp.o lib/Target/AArch64/Disassembler/CMakeFiles/LLVMAArch64Disassembler.dir/AArch64ExternalSymbolizer.cpp.o  && :
[3167/3408] : && DYLD_LIBRARY_PATH=/Users/buildslave/jenkins/workspace/clang-stage2-Rthinlto-release_70/host-compiler/lib/ "/Applications/Xcode.app/Contents/Developer/Toolchains/XcodeDefault.xctoolchain/usr/bin/libtool" -static -no_warning_for_no_symbols -o lib/libLLVMAArch64AsmPrinter.a          lib/Target/AArch64/InstPrinter/CMakeFiles/LLVMAArch64AsmPrinter.dir/AArch64InstPrinter.cpp.o  && :
[3168/3408] : && DYLD_LIBRARY_PATH=/Users/buildslave/jenkins/workspace/clang-stage2-Rthinlto-release_70/host-compiler/lib/ "/Applications/Xcode.app/Contents/Developer/Toolchains/XcodeDefault.xctoolchain/usr/bin/libtool" -static -no_warning_for_no_symbols -o lib/libLLVMAArch64Desc.a          lib/Target/AArch64/MCTargetDesc/CMakeFiles/LLVMAArch64Desc.dir/AArch64AsmBackend.cpp.o lib/Target/AArch64/MCTargetDesc/CMakeFiles/LLVMAArch64Desc.dir/AArch64ELFObjectWriter.cpp.o lib/Target/AArch64/MCTargetDesc/CMakeFiles/LLVMAArch64Desc.dir/AArch64ELFStreamer.cpp.o lib/Target/AArch64/MCTargetDesc/CMakeFiles/LLVMAArch64Desc.dir/AArch64MCAsmInfo.cpp.o lib/Target/AArch64/MCTargetDesc/CMakeFiles/LLVMAArch64Desc.dir/AArch64MCCodeEmitter.cpp.o lib/Target/AArch64/MCTargetDesc/CMakeFiles/LLVMAArch64Desc.dir/AArch64MCExpr.cpp.o lib/Target/AArch64/MCTargetDesc/CMakeFiles/LLVMAArch64Desc.dir/AArch64MCTargetDesc.cpp.o lib/Target/AArch64/MCTargetDesc/CMakeFiles/LLVMAArch64Desc.dir/AArch64MachObjectWriter.cpp.o lib/Target/AArch64/MCTargetDesc/CMakeFiles/LLVMAArch64Desc.dir/AArch64TargetStreamer.cpp.o lib/Target/AArch64/MCTargetDesc/CMakeFiles/LLVMAArch64Desc.dir/AArch64WinCOFFObjectWriter.cpp.o lib/Target/AArch64/MCTargetDesc/CMakeFiles/LLVMAArch64Desc.dir/AArch64WinCOFFStreamer.cpp.o  && :
[3169/3408] : && DYLD_LIBRARY_PATH=/Users/buildslave/jenkins/workspace/clang-stage2-Rthinlto-release_70/host-compiler/lib/ "/Applications/Xcode.app/Contents/Developer/Toolchains/XcodeDefault.xctoolchain/usr/bin/libtool" -static -no_warning_for_no_symbols -o lib/libLLVMAArch64Info.a          lib/Target/AArch64/TargetInfo/CMakeFiles/LLVMAArch64Info.dir/AArch64TargetInfo.cpp.o  && :
[3170/3408] : && DYLD_LIBRARY_PATH=/Users/buildslave/jenkins/workspace/clang-stage2-Rthinlto-release_70/host-compiler/lib/ "/Applications/Xcode.app/Contents/Developer/Toolchains/XcodeDefault.xctoolchain/usr/bin/libtool" -static -no_warning_for_no_symbols -o lib/libLLVMAArch64Utils.a          lib/Target/AArch64/Utils/CMakeFiles/LLVMAArch64Utils.dir/AArch64BaseInfo.cpp.o  && :
[3171/3408] : && DYLD_LIBRARY_PATH=/Users/buildslave/jenkins/workspace/clang-stage2-Rthinlto-release_70/host-compiler/lib/ "/Applications/Xcode.app/Contents/Developer/Toolchains/XcodeDefault.xctoolchain/usr/bin/libtool" -static -no_warning_for_no_symbols -o lib/libLLVMAsmParser.a          lib/AsmParser/CMakeFiles/LLVMAsmParser.dir/LLLexer.cpp.o lib/AsmParser/CMakeFiles/LLVMAsmParser.dir/LLParser.cpp.o lib/AsmParser/CMakeFiles/LLVMAsmParser.dir/Parser.cpp.o  && :
[3172/3408] : && DYLD_LIBRARY_PATH=/Users/buildslave/jenkins/workspace/clang-stage2-Rthinlto-release_70/host-compiler/lib/ "/Applications/Xcode.app/Contents/Developer/Toolchains/XcodeDefault.xctoolchain/usr/bin/libtool" -static -no_warning_for_no_symbols -o lib/libLLVMProfileData.a          lib/ProfileData/CMakeFiles/LLVMProfileData.dir/GCOV.cpp.o lib/ProfileData/CMakeFiles/LLVMProfileData.dir/InstrProf.cpp.o lib/ProfileData/CMakeFiles/LLVMProfileData.dir/InstrProfReader.cpp.o lib/ProfileData/CMakeFiles/LLVMProfileData.dir/InstrProfWriter.cpp.o lib/ProfileData/CMakeFiles/LLVMProfileData.dir/ProfileSummaryBuilder.cpp.o lib/ProfileData/CMakeFiles/LLVMProfileData.dir/SampleProf.cpp.o lib/ProfileData/CMakeFiles/LLVMProfileData.dir/SampleProfReader.cpp.o lib/ProfileData/CMakeFiles/LLVMProfileData.dir/SampleProfWriter.cpp.o  && :
[3173/3408] : && DYLD_LIBRARY_PATH=/Users/buildslave/jenkins/workspace/clang-stage2-Rthinlto-release_70/host-compiler/lib/ "/Applications/Xcode.app/Contents/Developer/Toolchains/XcodeDefault.xctoolchain/usr/bin/libtool" -static -no_warning_for_no_symbols -o lib/libLLVMCoverage.a          lib/ProfileData/Coverage/CMakeFiles/LLVMCoverage.dir/CoverageMapping.cpp.o lib/ProfileData/Coverage/CMakeFiles/LLVMCoverage.dir/CoverageMappingWriter.cpp.o lib/ProfileData/Coverage/CMakeFiles/LLVMCoverage.dir/CoverageMappingReader.cpp.o  && :
[3174/3408] : && DYLD_LIBRARY_PATH=/Users/buildslave/jenkins/workspace/clang-stage2-Rthinlto-release_70/host-compiler/lib/ "/Applications/Xcode.app/Contents/Developer/Toolchains/XcodeDefault.xctoolchain/usr/bin/libtool" -static -no_warning_for_no_symbols -o lib/libLLVMOrcJIT.a          lib/ExecutionEngine/Orc/CMakeFiles/LLVMOrcJIT.dir/CompileOnDemandLayer.cpp.o lib/ExecutionEngine/Orc/CMakeFiles/LLVMOrcJIT.dir/Core.cpp.o lib/ExecutionEngine/Orc/CMakeFiles/LLVMOrcJIT.dir/ExecutionUtils.cpp.o lib/ExecutionEngine/Orc/CMakeFiles/LLVMOrcJIT.dir/IndirectionUtils.cpp.o lib/ExecutionEngine/Orc/CMakeFiles/LLVMOrcJIT.dir/IRCompileLayer.cpp.o lib/ExecutionEngine/Orc/CMakeFiles/LLVMOrcJIT.dir/IRTransformLayer.cpp.o lib/ExecutionEngine/Orc/CMakeFiles/LLVMOrcJIT.dir/Legacy.cpp.o lib/ExecutionEngine/Orc/CMakeFiles/LLVMOrcJIT.dir/Layer.cpp.o lib/ExecutionEngine/Orc/CMakeFiles/LLVMOrcJIT.dir/LLJIT.cpp.o lib/ExecutionEngine/Orc/CMakeFiles/LLVMOrcJIT.dir/NullResolver.cpp.o lib/ExecutionEngine/Orc/CMakeFiles/LLVMOrcJIT.dir/ObjectTransformLayer.cpp.o lib/ExecutionEngine/Orc/CMakeFiles/LLVMOrcJIT.dir/OrcABISupport.cpp.o lib/ExecutionEngine/Orc/CMakeFiles/LLVMOrcJIT.dir/OrcCBindings.cpp.o lib/ExecutionEngine/Orc/CMakeFiles/LLVMOrcJIT.dir/OrcError.cpp.o lib/ExecutionEngine/Orc/CMakeFiles/LLVMOrcJIT.dir/OrcMCJITReplacement.cpp.o lib/ExecutionEngine/Orc/CMakeFiles/LLVMOrcJIT.dir/RPCUtils.cpp.o lib/ExecutionEngine/Orc/CMakeFiles/LLVMOrcJIT.dir/RTDyldObjectLinkingLayer.cpp.o  && :
[3175/3408] : && DYLD_LIBRARY_PATH=/Users/buildslave/jenkins/workspace/clang-stage2-Rthinlto-release_70/host-compiler/lib/ "/Applications/Xcode.app/Contents/Developer/Toolchains/XcodeDefault.xctoolchain/usr/bin/libtool" -static -no_warning_for_no_symbols -o lib/libLLVMPasses.a          lib/Passes/CMakeFiles/LLVMPasses.dir/PassBuilder.cpp.o lib/Passes/CMakeFiles/LLVMPasses.dir/PassPlugin.cpp.o  && :
[3176/3408] : && DYLD_LIBRARY_PATH=/Users/buildslave/jenkins/workspace/clang-stage2-Rthinlto-release_70/host-compiler/lib/ "/Applications/Xcode.app/Contents/Developer/Toolchains/XcodeDefault.xctoolchain/usr/bin/libtool" -static -no_warning_for_no_symbols -o lib/libLLVMDlltoolDriver.a          lib/ToolDrivers/llvm-dlltool/CMakeFiles/LLVMDlltoolDriver.dir/DlltoolDriver.cpp.o  && :
[3177/3408] : && DYLD_LIBRARY_PATH=/Users/buildslave/jenkins/workspace/clang-stage2-Rthinlto-release_70/host-compiler/lib/ "/Applications/Xcode.app/Contents/Developer/Toolchains/XcodeDefault.xctoolchain/usr/bin/libtool" -static -no_warning_for_no_symbols -o lib/libLLVMLibDriver.a          lib/ToolDrivers/llvm-lib/CMakeFiles/LLVMLibDriver.dir/LibDriver.cpp.o  && :
[3178/3408] : && DYLD_LIBRARY_PATH=/Users/buildslave/jenkins/workspace/clang-stage2-Rthinlto-release_70/host-compiler/lib/ "/Applications/Xcode.app/Contents/Developer/Toolchains/XcodeDefault.xctoolchain/usr/bin/libtool" -static -no_warning_for_no_symbols -o lib/libLLVMXRay.a          lib/XRay/CMakeFiles/LLVMXRay.dir/InstrumentationMap.cpp.o lib/XRay/CMakeFiles/LLVMXRay.dir/Trace.cpp.o  && :
[3179/3408] /Users/buildslave/jenkins/workspace/clang-stage2-Rthinlto-release_70/host-compiler/bin/clang++  -DGTEST_HAS_RTTI=0 -DGTEST_HAS_TR1_TUPLE=0 -DGTEST_LANG_CXX11=1 -D__STDC_CONSTANT_MACROS -D__STDC_FORMAT_MACROS -D__STDC_LIMIT_MACROS -Iunittests/IR -I/Users/buildslave/jenkins/workspace/clang-stage2-Rthinlto-release_70/llvm/unittests/IR -I/Applications/Xcode.app/Contents/Developer/Platforms/MacOSX.platform/Developer/SDKs/MacOSX10.14.sdk/usr/include/libxml2 -Iinclude -I/Users/buildslave/jenkins/workspace/clang-stage2-Rthinlto-release_70/llvm/include -I/Users/buildslave/jenkins/workspace/clang-stage2-Rthinlto-release_70/llvm/utils/unittest/googletest/include -I/Users/buildslave/jenkins/workspace/clang-stage2-Rthinlto-release_70/llvm/utils/unittest/googlemock/include -fno-stack-protector -fno-common -Wno-profile-instr-unprofiled -fPIC -fvisibility-inlines-hidden -Werror=date-time -Werror=unguarded-availability-new -std=c++11 -fmodules -fmodules-cache-path=/Users/buildslave/jenkins/workspace/clang-stage2-Rthinlto-release_70/clang-build/Build/module.cache -fcxx-modules -gmodules -Wall -Wextra -Wno-unused-parameter -Wwrite-strings -Wcast-qual -Wmissing-field-initializers -pedantic -Wno-long-long -Wcovered-switch-default -Wnon-virtual-dtor -Wdelete-non-virtual-dtor -Wstring-conversion -fdiagnostics-color -flto=thin -O2 -g -DNDEBUG -isysroot /Applications/Xcode.app/Contents/Developer/Platforms/MacOSX.platform/Developer/SDKs/MacOSX10.14.sdk    -Wno-variadic-macros -Wno-gnu-zero-variadic-macro-arguments -fno-exceptions -fno-rtti -MD -MT unittests/IR/CMakeFiles/IRTests.dir/DominatorTreeTest.cpp.o -MF unittests/IR/CMakeFiles/IRTests.dir/DominatorTreeTest.cpp.o.d -o unittests/IR/CMakeFiles/IRTests.dir/DominatorTreeTest.cpp.o -c /Users/buildslave/jenkins/workspace/clang-stage2-Rthinlto-release_70/llvm/unittests/IR/DominatorTreeTest.cpp
[3180/3408] /Users/buildslave/jenkins/workspace/clang-stage2-Rthinlto-release_70/host-compiler/bin/clang++  -DGTEST_HAS_RTTI=0 -DGTEST_HAS_TR1_TUPLE=0 -DGTEST_LANG_CXX11=1 -D__STDC_CONSTANT_MACROS -D__STDC_FORMAT_MACROS -D__STDC_LIMIT_MACROS -Iunittests/IR -I/Users/buildslave/jenkins/workspace/clang-stage2-Rthinlto-release_70/llvm/unittests/IR -I/Applications/Xcode.app/Contents/Developer/Platforms/MacOSX.platform/Developer/SDKs/MacOSX10.14.sdk/usr/include/libxml2 -Iinclude -I/Users/buildslave/jenkins/workspace/clang-stage2-Rthinlto-release_70/llvm/include -I/Users/buildslave/jenkins/workspace/clang-stage2-Rthinlto-release_70/llvm/utils/unittest/googletest/include -I/Users/buildslave/jenkins/workspace/clang-stage2-Rthinlto-release_70/llvm/utils/unittest/googlemock/include -fno-stack-protector -fno-common -Wno-profile-instr-unprofiled -fPIC -fvisibility-inlines-hidden -Werror=date-time -Werror=unguarded-availability-new -std=c++11 -fmodules -fmodules-cache-path=/Users/buildslave/jenkins/workspace/clang-stage2-Rthinlto-release_70/clang-build/Build/module.cache -fcxx-modules -gmodules -Wall -Wextra -Wno-unused-parameter -Wwrite-strings -Wcast-qual -Wmissing-field-initializers -pedantic -Wno-long-long -Wcovered-switch-default -Wnon-virtual-dtor -Wdelete-non-virtual-dtor -Wstring-conversion -fdiagnostics-color -flto=thin -O2 -g -DNDEBUG -isysroot /Applications/Xcode.app/Contents/Developer/Platforms/MacOSX.platform/Developer/SDKs/MacOSX10.14.sdk    -Wno-variadic-macros -Wno-gnu-zero-variadic-macro-arguments -fno-exceptions -fno-rtti -MD -MT unittests/IR/CMakeFiles/IRTests.dir/ValueMapTest.cpp.o -MF unittests/IR/CMakeFiles/IRTests.dir/ValueMapTest.cpp.o.d -o unittests/IR/CMakeFiles/IRTests.dir/ValueMapTest.cpp.o -c /Users/buildslave/jenkins/workspace/clang-stage2-Rthinlto-release_70/llvm/unittests/IR/ValueMapTest.cpp
[3181/3408] /Users/buildslave/jenkins/workspace/clang-stage2-Rthinlto-release_70/host-compiler/bin/clang++  -DGTEST_HAS_RTTI=0 -DGTEST_HAS_TR1_TUPLE=0 -DGTEST_LANG_CXX11=1 -DLLVM_ENABLE_PLUGINS -D__STDC_CONSTANT_MACROS -D__STDC_FORMAT_MACROS -D__STDC_LIMIT_MACROS -Iunittests/Passes -I/Users/buildslave/jenkins/workspace/clang-stage2-Rthinlto-release_70/llvm/unittests/Passes -I/Applications/Xcode.app/Contents/Developer/Platforms/MacOSX.platform/Developer/SDKs/MacOSX10.14.sdk/usr/include/libxml2 -Iinclude -I/Users/buildslave/jenkins/workspace/clang-stage2-Rthinlto-release_70/llvm/include -I/Users/buildslave/jenkins/workspace/clang-stage2-Rthinlto-release_70/llvm/utils/unittest/googletest/include -I/Users/buildslave/jenkins/workspace/clang-stage2-Rthinlto-release_70/llvm/utils/unittest/googlemock/include -fno-stack-protector -fno-common -Wno-profile-instr-unprofiled -fPIC -fvisibility-inlines-hidden -Werror=date-time -Werror=unguarded-availability-new -std=c++11 -fmodules -fmodules-cache-path=/Users/buildslave/jenkins/workspace/clang-stage2-Rthinlto-release_70/clang-build/Build/module.cache -fcxx-modules -gmodules -Wall -Wextra -Wno-unused-parameter -Wwrite-strings -Wcast-qual -Wmissing-field-initializers -pedantic -Wno-long-long -Wcovered-switch-default -Wnon-virtual-dtor -Wdelete-non-virtual-dtor -Wstring-conversion -fdiagnostics-color -flto=thin -O2 -g -DNDEBUG -isysroot /Applications/Xcode.app/Contents/Developer/Platforms/MacOSX.platform/Developer/SDKs/MacOSX10.14.sdk    -Wno-variadic-macros -Wno-gnu-zero-variadic-macro-arguments -fno-exceptions -fno-rtti -MD -MT unittests/Passes/CMakeFiles/PluginsTests.dir/PluginsTest.cpp.o -MF unittests/Passes/CMakeFiles/PluginsTests.dir/PluginsTest.cpp.o.d -o unittests/Passes/CMakeFiles/PluginsTests.dir/PluginsTest.cpp.o -c /Users/buildslave/jenkins/workspace/clang-stage2-Rthinlto-release_70/llvm/unittests/Passes/PluginsTest.cpp
[3182/3408] /Users/buildslave/jenkins/workspace/clang-stage2-Rthinlto-release_70/host-compiler/bin/clang++  -DGTEST_HAS_RTTI=0 -DGTEST_HAS_TR1_TUPLE=0 -DGTEST_LANG_CXX11=1 -D__STDC_CONSTANT_MACROS -D__STDC_FORMAT_MACROS -D__STDC_LIMIT_MACROS -Iunittests/Transforms/IPO -I/Users/buildslave/jenkins/workspace/clang-stage2-Rthinlto-release_70/llvm/unittests/Transforms/IPO -I/Applications/Xcode.app/Contents/Developer/Platforms/MacOSX.platform/Developer/SDKs/MacOSX10.14.sdk/usr/include/libxml2 -Iinclude -I/Users/buildslave/jenkins/workspace/clang-stage2-Rthinlto-release_70/llvm/include -I/Users/buildslave/jenkins/workspace/clang-stage2-Rthinlto-release_70/llvm/utils/unittest/googletest/include -I/Users/buildslave/jenkins/workspace/clang-stage2-Rthinlto-release_70/llvm/utils/unittest/googlemock/include -fno-stack-protector -fno-common -Wno-profile-instr-unprofiled -fPIC -fvisibility-inlines-hidden -Werror=date-time -Werror=unguarded-availability-new -std=c++11 -fmodules -fmodules-cache-path=/Users/buildslave/jenkins/workspace/clang-stage2-Rthinlto-release_70/clang-build/Build/module.cache -fcxx-modules -gmodules -Wall -Wextra -Wno-unused-parameter -Wwrite-strings -Wcast-qual -Wmissing-field-initializers -pedantic -Wno-long-long -Wcovered-switch-default -Wnon-virtual-dtor -Wdelete-non-virtual-dtor -Wstring-conversion -fdiagnostics-color -flto=thin -O2 -g -DNDEBUG -isysroot /Applications/Xcode.app/Contents/Developer/Platforms/MacOSX.platform/Developer/SDKs/MacOSX10.14.sdk    -Wno-variadic-macros -Wno-gnu-zero-variadic-macro-arguments -fno-exceptions -fno-rtti -MD -MT unittests/Transforms/IPO/CMakeFiles/IPOTests.dir/WholeProgramDevirt.cpp.o -MF unittests/Transforms/IPO/CMakeFiles/IPOTests.dir/WholeProgramDevirt.cpp.o.d -o unittests/Transforms/IPO/CMakeFiles/IPOTests.dir/WholeProgramDevirt.cpp.o -c /Users/buildslave/jenkins/workspace/clang-stage2-Rthinlto-release_70/llvm/unittests/Transforms/IPO/WholeProgramDevirt.cpp
[3183/3408] /Users/buildslave/jenkins/workspace/clang-stage2-Rthinlto-release_70/host-compiler/bin/clang++  -DGTEST_HAS_RTTI=0 -DGTEST_HAS_TR1_TUPLE=0 -DGTEST_LANG_CXX11=1 -DLLVM_ENABLE_PLUGINS -D__STDC_CONSTANT_MACROS -D__STDC_FORMAT_MACROS -D__STDC_LIMIT_MACROS -Iunittests/Passes -I/Users/buildslave/jenkins/workspace/clang-stage2-Rthinlto-release_70/llvm/unittests/Passes -I/Applications/Xcode.app/Contents/Developer/Platforms/MacOSX.platform/Developer/SDKs/MacOSX10.14.sdk/usr/include/libxml2 -Iinclude -I/Users/buildslave/jenkins/workspace/clang-stage2-Rthinlto-release_70/llvm/include -I/Users/buildslave/jenkins/workspace/clang-stage2-Rthinlto-release_70/llvm/utils/unittest/googletest/include -I/Users/buildslave/jenkins/workspace/clang-stage2-Rthinlto-release_70/llvm/utils/unittest/googlemock/include -fno-stack-protector -fno-common -Wno-profile-instr-unprofiled -fPIC -fvisibility-inlines-hidden -Werror=date-time -Werror=unguarded-availability-new -std=c++11 -fmodules -fmodules-cache-path=/Users/buildslave/jenkins/workspace/clang-stage2-Rthinlto-release_70/clang-build/Build/module.cache -fcxx-modules -gmodules -Wall -Wextra -Wno-unused-parameter -Wwrite-strings -Wcast-qual -Wmissing-field-initializers -pedantic -Wno-long-long -Wcovered-switch-default -Wnon-virtual-dtor -Wdelete-non-virtual-dtor -Wstring-conversion -fdiagnostics-color -flto=thin -O2 -g -DNDEBUG -isysroot /Applications/Xcode.app/Contents/Developer/Platforms/MacOSX.platform/Developer/SDKs/MacOSX10.14.sdk -fPIC    -fno-exceptions -fno-rtti -MD -MT unittests/Passes/CMakeFiles/TestPlugin.dir/TestPlugin.cpp.o -MF unittests/Passes/CMakeFiles/TestPlugin.dir/TestPlugin.cpp.o.d -o unittests/Passes/CMakeFiles/TestPlugin.dir/TestPlugin.cpp.o -c /Users/buildslave/jenkins/workspace/clang-stage2-Rthinlto-release_70/llvm/unittests/Passes/TestPlugin.cpp
[3184/3408] /Users/buildslave/jenkins/workspace/clang-stage2-Rthinlto-release_70/host-compiler/bin/clang++  -DGTEST_HAS_RTTI=0 -DGTEST_HAS_TR1_TUPLE=0 -DGTEST_LANG_CXX11=1 -D__STDC_CONSTANT_MACROS -D__STDC_FORMAT_MACROS -D__STDC_LIMIT_MACROS -Iunittests/Transforms/Utils -I/Users/buildslave/jenkins/workspace/clang-stage2-Rthinlto-release_70/llvm/unittests/Transforms/Utils -I/Applications/Xcode.app/Contents/Developer/Platforms/MacOSX.platform/Developer/SDKs/MacOSX10.14.sdk/usr/include/libxml2 -Iinclude -I/Users/buildslave/jenkins/workspace/clang-stage2-Rthinlto-release_70/llvm/include -I/Users/buildslave/jenkins/workspace/clang-stage2-Rthinlto-release_70/llvm/utils/unittest/googletest/include -I/Users/buildslave/jenkins/workspace/clang-stage2-Rthinlto-release_70/llvm/utils/unittest/googlemock/include -fno-stack-protector -fno-common -Wno-profile-instr-unprofiled -fPIC -fvisibility-inlines-hidden -Werror=date-time -Werror=unguarded-availability-new -std=c++11 -fmodules -fmodules-cache-path=/Users/buildslave/jenkins/workspace/clang-stage2-Rthinlto-release_70/clang-build/Build/module.cache -fcxx-modules -gmodules -Wall -Wextra -Wno-unused-parameter -Wwrite-strings -Wcast-qual -Wmissing-field-initializers -pedantic -Wno-long-long -Wcovered-switch-default -Wnon-virtual-dtor -Wdelete-non-virtual-dtor -Wstring-conversion -fdiagnostics-color -flto=thin -O2 -g -DNDEBUG -isysroot /Applications/Xcode.app/Contents/Developer/Platforms/MacOSX.platform/Developer/SDKs/MacOSX10.14.sdk    -Wno-variadic-macros -Wno-gnu-zero-variadic-macro-arguments -fno-exceptions -fno-rtti -MD -MT unittests/Transforms/Utils/CMakeFiles/UtilsTests.dir/BasicBlockUtils.cpp.o -MF unittests/Transforms/Utils/CMakeFiles/UtilsTests.dir/BasicBlockUtils.cpp.o.d -o unittests/Transforms/Utils/CMakeFiles/UtilsTests.dir/BasicBlockUtils.cpp.o -c /Users/buildslave/jenkins/workspace/clang-stage2-Rthinlto-release_70/llvm/unittests/Transforms/Utils/BasicBlockUtils.cpp
[3185/3408] /Users/buildslave/jenkins/workspace/clang-stage2-Rthinlto-release_70/host-compiler/bin/clang++  -DGTEST_HAS_RTTI=0 -DGTEST_HAS_TR1_TUPLE=0 -DGTEST_LANG_CXX11=1 -D__STDC_CONSTANT_MACROS -D__STDC_FORMAT_MACROS -D__STDC_LIMIT_MACROS -Iunittests/IR -I/Users/buildslave/jenkins/workspace/clang-stage2-Rthinlto-release_70/llvm/unittests/IR -I/Applications/Xcode.app/Contents/Developer/Platforms/MacOSX.platform/Developer/SDKs/MacOSX10.14.sdk/usr/include/libxml2 -Iinclude -I/Users/buildslave/jenkins/workspace/clang-stage2-Rthinlto-release_70/llvm/include -I/Users/buildslave/jenkins/workspace/clang-stage2-Rthinlto-release_70/llvm/utils/unittest/googletest/include -I/Users/buildslave/jenkins/workspace/clang-stage2-Rthinlto-release_70/llvm/utils/unittest/googlemock/include -fno-stack-protector -fno-common -Wno-profile-instr-unprofiled -fPIC -fvisibility-inlines-hidden -Werror=date-time -Werror=unguarded-availability-new -std=c++11 -fmodules -fmodules-cache-path=/Users/buildslave/jenkins/workspace/clang-stage2-Rthinlto-release_70/clang-build/Build/module.cache -fcxx-modules -gmodules -Wall -Wextra -Wno-unused-parameter -Wwrite-strings -Wcast-qual -Wmissing-field-initializers -pedantic -Wno-long-long -Wcovered-switch-default -Wnon-virtual-dtor -Wdelete-non-virtual-dtor -Wstring-conversion -fdiagnostics-color -flto=thin -O2 -g -DNDEBUG -isysroot /Applications/Xcode.app/Contents/Developer/Platforms/MacOSX.platform/Developer/SDKs/MacOSX10.14.sdk    -Wno-variadic-macros -Wno-gnu-zero-variadic-macro-arguments -fno-exceptions -fno-rtti -MD -MT unittests/IR/CMakeFiles/IRTests.dir/PassManagerTest.cpp.o -MF unittests/IR/CMakeFiles/IRTests.dir/PassManagerTest.cpp.o.d -o unittests/IR/CMakeFiles/IRTests.dir/PassManagerTest.cpp.o -c /Users/buildslave/jenkins/workspace/clang-stage2-Rthinlto-release_70/llvm/unittests/IR/PassManagerTest.cpp
[3186/3408] /Users/buildslave/jenkins/workspace/clang-stage2-Rthinlto-release_70/host-compiler/bin/clang++  -DGTEST_HAS_RTTI=0 -DGTEST_HAS_TR1_TUPLE=0 -DGTEST_LANG_CXX11=1 -D__STDC_CONSTANT_MACROS -D__STDC_FORMAT_MACROS -D__STDC_LIMIT_MACROS -Iunittests/Transforms/Utils -I/Users/buildslave/jenkins/workspace/clang-stage2-Rthinlto-release_70/llvm/unittests/Transforms/Utils -I/Applications/Xcode.app/Contents/Developer/Platforms/MacOSX.platform/Developer/SDKs/MacOSX10.14.sdk/usr/include/libxml2 -Iinclude -I/Users/buildslave/jenkins/workspace/clang-stage2-Rthinlto-release_70/llvm/include -I/Users/buildslave/jenkins/workspace/clang-stage2-Rthinlto-release_70/llvm/utils/unittest/googletest/include -I/Users/buildslave/jenkins/workspace/clang-stage2-Rthinlto-release_70/llvm/utils/unittest/googlemock/include -fno-stack-protector -fno-common -Wno-profile-instr-unprofiled -fPIC -fvisibility-inlines-hidden -Werror=date-time -Werror=unguarded-availability-new -std=c++11 -fmodules -fmodules-cache-path=/Users/buildslave/jenkins/workspace/clang-stage2-Rthinlto-release_70/clang-build/Build/module.cache -fcxx-modules -gmodules -Wall -Wextra -Wno-unused-parameter -Wwrite-strings -Wcast-qual -Wmissing-field-initializers -pedantic -Wno-long-long -Wcovered-switch-default -Wnon-virtual-dtor -Wdelete-non-virtual-dtor -Wstring-conversion -fdiagnostics-color -flto=thin -O2 -g -DNDEBUG -isysroot /Applications/Xcode.app/Contents/Developer/Platforms/MacOSX.platform/Developer/SDKs/MacOSX10.14.sdk    -Wno-variadic-macros -Wno-gnu-zero-variadic-macro-arguments -fno-exceptions -fno-rtti -MD -MT unittests/Transforms/Utils/CMakeFiles/UtilsTests.dir/CodeExtractor.cpp.o -MF unittests/Transforms/Utils/CMakeFiles/UtilsTests.dir/CodeExtractor.cpp.o.d -o unittests/Transforms/Utils/CMakeFiles/UtilsTests.dir/CodeExtractor.cpp.o -c /Users/buildslave/jenkins/workspace/clang-stage2-Rthinlto-release_70/llvm/unittests/Transforms/Utils/CodeExtractor.cpp
[3187/3408] /Users/buildslave/jenkins/workspace/clang-stage2-Rthinlto-release_70/host-compiler/bin/clang++  -DGTEST_HAS_RTTI=0 -DGTEST_HAS_TR1_TUPLE=0 -DGTEST_LANG_CXX11=1 -D__STDC_CONSTANT_MACROS -D__STDC_FORMAT_MACROS -D__STDC_LIMIT_MACROS -Iunittests/Transforms/Utils -I/Users/buildslave/jenkins/workspace/clang-stage2-Rthinlto-release_70/llvm/unittests/Transforms/Utils -I/Applications/Xcode.app/Contents/Developer/Platforms/MacOSX.platform/Developer/SDKs/MacOSX10.14.sdk/usr/include/libxml2 -Iinclude -I/Users/buildslave/jenkins/workspace/clang-stage2-Rthinlto-release_70/llvm/include -I/Users/buildslave/jenkins/workspace/clang-stage2-Rthinlto-release_70/llvm/utils/unittest/googletest/include -I/Users/buildslave/jenkins/workspace/clang-stage2-Rthinlto-release_70/llvm/utils/unittest/googlemock/include -fno-stack-protector -fno-common -Wno-profile-instr-unprofiled -fPIC -fvisibility-inlines-hidden -Werror=date-time -Werror=unguarded-availability-new -std=c++11 -fmodules -fmodules-cache-path=/Users/buildslave/jenkins/workspace/clang-stage2-Rthinlto-release_70/clang-build/Build/module.cache -fcxx-modules -gmodules -Wall -Wextra -Wno-unused-parameter -Wwrite-strings -Wcast-qual -Wmissing-field-initializers -pedantic -Wno-long-long -Wcovered-switch-default -Wnon-virtual-dtor -Wdelete-non-virtual-dtor -Wstring-conversion -fdiagnostics-color -flto=thin -O2 -g -DNDEBUG -isysroot /Applications/Xcode.app/Contents/Developer/Platforms/MacOSX.platform/Developer/SDKs/MacOSX10.14.sdk    -Wno-variadic-macros -Wno-gnu-zero-variadic-macro-arguments -fno-exceptions -fno-rtti -MD -MT unittests/Transforms/Utils/CMakeFiles/UtilsTests.dir/FunctionComparator.cpp.o -MF unittests/Transforms/Utils/CMakeFiles/UtilsTests.dir/FunctionComparator.cpp.o.d -o unittests/Transforms/Utils/CMakeFiles/UtilsTests.dir/FunctionComparator.cpp.o -c /Users/buildslave/jenkins/workspace/clang-stage2-Rthinlto-release_70/llvm/unittests/Transforms/Utils/FunctionComparator.cpp
[3188/3408] /Users/buildslave/jenkins/workspace/clang-stage2-Rthinlto-release_70/host-compiler/bin/clang++  -DGTEST_HAS_RTTI=0 -DGTEST_HAS_TR1_TUPLE=0 -DGTEST_LANG_CXX11=1 -D__STDC_CONSTANT_MACROS -D__STDC_FORMAT_MACROS -D__STDC_LIMIT_MACROS -Iunittests/Transforms/Utils -I/Users/buildslave/jenkins/workspace/clang-stage2-Rthinlto-release_70/llvm/unittests/Transforms/Utils -I/Applications/Xcode.app/Contents/Developer/Platforms/MacOSX.platform/Developer/SDKs/MacOSX10.14.sdk/usr/include/libxml2 -Iinclude -I/Users/buildslave/jenkins/workspace/clang-stage2-Rthinlto-release_70/llvm/include -I/Users/buildslave/jenkins/workspace/clang-stage2-Rthinlto-release_70/llvm/utils/unittest/googletest/include -I/Users/buildslave/jenkins/workspace/clang-stage2-Rthinlto-release_70/llvm/utils/unittest/googlemock/include -fno-stack-protector -fno-common -Wno-profile-instr-unprofiled -fPIC -fvisibility-inlines-hidden -Werror=date-time -Werror=unguarded-availability-new -std=c++11 -fmodules -fmodules-cache-path=/Users/buildslave/jenkins/workspace/clang-stage2-Rthinlto-release_70/clang-build/Build/module.cache -fcxx-modules -gmodules -Wall -Wextra -Wno-unused-parameter -Wwrite-strings -Wcast-qual -Wmissing-field-initializers -pedantic -Wno-long-long -Wcovered-switch-default -Wnon-virtual-dtor -Wdelete-non-virtual-dtor -Wstring-conversion -fdiagnostics-color -flto=thin -O2 -g -DNDEBUG -isysroot /Applications/Xcode.app/Contents/Developer/Platforms/MacOSX.platform/Developer/SDKs/MacOSX10.14.sdk    -Wno-variadic-macros -Wno-gnu-zero-variadic-macro-arguments -fno-exceptions -fno-rtti -MD -MT unittests/Transforms/Utils/CMakeFiles/UtilsTests.dir/ASanStackFrameLayoutTest.cpp.o -MF unittests/Transforms/Utils/CMakeFiles/UtilsTests.dir/ASanStackFrameLayoutTest.cpp.o.d -o unittests/Transforms/Utils/CMakeFiles/UtilsTests.dir/ASanStackFrameLayoutTest.cpp.o -c /Users/buildslave/jenkins/workspace/clang-stage2-Rthinlto-release_70/llvm/unittests/Transforms/Utils/ASanStackFrameLayoutTest.cpp
[3189/3408] /Users/buildslave/jenkins/workspace/clang-stage2-Rthinlto-release_70/host-compiler/bin/clang++  -DGTEST_HAS_RTTI=0 -DGTEST_HAS_TR1_TUPLE=0 -DGTEST_LANG_CXX11=1 -D__STDC_CONSTANT_MACROS -D__STDC_FORMAT_MACROS -D__STDC_LIMIT_MACROS -Iunittests/Transforms/Utils -I/Users/buildslave/jenkins/workspace/clang-stage2-Rthinlto-release_70/llvm/unittests/Transforms/Utils -I/Applications/Xcode.app/Contents/Developer/Platforms/MacOSX.platform/Developer/SDKs/MacOSX10.14.sdk/usr/include/libxml2 -Iinclude -I/Users/buildslave/jenkins/workspace/clang-stage2-Rthinlto-release_70/llvm/include -I/Users/buildslave/jenkins/workspace/clang-stage2-Rthinlto-release_70/llvm/utils/unittest/googletest/include -I/Users/buildslave/jenkins/workspace/clang-stage2-Rthinlto-release_70/llvm/utils/unittest/googlemock/include -fno-stack-protector -fno-common -Wno-profile-instr-unprofiled -fPIC -fvisibility-inlines-hidden -Werror=date-time -Werror=unguarded-availability-new -std=c++11 -fmodules -fmodules-cache-path=/Users/buildslave/jenkins/workspace/clang-stage2-Rthinlto-release_70/clang-build/Build/module.cache -fcxx-modules -gmodules -Wall -Wextra -Wno-unused-parameter -Wwrite-strings -Wcast-qual -Wmissing-field-initializers -pedantic -Wno-long-long -Wcovered-switch-default -Wnon-virtual-dtor -Wdelete-non-virtual-dtor -Wstring-conversion -fdiagnostics-color -flto=thin -O2 -g -DNDEBUG -isysroot /Applications/Xcode.app/Contents/Developer/Platforms/MacOSX.platform/Developer/SDKs/MacOSX10.14.sdk    -Wno-variadic-macros -Wno-gnu-zero-variadic-macro-arguments -fno-exceptions -fno-rtti -MD -MT unittests/Transforms/Utils/CMakeFiles/UtilsTests.dir/IntegerDivision.cpp.o -MF unittests/Transforms/Utils/CMakeFiles/UtilsTests.dir/IntegerDivision.cpp.o.d -o unittests/Transforms/Utils/CMakeFiles/UtilsTests.dir/IntegerDivision.cpp.o -c /Users/buildslave/jenkins/workspace/clang-stage2-Rthinlto-release_70/llvm/unittests/Transforms/Utils/IntegerDivision.cpp
[3190/3408] /Users/buildslave/jenkins/workspace/clang-stage2-Rthinlto-release_70/host-compiler/bin/clang++  -DGTEST_HAS_RTTI=0 -DGTEST_HAS_TR1_TUPLE=0 -DGTEST_LANG_CXX11=1 -D__STDC_CONSTANT_MACROS -D__STDC_FORMAT_MACROS -D__STDC_LIMIT_MACROS -Iunittests/Transforms/Utils -I/Users/buildslave/jenkins/workspace/clang-stage2-Rthinlto-release_70/llvm/unittests/Transforms/Utils -I/Applications/Xcode.app/Contents/Developer/Platforms/MacOSX.platform/Developer/SDKs/MacOSX10.14.sdk/usr/include/libxml2 -Iinclude -I/Users/buildslave/jenkins/workspace/clang-stage2-Rthinlto-release_70/llvm/include -I/Users/buildslave/jenkins/workspace/clang-stage2-Rthinlto-release_70/llvm/utils/unittest/googletest/include -I/Users/buildslave/jenkins/workspace/clang-stage2-Rthinlto-release_70/llvm/utils/unittest/googlemock/include -fno-stack-protector -fno-common -Wno-profile-instr-unprofiled -fPIC -fvisibility-inlines-hidden -Werror=date-time -Werror=unguarded-availability-new -std=c++11 -fmodules -fmodules-cache-path=/Users/buildslave/jenkins/workspace/clang-stage2-Rthinlto-release_70/clang-build/Build/module.cache -fcxx-modules -gmodules -Wall -Wextra -Wno-unused-parameter -Wwrite-strings -Wcast-qual -Wmissing-field-initializers -pedantic -Wno-long-long -Wcovered-switch-default -Wnon-virtual-dtor -Wdelete-non-virtual-dtor -Wstring-conversion -fdiagnostics-color -flto=thin -O2 -g -DNDEBUG -isysroot /Applications/Xcode.app/Contents/Developer/Platforms/MacOSX.platform/Developer/SDKs/MacOSX10.14.sdk    -Wno-variadic-macros -Wno-gnu-zero-variadic-macro-arguments -fno-exceptions -fno-rtti -MD -MT unittests/Transforms/Utils/CMakeFiles/UtilsTests.dir/OrderedInstructions.cpp.o -MF unittests/Transforms/Utils/CMakeFiles/UtilsTests.dir/OrderedInstructions.cpp.o.d -o unittests/Transforms/Utils/CMakeFiles/UtilsTests.dir/OrderedInstructions.cpp.o -c /Users/buildslave/jenkins/workspace/clang-stage2-Rthinlto-release_70/llvm/unittests/Transforms/Utils/OrderedInstructions.cpp
[3191/3408] /Users/buildslave/jenkins/workspace/clang-stage2-Rthinlto-release_70/host-compiler/bin/clang++  -DGTEST_HAS_RTTI=0 -DGTEST_HAS_TR1_TUPLE=0 -DGTEST_LANG_CXX11=1 -D__STDC_CONSTANT_MACROS -D__STDC_FORMAT_MACROS -D__STDC_LIMIT_MACROS -Iunittests/ProfileData -I/Users/buildslave/jenkins/workspace/clang-stage2-Rthinlto-release_70/llvm/unittests/ProfileData -I/Applications/Xcode.app/Contents/Developer/Platforms/MacOSX.platform/Developer/SDKs/MacOSX10.14.sdk/usr/include/libxml2 -Iinclude -I/Users/buildslave/jenkins/workspace/clang-stage2-Rthinlto-release_70/llvm/include -I/Users/buildslave/jenkins/workspace/clang-stage2-Rthinlto-release_70/llvm/utils/unittest/googletest/include -I/Users/buildslave/jenkins/workspace/clang-stage2-Rthinlto-release_70/llvm/utils/unittest/googlemock/include -fno-stack-protector -fno-common -Wno-profile-instr-unprofiled -fPIC -fvisibility-inlines-hidden -Werror=date-time -Werror=unguarded-availability-new -std=c++11 -fmodules -fmodules-cache-path=/Users/buildslave/jenkins/workspace/clang-stage2-Rthinlto-release_70/clang-build/Build/module.cache -fcxx-modules -gmodules -Wall -Wextra -Wno-unused-parameter -Wwrite-strings -Wcast-qual -Wmissing-field-initializers -pedantic -Wno-long-long -Wcovered-switch-default -Wnon-virtual-dtor -Wdelete-non-virtual-dtor -Wstring-conversion -fdiagnostics-color -flto=thin -O2 -g -DNDEBUG -isysroot /Applications/Xcode.app/Contents/Developer/Platforms/MacOSX.platform/Developer/SDKs/MacOSX10.14.sdk    -Wno-variadic-macros -Wno-gnu-zero-variadic-macro-arguments -fno-exceptions -fno-rtti -MD -MT unittests/ProfileData/CMakeFiles/ProfileDataTests.dir/InstrProfTest.cpp.o -MF unittests/ProfileData/CMakeFiles/ProfileDataTests.dir/InstrProfTest.cpp.o.d -o unittests/ProfileData/CMakeFiles/ProfileDataTests.dir/InstrProfTest.cpp.o -c /Users/buildslave/jenkins/workspace/clang-stage2-Rthinlto-release_70/llvm/unittests/ProfileData/InstrProfTest.cpp
[3192/3408] /Users/buildslave/jenkins/workspace/clang-stage2-Rthinlto-release_70/host-compiler/bin/clang++  -DGTEST_HAS_RTTI=0 -DGTEST_HAS_TR1_TUPLE=0 -DGTEST_LANG_CXX11=1 -D__STDC_CONSTANT_MACROS -D__STDC_FORMAT_MACROS -D__STDC_LIMIT_MACROS -Iunittests/Transforms/Utils -I/Users/buildslave/jenkins/workspace/clang-stage2-Rthinlto-release_70/llvm/unittests/Transforms/Utils -I/Applications/Xcode.app/Contents/Developer/Platforms/MacOSX.platform/Developer/SDKs/MacOSX10.14.sdk/usr/include/libxml2 -Iinclude -I/Users/buildslave/jenkins/workspace/clang-stage2-Rthinlto-release_70/llvm/include -I/Users/buildslave/jenkins/workspace/clang-stage2-Rthinlto-release_70/llvm/utils/unittest/googletest/include -I/Users/buildslave/jenkins/workspace/clang-stage2-Rthinlto-release_70/llvm/utils/unittest/googlemock/include -fno-stack-protector -fno-common -Wno-profile-instr-unprofiled -fPIC -fvisibility-inlines-hidden -Werror=date-time -Werror=unguarded-availability-new -std=c++11 -fmodules -fmodules-cache-path=/Users/buildslave/jenkins/workspace/clang-stage2-Rthinlto-release_70/clang-build/Build/module.cache -fcxx-modules -gmodules -Wall -Wextra -Wno-unused-parameter -Wwrite-strings -Wcast-qual -Wmissing-field-initializers -pedantic -Wno-long-long -Wcovered-switch-default -Wnon-virtual-dtor -Wdelete-non-virtual-dtor -Wstring-conversion -fdiagnostics-color -flto=thin -O2 -g -DNDEBUG -isysroot /Applications/Xcode.app/Contents/Developer/Platforms/MacOSX.platform/Developer/SDKs/MacOSX10.14.sdk    -Wno-variadic-macros -Wno-gnu-zero-variadic-macro-arguments -fno-exceptions -fno-rtti -MD -MT unittests/Transforms/Utils/CMakeFiles/UtilsTests.dir/SSAUpdaterBulk.cpp.o -MF unittests/Transforms/Utils/CMakeFiles/UtilsTests.dir/SSAUpdaterBulk.cpp.o.d -o unittests/Transforms/Utils/CMakeFiles/UtilsTests.dir/SSAUpdaterBulk.cpp.o -c /Users/buildslave/jenkins/workspace/clang-stage2-Rthinlto-release_70/llvm/unittests/Transforms/Utils/SSAUpdaterBulk.cpp
[3193/3408] /Users/buildslave/jenkins/workspace/clang-stage2-Rthinlto-release_70/host-compiler/bin/clang++  -DGTEST_HAS_RTTI=0 -DGTEST_HAS_TR1_TUPLE=0 -DGTEST_LANG_CXX11=1 -D__STDC_CONSTANT_MACROS -D__STDC_FORMAT_MACROS -D__STDC_LIMIT_MACROS -Iunittests/Transforms/Utils -I/Users/buildslave/jenkins/workspace/clang-stage2-Rthinlto-release_70/llvm/unittests/Transforms/Utils -I/Applications/Xcode.app/Contents/Developer/Platforms/MacOSX.platform/Developer/SDKs/MacOSX10.14.sdk/usr/include/libxml2 -Iinclude -I/Users/buildslave/jenkins/workspace/clang-stage2-Rthinlto-release_70/llvm/include -I/Users/buildslave/jenkins/workspace/clang-stage2-Rthinlto-release_70/llvm/utils/unittest/googletest/include -I/Users/buildslave/jenkins/workspace/clang-stage2-Rthinlto-release_70/llvm/utils/unittest/googlemock/include -fno-stack-protector -fno-common -Wno-profile-instr-unprofiled -fPIC -fvisibility-inlines-hidden -Werror=date-time -Werror=unguarded-availability-new -std=c++11 -fmodules -fmodules-cache-path=/Users/buildslave/jenkins/workspace/clang-stage2-Rthinlto-release_70/clang-build/Build/module.cache -fcxx-modules -gmodules -Wall -Wextra -Wno-unused-parameter -Wwrite-strings -Wcast-qual -Wmissing-field-initializers -pedantic -Wno-long-long -Wcovered-switch-default -Wnon-virtual-dtor -Wdelete-non-virtual-dtor -Wstring-conversion -fdiagnostics-color -flto=thin -O2 -g -DNDEBUG -isysroot /Applications/Xcode.app/Contents/Developer/Platforms/MacOSX.platform/Developer/SDKs/MacOSX10.14.sdk    -Wno-variadic-macros -Wno-gnu-zero-variadic-macro-arguments -fno-exceptions -fno-rtti -MD -MT unittests/Transforms/Utils/CMakeFiles/UtilsTests.dir/Cloning.cpp.o -MF unittests/Transforms/Utils/CMakeFiles/UtilsTests.dir/Cloning.cpp.o.d -o unittests/Transforms/Utils/CMakeFiles/UtilsTests.dir/Cloning.cpp.o -c /Users/buildslave/jenkins/workspace/clang-stage2-Rthinlto-release_70/llvm/unittests/Transforms/Utils/Cloning.cpp
[3194/3408] /Users/buildslave/jenkins/workspace/clang-stage2-Rthinlto-release_70/host-compiler/bin/clang++  -DGTEST_HAS_RTTI=0 -DGTEST_HAS_TR1_TUPLE=0 -DGTEST_LANG_CXX11=1 -D__STDC_CONSTANT_MACROS -D__STDC_FORMAT_MACROS -D__STDC_LIMIT_MACROS -Iunittests/Transforms/Utils -I/Users/buildslave/jenkins/workspace/clang-stage2-Rthinlto-release_70/llvm/unittests/Transforms/Utils -I/Applications/Xcode.app/Contents/Developer/Platforms/MacOSX.platform/Developer/SDKs/MacOSX10.14.sdk/usr/include/libxml2 -Iinclude -I/Users/buildslave/jenkins/workspace/clang-stage2-Rthinlto-release_70/llvm/include -I/Users/buildslave/jenkins/workspace/clang-stage2-Rthinlto-release_70/llvm/utils/unittest/googletest/include -I/Users/buildslave/jenkins/workspace/clang-stage2-Rthinlto-release_70/llvm/utils/unittest/googlemock/include -fno-stack-protector -fno-common -Wno-profile-instr-unprofiled -fPIC -fvisibility-inlines-hidden -Werror=date-time -Werror=unguarded-availability-new -std=c++11 -fmodules -fmodules-cache-path=/Users/buildslave/jenkins/workspace/clang-stage2-Rthinlto-release_70/clang-build/Build/module.cache -fcxx-modules -gmodules -Wall -Wextra -Wno-unused-parameter -Wwrite-strings -Wcast-qual -Wmissing-field-initializers -pedantic -Wno-long-long -Wcovered-switch-default -Wnon-virtual-dtor -Wdelete-non-virtual-dtor -Wstring-conversion -fdiagnostics-color -flto=thin -O2 -g -DNDEBUG -isysroot /Applications/Xcode.app/Contents/Developer/Platforms/MacOSX.platform/Developer/SDKs/MacOSX10.14.sdk    -Wno-variadic-macros -Wno-gnu-zero-variadic-macro-arguments -fno-exceptions -fno-rtti -MD -MT unittests/Transforms/Utils/CMakeFiles/UtilsTests.dir/Local.cpp.o -MF unittests/Transforms/Utils/CMakeFiles/UtilsTests.dir/Local.cpp.o.d -o unittests/Transforms/Utils/CMakeFiles/UtilsTests.dir/Local.cpp.o -c /Users/buildslave/jenkins/workspace/clang-stage2-Rthinlto-release_70/llvm/unittests/Transforms/Utils/Local.cpp
[3195/3408] /Users/buildslave/jenkins/workspace/clang-stage2-Rthinlto-release_70/host-compiler/bin/clang++  -DGTEST_HAS_RTTI=0 -DGTEST_HAS_TR1_TUPLE=0 -DGTEST_LANG_CXX11=1 -D__STDC_CONSTANT_MACROS -D__STDC_FORMAT_MACROS -D__STDC_LIMIT_MACROS -Iunittests/Transforms/Vectorize -I/Users/buildslave/jenkins/workspace/clang-stage2-Rthinlto-release_70/llvm/unittests/Transforms/Vectorize -I/Applications/Xcode.app/Contents/Developer/Platforms/MacOSX.platform/Developer/SDKs/MacOSX10.14.sdk/usr/include/libxml2 -Iinclude -I/Users/buildslave/jenkins/workspace/clang-stage2-Rthinlto-release_70/llvm/include -I/Users/buildslave/jenkins/workspace/clang-stage2-Rthinlto-release_70/llvm/utils/unittest/googletest/include -I/Users/buildslave/jenkins/workspace/clang-stage2-Rthinlto-release_70/llvm/utils/unittest/googlemock/include -fno-stack-protector -fno-common -Wno-profile-instr-unprofiled -fPIC -fvisibility-inlines-hidden -Werror=date-time -Werror=unguarded-availability-new -std=c++11 -fmodules -fmodules-cache-path=/Users/buildslave/jenkins/workspace/clang-stage2-Rthinlto-release_70/clang-build/Build/module.cache -fcxx-modules -gmodules -Wall -Wextra -Wno-unused-parameter -Wwrite-strings -Wcast-qual -Wmissing-field-initializers -pedantic -Wno-long-long -Wcovered-switch-default -Wnon-virtual-dtor -Wdelete-non-virtual-dtor -Wstring-conversion -fdiagnostics-color -flto=thin -O2 -g -DNDEBUG -isysroot /Applications/Xcode.app/Contents/Developer/Platforms/MacOSX.platform/Developer/SDKs/MacOSX10.14.sdk    -Wno-variadic-macros -Wno-gnu-zero-variadic-macro-arguments -fno-exceptions -fno-rtti -MD -MT unittests/Transforms/Vectorize/CMakeFiles/VectorizeTests.dir/VPlanTest.cpp.o -MF unittests/Transforms/Vectorize/CMakeFiles/VectorizeTests.dir/VPlanTest.cpp.o.d -o unittests/Transforms/Vectorize/CMakeFiles/VectorizeTests.dir/VPlanTest.cpp.o -c /Users/buildslave/jenkins/workspace/clang-stage2-Rthinlto-release_70/llvm/unittests/Transforms/Vectorize/VPlanTest.cpp
[3196/3408] /Users/buildslave/jenkins/workspace/clang-stage2-Rthinlto-release_70/host-compiler/bin/clang++  -DGTEST_HAS_RTTI=0 -DGTEST_HAS_TR1_TUPLE=0 -DGTEST_LANG_CXX11=1 -D__STDC_CONSTANT_MACROS -D__STDC_FORMAT_MACROS -D__STDC_LIMIT_MACROS -Iunittests/Transforms/Utils -I/Users/buildslave/jenkins/workspace/clang-stage2-Rthinlto-release_70/llvm/unittests/Transforms/Utils -I/Applications/Xcode.app/Contents/Developer/Platforms/MacOSX.platform/Developer/SDKs/MacOSX10.14.sdk/usr/include/libxml2 -Iinclude -I/Users/buildslave/jenkins/workspace/clang-stage2-Rthinlto-release_70/llvm/include -I/Users/buildslave/jenkins/workspace/clang-stage2-Rthinlto-release_70/llvm/utils/unittest/googletest/include -I/Users/buildslave/jenkins/workspace/clang-stage2-Rthinlto-release_70/llvm/utils/unittest/googlemock/include -fno-stack-protector -fno-common -Wno-profile-instr-unprofiled -fPIC -fvisibility-inlines-hidden -Werror=date-time -Werror=unguarded-availability-new -std=c++11 -fmodules -fmodules-cache-path=/Users/buildslave/jenkins/workspace/clang-stage2-Rthinlto-release_70/clang-build/Build/module.cache -fcxx-modules -gmodules -Wall -Wextra -Wno-unused-parameter -Wwrite-strings -Wcast-qual -Wmissing-field-initializers -pedantic -Wno-long-long -Wcovered-switch-default -Wnon-virtual-dtor -Wdelete-non-virtual-dtor -Wstring-conversion -fdiagnostics-color -flto=thin -O2 -g -DNDEBUG -isysroot /Applications/Xcode.app/Contents/Developer/Platforms/MacOSX.platform/Developer/SDKs/MacOSX10.14.sdk    -Wno-variadic-macros -Wno-gnu-zero-variadic-macro-arguments -fno-exceptions -fno-rtti -MD -MT unittests/Transforms/Utils/CMakeFiles/UtilsTests.dir/ValueMapperTest.cpp.o -MF unittests/Transforms/Utils/CMakeFiles/UtilsTests.dir/ValueMapperTest.cpp.o.d -o unittests/Transforms/Utils/CMakeFiles/UtilsTests.dir/ValueMapperTest.cpp.o -c /Users/buildslave/jenkins/workspace/clang-stage2-Rthinlto-release_70/llvm/unittests/Transforms/Utils/ValueMapperTest.cpp
[3197/3408] /Users/buildslave/jenkins/workspace/clang-stage2-Rthinlto-release_70/host-compiler/bin/clang++  -DGTEST_HAS_RTTI=0 -DGTEST_HAS_TR1_TUPLE=0 -DGTEST_LANG_CXX11=1 -D__STDC_CONSTANT_MACROS -D__STDC_FORMAT_MACROS -D__STDC_LIMIT_MACROS -Iunittests/ADT -I/Users/buildslave/jenkins/workspace/clang-stage2-Rthinlto-release_70/llvm/unittests/ADT -I/Applications/Xcode.app/Contents/Developer/Platforms/MacOSX.platform/Developer/SDKs/MacOSX10.14.sdk/usr/include/libxml2 -Iinclude -I/Users/buildslave/jenkins/workspace/clang-stage2-Rthinlto-release_70/llvm/include -I/Users/buildslave/jenkins/workspace/clang-stage2-Rthinlto-release_70/llvm/utils/unittest/googletest/include -I/Users/buildslave/jenkins/workspace/clang-stage2-Rthinlto-release_70/llvm/utils/unittest/googlemock/include -fno-stack-protector -fno-common -Wno-profile-instr-unprofiled -fPIC -fvisibility-inlines-hidden -Werror=date-time -Werror=unguarded-availability-new -std=c++11 -fmodules -fmodules-cache-path=/Users/buildslave/jenkins/workspace/clang-stage2-Rthinlto-release_70/clang-build/Build/module.cache -fcxx-modules -gmodules -Wall -Wextra -Wno-unused-parameter -Wwrite-strings -Wcast-qual -Wmissing-field-initializers -pedantic -Wno-long-long -Wcovered-switch-default -Wnon-virtual-dtor -Wdelete-non-virtual-dtor -Wstring-conversion -fdiagnostics-color -flto=thin -O2 -g -DNDEBUG -isysroot /Applications/Xcode.app/Contents/Developer/Platforms/MacOSX.platform/Developer/SDKs/MacOSX10.14.sdk    -Wno-variadic-macros -Wno-gnu-zero-variadic-macro-arguments -fno-exceptions -fno-rtti -MD -MT unittests/ADT/CMakeFiles/ADTTests.dir/BitVectorTest.cpp.o -MF unittests/ADT/CMakeFiles/ADTTests.dir/BitVectorTest.cpp.o.d -o unittests/ADT/CMakeFiles/ADTTests.dir/BitVectorTest.cpp.o -c /Users/buildslave/jenkins/workspace/clang-stage2-Rthinlto-release_70/llvm/unittests/ADT/BitVectorTest.cpp
[3198/3408] /Users/buildslave/jenkins/workspace/clang-stage2-Rthinlto-release_70/host-compiler/bin/clang++  -DGTEST_HAS_RTTI=0 -DGTEST_HAS_TR1_TUPLE=0 -DGTEST_LANG_CXX11=1 -D__STDC_CONSTANT_MACROS -D__STDC_FORMAT_MACROS -D__STDC_LIMIT_MACROS -Iunittests/Transforms/Vectorize -I/Users/buildslave/jenkins/workspace/clang-stage2-Rthinlto-release_70/llvm/unittests/Transforms/Vectorize -I/Applications/Xcode.app/Contents/Developer/Platforms/MacOSX.platform/Developer/SDKs/MacOSX10.14.sdk/usr/include/libxml2 -Iinclude -I/Users/buildslave/jenkins/workspace/clang-stage2-Rthinlto-release_70/llvm/include -I/Users/buildslave/jenkins/workspace/clang-stage2-Rthinlto-release_70/llvm/utils/unittest/googletest/include -I/Users/buildslave/jenkins/workspace/clang-stage2-Rthinlto-release_70/llvm/utils/unittest/googlemock/include -fno-stack-protector -fno-common -Wno-profile-instr-unprofiled -fPIC -fvisibility-inlines-hidden -Werror=date-time -Werror=unguarded-availability-new -std=c++11 -fmodules -fmodules-cache-path=/Users/buildslave/jenkins/workspace/clang-stage2-Rthinlto-release_70/clang-build/Build/module.cache -fcxx-modules -gmodules -Wall -Wextra -Wno-unused-parameter -Wwrite-strings -Wcast-qual -Wmissing-field-initializers -pedantic -Wno-long-long -Wcovered-switch-default -Wnon-virtual-dtor -Wdelete-non-virtual-dtor -Wstring-conversion -fdiagnostics-color -flto=thin -O2 -g -DNDEBUG -isysroot /Applications/Xcode.app/Contents/Developer/Platforms/MacOSX.platform/Developer/SDKs/MacOSX10.14.sdk    -Wno-variadic-macros -Wno-gnu-zero-variadic-macro-arguments -fno-exceptions -fno-rtti -MD -MT unittests/Transforms/Vectorize/CMakeFiles/VectorizeTests.dir/VPlanHCFGTest.cpp.o -MF unittests/Transforms/Vectorize/CMakeFiles/VectorizeTests.dir/VPlanHCFGTest.cpp.o.d -o unittests/Transforms/Vectorize/CMakeFiles/VectorizeTests.dir/VPlanHCFGTest.cpp.o -c /Users/buildslave/jenkins/workspace/clang-stage2-Rthinlto-release_70/llvm/unittests/Transforms/Vectorize/VPlanHCFGTest.cpp
[3199/3408] /Users/buildslave/jenkins/workspace/clang-stage2-Rthinlto-release_70/host-compiler/bin/clang++  -DGTEST_HAS_RTTI=0 -DGTEST_HAS_TR1_TUPLE=0 -DGTEST_LANG_CXX11=1 -D__STDC_CONSTANT_MACROS -D__STDC_FORMAT_MACROS -D__STDC_LIMIT_MACROS -Iunittests/Transforms/Vectorize -I/Users/buildslave/jenkins/workspace/clang-stage2-Rthinlto-release_70/llvm/unittests/Transforms/Vectorize -I/Applications/Xcode.app/Contents/Developer/Platforms/MacOSX.platform/Developer/SDKs/MacOSX10.14.sdk/usr/include/libxml2 -Iinclude -I/Users/buildslave/jenkins/workspace/clang-stage2-Rthinlto-release_70/llvm/include -I/Users/buildslave/jenkins/workspace/clang-stage2-Rthinlto-release_70/llvm/utils/unittest/googletest/include -I/Users/buildslave/jenkins/workspace/clang-stage2-Rthinlto-release_70/llvm/utils/unittest/googlemock/include -fno-stack-protector -fno-common -Wno-profile-instr-unprofiled -fPIC -fvisibility-inlines-hidden -Werror=date-time -Werror=unguarded-availability-new -std=c++11 -fmodules -fmodules-cache-path=/Users/buildslave/jenkins/workspace/clang-stage2-Rthinlto-release_70/clang-build/Build/module.cache -fcxx-modules -gmodules -Wall -Wextra -Wno-unused-parameter -Wwrite-strings -Wcast-qual -Wmissing-field-initializers -pedantic -Wno-long-long -Wcovered-switch-default -Wnon-virtual-dtor -Wdelete-non-virtual-dtor -Wstring-conversion -fdiagnostics-color -flto=thin -O2 -g -DNDEBUG -isysroot /Applications/Xcode.app/Contents/Developer/Platforms/MacOSX.platform/Developer/SDKs/MacOSX10.14.sdk    -Wno-variadic-macros -Wno-gnu-zero-variadic-macro-arguments -fno-exceptions -fno-rtti -MD -MT unittests/Transforms/Vectorize/CMakeFiles/VectorizeTests.dir/VPlanLoopInfoTest.cpp.o -MF unittests/Transforms/Vectorize/CMakeFiles/VectorizeTests.dir/VPlanLoopInfoTest.cpp.o.d -o unittests/Transforms/Vectorize/CMakeFiles/VectorizeTests.dir/VPlanLoopInfoTest.cpp.o -c /Users/buildslave/jenkins/workspace/clang-stage2-Rthinlto-release_70/llvm/unittests/Transforms/Vectorize/VPlanLoopInfoTest.cpp
[3200/3408] /Users/buildslave/jenkins/workspace/clang-stage2-Rthinlto-release_70/host-compiler/bin/clang++  -DGTEST_HAS_RTTI=0 -DGTEST_HAS_TR1_TUPLE=0 -DGTEST_LANG_CXX11=1 -D__STDC_CONSTANT_MACROS -D__STDC_FORMAT_MACROS -D__STDC_LIMIT_MACROS -Iunittests/Transforms/IPO -I/Users/buildslave/jenkins/workspace/clang-stage2-Rthinlto-release_70/llvm/unittests/Transforms/IPO -I/Applications/Xcode.app/Contents/Developer/Platforms/MacOSX.platform/Developer/SDKs/MacOSX10.14.sdk/usr/include/libxml2 -Iinclude -I/Users/buildslave/jenkins/workspace/clang-stage2-Rthinlto-release_70/llvm/include -I/Users/buildslave/jenkins/workspace/clang-stage2-Rthinlto-release_70/llvm/utils/unittest/googletest/include -I/Users/buildslave/jenkins/workspace/clang-stage2-Rthinlto-release_70/llvm/utils/unittest/googlemock/include -fno-stack-protector -fno-common -Wno-profile-instr-unprofiled -fPIC -fvisibility-inlines-hidden -Werror=date-time -Werror=unguarded-availability-new -std=c++11 -fmodules -fmodules-cache-path=/Users/buildslave/jenkins/workspace/clang-stage2-Rthinlto-release_70/clang-build/Build/module.cache -fcxx-modules -gmodules -Wall -Wextra -Wno-unused-parameter -Wwrite-strings -Wcast-qual -Wmissing-field-initializers -pedantic -Wno-long-long -Wcovered-switch-default -Wnon-virtual-dtor -Wdelete-non-virtual-dtor -Wstring-conversion -fdiagnostics-color -flto=thin -O2 -g -DNDEBUG -isysroot /Applications/Xcode.app/Contents/Developer/Platforms/MacOSX.platform/Developer/SDKs/MacOSX10.14.sdk    -Wno-variadic-macros -Wno-gnu-zero-variadic-macro-arguments -fno-exceptions -fno-rtti -MD -MT unittests/Transforms/IPO/CMakeFiles/IPOTests.dir/LowerTypeTests.cpp.o -MF unittests/Transforms/IPO/CMakeFiles/IPOTests.dir/LowerTypeTests.cpp.o.d -o unittests/Transforms/IPO/CMakeFiles/IPOTests.dir/LowerTypeTests.cpp.o -c /Users/buildslave/jenkins/workspace/clang-stage2-Rthinlto-release_70/llvm/unittests/Transforms/IPO/LowerTypeTests.cpp
[3201/3408] /Users/buildslave/jenkins/workspace/clang-stage2-Rthinlto-release_70/host-compiler/bin/clang++  -DGTEST_HAS_RTTI=0 -DGTEST_HAS_TR1_TUPLE=0 -DGTEST_LANG_CXX11=1 -D__STDC_CONSTANT_MACROS -D__STDC_FORMAT_MACROS -D__STDC_LIMIT_MACROS -Iunittests/tools/llvm-exegesis -I/Users/buildslave/jenkins/workspace/clang-stage2-Rthinlto-release_70/llvm/unittests/tools/llvm-exegesis -I/Applications/Xcode.app/Contents/Developer/Platforms/MacOSX.platform/Developer/SDKs/MacOSX10.14.sdk/usr/include/libxml2 -Iinclude -I/Users/buildslave/jenkins/workspace/clang-stage2-Rthinlto-release_70/llvm/include -I/Users/buildslave/jenkins/workspace/clang-stage2-Rthinlto-release_70/llvm/tools/llvm-exegesis/lib -I/Users/buildslave/jenkins/workspace/clang-stage2-Rthinlto-release_70/llvm/utils/unittest/googletest/include -I/Users/buildslave/jenkins/workspace/clang-stage2-Rthinlto-release_70/llvm/utils/unittest/googlemock/include -fno-stack-protector -fno-common -Wno-profile-instr-unprofiled -fPIC -fvisibility-inlines-hidden -Werror=date-time -Werror=unguarded-availability-new -std=c++11 -fmodules -fmodules-cache-path=/Users/buildslave/jenkins/workspace/clang-stage2-Rthinlto-release_70/clang-build/Build/module.cache -fcxx-modules -gmodules -Wall -Wextra -Wno-unused-parameter -Wwrite-strings -Wcast-qual -Wmissing-field-initializers -pedantic -Wno-long-long -Wcovered-switch-default -Wnon-virtual-dtor -Wdelete-non-virtual-dtor -Wstring-conversion -fdiagnostics-color -flto=thin -O2 -g -DNDEBUG -isysroot /Applications/Xcode.app/Contents/Developer/Platforms/MacOSX.platform/Developer/SDKs/MacOSX10.14.sdk    -Wno-variadic-macros -Wno-gnu-zero-variadic-macro-arguments -fno-exceptions -fno-rtti -MD -MT unittests/tools/llvm-exegesis/CMakeFiles/LLVMExegesisTests.dir/PerfHelperTest.cpp.o -MF unittests/tools/llvm-exegesis/CMakeFiles/LLVMExegesisTests.dir/PerfHelperTest.cpp.o.d -o unittests/tools/llvm-exegesis/CMakeFiles/LLVMExegesisTests.dir/PerfHelperTest.cpp.o -c /Users/buildslave/jenkins/workspace/clang-stage2-Rthinlto-release_70/llvm/unittests/tools/llvm-exegesis/PerfHelperTest.cpp
[3202/3408] /Users/buildslave/jenkins/workspace/clang-stage2-Rthinlto-release_70/host-compiler/bin/clang++  -DGTEST_HAS_RTTI=0 -DGTEST_HAS_TR1_TUPLE=0 -DGTEST_LANG_CXX11=1 -D__STDC_CONSTANT_MACROS -D__STDC_FORMAT_MACROS -D__STDC_LIMIT_MACROS -Iunittests/tools/llvm-exegesis -I/Users/buildslave/jenkins/workspace/clang-stage2-Rthinlto-release_70/llvm/unittests/tools/llvm-exegesis -I/Applications/Xcode.app/Contents/Developer/Platforms/MacOSX.platform/Developer/SDKs/MacOSX10.14.sdk/usr/include/libxml2 -Iinclude -I/Users/buildslave/jenkins/workspace/clang-stage2-Rthinlto-release_70/llvm/include -I/Users/buildslave/jenkins/workspace/clang-stage2-Rthinlto-release_70/llvm/tools/llvm-exegesis/lib -I/Users/buildslave/jenkins/workspace/clang-stage2-Rthinlto-release_70/llvm/utils/unittest/googletest/include -I/Users/buildslave/jenkins/workspace/clang-stage2-Rthinlto-release_70/llvm/utils/unittest/googlemock/include -fno-stack-protector -fno-common -Wno-profile-instr-unprofiled -fPIC -fvisibility-inlines-hidden -Werror=date-time -Werror=unguarded-availability-new -std=c++11 -fmodules -fmodules-cache-path=/Users/buildslave/jenkins/workspace/clang-stage2-Rthinlto-release_70/clang-build/Build/module.cache -fcxx-modules -gmodules -Wall -Wextra -Wno-unused-parameter -Wwrite-strings -Wcast-qual -Wmissing-field-initializers -pedantic -Wno-long-long -Wcovered-switch-default -Wnon-virtual-dtor -Wdelete-non-virtual-dtor -Wstring-conversion -fdiagnostics-color -flto=thin -O2 -g -DNDEBUG -isysroot /Applications/Xcode.app/Contents/Developer/Platforms/MacOSX.platform/Developer/SDKs/MacOSX10.14.sdk    -Wno-variadic-macros -Wno-gnu-zero-variadic-macro-arguments -fno-exceptions -fno-rtti -MD -MT unittests/tools/llvm-exegesis/CMakeFiles/LLVMExegesisTests.dir/BenchmarkResultTest.cpp.o -MF unittests/tools/llvm-exegesis/CMakeFiles/LLVMExegesisTests.dir/BenchmarkResultTest.cpp.o.d -o unittests/tools/llvm-exegesis/CMakeFiles/LLVMExegesisTests.dir/BenchmarkResultTest.cpp.o -c /Users/buildslave/jenkins/workspace/clang-stage2-Rthinlto-release_70/llvm/unittests/tools/llvm-exegesis/BenchmarkResultTest.cpp
[3203/3408] /Users/buildslave/jenkins/workspace/clang-stage2-Rthinlto-release_70/host-compiler/bin/clang++  -DGTEST_HAS_RTTI=0 -DGTEST_HAS_TR1_TUPLE=0 -DGTEST_LANG_CXX11=1 -D__STDC_CONSTANT_MACROS -D__STDC_FORMAT_MACROS -D__STDC_LIMIT_MACROS -Iunittests/tools/llvm-exegesis -I/Users/buildslave/jenkins/workspace/clang-stage2-Rthinlto-release_70/llvm/unittests/tools/llvm-exegesis -I/Applications/Xcode.app/Contents/Developer/Platforms/MacOSX.platform/Developer/SDKs/MacOSX10.14.sdk/usr/include/libxml2 -Iinclude -I/Users/buildslave/jenkins/workspace/clang-stage2-Rthinlto-release_70/llvm/include -I/Users/buildslave/jenkins/workspace/clang-stage2-Rthinlto-release_70/llvm/tools/llvm-exegesis/lib -I/Users/buildslave/jenkins/workspace/clang-stage2-Rthinlto-release_70/llvm/utils/unittest/googletest/include -I/Users/buildslave/jenkins/workspace/clang-stage2-Rthinlto-release_70/llvm/utils/unittest/googlemock/include -fno-stack-protector -fno-common -Wno-profile-instr-unprofiled -fPIC -fvisibility-inlines-hidden -Werror=date-time -Werror=unguarded-availability-new -std=c++11 -fmodules -fmodules-cache-path=/Users/buildslave/jenkins/workspace/clang-stage2-Rthinlto-release_70/clang-build/Build/module.cache -fcxx-modules -gmodules -Wall -Wextra -Wno-unused-parameter -Wwrite-strings -Wcast-qual -Wmissing-field-initializers -pedantic -Wno-long-long -Wcovered-switch-default -Wnon-virtual-dtor -Wdelete-non-virtual-dtor -Wstring-conversion -fdiagnostics-color -flto=thin -O2 -g -DNDEBUG -isysroot /Applications/Xcode.app/Contents/Developer/Platforms/MacOSX.platform/Developer/SDKs/MacOSX10.14.sdk    -Wno-variadic-macros -Wno-gnu-zero-variadic-macro-arguments -fno-exceptions -fno-rtti -MD -MT unittests/tools/llvm-exegesis/CMakeFiles/LLVMExegesisTests.dir/ClusteringTest.cpp.o -MF unittests/tools/llvm-exegesis/CMakeFiles/LLVMExegesisTests.dir/ClusteringTest.cpp.o.d -o unittests/tools/llvm-exegesis/CMakeFiles/LLVMExegesisTests.dir/ClusteringTest.cpp.o -c /Users/buildslave/jenkins/workspace/clang-stage2-Rthinlto-release_70/llvm/unittests/tools/llvm-exegesis/ClusteringTest.cpp
[3204/3408] /Users/buildslave/jenkins/workspace/clang-stage2-Rthinlto-release_70/host-compiler/bin/clang++  -DGTEST_HAS_RTTI=0 -DGTEST_HAS_TR1_TUPLE=0 -DGTEST_LANG_CXX11=1 -D__STDC_CONSTANT_MACROS -D__STDC_FORMAT_MACROS -D__STDC_LIMIT_MACROS -Iunittests/tools/llvm-exegesis/X86 -I/Users/buildslave/jenkins/workspace/clang-stage2-Rthinlto-release_70/llvm/unittests/tools/llvm-exegesis/X86 -I/Applications/Xcode.app/Contents/Developer/Platforms/MacOSX.platform/Developer/SDKs/MacOSX10.14.sdk/usr/include/libxml2 -Iinclude -I/Users/buildslave/jenkins/workspace/clang-stage2-Rthinlto-release_70/llvm/include -I/Users/buildslave/jenkins/workspace/clang-stage2-Rthinlto-release_70/llvm/tools/llvm-exegesis/lib -I/Users/buildslave/jenkins/workspace/clang-stage2-Rthinlto-release_70/llvm/utils/unittest/googletest/include -I/Users/buildslave/jenkins/workspace/clang-stage2-Rthinlto-release_70/llvm/utils/unittest/googlemock/include -I/Users/buildslave/jenkins/workspace/clang-stage2-Rthinlto-release_70/llvm/lib/Target/X86 -Ilib/Target/X86 -fno-stack-protector -fno-common -Wno-profile-instr-unprofiled -fPIC -fvisibility-inlines-hidden -Werror=date-time -Werror=unguarded-availability-new -std=c++11 -fmodules -fmodules-cache-path=/Users/buildslave/jenkins/workspace/clang-stage2-Rthinlto-release_70/clang-build/Build/module.cache -fcxx-modules -gmodules -Wall -Wextra -Wno-unused-parameter -Wwrite-strings -Wcast-qual -Wmissing-field-initializers -pedantic -Wno-long-long -Wcovered-switch-default -Wnon-virtual-dtor -Wdelete-non-virtual-dtor -Wstring-conversion -fdiagnostics-color -flto=thin -O2 -g -DNDEBUG -isysroot /Applications/Xcode.app/Contents/Developer/Platforms/MacOSX.platform/Developer/SDKs/MacOSX10.14.sdk    -Wno-variadic-macros -Wno-gnu-zero-variadic-macro-arguments -fno-exceptions -fno-rtti -MD -MT unittests/tools/llvm-exegesis/X86/CMakeFiles/LLVMExegesisX86Tests.dir/AssemblerTest.cpp.o -MF unittests/tools/llvm-exegesis/X86/CMakeFiles/LLVMExegesisX86Tests.dir/AssemblerTest.cpp.o.d -o unittests/tools/llvm-exegesis/X86/CMakeFiles/LLVMExegesisX86Tests.dir/AssemblerTest.cpp.o -c /Users/buildslave/jenkins/workspace/clang-stage2-Rthinlto-release_70/llvm/unittests/tools/llvm-exegesis/X86/AssemblerTest.cpp
[3205/3408] /Users/buildslave/jenkins/workspace/clang-stage2-Rthinlto-release_70/host-compiler/bin/clang++  -DGTEST_HAS_RTTI=0 -DGTEST_HAS_TR1_TUPLE=0 -DGTEST_LANG_CXX11=1 -D__STDC_CONSTANT_MACROS -D__STDC_FORMAT_MACROS -D__STDC_LIMIT_MACROS -Iunittests/Transforms/Vectorize -I/Users/buildslave/jenkins/workspace/clang-stage2-Rthinlto-release_70/llvm/unittests/Transforms/Vectorize -I/Applications/Xcode.app/Contents/Developer/Platforms/MacOSX.platform/Developer/SDKs/MacOSX10.14.sdk/usr/include/libxml2 -Iinclude -I/Users/buildslave/jenkins/workspace/clang-stage2-Rthinlto-release_70/llvm/include -I/Users/buildslave/jenkins/workspace/clang-stage2-Rthinlto-release_70/llvm/utils/unittest/googletest/include -I/Users/buildslave/jenkins/workspace/clang-stage2-Rthinlto-release_70/llvm/utils/unittest/googlemock/include -fno-stack-protector -fno-common -Wno-profile-instr-unprofiled -fPIC -fvisibility-inlines-hidden -Werror=date-time -Werror=unguarded-availability-new -std=c++11 -fmodules -fmodules-cache-path=/Users/buildslave/jenkins/workspace/clang-stage2-Rthinlto-release_70/clang-build/Build/module.cache -fcxx-modules -gmodules -Wall -Wextra -Wno-unused-parameter -Wwrite-strings -Wcast-qual -Wmissing-field-initializers -pedantic -Wno-long-long -Wcovered-switch-default -Wnon-virtual-dtor -Wdelete-non-virtual-dtor -Wstring-conversion -fdiagnostics-color -flto=thin -O2 -g -DNDEBUG -isysroot /Applications/Xcode.app/Contents/Developer/Platforms/MacOSX.platform/Developer/SDKs/MacOSX10.14.sdk    -Wno-variadic-macros -Wno-gnu-zero-variadic-macro-arguments -fno-exceptions -fno-rtti -MD -MT unittests/Transforms/Vectorize/CMakeFiles/VectorizeTests.dir/VPlanDominatorTreeTest.cpp.o -MF unittests/Transforms/Vectorize/CMakeFiles/VectorizeTests.dir/VPlanDominatorTreeTest.cpp.o.d -o unittests/Transforms/Vectorize/CMakeFiles/VectorizeTests.dir/VPlanDominatorTreeTest.cpp.o -c /Users/buildslave/jenkins/workspace/clang-stage2-Rthinlto-release_70/llvm/unittests/Transforms/Vectorize/VPlanDominatorTreeTest.cpp
[3206/3408] /Users/buildslave/jenkins/workspace/clang-stage2-Rthinlto-release_70/host-compiler/bin/clang++  -DGTEST_HAS_RTTI=0 -DGTEST_HAS_TR1_TUPLE=0 -DGTEST_LANG_CXX11=1 -D__STDC_CONSTANT_MACROS -D__STDC_FORMAT_MACROS -D__STDC_LIMIT_MACROS -Iunittests/tools/llvm-cfi-verify -I/Users/buildslave/jenkins/workspace/clang-stage2-Rthinlto-release_70/llvm/unittests/tools/llvm-cfi-verify -I/Applications/Xcode.app/Contents/Developer/Platforms/MacOSX.platform/Developer/SDKs/MacOSX10.14.sdk/usr/include/libxml2 -Iinclude -I/Users/buildslave/jenkins/workspace/clang-stage2-Rthinlto-release_70/llvm/include -I/Users/buildslave/jenkins/workspace/clang-stage2-Rthinlto-release_70/llvm/utils/unittest/googletest/include -I/Users/buildslave/jenkins/workspace/clang-stage2-Rthinlto-release_70/llvm/utils/unittest/googlemock/include -fno-stack-protector -fno-common -Wno-profile-instr-unprofiled -fPIC -fvisibility-inlines-hidden -Werror=date-time -Werror=unguarded-availability-new -std=c++11 -fmodules -fmodules-cache-path=/Users/buildslave/jenkins/workspace/clang-stage2-Rthinlto-release_70/clang-build/Build/module.cache -fcxx-modules -gmodules -Wall -Wextra -Wno-unused-parameter -Wwrite-strings -Wcast-qual -Wmissing-field-initializers -pedantic -Wno-long-long -Wcovered-switch-default -Wnon-virtual-dtor -Wdelete-non-virtual-dtor -Wstring-conversion -fdiagnostics-color -flto=thin -O2 -g -DNDEBUG -isysroot /Applications/Xcode.app/Contents/Developer/Platforms/MacOSX.platform/Developer/SDKs/MacOSX10.14.sdk    -Wno-variadic-macros -Wno-gnu-zero-variadic-macro-arguments -fno-exceptions -fno-rtti -MD -MT unittests/tools/llvm-cfi-verify/CMakeFiles/CFIVerifyTests.dir/FileAnalysis.cpp.o -MF unittests/tools/llvm-cfi-verify/CMakeFiles/CFIVerifyTests.dir/FileAnalysis.cpp.o.d -o unittests/tools/llvm-cfi-verify/CMakeFiles/CFIVerifyTests.dir/FileAnalysis.cpp.o -c /Users/buildslave/jenkins/workspace/clang-stage2-Rthinlto-release_70/llvm/unittests/tools/llvm-cfi-verify/FileAnalysis.cpp
[3207/3408] /Users/buildslave/jenkins/workspace/clang-stage2-Rthinlto-release_70/host-compiler/bin/clang++  -DGTEST_HAS_RTTI=0 -DGTEST_HAS_TR1_TUPLE=0 -DGTEST_LANG_CXX11=1 -D__STDC_CONSTANT_MACROS -D__STDC_FORMAT_MACROS -D__STDC_LIMIT_MACROS -Iunittests/tools/llvm-exegesis/X86 -I/Users/buildslave/jenkins/workspace/clang-stage2-Rthinlto-release_70/llvm/unittests/tools/llvm-exegesis/X86 -I/Applications/Xcode.app/Contents/Developer/Platforms/MacOSX.platform/Developer/SDKs/MacOSX10.14.sdk/usr/include/libxml2 -Iinclude -I/Users/buildslave/jenkins/workspace/clang-stage2-Rthinlto-release_70/llvm/include -I/Users/buildslave/jenkins/workspace/clang-stage2-Rthinlto-release_70/llvm/tools/llvm-exegesis/lib -I/Users/buildslave/jenkins/workspace/clang-stage2-Rthinlto-release_70/llvm/utils/unittest/googletest/include -I/Users/buildslave/jenkins/workspace/clang-stage2-Rthinlto-release_70/llvm/utils/unittest/googlemock/include -I/Users/buildslave/jenkins/workspace/clang-stage2-Rthinlto-release_70/llvm/lib/Target/X86 -Ilib/Target/X86 -fno-stack-protector -fno-common -Wno-profile-instr-unprofiled -fPIC -fvisibility-inlines-hidden -Werror=date-time -Werror=unguarded-availability-new -std=c++11 -fmodules -fmodules-cache-path=/Users/buildslave/jenkins/workspace/clang-stage2-Rthinlto-release_70/clang-build/Build/module.cache -fcxx-modules -gmodules -Wall -Wextra -Wno-unused-parameter -Wwrite-strings -Wcast-qual -Wmissing-field-initializers -pedantic -Wno-long-long -Wcovered-switch-default -Wnon-virtual-dtor -Wdelete-non-virtual-dtor -Wstring-conversion -fdiagnostics-color -flto=thin -O2 -g -DNDEBUG -isysroot /Applications/Xcode.app/Contents/Developer/Platforms/MacOSX.platform/Developer/SDKs/MacOSX10.14.sdk    -Wno-variadic-macros -Wno-gnu-zero-variadic-macro-arguments -fno-exceptions -fno-rtti -MD -MT unittests/tools/llvm-exegesis/X86/CMakeFiles/LLVMExegesisX86Tests.dir/AnalysisTest.cpp.o -MF unittests/tools/llvm-exegesis/X86/CMakeFiles/LLVMExegesisX86Tests.dir/AnalysisTest.cpp.o.d -o unittests/tools/llvm-exegesis/X86/CMakeFiles/LLVMExegesisX86Tests.dir/AnalysisTest.cpp.o -c /Users/buildslave/jenkins/workspace/clang-stage2-Rthinlto-release_70/llvm/unittests/tools/llvm-exegesis/X86/AnalysisTest.cpp
[3208/3408] /Users/buildslave/jenkins/workspace/clang-stage2-Rthinlto-release_70/host-compiler/bin/clang++  -DGTEST_HAS_RTTI=0 -DGTEST_HAS_TR1_TUPLE=0 -DGTEST_LANG_CXX11=1 -D__STDC_CONSTANT_MACROS -D__STDC_FORMAT_MACROS -D__STDC_LIMIT_MACROS -Iunittests/tools/llvm-exegesis/AArch64 -I/Users/buildslave/jenkins/workspace/clang-stage2-Rthinlto-release_70/llvm/unittests/tools/llvm-exegesis/AArch64 -I/Applications/Xcode.app/Contents/Developer/Platforms/MacOSX.platform/Developer/SDKs/MacOSX10.14.sdk/usr/include/libxml2 -Iinclude -I/Users/buildslave/jenkins/workspace/clang-stage2-Rthinlto-release_70/llvm/include -I/Users/buildslave/jenkins/workspace/clang-stage2-Rthinlto-release_70/llvm/tools/llvm-exegesis/lib -I/Users/buildslave/jenkins/workspace/clang-stage2-Rthinlto-release_70/llvm/utils/unittest/googletest/include -I/Users/buildslave/jenkins/workspace/clang-stage2-Rthinlto-release_70/llvm/utils/unittest/googlemock/include -I/Users/buildslave/jenkins/workspace/clang-stage2-Rthinlto-release_70/llvm/lib/Target/AArch64 -Ilib/Target/AArch64 -fno-stack-protector -fno-common -Wno-profile-instr-unprofiled -fPIC -fvisibility-inlines-hidden -Werror=date-time -Werror=unguarded-availability-new -std=c++11 -fmodules -fmodules-cache-path=/Users/buildslave/jenkins/workspace/clang-stage2-Rthinlto-release_70/clang-build/Build/module.cache -fcxx-modules -gmodules -Wall -Wextra -Wno-unused-parameter -Wwrite-strings -Wcast-qual -Wmissing-field-initializers -pedantic -Wno-long-long -Wcovered-switch-default -Wnon-virtual-dtor -Wdelete-non-virtual-dtor -Wstring-conversion -fdiagnostics-color -flto=thin -O2 -g -DNDEBUG -isysroot /Applications/Xcode.app/Contents/Developer/Platforms/MacOSX.platform/Developer/SDKs/MacOSX10.14.sdk    -Wno-variadic-macros -Wno-gnu-zero-variadic-macro-arguments -fno-exceptions -fno-rtti -MD -MT unittests/tools/llvm-exegesis/AArch64/CMakeFiles/LLVMExegesisAArch64Tests.dir/TargetTest.cpp.o -MF unittests/tools/llvm-exegesis/AArch64/CMakeFiles/LLVMExegesisAArch64Tests.dir/TargetTest.cpp.o.d -o unittests/tools/llvm-exegesis/AArch64/CMakeFiles/LLVMExegesisAArch64Tests.dir/TargetTest.cpp.o -c /Users/buildslave/jenkins/workspace/clang-stage2-Rthinlto-release_70/llvm/unittests/tools/llvm-exegesis/AArch64/TargetTest.cpp
[3209/3408] /Users/buildslave/jenkins/workspace/clang-stage2-Rthinlto-release_70/host-compiler/bin/clang++  -DGTEST_HAS_RTTI=0 -DGTEST_HAS_TR1_TUPLE=0 -DGTEST_LANG_CXX11=1 -D__STDC_CONSTANT_MACROS -D__STDC_FORMAT_MACROS -D__STDC_LIMIT_MACROS -Iunittests/tools/llvm-exegesis/ARM -I/Users/buildslave/jenkins/workspace/clang-stage2-Rthinlto-release_70/llvm/unittests/tools/llvm-exegesis/ARM -I/Applications/Xcode.app/Contents/Developer/Platforms/MacOSX.platform/Developer/SDKs/MacOSX10.14.sdk/usr/include/libxml2 -Iinclude -I/Users/buildslave/jenkins/workspace/clang-stage2-Rthinlto-release_70/llvm/include -I/Users/buildslave/jenkins/workspace/clang-stage2-Rthinlto-release_70/llvm/tools/llvm-exegesis/lib -I/Users/buildslave/jenkins/workspace/clang-stage2-Rthinlto-release_70/llvm/utils/unittest/googletest/include -I/Users/buildslave/jenkins/workspace/clang-stage2-Rthinlto-release_70/llvm/utils/unittest/googlemock/include -I/Users/buildslave/jenkins/workspace/clang-stage2-Rthinlto-release_70/llvm/lib/Target/ARM -Ilib/Target/ARM -fno-stack-protector -fno-common -Wno-profile-instr-unprofiled -fPIC -fvisibility-inlines-hidden -Werror=date-time -Werror=unguarded-availability-new -std=c++11 -fmodules -fmodules-cache-path=/Users/buildslave/jenkins/workspace/clang-stage2-Rthinlto-release_70/clang-build/Build/module.cache -fcxx-modules -gmodules -Wall -Wextra -Wno-unused-parameter -Wwrite-strings -Wcast-qual -Wmissing-field-initializers -pedantic -Wno-long-long -Wcovered-switch-default -Wnon-virtual-dtor -Wdelete-non-virtual-dtor -Wstring-conversion -fdiagnostics-color -flto=thin -O2 -g -DNDEBUG -isysroot /Applications/Xcode.app/Contents/Developer/Platforms/MacOSX.platform/Developer/SDKs/MacOSX10.14.sdk    -Wno-variadic-macros -Wno-gnu-zero-variadic-macro-arguments -fno-exceptions -fno-rtti -MD -MT unittests/tools/llvm-exegesis/ARM/CMakeFiles/LLVMExegesisARMTests.dir/AssemblerTest.cpp.o -MF unittests/tools/llvm-exegesis/ARM/CMakeFiles/LLVMExegesisARMTests.dir/AssemblerTest.cpp.o.d -o unittests/tools/llvm-exegesis/ARM/CMakeFiles/LLVMExegesisARMTests.dir/AssemblerTest.cpp.o -c /Users/buildslave/jenkins/workspace/clang-stage2-Rthinlto-release_70/llvm/unittests/tools/llvm-exegesis/ARM/AssemblerTest.cpp
[3210/3408] /Users/buildslave/jenkins/workspace/clang-stage2-Rthinlto-release_70/host-compiler/bin/clang++  -DGTEST_HAS_RTTI=0 -DGTEST_HAS_TR1_TUPLE=0 -DGTEST_LANG_CXX11=1 -D__STDC_CONSTANT_MACROS -D__STDC_FORMAT_MACROS -D__STDC_LIMIT_MACROS -Iunittests/tools/llvm-exegesis/X86 -I/Users/buildslave/jenkins/workspace/clang-stage2-Rthinlto-release_70/llvm/unittests/tools/llvm-exegesis/X86 -I/Applications/Xcode.app/Contents/Developer/Platforms/MacOSX.platform/Developer/SDKs/MacOSX10.14.sdk/usr/include/libxml2 -Iinclude -I/Users/buildslave/jenkins/workspace/clang-stage2-Rthinlto-release_70/llvm/include -I/Users/buildslave/jenkins/workspace/clang-stage2-Rthinlto-release_70/llvm/tools/llvm-exegesis/lib -I/Users/buildslave/jenkins/workspace/clang-stage2-Rthinlto-release_70/llvm/utils/unittest/googletest/include -I/Users/buildslave/jenkins/workspace/clang-stage2-Rthinlto-release_70/llvm/utils/unittest/googlemock/include -I/Users/buildslave/jenkins/workspace/clang-stage2-Rthinlto-release_70/llvm/lib/Target/X86 -Ilib/Target/X86 -fno-stack-protector -fno-common -Wno-profile-instr-unprofiled -fPIC -fvisibility-inlines-hidden -Werror=date-time -Werror=unguarded-availability-new -std=c++11 -fmodules -fmodules-cache-path=/Users/buildslave/jenkins/workspace/clang-stage2-Rthinlto-release_70/clang-build/Build/module.cache -fcxx-modules -gmodules -Wall -Wextra -Wno-unused-parameter -Wwrite-strings -Wcast-qual -Wmissing-field-initializers -pedantic -Wno-long-long -Wcovered-switch-default -Wnon-virtual-dtor -Wdelete-non-virtual-dtor -Wstring-conversion -fdiagnostics-color -flto=thin -O2 -g -DNDEBUG -isysroot /Applications/Xcode.app/Contents/Developer/Platforms/MacOSX.platform/Developer/SDKs/MacOSX10.14.sdk    -Wno-variadic-macros -Wno-gnu-zero-variadic-macro-arguments -fno-exceptions -fno-rtti -MD -MT unittests/tools/llvm-exegesis/X86/CMakeFiles/LLVMExegesisX86Tests.dir/RegisterAliasingTest.cpp.o -MF unittests/tools/llvm-exegesis/X86/CMakeFiles/LLVMExegesisX86Tests.dir/RegisterAliasingTest.cpp.o.d -o unittests/tools/llvm-exegesis/X86/CMakeFiles/LLVMExegesisX86Tests.dir/RegisterAliasingTest.cpp.o -c /Users/buildslave/jenkins/workspace/clang-stage2-Rthinlto-release_70/llvm/unittests/tools/llvm-exegesis/X86/RegisterAliasingTest.cpp
[3211/3408] /Users/buildslave/jenkins/workspace/clang-stage2-Rthinlto-release_70/host-compiler/bin/clang++  -DGTEST_HAS_RTTI=0 -DGTEST_HAS_TR1_TUPLE=0 -DGTEST_LANG_CXX11=1 -D__STDC_CONSTANT_MACROS -D__STDC_FORMAT_MACROS -D__STDC_LIMIT_MACROS -Iunittests/tools/llvm-exegesis/X86 -I/Users/buildslave/jenkins/workspace/clang-stage2-Rthinlto-release_70/llvm/unittests/tools/llvm-exegesis/X86 -I/Applications/Xcode.app/Contents/Developer/Platforms/MacOSX.platform/Developer/SDKs/MacOSX10.14.sdk/usr/include/libxml2 -Iinclude -I/Users/buildslave/jenkins/workspace/clang-stage2-Rthinlto-release_70/llvm/include -I/Users/buildslave/jenkins/workspace/clang-stage2-Rthinlto-release_70/llvm/tools/llvm-exegesis/lib -I/Users/buildslave/jenkins/workspace/clang-stage2-Rthinlto-release_70/llvm/utils/unittest/googletest/include -I/Users/buildslave/jenkins/workspace/clang-stage2-Rthinlto-release_70/llvm/utils/unittest/googlemock/include -I/Users/buildslave/jenkins/workspace/clang-stage2-Rthinlto-release_70/llvm/lib/Target/X86 -Ilib/Target/X86 -fno-stack-protector -fno-common -Wno-profile-instr-unprofiled -fPIC -fvisibility-inlines-hidden -Werror=date-time -Werror=unguarded-availability-new -std=c++11 -fmodules -fmodules-cache-path=/Users/buildslave/jenkins/workspace/clang-stage2-Rthinlto-release_70/clang-build/Build/module.cache -fcxx-modules -gmodules -Wall -Wextra -Wno-unused-parameter -Wwrite-strings -Wcast-qual -Wmissing-field-initializers -pedantic -Wno-long-long -Wcovered-switch-default -Wnon-virtual-dtor -Wdelete-non-virtual-dtor -Wstring-conversion -fdiagnostics-color -flto=thin -O2 -g -DNDEBUG -isysroot /Applications/Xcode.app/Contents/Developer/Platforms/MacOSX.platform/Developer/SDKs/MacOSX10.14.sdk    -Wno-variadic-macros -Wno-gnu-zero-variadic-macro-arguments -fno-exceptions -fno-rtti -MD -MT unittests/tools/llvm-exegesis/X86/CMakeFiles/LLVMExegesisX86Tests.dir/TargetTest.cpp.o -MF unittests/tools/llvm-exegesis/X86/CMakeFiles/LLVMExegesisX86Tests.dir/TargetTest.cpp.o.d -o unittests/tools/llvm-exegesis/X86/CMakeFiles/LLVMExegesisX86Tests.dir/TargetTest.cpp.o -c /Users/buildslave/jenkins/workspace/clang-stage2-Rthinlto-release_70/llvm/unittests/tools/llvm-exegesis/X86/TargetTest.cpp
[3212/3408] /Users/buildslave/jenkins/workspace/clang-stage2-Rthinlto-release_70/host-compiler/bin/clang++  -DGTEST_HAS_RTTI=0 -DGTEST_HAS_TR1_TUPLE=0 -DGTEST_LANG_CXX11=1 -D__STDC_CONSTANT_MACROS -D__STDC_FORMAT_MACROS -D__STDC_LIMIT_MACROS -Iunittests/tools/llvm-exegesis/X86 -I/Users/buildslave/jenkins/workspace/clang-stage2-Rthinlto-release_70/llvm/unittests/tools/llvm-exegesis/X86 -I/Applications/Xcode.app/Contents/Developer/Platforms/MacOSX.platform/Developer/SDKs/MacOSX10.14.sdk/usr/include/libxml2 -Iinclude -I/Users/buildslave/jenkins/workspace/clang-stage2-Rthinlto-release_70/llvm/include -I/Users/buildslave/jenkins/workspace/clang-stage2-Rthinlto-release_70/llvm/tools/llvm-exegesis/lib -I/Users/buildslave/jenkins/workspace/clang-stage2-Rthinlto-release_70/llvm/utils/unittest/googletest/include -I/Users/buildslave/jenkins/workspace/clang-stage2-Rthinlto-release_70/llvm/utils/unittest/googlemock/include -I/Users/buildslave/jenkins/workspace/clang-stage2-Rthinlto-release_70/llvm/lib/Target/X86 -Ilib/Target/X86 -fno-stack-protector -fno-common -Wno-profile-instr-unprofiled -fPIC -fvisibility-inlines-hidden -Werror=date-time -Werror=unguarded-availability-new -std=c++11 -fmodules -fmodules-cache-path=/Users/buildslave/jenkins/workspace/clang-stage2-Rthinlto-release_70/clang-build/Build/module.cache -fcxx-modules -gmodules -Wall -Wextra -Wno-unused-parameter -Wwrite-strings -Wcast-qual -Wmissing-field-initializers -pedantic -Wno-long-long -Wcovered-switch-default -Wnon-virtual-dtor -Wdelete-non-virtual-dtor -Wstring-conversion -fdiagnostics-color -flto=thin -O2 -g -DNDEBUG -isysroot /Applications/Xcode.app/Contents/Developer/Platforms/MacOSX.platform/Developer/SDKs/MacOSX10.14.sdk    -Wno-variadic-macros -Wno-gnu-zero-variadic-macro-arguments -fno-exceptions -fno-rtti -MD -MT unittests/tools/llvm-exegesis/X86/CMakeFiles/LLVMExegesisX86Tests.dir/SnippetGeneratorTest.cpp.o -MF unittests/tools/llvm-exegesis/X86/CMakeFiles/LLVMExegesisX86Tests.dir/SnippetGeneratorTest.cpp.o.d -o unittests/tools/llvm-exegesis/X86/CMakeFiles/LLVMExegesisX86Tests.dir/SnippetGeneratorTest.cpp.o -c /Users/buildslave/jenkins/workspace/clang-stage2-Rthinlto-release_70/llvm/unittests/tools/llvm-exegesis/X86/SnippetGeneratorTest.cpp
[3213/3408] /Users/buildslave/jenkins/workspace/clang-stage2-Rthinlto-release_70/host-compiler/bin/clang++  -DGTEST_HAS_RTTI=0 -DGTEST_HAS_TR1_TUPLE=0 -DGTEST_LANG_CXX11=1 -D__STDC_CONSTANT_MACROS -D__STDC_FORMAT_MACROS -D__STDC_LIMIT_MACROS -Iunittests/tools/llvm-cfi-verify -I/Users/buildslave/jenkins/workspace/clang-stage2-Rthinlto-release_70/llvm/unittests/tools/llvm-cfi-verify -I/Applications/Xcode.app/Contents/Developer/Platforms/MacOSX.platform/Developer/SDKs/MacOSX10.14.sdk/usr/include/libxml2 -Iinclude -I/Users/buildslave/jenkins/workspace/clang-stage2-Rthinlto-release_70/llvm/include -I/Users/buildslave/jenkins/workspace/clang-stage2-Rthinlto-release_70/llvm/utils/unittest/googletest/include -I/Users/buildslave/jenkins/workspace/clang-stage2-Rthinlto-release_70/llvm/utils/unittest/googlemock/include -fno-stack-protector -fno-common -Wno-profile-instr-unprofiled -fPIC -fvisibility-inlines-hidden -Werror=date-time -Werror=unguarded-availability-new -std=c++11 -fmodules -fmodules-cache-path=/Users/buildslave/jenkins/workspace/clang-stage2-Rthinlto-release_70/clang-build/Build/module.cache -fcxx-modules -gmodules -Wall -Wextra -Wno-unused-parameter -Wwrite-strings -Wcast-qual -Wmissing-field-initializers -pedantic -Wno-long-long -Wcovered-switch-default -Wnon-virtual-dtor -Wdelete-non-virtual-dtor -Wstring-conversion -fdiagnostics-color -flto=thin -O2 -g -DNDEBUG -isysroot /Applications/Xcode.app/Contents/Developer/Platforms/MacOSX.platform/Developer/SDKs/MacOSX10.14.sdk    -Wno-variadic-macros -Wno-gnu-zero-variadic-macro-arguments -fno-exceptions -fno-rtti -MD -MT unittests/tools/llvm-cfi-verify/CMakeFiles/CFIVerifyTests.dir/GraphBuilder.cpp.o -MF unittests/tools/llvm-cfi-verify/CMakeFiles/CFIVerifyTests.dir/GraphBuilder.cpp.o.d -o unittests/tools/llvm-cfi-verify/CMakeFiles/CFIVerifyTests.dir/GraphBuilder.cpp.o -c /Users/buildslave/jenkins/workspace/clang-stage2-Rthinlto-release_70/llvm/unittests/tools/llvm-cfi-verify/GraphBuilder.cpp
[3214/3408] /Users/buildslave/jenkins/workspace/clang-stage2-Rthinlto-release_70/host-compiler/bin/clang++  -DGTEST_HAS_RTTI=0 -DGTEST_HAS_TR1_TUPLE=0 -DGTEST_LANG_CXX11=1 -D__STDC_CONSTANT_MACROS -D__STDC_FORMAT_MACROS -D__STDC_LIMIT_MACROS -Iunittests/XRay -I/Users/buildslave/jenkins/workspace/clang-stage2-Rthinlto-release_70/llvm/unittests/XRay -I/Applications/Xcode.app/Contents/Developer/Platforms/MacOSX.platform/Developer/SDKs/MacOSX10.14.sdk/usr/include/libxml2 -Iinclude -I/Users/buildslave/jenkins/workspace/clang-stage2-Rthinlto-release_70/llvm/include -I/Users/buildslave/jenkins/workspace/clang-stage2-Rthinlto-release_70/llvm/utils/unittest/googletest/include -I/Users/buildslave/jenkins/workspace/clang-stage2-Rthinlto-release_70/llvm/utils/unittest/googlemock/include -fno-stack-protector -fno-common -Wno-profile-instr-unprofiled -fPIC -fvisibility-inlines-hidden -Werror=date-time -Werror=unguarded-availability-new -std=c++11 -fmodules -fmodules-cache-path=/Users/buildslave/jenkins/workspace/clang-stage2-Rthinlto-release_70/clang-build/Build/module.cache -fcxx-modules -gmodules -Wall -Wextra -Wno-unused-parameter -Wwrite-strings -Wcast-qual -Wmissing-field-initializers -pedantic -Wno-long-long -Wcovered-switch-default -Wnon-virtual-dtor -Wdelete-non-virtual-dtor -Wstring-conversion -fdiagnostics-color -flto=thin -O2 -g -DNDEBUG -isysroot /Applications/Xcode.app/Contents/Developer/Platforms/MacOSX.platform/Developer/SDKs/MacOSX10.14.sdk    -Wno-variadic-macros -Wno-gnu-zero-variadic-macro-arguments -fno-exceptions -fno-rtti -MD -MT unittests/XRay/CMakeFiles/XRayTests.dir/GraphTest.cpp.o -MF unittests/XRay/CMakeFiles/XRayTests.dir/GraphTest.cpp.o.d -o unittests/XRay/CMakeFiles/XRayTests.dir/GraphTest.cpp.o -c /Users/buildslave/jenkins/workspace/clang-stage2-Rthinlto-release_70/llvm/unittests/XRay/GraphTest.cpp
[3215/3408] /Users/buildslave/jenkins/workspace/clang-stage2-Rthinlto-release_70/host-compiler/bin/clang++  -DCLANG_REPOSITORY_STRING=\"master\" -DCLANG_VENDOR="\"Apple \"" -DGTEST_HAS_RTTI=0 -DGTEST_HAS_TR1_TUPLE=0 -DGTEST_LANG_CXX11=1 -D_GNU_SOURCE -D__STDC_CONSTANT_MACROS -D__STDC_FORMAT_MACROS -D__STDC_LIMIT_MACROS -Itools/clang/unittests/Tooling -I/Users/buildslave/jenkins/workspace/clang-stage2-Rthinlto-release_70/llvm/tools/clang/unittests/Tooling -I/Users/buildslave/jenkins/workspace/clang-stage2-Rthinlto-release_70/llvm/tools/clang/include -Itools/clang/include -I/Applications/Xcode.app/Contents/Developer/Platforms/MacOSX.platform/Developer/SDKs/MacOSX10.14.sdk/usr/include/libxml2 -Iinclude -I/Users/buildslave/jenkins/workspace/clang-stage2-Rthinlto-release_70/llvm/include -I/Users/buildslave/jenkins/workspace/clang-stage2-Rthinlto-release_70/llvm/utils/unittest/googletest/include -I/Users/buildslave/jenkins/workspace/clang-stage2-Rthinlto-release_70/llvm/utils/unittest/googlemock/include -fno-stack-protector -fno-common -Wno-profile-instr-unprofiled -fPIC -fvisibility-inlines-hidden -Werror=date-time -Werror=unguarded-availability-new -std=c++11 -fmodules -fmodules-cache-path=/Users/buildslave/jenkins/workspace/clang-stage2-Rthinlto-release_70/clang-build/Build/module.cache -fcxx-modules -gmodules -Wall -Wextra -Wno-unused-parameter -Wwrite-strings -Wcast-qual -Wmissing-field-initializers -pedantic -Wno-long-long -Wcovered-switch-default -Wnon-virtual-dtor -Wdelete-non-virtual-dtor -Wstring-conversion -fdiagnostics-color -flto=thin -fno-common -Woverloaded-virtual -Wno-nested-anon-types -O2 -g -DNDEBUG -isysroot /Applications/Xcode.app/Contents/Developer/Platforms/MacOSX.platform/Developer/SDKs/MacOSX10.14.sdk    -Wno-variadic-macros -Wno-gnu-zero-variadic-macro-arguments -fno-exceptions -fno-rtti -MD -MT tools/clang/unittests/Tooling/CMakeFiles/ToolingTests.dir/RecursiveASTVisitorTests/ParenExpr.cpp.o -MF tools/clang/unittests/Tooling/CMakeFiles/ToolingTests.dir/RecursiveASTVisitorTests/ParenExpr.cpp.o.d -o tools/clang/unittests/Tooling/CMakeFiles/ToolingTests.dir/RecursiveASTVisitorTests/ParenExpr.cpp.o -c /Users/buildslave/jenkins/workspace/clang-stage2-Rthinlto-release_70/llvm/tools/clang/unittests/Tooling/RecursiveASTVisitorTests/ParenExpr.cpp
[3216/3408] /Users/buildslave/jenkins/workspace/clang-stage2-Rthinlto-release_70/host-compiler/bin/clang++  -DCLANG_REPOSITORY_STRING=\"master\" -DCLANG_VENDOR="\"Apple \"" -DGTEST_HAS_RTTI=0 -DGTEST_HAS_TR1_TUPLE=0 -DGTEST_LANG_CXX11=1 -D_GNU_SOURCE -D__STDC_CONSTANT_MACROS -D__STDC_FORMAT_MACROS -D__STDC_LIMIT_MACROS -Itools/clang/unittests/Tooling -I/Users/buildslave/jenkins/workspace/clang-stage2-Rthinlto-release_70/llvm/tools/clang/unittests/Tooling -I/Users/buildslave/jenkins/workspace/clang-stage2-Rthinlto-release_70/llvm/tools/clang/include -Itools/clang/include -I/Applications/Xcode.app/Contents/Developer/Platforms/MacOSX.platform/Developer/SDKs/MacOSX10.14.sdk/usr/include/libxml2 -Iinclude -I/Users/buildslave/jenkins/workspace/clang-stage2-Rthinlto-release_70/llvm/include -I/Users/buildslave/jenkins/workspace/clang-stage2-Rthinlto-release_70/llvm/utils/unittest/googletest/include -I/Users/buildslave/jenkins/workspace/clang-stage2-Rthinlto-release_70/llvm/utils/unittest/googlemock/include -fno-stack-protector -fno-common -Wno-profile-instr-unprofiled -fPIC -fvisibility-inlines-hidden -Werror=date-time -Werror=unguarded-availability-new -std=c++11 -fmodules -fmodules-cache-path=/Users/buildslave/jenkins/workspace/clang-stage2-Rthinlto-release_70/clang-build/Build/module.cache -fcxx-modules -gmodules -Wall -Wextra -Wno-unused-parameter -Wwrite-strings -Wcast-qual -Wmissing-field-initializers -pedantic -Wno-long-long -Wcovered-switch-default -Wnon-virtual-dtor -Wdelete-non-virtual-dtor -Wstring-conversion -fdiagnostics-color -flto=thin -fno-common -Woverloaded-virtual -Wno-nested-anon-types -O2 -g -DNDEBUG -isysroot /Applications/Xcode.app/Contents/Developer/Platforms/MacOSX.platform/Developer/SDKs/MacOSX10.14.sdk    -Wno-variadic-macros -Wno-gnu-zero-variadic-macro-arguments -fno-exceptions -fno-rtti -MD -MT tools/clang/unittests/Tooling/CMakeFiles/ToolingTests.dir/RecursiveASTVisitorTests/TemplateArgumentLocTraverser.cpp.o -MF tools/clang/unittests/Tooling/CMakeFiles/ToolingTests.dir/RecursiveASTVisitorTests/TemplateArgumentLocTraverser.cpp.o.d -o tools/clang/unittests/Tooling/CMakeFiles/ToolingTests.dir/RecursiveASTVisitorTests/TemplateArgumentLocTraverser.cpp.o -c /Users/buildslave/jenkins/workspace/clang-stage2-Rthinlto-release_70/llvm/tools/clang/unittests/Tooling/RecursiveASTVisitorTests/TemplateArgumentLocTraverser.cpp
[3217/3408] /Users/buildslave/jenkins/workspace/clang-stage2-Rthinlto-release_70/host-compiler/bin/clang++  -DCLANG_REPOSITORY_STRING=\"master\" -DCLANG_VENDOR="\"Apple \"" -DGTEST_HAS_RTTI=0 -DGTEST_HAS_TR1_TUPLE=0 -DGTEST_LANG_CXX11=1 -D_GNU_SOURCE -D__STDC_CONSTANT_MACROS -D__STDC_FORMAT_MACROS -D__STDC_LIMIT_MACROS -Itools/clang/unittests/Tooling -I/Users/buildslave/jenkins/workspace/clang-stage2-Rthinlto-release_70/llvm/tools/clang/unittests/Tooling -I/Users/buildslave/jenkins/workspace/clang-stage2-Rthinlto-release_70/llvm/tools/clang/include -Itools/clang/include -I/Applications/Xcode.app/Contents/Developer/Platforms/MacOSX.platform/Developer/SDKs/MacOSX10.14.sdk/usr/include/libxml2 -Iinclude -I/Users/buildslave/jenkins/workspace/clang-stage2-Rthinlto-release_70/llvm/include -I/Users/buildslave/jenkins/workspace/clang-stage2-Rthinlto-release_70/llvm/utils/unittest/googletest/include -I/Users/buildslave/jenkins/workspace/clang-stage2-Rthinlto-release_70/llvm/utils/unittest/googlemock/include -fno-stack-protector -fno-common -Wno-profile-instr-unprofiled -fPIC -fvisibility-inlines-hidden -Werror=date-time -Werror=unguarded-availability-new -std=c++11 -fmodules -fmodules-cache-path=/Users/buildslave/jenkins/workspace/clang-stage2-Rthinlto-release_70/clang-build/Build/module.cache -fcxx-modules -gmodules -Wall -Wextra -Wno-unused-parameter -Wwrite-strings -Wcast-qual -Wmissing-field-initializers -pedantic -Wno-long-long -Wcovered-switch-default -Wnon-virtual-dtor -Wdelete-non-virtual-dtor -Wstring-conversion -fdiagnostics-color -flto=thin -fno-common -Woverloaded-virtual -Wno-nested-anon-types -O2 -g -DNDEBUG -isysroot /Applications/Xcode.app/Contents/Developer/Platforms/MacOSX.platform/Developer/SDKs/MacOSX10.14.sdk    -Wno-variadic-macros -Wno-gnu-zero-variadic-macro-arguments -fno-exceptions -fno-rtti -MD -MT tools/clang/unittests/Tooling/CMakeFiles/ToolingTests.dir/RecursiveASTVisitorTestPostOrderVisitor.cpp.o -MF tools/clang/unittests/Tooling/CMakeFiles/ToolingTests.dir/RecursiveASTVisitorTestPostOrderVisitor.cpp.o.d -o tools/clang/unittests/Tooling/CMakeFiles/ToolingTests.dir/RecursiveASTVisitorTestPostOrderVisitor.cpp.o -c /Users/buildslave/jenkins/workspace/clang-stage2-Rthinlto-release_70/llvm/tools/clang/unittests/Tooling/RecursiveASTVisitorTestPostOrderVisitor.cpp
[3218/3408] /Users/buildslave/jenkins/workspace/clang-stage2-Rthinlto-release_70/host-compiler/bin/clang++  -DCLANG_REPOSITORY_STRING=\"master\" -DCLANG_VENDOR="\"Apple \"" -DGTEST_HAS_RTTI=0 -DGTEST_HAS_TR1_TUPLE=0 -DGTEST_LANG_CXX11=1 -D_GNU_SOURCE -D__STDC_CONSTANT_MACROS -D__STDC_FORMAT_MACROS -D__STDC_LIMIT_MACROS -Itools/clang/unittests/Tooling -I/Users/buildslave/jenkins/workspace/clang-stage2-Rthinlto-release_70/llvm/tools/clang/unittests/Tooling -I/Users/buildslave/jenkins/workspace/clang-stage2-Rthinlto-release_70/llvm/tools/clang/include -Itools/clang/include -I/Applications/Xcode.app/Contents/Developer/Platforms/MacOSX.platform/Developer/SDKs/MacOSX10.14.sdk/usr/include/libxml2 -Iinclude -I/Users/buildslave/jenkins/workspace/clang-stage2-Rthinlto-release_70/llvm/include -I/Users/buildslave/jenkins/workspace/clang-stage2-Rthinlto-release_70/llvm/utils/unittest/googletest/include -I/Users/buildslave/jenkins/workspace/clang-stage2-Rthinlto-release_70/llvm/utils/unittest/googlemock/include -fno-stack-protector -fno-common -Wno-profile-instr-unprofiled -fPIC -fvisibility-inlines-hidden -Werror=date-time -Werror=unguarded-availability-new -std=c++11 -fmodules -fmodules-cache-path=/Users/buildslave/jenkins/workspace/clang-stage2-Rthinlto-release_70/clang-build/Build/module.cache -fcxx-modules -gmodules -Wall -Wextra -Wno-unused-parameter -Wwrite-strings -Wcast-qual -Wmissing-field-initializers -pedantic -Wno-long-long -Wcovered-switch-default -Wnon-virtual-dtor -Wdelete-non-virtual-dtor -Wstring-conversion -fdiagnostics-color -flto=thin -fno-common -Woverloaded-virtual -Wno-nested-anon-types -O2 -g -DNDEBUG -isysroot /Applications/Xcode.app/Contents/Developer/Platforms/MacOSX.platform/Developer/SDKs/MacOSX10.14.sdk    -Wno-variadic-macros -Wno-gnu-zero-variadic-macro-arguments -fno-exceptions -fno-rtti -MD -MT tools/clang/unittests/Tooling/CMakeFiles/ToolingTests.dir/RecursiveASTVisitorTestTypeLocVisitor.cpp.o -MF tools/clang/unittests/Tooling/CMakeFiles/ToolingTests.dir/RecursiveASTVisitorTestTypeLocVisitor.cpp.o.d -o tools/clang/unittests/Tooling/CMakeFiles/ToolingTests.dir/RecursiveASTVisitorTestTypeLocVisitor.cpp.o -c /Users/buildslave/jenkins/workspace/clang-stage2-Rthinlto-release_70/llvm/tools/clang/unittests/Tooling/RecursiveASTVisitorTestTypeLocVisitor.cpp
[3219/3408] /Users/buildslave/jenkins/workspace/clang-stage2-Rthinlto-release_70/host-compiler/bin/clang++  -DGTEST_HAS_RTTI=0 -DGTEST_HAS_TR1_TUPLE=0 -DGTEST_LANG_CXX11=1 -D__STDC_CONSTANT_MACROS -D__STDC_FORMAT_MACROS -D__STDC_LIMIT_MACROS -Iunittests/Analysis -I/Users/buildslave/jenkins/workspace/clang-stage2-Rthinlto-release_70/llvm/unittests/Analysis -I/Applications/Xcode.app/Contents/Developer/Platforms/MacOSX.platform/Developer/SDKs/MacOSX10.14.sdk/usr/include/libxml2 -Iinclude -I/Users/buildslave/jenkins/workspace/clang-stage2-Rthinlto-release_70/llvm/include -I/Users/buildslave/jenkins/workspace/clang-stage2-Rthinlto-release_70/llvm/utils/unittest/googletest/include -I/Users/buildslave/jenkins/workspace/clang-stage2-Rthinlto-release_70/llvm/utils/unittest/googlemock/include -fno-stack-protector -fno-common -Wno-profile-instr-unprofiled -fPIC -fvisibility-inlines-hidden -Werror=date-time -Werror=unguarded-availability-new -std=c++11 -fmodules -fmodules-cache-path=/Users/buildslave/jenkins/workspace/clang-stage2-Rthinlto-release_70/clang-build/Build/module.cache -fcxx-modules -gmodules -Wall -Wextra -Wno-unused-parameter -Wwrite-strings -Wcast-qual -Wmissing-field-initializers -pedantic -Wno-long-long -Wcovered-switch-default -Wnon-virtual-dtor -Wdelete-non-virtual-dtor -Wstring-conversion -fdiagnostics-color -flto=thin -O2 -g -DNDEBUG -isysroot /Applications/Xcode.app/Contents/Developer/Platforms/MacOSX.platform/Developer/SDKs/MacOSX10.14.sdk    -Wno-variadic-macros -Wno-gnu-zero-variadic-macro-arguments -fno-exceptions -fno-rtti -MD -MT unittests/Analysis/CMakeFiles/AnalysisTests.dir/LazyCallGraphTest.cpp.o -MF unittests/Analysis/CMakeFiles/AnalysisTests.dir/LazyCallGraphTest.cpp.o.d -o unittests/Analysis/CMakeFiles/AnalysisTests.dir/LazyCallGraphTest.cpp.o -c /Users/buildslave/jenkins/workspace/clang-stage2-Rthinlto-release_70/llvm/unittests/Analysis/LazyCallGraphTest.cpp
[3220/3408] /Users/buildslave/jenkins/workspace/clang-stage2-Rthinlto-release_70/host-compiler/bin/clang++  -DCLANG_REPOSITORY_STRING=\"master\" -DCLANG_VENDOR="\"Apple \"" -DGTEST_HAS_RTTI=0 -D_GNU_SOURCE -D__STDC_CONSTANT_MACROS -D__STDC_FORMAT_MACROS -D__STDC_LIMIT_MACROS -Itools/clang/lib/Sema -I/Users/buildslave/jenkins/workspace/clang-stage2-Rthinlto-release_70/llvm/tools/clang/lib/Sema -I/Users/buildslave/jenkins/workspace/clang-stage2-Rthinlto-release_70/llvm/tools/clang/include -Itools/clang/include -I/Applications/Xcode.app/Contents/Developer/Platforms/MacOSX.platform/Developer/SDKs/MacOSX10.14.sdk/usr/include/libxml2 -Iinclude -I/Users/buildslave/jenkins/workspace/clang-stage2-Rthinlto-release_70/llvm/include -fno-stack-protector -fno-common -Wno-profile-instr-unprofiled -fPIC -fvisibility-inlines-hidden -Werror=date-time -Werror=unguarded-availability-new -std=c++11 -fmodules -fmodules-cache-path=/Users/buildslave/jenkins/workspace/clang-stage2-Rthinlto-release_70/clang-build/Build/module.cache -fcxx-modules -gmodules -Wall -Wextra -Wno-unused-parameter -Wwrite-strings -Wcast-qual -Wmissing-field-initializers -pedantic -Wno-long-long -Wcovered-switch-default -Wnon-virtual-dtor -Wdelete-non-virtual-dtor -Wstring-conversion -fdiagnostics-color -flto=thin -fno-common -Woverloaded-virtual -Wno-nested-anon-types -O2 -g -DNDEBUG -isysroot /Applications/Xcode.app/Contents/Developer/Platforms/MacOSX.platform/Developer/SDKs/MacOSX10.14.sdk    -fno-exceptions -fno-rtti -MD -MT tools/clang/lib/Sema/CMakeFiles/clangSema.dir/SemaChecking.cpp.o -MF tools/clang/lib/Sema/CMakeFiles/clangSema.dir/SemaChecking.cpp.o.d -o tools/clang/lib/Sema/CMakeFiles/clangSema.dir/SemaChecking.cpp.o -c /Users/buildslave/jenkins/workspace/clang-stage2-Rthinlto-release_70/llvm/tools/clang/lib/Sema/SemaChecking.cpp
[3221/3408] /Users/buildslave/jenkins/workspace/clang-stage2-Rthinlto-release_70/host-compiler/bin/clang++  -DGTEST_HAS_RTTI=0 -DGTEST_HAS_TR1_TUPLE=0 -DGTEST_LANG_CXX11=1 -D__STDC_CONSTANT_MACROS -D__STDC_FORMAT_MACROS -D__STDC_LIMIT_MACROS -Iunittests/Transforms/Scalar -I/Users/buildslave/jenkins/workspace/clang-stage2-Rthinlto-release_70/llvm/unittests/Transforms/Scalar -I/Applications/Xcode.app/Contents/Developer/Platforms/MacOSX.platform/Developer/SDKs/MacOSX10.14.sdk/usr/include/libxml2 -Iinclude -I/Users/buildslave/jenkins/workspace/clang-stage2-Rthinlto-release_70/llvm/include -I/Users/buildslave/jenkins/workspace/clang-stage2-Rthinlto-release_70/llvm/utils/unittest/googletest/include -I/Users/buildslave/jenkins/workspace/clang-stage2-Rthinlto-release_70/llvm/utils/unittest/googlemock/include -fno-stack-protector -fno-common -Wno-profile-instr-unprofiled -fPIC -fvisibility-inlines-hidden -Werror=date-time -Werror=unguarded-availability-new -std=c++11 -fmodules -fmodules-cache-path=/Users/buildslave/jenkins/workspace/clang-stage2-Rthinlto-release_70/clang-build/Build/module.cache -fcxx-modules -gmodules -Wall -Wextra -Wno-unused-parameter -Wwrite-strings -Wcast-qual -Wmissing-field-initializers -pedantic -Wno-long-long -Wcovered-switch-default -Wnon-virtual-dtor -Wdelete-non-virtual-dtor -Wstring-conversion -fdiagnostics-color -flto=thin -O2 -g -DNDEBUG -isysroot /Applications/Xcode.app/Contents/Developer/Platforms/MacOSX.platform/Developer/SDKs/MacOSX10.14.sdk    -Wno-variadic-macros -Wno-gnu-zero-variadic-macro-arguments -fno-exceptions -fno-rtti -MD -MT unittests/Transforms/Scalar/CMakeFiles/ScalarTests.dir/LoopPassManagerTest.cpp.o -MF unittests/Transforms/Scalar/CMakeFiles/ScalarTests.dir/LoopPassManagerTest.cpp.o.d -o unittests/Transforms/Scalar/CMakeFiles/ScalarTests.dir/LoopPassManagerTest.cpp.o -c /Users/buildslave/jenkins/workspace/clang-stage2-Rthinlto-release_70/llvm/unittests/Transforms/Scalar/LoopPassManagerTest.cpp
[3222/3408] /Users/buildslave/jenkins/workspace/clang-stage2-Rthinlto-release_70/host-compiler/bin/clang++  -DCLANG_REPOSITORY_STRING=\"master\" -DCLANG_VENDOR="\"Apple \"" -DGTEST_HAS_RTTI=0 -D_GNU_SOURCE -D__STDC_CONSTANT_MACROS -D__STDC_FORMAT_MACROS -D__STDC_LIMIT_MACROS -Itools/clang/lib/Sema -I/Users/buildslave/jenkins/workspace/clang-stage2-Rthinlto-release_70/llvm/tools/clang/lib/Sema -I/Users/buildslave/jenkins/workspace/clang-stage2-Rthinlto-release_70/llvm/tools/clang/include -Itools/clang/include -I/Applications/Xcode.app/Contents/Developer/Platforms/MacOSX.platform/Developer/SDKs/MacOSX10.14.sdk/usr/include/libxml2 -Iinclude -I/Users/buildslave/jenkins/workspace/clang-stage2-Rthinlto-release_70/llvm/include -fno-stack-protector -fno-common -Wno-profile-instr-unprofiled -fPIC -fvisibility-inlines-hidden -Werror=date-time -Werror=unguarded-availability-new -std=c++11 -fmodules -fmodules-cache-path=/Users/buildslave/jenkins/workspace/clang-stage2-Rthinlto-release_70/clang-build/Build/module.cache -fcxx-modules -gmodules -Wall -Wextra -Wno-unused-parameter -Wwrite-strings -Wcast-qual -Wmissing-field-initializers -pedantic -Wno-long-long -Wcovered-switch-default -Wnon-virtual-dtor -Wdelete-non-virtual-dtor -Wstring-conversion -fdiagnostics-color -flto=thin -fno-common -Woverloaded-virtual -Wno-nested-anon-types -O2 -g -DNDEBUG -isysroot /Applications/Xcode.app/Contents/Developer/Platforms/MacOSX.platform/Developer/SDKs/MacOSX10.14.sdk    -fno-exceptions -fno-rtti -MD -MT tools/clang/lib/Sema/CMakeFiles/clangSema.dir/SemaDeclAttr.cpp.o -MF tools/clang/lib/Sema/CMakeFiles/clangSema.dir/SemaDeclAttr.cpp.o.d -o tools/clang/lib/Sema/CMakeFiles/clangSema.dir/SemaDeclAttr.cpp.o -c /Users/buildslave/jenkins/workspace/clang-stage2-Rthinlto-release_70/llvm/tools/clang/lib/Sema/SemaDeclAttr.cpp
[3223/3408] /Users/buildslave/jenkins/workspace/clang-stage2-Rthinlto-release_70/host-compiler/bin/clang++  -DGTEST_HAS_RTTI=0 -DGTEST_HAS_TR1_TUPLE=0 -DGTEST_LANG_CXX11=1 -D__STDC_CONSTANT_MACROS -D__STDC_FORMAT_MACROS -D__STDC_LIMIT_MACROS -Iunittests/ADT -I/Users/buildslave/jenkins/workspace/clang-stage2-Rthinlto-release_70/llvm/unittests/ADT -I/Applications/Xcode.app/Contents/Developer/Platforms/MacOSX.platform/Developer/SDKs/MacOSX10.14.sdk/usr/include/libxml2 -Iinclude -I/Users/buildslave/jenkins/workspace/clang-stage2-Rthinlto-release_70/llvm/include -I/Users/buildslave/jenkins/workspace/clang-stage2-Rthinlto-release_70/llvm/utils/unittest/googletest/include -I/Users/buildslave/jenkins/workspace/clang-stage2-Rthinlto-release_70/llvm/utils/unittest/googlemock/include -fno-stack-protector -fno-common -Wno-profile-instr-unprofiled -fPIC -fvisibility-inlines-hidden -Werror=date-time -Werror=unguarded-availability-new -std=c++11 -fmodules -fmodules-cache-path=/Users/buildslave/jenkins/workspace/clang-stage2-Rthinlto-release_70/clang-build/Build/module.cache -fcxx-modules -gmodules -Wall -Wextra -Wno-unused-parameter -Wwrite-strings -Wcast-qual -Wmissing-field-initializers -pedantic -Wno-long-long -Wcovered-switch-default -Wnon-virtual-dtor -Wdelete-non-virtual-dtor -Wstring-conversion -fdiagnostics-color -flto=thin -O2 -g -DNDEBUG -isysroot /Applications/Xcode.app/Contents/Developer/Platforms/MacOSX.platform/Developer/SDKs/MacOSX10.14.sdk    -Wno-variadic-macros -Wno-gnu-zero-variadic-macro-arguments -fno-exceptions -fno-rtti -MD -MT unittests/ADT/CMakeFiles/ADTTests.dir/SmallVectorTest.cpp.o -MF unittests/ADT/CMakeFiles/ADTTests.dir/SmallVectorTest.cpp.o.d -o unittests/ADT/CMakeFiles/ADTTests.dir/SmallVectorTest.cpp.o -c /Users/buildslave/jenkins/workspace/clang-stage2-Rthinlto-release_70/llvm/unittests/ADT/SmallVectorTest.cpp
[3224/3408] /Users/buildslave/jenkins/workspace/clang-stage2-Rthinlto-release_70/host-compiler/bin/clang++  -DCLANG_REPOSITORY_STRING=\"master\" -DCLANG_VENDOR="\"Apple \"" -DGTEST_HAS_RTTI=0 -DGTEST_HAS_TR1_TUPLE=0 -DGTEST_LANG_CXX11=1 -D_GNU_SOURCE -D__STDC_CONSTANT_MACROS -D__STDC_FORMAT_MACROS -D__STDC_LIMIT_MACROS -Itools/clang/unittests/Tooling -I/Users/buildslave/jenkins/workspace/clang-stage2-Rthinlto-release_70/llvm/tools/clang/unittests/Tooling -I/Users/buildslave/jenkins/workspace/clang-stage2-Rthinlto-release_70/llvm/tools/clang/include -Itools/clang/include -I/Applications/Xcode.app/Contents/Developer/Platforms/MacOSX.platform/Developer/SDKs/MacOSX10.14.sdk/usr/include/libxml2 -Iinclude -I/Users/buildslave/jenkins/workspace/clang-stage2-Rthinlto-release_70/llvm/include -I/Users/buildslave/jenkins/workspace/clang-stage2-Rthinlto-release_70/llvm/utils/unittest/googletest/include -I/Users/buildslave/jenkins/workspace/clang-stage2-Rthinlto-release_70/llvm/utils/unittest/googlemock/include -fno-stack-protector -fno-common -Wno-profile-instr-unprofiled -fPIC -fvisibility-inlines-hidden -Werror=date-time -Werror=unguarded-availability-new -std=c++11 -fmodules -fmodules-cache-path=/Users/buildslave/jenkins/workspace/clang-stage2-Rthinlto-release_70/clang-build/Build/module.cache -fcxx-modules -gmodules -Wall -Wextra -Wno-unused-parameter -Wwrite-strings -Wcast-qual -Wmissing-field-initializers -pedantic -Wno-long-long -Wcovered-switch-default -Wnon-virtual-dtor -Wdelete-non-virtual-dtor -Wstring-conversion -fdiagnostics-color -flto=thin -fno-common -Woverloaded-virtual -Wno-nested-anon-types -O2 -g -DNDEBUG -isysroot /Applications/Xcode.app/Contents/Developer/Platforms/MacOSX.platform/Developer/SDKs/MacOSX10.14.sdk    -Wno-variadic-macros -Wno-gnu-zero-variadic-macro-arguments -fno-exceptions -fno-rtti -MD -MT tools/clang/unittests/Tooling/CMakeFiles/ToolingTests.dir/RecursiveASTVisitorTestDeclVisitor.cpp.o -MF tools/clang/unittests/Tooling/CMakeFiles/ToolingTests.dir/RecursiveASTVisitorTestDeclVisitor.cpp.o.d -o tools/clang/unittests/Tooling/CMakeFiles/ToolingTests.dir/RecursiveASTVisitorTestDeclVisitor.cpp.o -c /Users/buildslave/jenkins/workspace/clang-stage2-Rthinlto-release_70/llvm/tools/clang/unittests/Tooling/RecursiveASTVisitorTestDeclVisitor.cpp
[3225/3408] : && /Users/buildslave/jenkins/workspace/clang-stage2-Rthinlto-release_70/host-compiler/bin/clang++ -fno-stack-protector -fno-common -Wno-profile-instr-unprofiled -fPIC -fvisibility-inlines-hidden -Werror=date-time -Werror=unguarded-availability-new -std=c++11 -fmodules -fmodules-cache-path=/Users/buildslave/jenkins/workspace/clang-stage2-Rthinlto-release_70/clang-build/Build/module.cache -fcxx-modules -gmodules -Wall -Wextra -Wno-unused-parameter -Wwrite-strings -Wcast-qual -Wmissing-field-initializers -pedantic -Wno-long-long -Wcovered-switch-default -Wnon-virtual-dtor -Wdelete-non-virtual-dtor -Wstring-conversion -fdiagnostics-color -flto=thin -O2 -g -DNDEBUG -isysroot /Applications/Xcode.app/Contents/Developer/Platforms/MacOSX.platform/Developer/SDKs/MacOSX10.14.sdk -dynamiclib -Wl,-headerpad_max_install_names -flto=thin -Wl,-cache_path_lto,/Users/buildslave/jenkins/workspace/clang-stage2-Rthinlto-release_70/clang-build/Build/lto.cache   -Wl,-dead_strip -Wl,-exported_symbols_list,/Users/buildslave/jenkins/workspace/clang-stage2-Rthinlto-release_70/clang-build/Build/tools/lto/LTO.exports -Wl,-object_path_lto,/Users/buildslave/jenkins/workspace/clang-stage2-Rthinlto-release_70/clang-build/Build/tools/lto/./LTO-lto.o -compatibility_version 1 -current_version 3007.1.99 -o lib/libLTO.dylib -install_name @rpath/libLTO.dylib tools/lto/CMakeFiles/LTO.dir/LTODisassembler.cpp.o tools/lto/CMakeFiles/LTO.dir/lto.cpp.o  -Wl,-rpath,@loader_path/../lib lib/libLLVMX86CodeGen.a lib/libLLVMX86AsmParser.a lib/libLLVMX86AsmPrinter.a lib/libLLVMX86Desc.a lib/libLLVMX86Disassembler.a lib/libLLVMX86Info.a lib/libLLVMX86Utils.a lib/libLLVMARMCodeGen.a lib/libLLVMARMAsmParser.a lib/libLLVMARMAsmPrinter.a lib/libLLVMARMDesc.a lib/libLLVMARMDisassembler.a lib/libLLVMARMInfo.a lib/libLLVMARMUtils.a lib/libLLVMAArch64CodeGen.a lib/libLLVMAArch64AsmParser.a lib/libLLVMAArch64AsmPrinter.a lib/libLLVMAArch64Desc.a lib/libLLVMAArch64Disassembler.a lib/libLLVMAArch64Info.a lib/libLLVMAArch64Utils.a lib/libLLVMBitReader.a lib/libLLVMCore.a lib/libLLVMLTO.a lib/libLLVMMC.a lib/libLLVMMCDisassembler.a lib/libLLVMSupport.a lib/libLLVMTarget.a lib/libLLVMX86AsmPrinter.a lib/libLLVMX86Utils.a lib/libLLVMARMDesc.a lib/libLLVMARMAsmPrinter.a lib/libLLVMARMInfo.a lib/libLLVMARMUtils.a lib/libLLVMAsmPrinter.a lib/libLLVMGlobalISel.a lib/libLLVMSelectionDAG.a lib/libLLVMAArch64Desc.a lib/libLLVMAArch64AsmPrinter.a lib/libLLVMAArch64Info.a lib/libLLVMAArch64Utils.a lib/libLLVMMCDisassembler.a lib/libLLVMObjCARCOpts.a lib/libLLVMPasses.a lib/libLLVMCodeGen.a lib/libLLVMTarget.a lib/libLLVMipo.a lib/libLLVMScalarOpts.a lib/libLLVMAggressiveInstCombine.a lib/libLLVMBitWriter.a lib/libLLVMInstCombine.a lib/libLLVMLinker.a lib/libLLVMInstrumentation.a lib/libLLVMVectorize.a lib/libLLVMTransformUtils.a lib/libLLVMAnalysis.a lib/libLLVMObject.a lib/libLLVMMCParser.a lib/libLLVMMC.a lib/libLLVMDebugInfoCodeView.a lib/libLLVMDebugInfoMSF.a lib/libLLVMProfileData.a lib/libLLVMIRReader.a lib/libLLVMBitReader.a lib/libLLVMAsmParser.a lib/libLLVMCore.a lib/libLLVMBinaryFormat.a lib/libLLVMSupport.a -lz -lcurses -lm lib/libLLVMDemangle.a && cd /Users/buildslave/jenkins/workspace/clang-stage2-Rthinlto-release_70/clang-build/Build/tools/lto && xcrun dsymutil /Users/buildslave/jenkins/workspace/clang-stage2-Rthinlto-release_70/clang-build/Build/lib/libLTO.dylib && /usr/bin/strip -Sxl /Users/buildslave/jenkins/workspace/clang-stage2-Rthinlto-release_70/clang-build/Build/lib/libLTO.dylib
FAILED: lib/libLTO.dylib 
: && /Users/buildslave/jenkins/workspace/clang-stage2-Rthinlto-release_70/host-compiler/bin/clang++ -fno-stack-protector -fno-common -Wno-profile-instr-unprofiled -fPIC -fvisibility-inlines-hidden -Werror=date-time -Werror=unguarded-availability-new -std=c++11 -fmodules -fmodules-cache-path=/Users/buildslave/jenkins/workspace/clang-stage2-Rthinlto-release_70/clang-build/Build/module.cache -fcxx-modules -gmodules -Wall -Wextra -Wno-unused-parameter -Wwrite-strings -Wcast-qual -Wmissing-field-initializers -pedantic -Wno-long-long -Wcovered-switch-default -Wnon-virtual-dtor -Wdelete-non-virtual-dtor -Wstring-conversion -fdiagnostics-color -flto=thin -O2 -g -DNDEBUG -isysroot /Applications/Xcode.app/Contents/Developer/Platforms/MacOSX.platform/Developer/SDKs/MacOSX10.14.sdk -dynamiclib -Wl,-headerpad_max_install_names -flto=thin -Wl,-cache_path_lto,/Users/buildslave/jenkins/workspace/clang-stage2-Rthinlto-release_70/clang-build/Build/lto.cache   -Wl,-dead_strip -Wl,-exported_symbols_list,/Users/buildslave/jenkins/workspace/clang-stage2-Rthinlto-release_70/clang-build/Build/tools/lto/LTO.exports -Wl,-object_path_lto,/Users/buildslave/jenkins/workspace/clang-stage2-Rthinlto-release_70/clang-build/Build/tools/lto/./LTO-lto.o -compatibility_version 1 -current_version 3007.1.99 -o lib/libLTO.dylib -install_name @rpath/libLTO.dylib tools/lto/CMakeFiles/LTO.dir/LTODisassembler.cpp.o tools/lto/CMakeFiles/LTO.dir/lto.cpp.o  -Wl,-rpath,@loader_path/../lib lib/libLLVMX86CodeGen.a lib/libLLVMX86AsmParser.a lib/libLLVMX86AsmPrinter.a lib/libLLVMX86Desc.a lib/libLLVMX86Disassembler.a lib/libLLVMX86Info.a lib/libLLVMX86Utils.a lib/libLLVMARMCodeGen.a lib/libLLVMARMAsmParser.a lib/libLLVMARMAsmPrinter.a lib/libLLVMARMDesc.a lib/libLLVMARMDisassembler.a lib/libLLVMARMInfo.a lib/libLLVMARMUtils.a lib/libLLVMAArch64CodeGen.a lib/libLLVMAArch64AsmParser.a lib/libLLVMAArch64AsmPrinter.a lib/libLLVMAArch64Desc.a lib/libLLVMAArch64Disassembler.a lib/libLLVMAArch64Info.a lib/libLLVMAArch64Utils.a lib/libLLVMBitReader.a lib/libLLVMCore.a lib/libLLVMLTO.a lib/libLLVMMC.a lib/libLLVMMCDisassembler.a lib/libLLVMSupport.a lib/libLLVMTarget.a lib/libLLVMX86AsmPrinter.a lib/libLLVMX86Utils.a lib/libLLVMARMDesc.a lib/libLLVMARMAsmPrinter.a lib/libLLVMARMInfo.a lib/libLLVMARMUtils.a lib/libLLVMAsmPrinter.a lib/libLLVMGlobalISel.a lib/libLLVMSelectionDAG.a lib/libLLVMAArch64Desc.a lib/libLLVMAArch64AsmPrinter.a lib/libLLVMAArch64Info.a lib/libLLVMAArch64Utils.a lib/libLLVMMCDisassembler.a lib/libLLVMObjCARCOpts.a lib/libLLVMPasses.a lib/libLLVMCodeGen.a lib/libLLVMTarget.a lib/libLLVMipo.a lib/libLLVMScalarOpts.a lib/libLLVMAggressiveInstCombine.a lib/libLLVMBitWriter.a lib/libLLVMInstCombine.a lib/libLLVMLinker.a lib/libLLVMInstrumentation.a lib/libLLVMVectorize.a lib/libLLVMTransformUtils.a lib/libLLVMAnalysis.a lib/libLLVMObject.a lib/libLLVMMCParser.a lib/libLLVMMC.a lib/libLLVMDebugInfoCodeView.a lib/libLLVMDebugInfoMSF.a lib/libLLVMProfileData.a lib/libLLVMIRReader.a lib/libLLVMBitReader.a lib/libLLVMAsmParser.a lib/libLLVMCore.a lib/libLLVMBinaryFormat.a lib/libLLVMSupport.a -lz -lcurses -lm lib/libLLVMDemangle.a && cd /Users/buildslave/jenkins/workspace/clang-stage2-Rthinlto-release_70/clang-build/Build/tools/lto && xcrun dsymutil /Users/buildslave/jenkins/workspace/clang-stage2-Rthinlto-release_70/clang-build/Build/lib/libLTO.dylib && /usr/bin/strip -Sxl /Users/buildslave/jenkins/workspace/clang-stage2-Rthinlto-release_70/clang-build/Build/lib/libLTO.dylib
clang-7: error: unable to execute command: Bus error: 10
clang-7: error: linker command failed due to signal (use -v to see invocation)
ninja: build stopped: subcommand failed.
Command failed 
Command: ['/usr/local/bin/ninja', '-v', 'install']
Build step 'Execute shell' marked build as failure
[WARNINGS] Skipping publisher since build result is FAILURE
Recording test results
ERROR: Step ‘Publish JUnit test result report’ failed: No test report files were found. Configuration error?
[BFA] Scanning build for known causes...
[BFA] Found failure cause(s):
[BFA] Compile Error from category Compile
[BFA] Ninja target failed from category Compile
[BFA] Missing test results from category Infrastructure
[BFA] Done. 3s
Extended Email Publisher is currently disabled in project settings
Finished: FAILURE