FailedConsole Output

Skipping 78 KB.. Full Log
ze=address,undefined -fno-sanitize=vptr,function -fno-sanitize-recover=all -fsanitize-address-use-after-scope -fsanitize-blacklist=/Users/buildslave/jenkins/workspace/clang-stage2-cmake-RgSan/llvm-project/llvm/utils/sanitizers/ubsan_blacklist.txt -fdiagnostics-color -O2 -g -DNDEBUG -isysroot /Applications/Xcode.app/Contents/Developer/Platforms/MacOSX.platform/Developer/SDKs/MacOSX10.15.sdk   -std=c++14  -fno-exceptions -fno-rtti -MD -MT lib/Support/CMakeFiles/LLVMSupport.dir/Chrono.cpp.o -MF lib/Support/CMakeFiles/LLVMSupport.dir/Chrono.cpp.o.d -o lib/Support/CMakeFiles/LLVMSupport.dir/Chrono.cpp.o -c /Users/buildslave/jenkins/workspace/clang-stage2-cmake-RgSan/llvm-project/llvm/lib/Support/Chrono.cpp
[39/4672] /usr/local/bin/sccache /Users/buildslave/jenkins/workspace/clang-stage2-cmake-RgSan/host-compiler/bin/clang++  -DBUILD_EXAMPLES -DGTEST_HAS_RTTI=0 -D__STDC_CONSTANT_MACROS -D__STDC_FORMAT_MACROS -D__STDC_LIMIT_MACROS -Ilib/Support -I/Users/buildslave/jenkins/workspace/clang-stage2-cmake-RgSan/llvm-project/llvm/lib/Support -Iinclude -I/Users/buildslave/jenkins/workspace/clang-stage2-cmake-RgSan/llvm-project/llvm/include -fPIC -fvisibility-inlines-hidden -Werror=date-time -Werror=unguarded-availability-new -Wall -Wextra -Wno-unused-parameter -Wwrite-strings -Wcast-qual -Wmissing-field-initializers -pedantic -Wno-long-long -Wimplicit-fallthrough -Wcovered-switch-default -Wno-noexcept-type -Wnon-virtual-dtor -Wdelete-non-virtual-dtor -Wsuggest-override -Wstring-conversion -fno-omit-frame-pointer -fsanitize=address,undefined -fno-sanitize=vptr,function -fno-sanitize-recover=all -fsanitize-address-use-after-scope -fsanitize-blacklist=/Users/buildslave/jenkins/workspace/clang-stage2-cmake-RgSan/llvm-project/llvm/utils/sanitizers/ubsan_blacklist.txt -fdiagnostics-color -O2 -g -DNDEBUG -isysroot /Applications/Xcode.app/Contents/Developer/Platforms/MacOSX.platform/Developer/SDKs/MacOSX10.15.sdk   -std=c++14  -fno-exceptions -fno-rtti -MD -MT lib/Support/CMakeFiles/LLVMSupport.dir/APFloat.cpp.o -MF lib/Support/CMakeFiles/LLVMSupport.dir/APFloat.cpp.o.d -o lib/Support/CMakeFiles/LLVMSupport.dir/APFloat.cpp.o -c /Users/buildslave/jenkins/workspace/clang-stage2-cmake-RgSan/llvm-project/llvm/lib/Support/APFloat.cpp
[40/4672] /usr/local/bin/sccache /Users/buildslave/jenkins/workspace/clang-stage2-cmake-RgSan/host-compiler/bin/clang++  -DBUILD_EXAMPLES -DGTEST_HAS_RTTI=0 -D__STDC_CONSTANT_MACROS -D__STDC_FORMAT_MACROS -D__STDC_LIMIT_MACROS -Ilib/Support -I/Users/buildslave/jenkins/workspace/clang-stage2-cmake-RgSan/llvm-project/llvm/lib/Support -Iinclude -I/Users/buildslave/jenkins/workspace/clang-stage2-cmake-RgSan/llvm-project/llvm/include -fPIC -fvisibility-inlines-hidden -Werror=date-time -Werror=unguarded-availability-new -Wall -Wextra -Wno-unused-parameter -Wwrite-strings -Wcast-qual -Wmissing-field-initializers -pedantic -Wno-long-long -Wimplicit-fallthrough -Wcovered-switch-default -Wno-noexcept-type -Wnon-virtual-dtor -Wdelete-non-virtual-dtor -Wsuggest-override -Wstring-conversion -fno-omit-frame-pointer -fsanitize=address,undefined -fno-sanitize=vptr,function -fno-sanitize-recover=all -fsanitize-address-use-after-scope -fsanitize-blacklist=/Users/buildslave/jenkins/workspace/clang-stage2-cmake-RgSan/llvm-project/llvm/utils/sanitizers/ubsan_blacklist.txt -fdiagnostics-color -O2 -g -DNDEBUG -isysroot /Applications/Xcode.app/Contents/Developer/Platforms/MacOSX.platform/Developer/SDKs/MacOSX10.15.sdk   -std=c++14  -fno-exceptions -fno-rtti -MD -MT lib/Support/CMakeFiles/LLVMSupport.dir/CRC.cpp.o -MF lib/Support/CMakeFiles/LLVMSupport.dir/CRC.cpp.o.d -o lib/Support/CMakeFiles/LLVMSupport.dir/CRC.cpp.o -c /Users/buildslave/jenkins/workspace/clang-stage2-cmake-RgSan/llvm-project/llvm/lib/Support/CRC.cpp
[41/4672] /usr/local/bin/sccache /Users/buildslave/jenkins/workspace/clang-stage2-cmake-RgSan/host-compiler/bin/clang++  -DBUILD_EXAMPLES -DGTEST_HAS_RTTI=0 -D__STDC_CONSTANT_MACROS -D__STDC_FORMAT_MACROS -D__STDC_LIMIT_MACROS -Ilib/Demangle -I/Users/buildslave/jenkins/workspace/clang-stage2-cmake-RgSan/llvm-project/llvm/lib/Demangle -Iinclude -I/Users/buildslave/jenkins/workspace/clang-stage2-cmake-RgSan/llvm-project/llvm/include -fPIC -fvisibility-inlines-hidden -Werror=date-time -Werror=unguarded-availability-new -Wall -Wextra -Wno-unused-parameter -Wwrite-strings -Wcast-qual -Wmissing-field-initializers -pedantic -Wno-long-long -Wimplicit-fallthrough -Wcovered-switch-default -Wno-noexcept-type -Wnon-virtual-dtor -Wdelete-non-virtual-dtor -Wsuggest-override -Wstring-conversion -fno-omit-frame-pointer -fsanitize=address,undefined -fno-sanitize=vptr,function -fno-sanitize-recover=all -fsanitize-address-use-after-scope -fsanitize-blacklist=/Users/buildslave/jenkins/workspace/clang-stage2-cmake-RgSan/llvm-project/llvm/utils/sanitizers/ubsan_blacklist.txt -fdiagnostics-color -O2 -g -DNDEBUG -isysroot /Applications/Xcode.app/Contents/Developer/Platforms/MacOSX.platform/Developer/SDKs/MacOSX10.15.sdk    -fno-exceptions -fno-rtti -std=c++14 -MD -MT lib/Demangle/CMakeFiles/LLVMDemangle.dir/ItaniumDemangle.cpp.o -MF lib/Demangle/CMakeFiles/LLVMDemangle.dir/ItaniumDemangle.cpp.o.d -o lib/Demangle/CMakeFiles/LLVMDemangle.dir/ItaniumDemangle.cpp.o -c /Users/buildslave/jenkins/workspace/clang-stage2-cmake-RgSan/llvm-project/llvm/lib/Demangle/ItaniumDemangle.cpp
[42/4672] : && "/Applications/Xcode.app/Contents/Developer/Toolchains/XcodeDefault.xctoolchain/usr/bin/libtool" -static -no_warning_for_no_symbols -o lib/libLLVMDemangle.a  lib/Demangle/CMakeFiles/LLVMDemangle.dir/Demangle.cpp.o lib/Demangle/CMakeFiles/LLVMDemangle.dir/ItaniumDemangle.cpp.o lib/Demangle/CMakeFiles/LLVMDemangle.dir/MicrosoftDemangle.cpp.o lib/Demangle/CMakeFiles/LLVMDemangle.dir/MicrosoftDemangleNodes.cpp.o && :
[43/4672] /usr/local/bin/sccache /Users/buildslave/jenkins/workspace/clang-stage2-cmake-RgSan/host-compiler/bin/clang++  -DBUILD_EXAMPLES -DGTEST_HAS_RTTI=0 -D__STDC_CONSTANT_MACROS -D__STDC_FORMAT_MACROS -D__STDC_LIMIT_MACROS -Ilib/Support -I/Users/buildslave/jenkins/workspace/clang-stage2-cmake-RgSan/llvm-project/llvm/lib/Support -Iinclude -I/Users/buildslave/jenkins/workspace/clang-stage2-cmake-RgSan/llvm-project/llvm/include -fPIC -fvisibility-inlines-hidden -Werror=date-time -Werror=unguarded-availability-new -Wall -Wextra -Wno-unused-parameter -Wwrite-strings -Wcast-qual -Wmissing-field-initializers -pedantic -Wno-long-long -Wimplicit-fallthrough -Wcovered-switch-default -Wno-noexcept-type -Wnon-virtual-dtor -Wdelete-non-virtual-dtor -Wsuggest-override -Wstring-conversion -fno-omit-frame-pointer -fsanitize=address,undefined -fno-sanitize=vptr,function -fno-sanitize-recover=all -fsanitize-address-use-after-scope -fsanitize-blacklist=/Users/buildslave/jenkins/workspace/clang-stage2-cmake-RgSan/llvm-project/llvm/utils/sanitizers/ubsan_blacklist.txt -fdiagnostics-color -O2 -g -DNDEBUG -isysroot /Applications/Xcode.app/Contents/Developer/Platforms/MacOSX.platform/Developer/SDKs/MacOSX10.15.sdk   -std=c++14  -fno-exceptions -fno-rtti -MD -MT lib/Support/CMakeFiles/LLVMSupport.dir/Compression.cpp.o -MF lib/Support/CMakeFiles/LLVMSupport.dir/Compression.cpp.o.d -o lib/Support/CMakeFiles/LLVMSupport.dir/Compression.cpp.o -c /Users/buildslave/jenkins/workspace/clang-stage2-cmake-RgSan/llvm-project/llvm/lib/Support/Compression.cpp
[44/4672] /usr/local/bin/sccache /Users/buildslave/jenkins/workspace/clang-stage2-cmake-RgSan/host-compiler/bin/clang++  -DBUILD_EXAMPLES -DGTEST_HAS_RTTI=0 -D__STDC_CONSTANT_MACROS -D__STDC_FORMAT_MACROS -D__STDC_LIMIT_MACROS -Ilib/Support -I/Users/buildslave/jenkins/workspace/clang-stage2-cmake-RgSan/llvm-project/llvm/lib/Support -Iinclude -I/Users/buildslave/jenkins/workspace/clang-stage2-cmake-RgSan/llvm-project/llvm/include -fPIC -fvisibility-inlines-hidden -Werror=date-time -Werror=unguarded-availability-new -Wall -Wextra -Wno-unused-parameter -Wwrite-strings -Wcast-qual -Wmissing-field-initializers -pedantic -Wno-long-long -Wimplicit-fallthrough -Wcovered-switch-default -Wno-noexcept-type -Wnon-virtual-dtor -Wdelete-non-virtual-dtor -Wsuggest-override -Wstring-conversion -fno-omit-frame-pointer -fsanitize=address,undefined -fno-sanitize=vptr,function -fno-sanitize-recover=all -fsanitize-address-use-after-scope -fsanitize-blacklist=/Users/buildslave/jenkins/workspace/clang-stage2-cmake-RgSan/llvm-project/llvm/utils/sanitizers/ubsan_blacklist.txt -fdiagnostics-color -O2 -g -DNDEBUG -isysroot /Applications/Xcode.app/Contents/Developer/Platforms/MacOSX.platform/Developer/SDKs/MacOSX10.15.sdk   -std=c++14  -fno-exceptions -fno-rtti -MD -MT lib/Support/CMakeFiles/LLVMSupport.dir/CodeGenCoverage.cpp.o -MF lib/Support/CMakeFiles/LLVMSupport.dir/CodeGenCoverage.cpp.o.d -o lib/Support/CMakeFiles/LLVMSupport.dir/CodeGenCoverage.cpp.o -c /Users/buildslave/jenkins/workspace/clang-stage2-cmake-RgSan/llvm-project/llvm/lib/Support/CodeGenCoverage.cpp
[45/4672] /usr/local/bin/sccache /Users/buildslave/jenkins/workspace/clang-stage2-cmake-RgSan/host-compiler/bin/clang++  -DBUILD_EXAMPLES -DGTEST_HAS_RTTI=0 -D__STDC_CONSTANT_MACROS -D__STDC_FORMAT_MACROS -D__STDC_LIMIT_MACROS -Ilib/Support -I/Users/buildslave/jenkins/workspace/clang-stage2-cmake-RgSan/llvm-project/llvm/lib/Support -Iinclude -I/Users/buildslave/jenkins/workspace/clang-stage2-cmake-RgSan/llvm-project/llvm/include -fPIC -fvisibility-inlines-hidden -Werror=date-time -Werror=unguarded-availability-new -Wall -Wextra -Wno-unused-parameter -Wwrite-strings -Wcast-qual -Wmissing-field-initializers -pedantic -Wno-long-long -Wimplicit-fallthrough -Wcovered-switch-default -Wno-noexcept-type -Wnon-virtual-dtor -Wdelete-non-virtual-dtor -Wsuggest-override -Wstring-conversion -fno-omit-frame-pointer -fsanitize=address,undefined -fno-sanitize=vptr,function -fno-sanitize-recover=all -fsanitize-address-use-after-scope -fsanitize-blacklist=/Users/buildslave/jenkins/workspace/clang-stage2-cmake-RgSan/llvm-project/llvm/utils/sanitizers/ubsan_blacklist.txt -fdiagnostics-color -O2 -g -DNDEBUG -isysroot /Applications/Xcode.app/Contents/Developer/Platforms/MacOSX.platform/Developer/SDKs/MacOSX10.15.sdk   -std=c++14  -fno-exceptions -fno-rtti -MD -MT lib/Support/CMakeFiles/LLVMSupport.dir/ConvertUTF.cpp.o -MF lib/Support/CMakeFiles/LLVMSupport.dir/ConvertUTF.cpp.o.d -o lib/Support/CMakeFiles/LLVMSupport.dir/ConvertUTF.cpp.o -c /Users/buildslave/jenkins/workspace/clang-stage2-cmake-RgSan/llvm-project/llvm/lib/Support/ConvertUTF.cpp
[46/4672] /usr/local/bin/sccache /Users/buildslave/jenkins/workspace/clang-stage2-cmake-RgSan/host-compiler/bin/clang++  -DBUILD_EXAMPLES -DGTEST_HAS_RTTI=0 -D__STDC_CONSTANT_MACROS -D__STDC_FORMAT_MACROS -D__STDC_LIMIT_MACROS -Ilib/Support -I/Users/buildslave/jenkins/workspace/clang-stage2-cmake-RgSan/llvm-project/llvm/lib/Support -Iinclude -I/Users/buildslave/jenkins/workspace/clang-stage2-cmake-RgSan/llvm-project/llvm/include -fPIC -fvisibility-inlines-hidden -Werror=date-time -Werror=unguarded-availability-new -Wall -Wextra -Wno-unused-parameter -Wwrite-strings -Wcast-qual -Wmissing-field-initializers -pedantic -Wno-long-long -Wimplicit-fallthrough -Wcovered-switch-default -Wno-noexcept-type -Wnon-virtual-dtor -Wdelete-non-virtual-dtor -Wsuggest-override -Wstring-conversion -fno-omit-frame-pointer -fsanitize=address,undefined -fno-sanitize=vptr,function -fno-sanitize-recover=all -fsanitize-address-use-after-scope -fsanitize-blacklist=/Users/buildslave/jenkins/workspace/clang-stage2-cmake-RgSan/llvm-project/llvm/utils/sanitizers/ubsan_blacklist.txt -fdiagnostics-color -O2 -g -DNDEBUG -isysroot /Applications/Xcode.app/Contents/Developer/Platforms/MacOSX.platform/Developer/SDKs/MacOSX10.15.sdk   -std=c++14  -fno-exceptions -fno-rtti -MD -MT lib/Support/CMakeFiles/LLVMSupport.dir/CrashRecoveryContext.cpp.o -MF lib/Support/CMakeFiles/LLVMSupport.dir/CrashRecoveryContext.cpp.o.d -o lib/Support/CMakeFiles/LLVMSupport.dir/CrashRecoveryContext.cpp.o -c /Users/buildslave/jenkins/workspace/clang-stage2-cmake-RgSan/llvm-project/llvm/lib/Support/CrashRecoveryContext.cpp
[47/4672] /usr/local/bin/sccache /Users/buildslave/jenkins/workspace/clang-stage2-cmake-RgSan/host-compiler/bin/clang++  -DBUILD_EXAMPLES -DGTEST_HAS_RTTI=0 -D__STDC_CONSTANT_MACROS -D__STDC_FORMAT_MACROS -D__STDC_LIMIT_MACROS -Ilib/Support -I/Users/buildslave/jenkins/workspace/clang-stage2-cmake-RgSan/llvm-project/llvm/lib/Support -Iinclude -I/Users/buildslave/jenkins/workspace/clang-stage2-cmake-RgSan/llvm-project/llvm/include -fPIC -fvisibility-inlines-hidden -Werror=date-time -Werror=unguarded-availability-new -Wall -Wextra -Wno-unused-parameter -Wwrite-strings -Wcast-qual -Wmissing-field-initializers -pedantic -Wno-long-long -Wimplicit-fallthrough -Wcovered-switch-default -Wno-noexcept-type -Wnon-virtual-dtor -Wdelete-non-virtual-dtor -Wsuggest-override -Wstring-conversion -fno-omit-frame-pointer -fsanitize=address,undefined -fno-sanitize=vptr,function -fno-sanitize-recover=all -fsanitize-address-use-after-scope -fsanitize-blacklist=/Users/buildslave/jenkins/workspace/clang-stage2-cmake-RgSan/llvm-project/llvm/utils/sanitizers/ubsan_blacklist.txt -fdiagnostics-color -O2 -g -DNDEBUG -isysroot /Applications/Xcode.app/Contents/Developer/Platforms/MacOSX.platform/Developer/SDKs/MacOSX10.15.sdk   -std=c++14  -fno-exceptions -fno-rtti -MD -MT lib/Support/CMakeFiles/LLVMSupport.dir/ConvertUTFWrapper.cpp.o -MF lib/Support/CMakeFiles/LLVMSupport.dir/ConvertUTFWrapper.cpp.o.d -o lib/Support/CMakeFiles/LLVMSupport.dir/ConvertUTFWrapper.cpp.o -c /Users/buildslave/jenkins/workspace/clang-stage2-cmake-RgSan/llvm-project/llvm/lib/Support/ConvertUTFWrapper.cpp
[48/4672] /usr/local/bin/sccache /Users/buildslave/jenkins/workspace/clang-stage2-cmake-RgSan/host-compiler/bin/clang++  -DBUILD_EXAMPLES -DGTEST_HAS_RTTI=0 -D__STDC_CONSTANT_MACROS -D__STDC_FORMAT_MACROS -D__STDC_LIMIT_MACROS -Ilib/Support -I/Users/buildslave/jenkins/workspace/clang-stage2-cmake-RgSan/llvm-project/llvm/lib/Support -Iinclude -I/Users/buildslave/jenkins/workspace/clang-stage2-cmake-RgSan/llvm-project/llvm/include -fPIC -fvisibility-inlines-hidden -Werror=date-time -Werror=unguarded-availability-new -Wall -Wextra -Wno-unused-parameter -Wwrite-strings -Wcast-qual -Wmissing-field-initializers -pedantic -Wno-long-long -Wimplicit-fallthrough -Wcovered-switch-default -Wno-noexcept-type -Wnon-virtual-dtor -Wdelete-non-virtual-dtor -Wsuggest-override -Wstring-conversion -fno-omit-frame-pointer -fsanitize=address,undefined -fno-sanitize=vptr,function -fno-sanitize-recover=all -fsanitize-address-use-after-scope -fsanitize-blacklist=/Users/buildslave/jenkins/workspace/clang-stage2-cmake-RgSan/llvm-project/llvm/utils/sanitizers/ubsan_blacklist.txt -fdiagnostics-color -O2 -g -DNDEBUG -isysroot /Applications/Xcode.app/Contents/Developer/Platforms/MacOSX.platform/Developer/SDKs/MacOSX10.15.sdk   -std=c++14  -fno-exceptions -fno-rtti -MD -MT lib/Support/CMakeFiles/LLVMSupport.dir/CachePruning.cpp.o -MF lib/Support/CMakeFiles/LLVMSupport.dir/CachePruning.cpp.o.d -o lib/Support/CMakeFiles/LLVMSupport.dir/CachePruning.cpp.o -c /Users/buildslave/jenkins/workspace/clang-stage2-cmake-RgSan/llvm-project/llvm/lib/Support/CachePruning.cpp
[49/4672] /usr/local/bin/sccache /Users/buildslave/jenkins/workspace/clang-stage2-cmake-RgSan/host-compiler/bin/clang++  -DBUILD_EXAMPLES -DGTEST_HAS_RTTI=0 -D__STDC_CONSTANT_MACROS -D__STDC_FORMAT_MACROS -D__STDC_LIMIT_MACROS -Ilib/Support -I/Users/buildslave/jenkins/workspace/clang-stage2-cmake-RgSan/llvm-project/llvm/lib/Support -Iinclude -I/Users/buildslave/jenkins/workspace/clang-stage2-cmake-RgSan/llvm-project/llvm/include -fPIC -fvisibility-inlines-hidden -Werror=date-time -Werror=unguarded-availability-new -Wall -Wextra -Wno-unused-parameter -Wwrite-strings -Wcast-qual -Wmissing-field-initializers -pedantic -Wno-long-long -Wimplicit-fallthrough -Wcovered-switch-default -Wno-noexcept-type -Wnon-virtual-dtor -Wdelete-non-virtual-dtor -Wsuggest-override -Wstring-conversion -fno-omit-frame-pointer -fsanitize=address,undefined -fno-sanitize=vptr,function -fno-sanitize-recover=all -fsanitize-address-use-after-scope -fsanitize-blacklist=/Users/buildslave/jenkins/workspace/clang-stage2-cmake-RgSan/llvm-project/llvm/utils/sanitizers/ubsan_blacklist.txt -fdiagnostics-color -O2 -g -DNDEBUG -isysroot /Applications/Xcode.app/Contents/Developer/Platforms/MacOSX.platform/Developer/SDKs/MacOSX10.15.sdk   -std=c++14  -fno-exceptions -fno-rtti -MD -MT lib/Support/CMakeFiles/LLVMSupport.dir/DataExtractor.cpp.o -MF lib/Support/CMakeFiles/LLVMSupport.dir/DataExtractor.cpp.o.d -o lib/Support/CMakeFiles/LLVMSupport.dir/DataExtractor.cpp.o -c /Users/buildslave/jenkins/workspace/clang-stage2-cmake-RgSan/llvm-project/llvm/lib/Support/DataExtractor.cpp
[50/4672] /usr/local/bin/sccache /Users/buildslave/jenkins/workspace/clang-stage2-cmake-RgSan/host-compiler/bin/clang++  -DBUILD_EXAMPLES -DGTEST_HAS_RTTI=0 -D__STDC_CONSTANT_MACROS -D__STDC_FORMAT_MACROS -D__STDC_LIMIT_MACROS -Ilib/Support -I/Users/buildslave/jenkins/workspace/clang-stage2-cmake-RgSan/llvm-project/llvm/lib/Support -Iinclude -I/Users/buildslave/jenkins/workspace/clang-stage2-cmake-RgSan/llvm-project/llvm/include -fPIC -fvisibility-inlines-hidden -Werror=date-time -Werror=unguarded-availability-new -Wall -Wextra -Wno-unused-parameter -Wwrite-strings -Wcast-qual -Wmissing-field-initializers -pedantic -Wno-long-long -Wimplicit-fallthrough -Wcovered-switch-default -Wno-noexcept-type -Wnon-virtual-dtor -Wdelete-non-virtual-dtor -Wsuggest-override -Wstring-conversion -fno-omit-frame-pointer -fsanitize=address,undefined -fno-sanitize=vptr,function -fno-sanitize-recover=all -fsanitize-address-use-after-scope -fsanitize-blacklist=/Users/buildslave/jenkins/workspace/clang-stage2-cmake-RgSan/llvm-project/llvm/utils/sanitizers/ubsan_blacklist.txt -fdiagnostics-color -O2 -g -DNDEBUG -isysroot /Applications/Xcode.app/Contents/Developer/Platforms/MacOSX.platform/Developer/SDKs/MacOSX10.15.sdk   -std=c++14  -fno-exceptions -fno-rtti -MD -MT lib/Support/CMakeFiles/LLVMSupport.dir/DJB.cpp.o -MF lib/Support/CMakeFiles/LLVMSupport.dir/DJB.cpp.o.d -o lib/Support/CMakeFiles/LLVMSupport.dir/DJB.cpp.o -c /Users/buildslave/jenkins/workspace/clang-stage2-cmake-RgSan/llvm-project/llvm/lib/Support/DJB.cpp
[51/4672] /usr/local/bin/sccache /Users/buildslave/jenkins/workspace/clang-stage2-cmake-RgSan/host-compiler/bin/clang++  -DBUILD_EXAMPLES -DGTEST_HAS_RTTI=0 -D__STDC_CONSTANT_MACROS -D__STDC_FORMAT_MACROS -D__STDC_LIMIT_MACROS -Ilib/Support -I/Users/buildslave/jenkins/workspace/clang-stage2-cmake-RgSan/llvm-project/llvm/lib/Support -Iinclude -I/Users/buildslave/jenkins/workspace/clang-stage2-cmake-RgSan/llvm-project/llvm/include -fPIC -fvisibility-inlines-hidden -Werror=date-time -Werror=unguarded-availability-new -Wall -Wextra -Wno-unused-parameter -Wwrite-strings -Wcast-qual -Wmissing-field-initializers -pedantic -Wno-long-long -Wimplicit-fallthrough -Wcovered-switch-default -Wno-noexcept-type -Wnon-virtual-dtor -Wdelete-non-virtual-dtor -Wsuggest-override -Wstring-conversion -fno-omit-frame-pointer -fsanitize=address,undefined -fno-sanitize=vptr,function -fno-sanitize-recover=all -fsanitize-address-use-after-scope -fsanitize-blacklist=/Users/buildslave/jenkins/workspace/clang-stage2-cmake-RgSan/llvm-project/llvm/utils/sanitizers/ubsan_blacklist.txt -fdiagnostics-color -O2 -g -DNDEBUG -isysroot /Applications/Xcode.app/Contents/Developer/Platforms/MacOSX.platform/Developer/SDKs/MacOSX10.15.sdk   -std=c++14  -fno-exceptions -fno-rtti -MD -MT lib/Support/CMakeFiles/LLVMSupport.dir/Debug.cpp.o -MF lib/Support/CMakeFiles/LLVMSupport.dir/Debug.cpp.o.d -o lib/Support/CMakeFiles/LLVMSupport.dir/Debug.cpp.o -c /Users/buildslave/jenkins/workspace/clang-stage2-cmake-RgSan/llvm-project/llvm/lib/Support/Debug.cpp
[52/4672] /usr/local/bin/sccache /Users/buildslave/jenkins/workspace/clang-stage2-cmake-RgSan/host-compiler/bin/clang++  -DBUILD_EXAMPLES -DGTEST_HAS_RTTI=0 -D__STDC_CONSTANT_MACROS -D__STDC_FORMAT_MACROS -D__STDC_LIMIT_MACROS -Ilib/Support -I/Users/buildslave/jenkins/workspace/clang-stage2-cmake-RgSan/llvm-project/llvm/lib/Support -Iinclude -I/Users/buildslave/jenkins/workspace/clang-stage2-cmake-RgSan/llvm-project/llvm/include -fPIC -fvisibility-inlines-hidden -Werror=date-time -Werror=unguarded-availability-new -Wall -Wextra -Wno-unused-parameter -Wwrite-strings -Wcast-qual -Wmissing-field-initializers -pedantic -Wno-long-long -Wimplicit-fallthrough -Wcovered-switch-default -Wno-noexcept-type -Wnon-virtual-dtor -Wdelete-non-virtual-dtor -Wsuggest-override -Wstring-conversion -fno-omit-frame-pointer -fsanitize=address,undefined -fno-sanitize=vptr,function -fno-sanitize-recover=all -fsanitize-address-use-after-scope -fsanitize-blacklist=/Users/buildslave/jenkins/workspace/clang-stage2-cmake-RgSan/llvm-project/llvm/utils/sanitizers/ubsan_blacklist.txt -fdiagnostics-color -O2 -g -DNDEBUG -isysroot /Applications/Xcode.app/Contents/Developer/Platforms/MacOSX.platform/Developer/SDKs/MacOSX10.15.sdk   -std=c++14  -fno-exceptions -fno-rtti -MD -MT lib/Support/CMakeFiles/LLVMSupport.dir/DeltaAlgorithm.cpp.o -MF lib/Support/CMakeFiles/LLVMSupport.dir/DeltaAlgorithm.cpp.o.d -o lib/Support/CMakeFiles/LLVMSupport.dir/DeltaAlgorithm.cpp.o -c /Users/buildslave/jenkins/workspace/clang-stage2-cmake-RgSan/llvm-project/llvm/lib/Support/DeltaAlgorithm.cpp
[53/4672] /usr/local/bin/sccache /Users/buildslave/jenkins/workspace/clang-stage2-cmake-RgSan/host-compiler/bin/clang++  -DBUILD_EXAMPLES -DGTEST_HAS_RTTI=0 -D__STDC_CONSTANT_MACROS -D__STDC_FORMAT_MACROS -D__STDC_LIMIT_MACROS -Ilib/Support -I/Users/buildslave/jenkins/workspace/clang-stage2-cmake-RgSan/llvm-project/llvm/lib/Support -Iinclude -I/Users/buildslave/jenkins/workspace/clang-stage2-cmake-RgSan/llvm-project/llvm/include -fPIC -fvisibility-inlines-hidden -Werror=date-time -Werror=unguarded-availability-new -Wall -Wextra -Wno-unused-parameter -Wwrite-strings -Wcast-qual -Wmissing-field-initializers -pedantic -Wno-long-long -Wimplicit-fallthrough -Wcovered-switch-default -Wno-noexcept-type -Wnon-virtual-dtor -Wdelete-non-virtual-dtor -Wsuggest-override -Wstring-conversion -fno-omit-frame-pointer -fsanitize=address,undefined -fno-sanitize=vptr,function -fno-sanitize-recover=all -fsanitize-address-use-after-scope -fsanitize-blacklist=/Users/buildslave/jenkins/workspace/clang-stage2-cmake-RgSan/llvm-project/llvm/utils/sanitizers/ubsan_blacklist.txt -fdiagnostics-color -O2 -g -DNDEBUG -isysroot /Applications/Xcode.app/Contents/Developer/Platforms/MacOSX.platform/Developer/SDKs/MacOSX10.15.sdk   -std=c++14  -fno-exceptions -fno-rtti -MD -MT lib/Support/CMakeFiles/LLVMSupport.dir/ExtensibleRTTI.cpp.o -MF lib/Support/CMakeFiles/LLVMSupport.dir/ExtensibleRTTI.cpp.o.d -o lib/Support/CMakeFiles/LLVMSupport.dir/ExtensibleRTTI.cpp.o -c /Users/buildslave/jenkins/workspace/clang-stage2-cmake-RgSan/llvm-project/llvm/lib/Support/ExtensibleRTTI.cpp
[54/4672] /usr/local/bin/sccache /Users/buildslave/jenkins/workspace/clang-stage2-cmake-RgSan/host-compiler/bin/clang++  -DBUILD_EXAMPLES -DGTEST_HAS_RTTI=0 -D__STDC_CONSTANT_MACROS -D__STDC_FORMAT_MACROS -D__STDC_LIMIT_MACROS -Ilib/Support -I/Users/buildslave/jenkins/workspace/clang-stage2-cmake-RgSan/llvm-project/llvm/lib/Support -Iinclude -I/Users/buildslave/jenkins/workspace/clang-stage2-cmake-RgSan/llvm-project/llvm/include -fPIC -fvisibility-inlines-hidden -Werror=date-time -Werror=unguarded-availability-new -Wall -Wextra -Wno-unused-parameter -Wwrite-strings -Wcast-qual -Wmissing-field-initializers -pedantic -Wno-long-long -Wimplicit-fallthrough -Wcovered-switch-default -Wno-noexcept-type -Wnon-virtual-dtor -Wdelete-non-virtual-dtor -Wsuggest-override -Wstring-conversion -fno-omit-frame-pointer -fsanitize=address,undefined -fno-sanitize=vptr,function -fno-sanitize-recover=all -fsanitize-address-use-after-scope -fsanitize-blacklist=/Users/buildslave/jenkins/workspace/clang-stage2-cmake-RgSan/llvm-project/llvm/utils/sanitizers/ubsan_blacklist.txt -fdiagnostics-color -O2 -g -DNDEBUG -isysroot /Applications/Xcode.app/Contents/Developer/Platforms/MacOSX.platform/Developer/SDKs/MacOSX10.15.sdk   -std=c++14  -fno-exceptions -fno-rtti -MD -MT lib/Support/CMakeFiles/LLVMSupport.dir/ELFAttributes.cpp.o -MF lib/Support/CMakeFiles/LLVMSupport.dir/ELFAttributes.cpp.o.d -o lib/Support/CMakeFiles/LLVMSupport.dir/ELFAttributes.cpp.o -c /Users/buildslave/jenkins/workspace/clang-stage2-cmake-RgSan/llvm-project/llvm/lib/Support/ELFAttributes.cpp
[55/4672] /usr/local/bin/sccache /Users/buildslave/jenkins/workspace/clang-stage2-cmake-RgSan/host-compiler/bin/clang++  -DBUILD_EXAMPLES -DGTEST_HAS_RTTI=0 -D__STDC_CONSTANT_MACROS -D__STDC_FORMAT_MACROS -D__STDC_LIMIT_MACROS -Ilib/Support -I/Users/buildslave/jenkins/workspace/clang-stage2-cmake-RgSan/llvm-project/llvm/lib/Support -Iinclude -I/Users/buildslave/jenkins/workspace/clang-stage2-cmake-RgSan/llvm-project/llvm/include -fPIC -fvisibility-inlines-hidden -Werror=date-time -Werror=unguarded-availability-new -Wall -Wextra -Wno-unused-parameter -Wwrite-strings -Wcast-qual -Wmissing-field-initializers -pedantic -Wno-long-long -Wimplicit-fallthrough -Wcovered-switch-default -Wno-noexcept-type -Wnon-virtual-dtor -Wdelete-non-virtual-dtor -Wsuggest-override -Wstring-conversion -fno-omit-frame-pointer -fsanitize=address,undefined -fno-sanitize=vptr,function -fno-sanitize-recover=all -fsanitize-address-use-after-scope -fsanitize-blacklist=/Users/buildslave/jenkins/workspace/clang-stage2-cmake-RgSan/llvm-project/llvm/utils/sanitizers/ubsan_blacklist.txt -fdiagnostics-color -O2 -g -DNDEBUG -isysroot /Applications/Xcode.app/Contents/Developer/Platforms/MacOSX.platform/Developer/SDKs/MacOSX10.15.sdk   -std=c++14  -fno-exceptions -fno-rtti -MD -MT lib/Support/CMakeFiles/LLVMSupport.dir/ErrorHandling.cpp.o -MF lib/Support/CMakeFiles/LLVMSupport.dir/ErrorHandling.cpp.o.d -o lib/Support/CMakeFiles/LLVMSupport.dir/ErrorHandling.cpp.o -c /Users/buildslave/jenkins/workspace/clang-stage2-cmake-RgSan/llvm-project/llvm/lib/Support/ErrorHandling.cpp
[56/4672] /usr/local/bin/sccache /Users/buildslave/jenkins/workspace/clang-stage2-cmake-RgSan/host-compiler/bin/clang++  -DBUILD_EXAMPLES -DGTEST_HAS_RTTI=0 -D__STDC_CONSTANT_MACROS -D__STDC_FORMAT_MACROS -D__STDC_LIMIT_MACROS -Ilib/Support -I/Users/buildslave/jenkins/workspace/clang-stage2-cmake-RgSan/llvm-project/llvm/lib/Support -Iinclude -I/Users/buildslave/jenkins/workspace/clang-stage2-cmake-RgSan/llvm-project/llvm/include -fPIC -fvisibility-inlines-hidden -Werror=date-time -Werror=unguarded-availability-new -Wall -Wextra -Wno-unused-parameter -Wwrite-strings -Wcast-qual -Wmissing-field-initializers -pedantic -Wno-long-long -Wimplicit-fallthrough -Wcovered-switch-default -Wno-noexcept-type -Wnon-virtual-dtor -Wdelete-non-virtual-dtor -Wsuggest-override -Wstring-conversion -fno-omit-frame-pointer -fsanitize=address,undefined -fno-sanitize=vptr,function -fno-sanitize-recover=all -fsanitize-address-use-after-scope -fsanitize-blacklist=/Users/buildslave/jenkins/workspace/clang-stage2-cmake-RgSan/llvm-project/llvm/utils/sanitizers/ubsan_blacklist.txt -fdiagnostics-color -O2 -g -DNDEBUG -isysroot /Applications/Xcode.app/Contents/Developer/Platforms/MacOSX.platform/Developer/SDKs/MacOSX10.15.sdk   -std=c++14  -fno-exceptions -fno-rtti -MD -MT lib/Support/CMakeFiles/LLVMSupport.dir/DAGDeltaAlgorithm.cpp.o -MF lib/Support/CMakeFiles/LLVMSupport.dir/DAGDeltaAlgorithm.cpp.o.d -o lib/Support/CMakeFiles/LLVMSupport.dir/DAGDeltaAlgorithm.cpp.o -c /Users/buildslave/jenkins/workspace/clang-stage2-cmake-RgSan/llvm-project/llvm/lib/Support/DAGDeltaAlgorithm.cpp
[57/4672] /usr/local/bin/sccache /Users/buildslave/jenkins/workspace/clang-stage2-cmake-RgSan/host-compiler/bin/clang++  -DBUILD_EXAMPLES -DGTEST_HAS_RTTI=0 -D__STDC_CONSTANT_MACROS -D__STDC_FORMAT_MACROS -D__STDC_LIMIT_MACROS -Ilib/Support -I/Users/buildslave/jenkins/workspace/clang-stage2-cmake-RgSan/llvm-project/llvm/lib/Support -Iinclude -I/Users/buildslave/jenkins/workspace/clang-stage2-cmake-RgSan/llvm-project/llvm/include -fPIC -fvisibility-inlines-hidden -Werror=date-time -Werror=unguarded-availability-new -Wall -Wextra -Wno-unused-parameter -Wwrite-strings -Wcast-qual -Wmissing-field-initializers -pedantic -Wno-long-long -Wimplicit-fallthrough -Wcovered-switch-default -Wno-noexcept-type -Wnon-virtual-dtor -Wdelete-non-virtual-dtor -Wsuggest-override -Wstring-conversion -fno-omit-frame-pointer -fsanitize=address,undefined -fno-sanitize=vptr,function -fno-sanitize-recover=all -fsanitize-address-use-after-scope -fsanitize-blacklist=/Users/buildslave/jenkins/workspace/clang-stage2-cmake-RgSan/llvm-project/llvm/utils/sanitizers/ubsan_blacklist.txt -fdiagnostics-color -O2 -g -DNDEBUG -isysroot /Applications/Xcode.app/Contents/Developer/Platforms/MacOSX.platform/Developer/SDKs/MacOSX10.15.sdk   -std=c++14  -fno-exceptions -fno-rtti -MD -MT lib/Support/CMakeFiles/LLVMSupport.dir/DebugCounter.cpp.o -MF lib/Support/CMakeFiles/LLVMSupport.dir/DebugCounter.cpp.o.d -o lib/Support/CMakeFiles/LLVMSupport.dir/DebugCounter.cpp.o -c /Users/buildslave/jenkins/workspace/clang-stage2-cmake-RgSan/llvm-project/llvm/lib/Support/DebugCounter.cpp
[58/4672] /usr/local/bin/sccache /Users/buildslave/jenkins/workspace/clang-stage2-cmake-RgSan/host-compiler/bin/clang++  -DBUILD_EXAMPLES -DGTEST_HAS_RTTI=0 -D__STDC_CONSTANT_MACROS -D__STDC_FORMAT_MACROS -D__STDC_LIMIT_MACROS -Ilib/Support -I/Users/buildslave/jenkins/workspace/clang-stage2-cmake-RgSan/llvm-project/llvm/lib/Support -Iinclude -I/Users/buildslave/jenkins/workspace/clang-stage2-cmake-RgSan/llvm-project/llvm/include -fPIC -fvisibility-inlines-hidden -Werror=date-time -Werror=unguarded-availability-new -Wall -Wextra -Wno-unused-parameter -Wwrite-strings -Wcast-qual -Wmissing-field-initializers -pedantic -Wno-long-long -Wimplicit-fallthrough -Wcovered-switch-default -Wno-noexcept-type -Wnon-virtual-dtor -Wdelete-non-virtual-dtor -Wsuggest-override -Wstring-conversion -fno-omit-frame-pointer -fsanitize=address,undefined -fno-sanitize=vptr,function -fno-sanitize-recover=all -fsanitize-address-use-after-scope -fsanitize-blacklist=/Users/buildslave/jenkins/workspace/clang-stage2-cmake-RgSan/llvm-project/llvm/utils/sanitizers/ubsan_blacklist.txt -fdiagnostics-color -O2 -g -DNDEBUG -isysroot /Applications/Xcode.app/Contents/Developer/Platforms/MacOSX.platform/Developer/SDKs/MacOSX10.15.sdk   -std=c++14  -fno-exceptions -fno-rtti -MD -MT lib/Support/CMakeFiles/LLVMSupport.dir/ELFAttributeParser.cpp.o -MF lib/Support/CMakeFiles/LLVMSupport.dir/ELFAttributeParser.cpp.o.d -o lib/Support/CMakeFiles/LLVMSupport.dir/ELFAttributeParser.cpp.o -c /Users/buildslave/jenkins/workspace/clang-stage2-cmake-RgSan/llvm-project/llvm/lib/Support/ELFAttributeParser.cpp
[59/4672] /usr/local/bin/sccache /Users/buildslave/jenkins/workspace/clang-stage2-cmake-RgSan/host-compiler/bin/clang++  -DBUILD_EXAMPLES -DGTEST_HAS_RTTI=0 -D__STDC_CONSTANT_MACROS -D__STDC_FORMAT_MACROS -D__STDC_LIMIT_MACROS -Ilib/Support -I/Users/buildslave/jenkins/workspace/clang-stage2-cmake-RgSan/llvm-project/llvm/lib/Support -Iinclude -I/Users/buildslave/jenkins/workspace/clang-stage2-cmake-RgSan/llvm-project/llvm/include -fPIC -fvisibility-inlines-hidden -Werror=date-time -Werror=unguarded-availability-new -Wall -Wextra -Wno-unused-parameter -Wwrite-strings -Wcast-qual -Wmissing-field-initializers -pedantic -Wno-long-long -Wimplicit-fallthrough -Wcovered-switch-default -Wno-noexcept-type -Wnon-virtual-dtor -Wdelete-non-virtual-dtor -Wsuggest-override -Wstring-conversion -fno-omit-frame-pointer -fsanitize=address,undefined -fno-sanitize=vptr,function -fno-sanitize-recover=all -fsanitize-address-use-after-scope -fsanitize-blacklist=/Users/buildslave/jenkins/workspace/clang-stage2-cmake-RgSan/llvm-project/llvm/utils/sanitizers/ubsan_blacklist.txt -fdiagnostics-color -O2 -g -DNDEBUG -isysroot /Applications/Xcode.app/Contents/Developer/Platforms/MacOSX.platform/Developer/SDKs/MacOSX10.15.sdk   -std=c++14  -fno-exceptions -fno-rtti -MD -MT lib/Support/CMakeFiles/LLVMSupport.dir/Error.cpp.o -MF lib/Support/CMakeFiles/LLVMSupport.dir/Error.cpp.o.d -o lib/Support/CMakeFiles/LLVMSupport.dir/Error.cpp.o -c /Users/buildslave/jenkins/workspace/clang-stage2-cmake-RgSan/llvm-project/llvm/lib/Support/Error.cpp
[60/4672] /usr/local/bin/sccache /Users/buildslave/jenkins/workspace/clang-stage2-cmake-RgSan/host-compiler/bin/clang++  -DBUILD_EXAMPLES -DGTEST_HAS_RTTI=0 -D__STDC_CONSTANT_MACROS -D__STDC_FORMAT_MACROS -D__STDC_LIMIT_MACROS -Ilib/Support -I/Users/buildslave/jenkins/workspace/clang-stage2-cmake-RgSan/llvm-project/llvm/lib/Support -Iinclude -I/Users/buildslave/jenkins/workspace/clang-stage2-cmake-RgSan/llvm-project/llvm/include -fPIC -fvisibility-inlines-hidden -Werror=date-time -Werror=unguarded-availability-new -Wall -Wextra -Wno-unused-parameter -Wwrite-strings -Wcast-qual -Wmissing-field-initializers -pedantic -Wno-long-long -Wimplicit-fallthrough -Wcovered-switch-default -Wno-noexcept-type -Wnon-virtual-dtor -Wdelete-non-virtual-dtor -Wsuggest-override -Wstring-conversion -fno-omit-frame-pointer -fsanitize=address,undefined -fno-sanitize=vptr,function -fno-sanitize-recover=all -fsanitize-address-use-after-scope -fsanitize-blacklist=/Users/buildslave/jenkins/workspace/clang-stage2-cmake-RgSan/llvm-project/llvm/utils/sanitizers/ubsan_blacklist.txt -fdiagnostics-color -O2 -g -DNDEBUG -isysroot /Applications/Xcode.app/Contents/Developer/Platforms/MacOSX.platform/Developer/SDKs/MacOSX10.15.sdk   -std=c++14  -fno-exceptions -fno-rtti -MD -MT lib/Support/CMakeFiles/LLVMSupport.dir/FileUtilities.cpp.o -MF lib/Support/CMakeFiles/LLVMSupport.dir/FileUtilities.cpp.o.d -o lib/Support/CMakeFiles/LLVMSupport.dir/FileUtilities.cpp.o -c /Users/buildslave/jenkins/workspace/clang-stage2-cmake-RgSan/llvm-project/llvm/lib/Support/FileUtilities.cpp
[61/4672] /usr/local/bin/sccache /Users/buildslave/jenkins/workspace/clang-stage2-cmake-RgSan/host-compiler/bin/clang++  -DBUILD_EXAMPLES -DGTEST_HAS_RTTI=0 -D__STDC_CONSTANT_MACROS -D__STDC_FORMAT_MACROS -D__STDC_LIMIT_MACROS -Ilib/Support -I/Users/buildslave/jenkins/workspace/clang-stage2-cmake-RgSan/llvm-project/llvm/lib/Support -Iinclude -I/Users/buildslave/jenkins/workspace/clang-stage2-cmake-RgSan/llvm-project/llvm/include -fPIC -fvisibility-inlines-hidden -Werror=date-time -Werror=unguarded-availability-new -Wall -Wextra -Wno-unused-parameter -Wwrite-strings -Wcast-qual -Wmissing-field-initializers -pedantic -Wno-long-long -Wimplicit-fallthrough -Wcovered-switch-default -Wno-noexcept-type -Wnon-virtual-dtor -Wdelete-non-virtual-dtor -Wsuggest-override -Wstring-conversion -fno-omit-frame-pointer -fsanitize=address,undefined -fno-sanitize=vptr,function -fno-sanitize-recover=all -fsanitize-address-use-after-scope -fsanitize-blacklist=/Users/buildslave/jenkins/workspace/clang-stage2-cmake-RgSan/llvm-project/llvm/utils/sanitizers/ubsan_blacklist.txt -fdiagnostics-color -O2 -g -DNDEBUG -isysroot /Applications/Xcode.app/Contents/Developer/Platforms/MacOSX.platform/Developer/SDKs/MacOSX10.15.sdk   -std=c++14  -fno-exceptions -fno-rtti -MD -MT lib/Support/CMakeFiles/LLVMSupport.dir/FileCollector.cpp.o -MF lib/Support/CMakeFiles/LLVMSupport.dir/FileCollector.cpp.o.d -o lib/Support/CMakeFiles/LLVMSupport.dir/FileCollector.cpp.o -c /Users/buildslave/jenkins/workspace/clang-stage2-cmake-RgSan/llvm-project/llvm/lib/Support/FileCollector.cpp
[62/4672] /usr/local/bin/sccache /Users/buildslave/jenkins/workspace/clang-stage2-cmake-RgSan/host-compiler/bin/clang++  -DBUILD_EXAMPLES -DGTEST_HAS_RTTI=0 -D__STDC_CONSTANT_MACROS -D__STDC_FORMAT_MACROS -D__STDC_LIMIT_MACROS -Ilib/Support -I/Users/buildslave/jenkins/workspace/clang-stage2-cmake-RgSan/llvm-project/llvm/lib/Support -Iinclude -I/Users/buildslave/jenkins/workspace/clang-stage2-cmake-RgSan/llvm-project/llvm/include -fPIC -fvisibility-inlines-hidden -Werror=date-time -Werror=unguarded-availability-new -Wall -Wextra -Wno-unused-parameter -Wwrite-strings -Wcast-qual -Wmissing-field-initializers -pedantic -Wno-long-long -Wimplicit-fallthrough -Wcovered-switch-default -Wno-noexcept-type -Wnon-virtual-dtor -Wdelete-non-virtual-dtor -Wsuggest-override -Wstring-conversion -fno-omit-frame-pointer -fsanitize=address,undefined -fno-sanitize=vptr,function -fno-sanitize-recover=all -fsanitize-address-use-after-scope -fsanitize-blacklist=/Users/buildslave/jenkins/workspace/clang-stage2-cmake-RgSan/llvm-project/llvm/utils/sanitizers/ubsan_blacklist.txt -fdiagnostics-color -O2 -g -DNDEBUG -isysroot /Applications/Xcode.app/Contents/Developer/Platforms/MacOSX.platform/Developer/SDKs/MacOSX10.15.sdk   -std=c++14  -fno-exceptions -fno-rtti -MD -MT lib/Support/CMakeFiles/LLVMSupport.dir/FormattedStream.cpp.o -MF lib/Support/CMakeFiles/LLVMSupport.dir/FormattedStream.cpp.o.d -o lib/Support/CMakeFiles/LLVMSupport.dir/FormattedStream.cpp.o -c /Users/buildslave/jenkins/workspace/clang-stage2-cmake-RgSan/llvm-project/llvm/lib/Support/FormattedStream.cpp
[63/4672] /usr/local/bin/sccache /Users/buildslave/jenkins/workspace/clang-stage2-cmake-RgSan/host-compiler/bin/clang++  -DBUILD_EXAMPLES -DGTEST_HAS_RTTI=0 -D__STDC_CONSTANT_MACROS -D__STDC_FORMAT_MACROS -D__STDC_LIMIT_MACROS -Ilib/Support -I/Users/buildslave/jenkins/workspace/clang-stage2-cmake-RgSan/llvm-project/llvm/lib/Support -Iinclude -I/Users/buildslave/jenkins/workspace/clang-stage2-cmake-RgSan/llvm-project/llvm/include -fPIC -fvisibility-inlines-hidden -Werror=date-time -Werror=unguarded-availability-new -Wall -Wextra -Wno-unused-parameter -Wwrite-strings -Wcast-qual -Wmissing-field-initializers -pedantic -Wno-long-long -Wimplicit-fallthrough -Wcovered-switch-default -Wno-noexcept-type -Wnon-virtual-dtor -Wdelete-non-virtual-dtor -Wsuggest-override -Wstring-conversion -fno-omit-frame-pointer -fsanitize=address,undefined -fno-sanitize=vptr,function -fno-sanitize-recover=all -fsanitize-address-use-after-scope -fsanitize-blacklist=/Users/buildslave/jenkins/workspace/clang-stage2-cmake-RgSan/llvm-project/llvm/utils/sanitizers/ubsan_blacklist.txt -fdiagnostics-color -O2 -g -DNDEBUG -isysroot /Applications/Xcode.app/Contents/Developer/Platforms/MacOSX.platform/Developer/SDKs/MacOSX10.15.sdk   -std=c++14  -fno-exceptions -fno-rtti -MD -MT lib/Support/CMakeFiles/LLVMSupport.dir/FoldingSet.cpp.o -MF lib/Support/CMakeFiles/LLVMSupport.dir/FoldingSet.cpp.o.d -o lib/Support/CMakeFiles/LLVMSupport.dir/FoldingSet.cpp.o -c /Users/buildslave/jenkins/workspace/clang-stage2-cmake-RgSan/llvm-project/llvm/lib/Support/FoldingSet.cpp
[64/4672] /usr/local/bin/sccache /Users/buildslave/jenkins/workspace/clang-stage2-cmake-RgSan/host-compiler/bin/clang++  -DBUILD_EXAMPLES -DGTEST_HAS_RTTI=0 -D__STDC_CONSTANT_MACROS -D__STDC_FORMAT_MACROS -D__STDC_LIMIT_MACROS -Ilib/Support -I/Users/buildslave/jenkins/workspace/clang-stage2-cmake-RgSan/llvm-project/llvm/lib/Support -Iinclude -I/Users/buildslave/jenkins/workspace/clang-stage2-cmake-RgSan/llvm-project/llvm/include -fPIC -fvisibility-inlines-hidden -Werror=date-time -Werror=unguarded-availability-new -Wall -Wextra -Wno-unused-parameter -Wwrite-strings -Wcast-qual -Wmissing-field-initializers -pedantic -Wno-long-long -Wimplicit-fallthrough -Wcovered-switch-default -Wno-noexcept-type -Wnon-virtual-dtor -Wdelete-non-virtual-dtor -Wsuggest-override -Wstring-conversion -fno-omit-frame-pointer -fsanitize=address,undefined -fno-sanitize=vptr,function -fno-sanitize-recover=all -fsanitize-address-use-after-scope -fsanitize-blacklist=/Users/buildslave/jenkins/workspace/clang-stage2-cmake-RgSan/llvm-project/llvm/utils/sanitizers/ubsan_blacklist.txt -fdiagnostics-color -O2 -g -DNDEBUG -isysroot /Applications/Xcode.app/Contents/Developer/Platforms/MacOSX.platform/Developer/SDKs/MacOSX10.15.sdk   -std=c++14  -fno-exceptions -fno-rtti -MD -MT lib/Support/CMakeFiles/LLVMSupport.dir/FormatVariadic.cpp.o -MF lib/Support/CMakeFiles/LLVMSupport.dir/FormatVariadic.cpp.o.d -o lib/Support/CMakeFiles/LLVMSupport.dir/FormatVariadic.cpp.o -c /Users/buildslave/jenkins/workspace/clang-stage2-cmake-RgSan/llvm-project/llvm/lib/Support/FormatVariadic.cpp
[65/4672] /usr/local/bin/sccache /Users/buildslave/jenkins/workspace/clang-stage2-cmake-RgSan/host-compiler/bin/clang++  -DBUILD_EXAMPLES -DGTEST_HAS_RTTI=0 -D__STDC_CONSTANT_MACROS -D__STDC_FORMAT_MACROS -D__STDC_LIMIT_MACROS -Ilib/Support -I/Users/buildslave/jenkins/workspace/clang-stage2-cmake-RgSan/llvm-project/llvm/lib/Support -Iinclude -I/Users/buildslave/jenkins/workspace/clang-stage2-cmake-RgSan/llvm-project/llvm/include -fPIC -fvisibility-inlines-hidden -Werror=date-time -Werror=unguarded-availability-new -Wall -Wextra -Wno-unused-parameter -Wwrite-strings -Wcast-qual -Wmissing-field-initializers -pedantic -Wno-long-long -Wimplicit-fallthrough -Wcovered-switch-default -Wno-noexcept-type -Wnon-virtual-dtor -Wdelete-non-virtual-dtor -Wsuggest-override -Wstring-conversion -fno-omit-frame-pointer -fsanitize=address,undefined -fno-sanitize=vptr,function -fno-sanitize-recover=all -fsanitize-address-use-after-scope -fsanitize-blacklist=/Users/buildslave/jenkins/workspace/clang-stage2-cmake-RgSan/llvm-project/llvm/utils/sanitizers/ubsan_blacklist.txt -fdiagnostics-color -O2 -g -DNDEBUG -isysroot /Applications/Xcode.app/Contents/Developer/Platforms/MacOSX.platform/Developer/SDKs/MacOSX10.15.sdk   -std=c++14  -fno-exceptions -fno-rtti -MD -MT lib/Support/CMakeFiles/LLVMSupport.dir/Hashing.cpp.o -MF lib/Support/CMakeFiles/LLVMSupport.dir/Hashing.cpp.o.d -o lib/Support/CMakeFiles/LLVMSupport.dir/Hashing.cpp.o -c /Users/buildslave/jenkins/workspace/clang-stage2-cmake-RgSan/llvm-project/llvm/lib/Support/Hashing.cpp
[66/4672] /usr/local/bin/sccache /Users/buildslave/jenkins/workspace/clang-stage2-cmake-RgSan/host-compiler/bin/clang++  -DBUILD_EXAMPLES -DGTEST_HAS_RTTI=0 -D__STDC_CONSTANT_MACROS -D__STDC_FORMAT_MACROS -D__STDC_LIMIT_MACROS -Ilib/Support -I/Users/buildslave/jenkins/workspace/clang-stage2-cmake-RgSan/llvm-project/llvm/lib/Support -Iinclude -I/Users/buildslave/jenkins/workspace/clang-stage2-cmake-RgSan/llvm-project/llvm/include -fPIC -fvisibility-inlines-hidden -Werror=date-time -Werror=unguarded-availability-new -Wall -Wextra -Wno-unused-parameter -Wwrite-strings -Wcast-qual -Wmissing-field-initializers -pedantic -Wno-long-long -Wimplicit-fallthrough -Wcovered-switch-default -Wno-noexcept-type -Wnon-virtual-dtor -Wdelete-non-virtual-dtor -Wsuggest-override -Wstring-conversion -fno-omit-frame-pointer -fsanitize=address,undefined -fno-sanitize=vptr,function -fno-sanitize-recover=all -fsanitize-address-use-after-scope -fsanitize-blacklist=/Users/buildslave/jenkins/workspace/clang-stage2-cmake-RgSan/llvm-project/llvm/utils/sanitizers/ubsan_blacklist.txt -fdiagnostics-color -O2 -g -DNDEBUG -isysroot /Applications/Xcode.app/Contents/Developer/Platforms/MacOSX.platform/Developer/SDKs/MacOSX10.15.sdk   -std=c++14  -fno-exceptions -fno-rtti -MD -MT lib/Support/CMakeFiles/LLVMSupport.dir/FileOutputBuffer.cpp.o -MF lib/Support/CMakeFiles/LLVMSupport.dir/FileOutputBuffer.cpp.o.d -o lib/Support/CMakeFiles/LLVMSupport.dir/FileOutputBuffer.cpp.o -c /Users/buildslave/jenkins/workspace/clang-stage2-cmake-RgSan/llvm-project/llvm/lib/Support/FileOutputBuffer.cpp
[67/4672] /usr/local/bin/sccache /Users/buildslave/jenkins/workspace/clang-stage2-cmake-RgSan/host-compiler/bin/clang++  -DBUILD_EXAMPLES -DGTEST_HAS_RTTI=0 -D__STDC_CONSTANT_MACROS -D__STDC_FORMAT_MACROS -D__STDC_LIMIT_MACROS -Ilib/Support -I/Users/buildslave/jenkins/workspace/clang-stage2-cmake-RgSan/llvm-project/llvm/lib/Support -Iinclude -I/Users/buildslave/jenkins/workspace/clang-stage2-cmake-RgSan/llvm-project/llvm/include -fPIC -fvisibility-inlines-hidden -Werror=date-time -Werror=unguarded-availability-new -Wall -Wextra -Wno-unused-parameter -Wwrite-strings -Wcast-qual -Wmissing-field-initializers -pedantic -Wno-long-long -Wimplicit-fallthrough -Wcovered-switch-default -Wno-noexcept-type -Wnon-virtual-dtor -Wdelete-non-virtual-dtor -Wsuggest-override -Wstring-conversion -fno-omit-frame-pointer -fsanitize=address,undefined -fno-sanitize=vptr,function -fno-sanitize-recover=all -fsanitize-address-use-after-scope -fsanitize-blacklist=/Users/buildslave/jenkins/workspace/clang-stage2-cmake-RgSan/llvm-project/llvm/utils/sanitizers/ubsan_blacklist.txt -fdiagnostics-color -O2 -g -DNDEBUG -isysroot /Applications/Xcode.app/Contents/Developer/Platforms/MacOSX.platform/Developer/SDKs/MacOSX10.15.sdk   -std=c++14  -fno-exceptions -fno-rtti -MD -MT lib/Support/CMakeFiles/LLVMSupport.dir/IntEqClasses.cpp.o -MF lib/Support/CMakeFiles/LLVMSupport.dir/IntEqClasses.cpp.o.d -o lib/Support/CMakeFiles/LLVMSupport.dir/IntEqClasses.cpp.o -c /Users/buildslave/jenkins/workspace/clang-stage2-cmake-RgSan/llvm-project/llvm/lib/Support/IntEqClasses.cpp
[68/4672] /usr/local/bin/sccache /Users/buildslave/jenkins/workspace/clang-stage2-cmake-RgSan/host-compiler/bin/clang++  -DBUILD_EXAMPLES -DGTEST_HAS_RTTI=0 -D__STDC_CONSTANT_MACROS -D__STDC_FORMAT_MACROS -D__STDC_LIMIT_MACROS -Ilib/Support -I/Users/buildslave/jenkins/workspace/clang-stage2-cmake-RgSan/llvm-project/llvm/lib/Support -Iinclude -I/Users/buildslave/jenkins/workspace/clang-stage2-cmake-RgSan/llvm-project/llvm/include -fPIC -fvisibility-inlines-hidden -Werror=date-time -Werror=unguarded-availability-new -Wall -Wextra -Wno-unused-parameter -Wwrite-strings -Wcast-qual -Wmissing-field-initializers -pedantic -Wno-long-long -Wimplicit-fallthrough -Wcovered-switch-default -Wno-noexcept-type -Wnon-virtual-dtor -Wdelete-non-virtual-dtor -Wsuggest-override -Wstring-conversion -fno-omit-frame-pointer -fsanitize=address,undefined -fno-sanitize=vptr,function -fno-sanitize-recover=all -fsanitize-address-use-after-scope -fsanitize-blacklist=/Users/buildslave/jenkins/workspace/clang-stage2-cmake-RgSan/llvm-project/llvm/utils/sanitizers/ubsan_blacklist.txt -fdiagnostics-color -O2 -g -DNDEBUG -isysroot /Applications/Xcode.app/Contents/Developer/Platforms/MacOSX.platform/Developer/SDKs/MacOSX10.15.sdk   -std=c++14  -fno-exceptions -fno-rtti -MD -MT lib/Support/CMakeFiles/LLVMSupport.dir/InitLLVM.cpp.o -MF lib/Support/CMakeFiles/LLVMSupport.dir/InitLLVM.cpp.o.d -o lib/Support/CMakeFiles/LLVMSupport.dir/InitLLVM.cpp.o -c /Users/buildslave/jenkins/workspace/clang-stage2-cmake-RgSan/llvm-project/llvm/lib/Support/InitLLVM.cpp
[69/4672] /usr/local/bin/sccache /Users/buildslave/jenkins/workspace/clang-stage2-cmake-RgSan/host-compiler/bin/clang++  -DBUILD_EXAMPLES -DGTEST_HAS_RTTI=0 -D__STDC_CONSTANT_MACROS -D__STDC_FORMAT_MACROS -D__STDC_LIMIT_MACROS -Ilib/Support -I/Users/buildslave/jenkins/workspace/clang-stage2-cmake-RgSan/llvm-project/llvm/lib/Support -Iinclude -I/Users/buildslave/jenkins/workspace/clang-stage2-cmake-RgSan/llvm-project/llvm/include -fPIC -fvisibility-inlines-hidden -Werror=date-time -Werror=unguarded-availability-new -Wall -Wextra -Wno-unused-parameter -Wwrite-strings -Wcast-qual -Wmissing-field-initializers -pedantic -Wno-long-long -Wimplicit-fallthrough -Wcovered-switch-default -Wno-noexcept-type -Wnon-virtual-dtor -Wdelete-non-virtual-dtor -Wsuggest-override -Wstring-conversion -fno-omit-frame-pointer -fsanitize=address,undefined -fno-sanitize=vptr,function -fno-sanitize-recover=all -fsanitize-address-use-after-scope -fsanitize-blacklist=/Users/buildslave/jenkins/workspace/clang-stage2-cmake-RgSan/llvm-project/llvm/utils/sanitizers/ubsan_blacklist.txt -fdiagnostics-color -O2 -g -DNDEBUG -isysroot /Applications/Xcode.app/Contents/Developer/Platforms/MacOSX.platform/Developer/SDKs/MacOSX10.15.sdk   -std=c++14  -fno-exceptions -fno-rtti -MD -MT lib/Support/CMakeFiles/LLVMSupport.dir/GlobPattern.cpp.o -MF lib/Support/CMakeFiles/LLVMSupport.dir/GlobPattern.cpp.o.d -o lib/Support/CMakeFiles/LLVMSupport.dir/GlobPattern.cpp.o -c /Users/buildslave/jenkins/workspace/clang-stage2-cmake-RgSan/llvm-project/llvm/lib/Support/GlobPattern.cpp
[70/4672] /usr/local/bin/sccache /Users/buildslave/jenkins/workspace/clang-stage2-cmake-RgSan/host-compiler/bin/clang++  -DBUILD_EXAMPLES -DGTEST_HAS_RTTI=0 -D__STDC_CONSTANT_MACROS -D__STDC_FORMAT_MACROS -D__STDC_LIMIT_MACROS -Ilib/Support -I/Users/buildslave/jenkins/workspace/clang-stage2-cmake-RgSan/llvm-project/llvm/lib/Support -Iinclude -I/Users/buildslave/jenkins/workspace/clang-stage2-cmake-RgSan/llvm-project/llvm/include -fPIC -fvisibility-inlines-hidden -Werror=date-time -Werror=unguarded-availability-new -Wall -Wextra -Wno-unused-parameter -Wwrite-strings -Wcast-qual -Wmissing-field-initializers -pedantic -Wno-long-long -Wimplicit-fallthrough -Wcovered-switch-default -Wno-noexcept-type -Wnon-virtual-dtor -Wdelete-non-virtual-dtor -Wsuggest-override -Wstring-conversion -fno-omit-frame-pointer -fsanitize=address,undefined -fno-sanitize=vptr,function -fno-sanitize-recover=all -fsanitize-address-use-after-scope -fsanitize-blacklist=/Users/buildslave/jenkins/workspace/clang-stage2-cmake-RgSan/llvm-project/llvm/utils/sanitizers/ubsan_blacklist.txt -fdiagnostics-color -O2 -g -DNDEBUG -isysroot /Applications/Xcode.app/Contents/Developer/Platforms/MacOSX.platform/Developer/SDKs/MacOSX10.15.sdk   -std=c++14  -fno-exceptions -fno-rtti -MD -MT lib/Support/CMakeFiles/LLVMSupport.dir/IntervalMap.cpp.o -MF lib/Support/CMakeFiles/LLVMSupport.dir/IntervalMap.cpp.o.d -o lib/Support/CMakeFiles/LLVMSupport.dir/IntervalMap.cpp.o -c /Users/buildslave/jenkins/workspace/clang-stage2-cmake-RgSan/llvm-project/llvm/lib/Support/IntervalMap.cpp
[71/4672] /usr/local/bin/sccache /Users/buildslave/jenkins/workspace/clang-stage2-cmake-RgSan/host-compiler/bin/clang++  -DBUILD_EXAMPLES -DGTEST_HAS_RTTI=0 -D__STDC_CONSTANT_MACROS -D__STDC_FORMAT_MACROS -D__STDC_LIMIT_MACROS -Ilib/Support -I/Users/buildslave/jenkins/workspace/clang-stage2-cmake-RgSan/llvm-project/llvm/lib/Support -Iinclude -I/Users/buildslave/jenkins/workspace/clang-stage2-cmake-RgSan/llvm-project/llvm/include -fPIC -fvisibility-inlines-hidden -Werror=date-time -Werror=unguarded-availability-new -Wall -Wextra -Wno-unused-parameter -Wwrite-strings -Wcast-qual -Wmissing-field-initializers -pedantic -Wno-long-long -Wimplicit-fallthrough -Wcovered-switch-default -Wno-noexcept-type -Wnon-virtual-dtor -Wdelete-non-virtual-dtor -Wsuggest-override -Wstring-conversion -fno-omit-frame-pointer -fsanitize=address,undefined -fno-sanitize=vptr,function -fno-sanitize-recover=all -fsanitize-address-use-after-scope -fsanitize-blacklist=/Users/buildslave/jenkins/workspace/clang-stage2-cmake-RgSan/llvm-project/llvm/utils/sanitizers/ubsan_blacklist.txt -fdiagnostics-color -O2 -g -DNDEBUG -isysroot /Applications/Xcode.app/Contents/Developer/Platforms/MacOSX.platform/Developer/SDKs/MacOSX10.15.sdk   -std=c++14  -fno-exceptions -fno-rtti -MD -MT lib/Support/CMakeFiles/LLVMSupport.dir/LEB128.cpp.o -MF lib/Support/CMakeFiles/LLVMSupport.dir/LEB128.cpp.o.d -o lib/Support/CMakeFiles/LLVMSupport.dir/LEB128.cpp.o -c /Users/buildslave/jenkins/workspace/clang-stage2-cmake-RgSan/llvm-project/llvm/lib/Support/LEB128.cpp
[72/4672] /usr/local/bin/sccache /Users/buildslave/jenkins/workspace/clang-stage2-cmake-RgSan/host-compiler/bin/clang++  -DBUILD_EXAMPLES -DGTEST_HAS_RTTI=0 -D__STDC_CONSTANT_MACROS -D__STDC_FORMAT_MACROS -D__STDC_LIMIT_MACROS -Ilib/Support -I/Users/buildslave/jenkins/workspace/clang-stage2-cmake-RgSan/llvm-project/llvm/lib/Support -Iinclude -I/Users/buildslave/jenkins/workspace/clang-stage2-cmake-RgSan/llvm-project/llvm/include -fPIC -fvisibility-inlines-hidden -Werror=date-time -Werror=unguarded-availability-new -Wall -Wextra -Wno-unused-parameter -Wwrite-strings -Wcast-qual -Wmissing-field-initializers -pedantic -Wno-long-long -Wimplicit-fallthrough -Wcovered-switch-default -Wno-noexcept-type -Wnon-virtual-dtor -Wdelete-non-virtual-dtor -Wsuggest-override -Wstring-conversion -fno-omit-frame-pointer -fsanitize=address,undefined -fno-sanitize=vptr,function -fno-sanitize-recover=all -fsanitize-address-use-after-scope -fsanitize-blacklist=/Users/buildslave/jenkins/workspace/clang-stage2-cmake-RgSan/llvm-project/llvm/utils/sanitizers/ubsan_blacklist.txt -fdiagnostics-color -O2 -g -DNDEBUG -isysroot /Applications/Xcode.app/Contents/Developer/Platforms/MacOSX.platform/Developer/SDKs/MacOSX10.15.sdk   -std=c++14  -fno-exceptions -fno-rtti -MD -MT lib/Support/CMakeFiles/LLVMSupport.dir/Locale.cpp.o -MF lib/Support/CMakeFiles/LLVMSupport.dir/Locale.cpp.o.d -o lib/Support/CMakeFiles/LLVMSupport.dir/Locale.cpp.o -c /Users/buildslave/jenkins/workspace/clang-stage2-cmake-RgSan/llvm-project/llvm/lib/Support/Locale.cpp
[73/4672] /usr/local/bin/sccache /Users/buildslave/jenkins/workspace/clang-stage2-cmake-RgSan/host-compiler/bin/clang++  -DBUILD_EXAMPLES -DGTEST_HAS_RTTI=0 -D__STDC_CONSTANT_MACROS -D__STDC_FORMAT_MACROS -D__STDC_LIMIT_MACROS -Ilib/Support -I/Users/buildslave/jenkins/workspace/clang-stage2-cmake-RgSan/llvm-project/llvm/lib/Support -Iinclude -I/Users/buildslave/jenkins/workspace/clang-stage2-cmake-RgSan/llvm-project/llvm/include -fPIC -fvisibility-inlines-hidden -Werror=date-time -Werror=unguarded-availability-new -Wall -Wextra -Wno-unused-parameter -Wwrite-strings -Wcast-qual -Wmissing-field-initializers -pedantic -Wno-long-long -Wimplicit-fallthrough -Wcovered-switch-default -Wno-noexcept-type -Wnon-virtual-dtor -Wdelete-non-virtual-dtor -Wsuggest-override -Wstring-conversion -fno-omit-frame-pointer -fsanitize=address,undefined -fno-sanitize=vptr,function -fno-sanitize-recover=all -fsanitize-address-use-after-scope -fsanitize-blacklist=/Users/buildslave/jenkins/workspace/clang-stage2-cmake-RgSan/llvm-project/llvm/utils/sanitizers/ubsan_blacklist.txt -fdiagnostics-color -O2 -g -DNDEBUG -isysroot /Applications/Xcode.app/Contents/Developer/Platforms/MacOSX.platform/Developer/SDKs/MacOSX10.15.sdk   -std=c++14  -fno-exceptions -fno-rtti -MD -MT lib/Support/CMakeFiles/LLVMSupport.dir/KnownBits.cpp.o -MF lib/Support/CMakeFiles/LLVMSupport.dir/KnownBits.cpp.o.d -o lib/Support/CMakeFiles/LLVMSupport.dir/KnownBits.cpp.o -c /Users/buildslave/jenkins/workspace/clang-stage2-cmake-RgSan/llvm-project/llvm/lib/Support/KnownBits.cpp
[74/4672] /usr/local/bin/sccache /Users/buildslave/jenkins/workspace/clang-stage2-cmake-RgSan/host-compiler/bin/clang++  -DBUILD_EXAMPLES -DGTEST_HAS_RTTI=0 -D__STDC_CONSTANT_MACROS -D__STDC_FORMAT_MACROS -D__STDC_LIMIT_MACROS -Ilib/Support -I/Users/buildslave/jenkins/workspace/clang-stage2-cmake-RgSan/llvm-project/llvm/lib/Support -Iinclude -I/Users/buildslave/jenkins/workspace/clang-stage2-cmake-RgSan/llvm-project/llvm/include -fPIC -fvisibility-inlines-hidden -Werror=date-time -Werror=unguarded-availability-new -Wall -Wextra -Wno-unused-parameter -Wwrite-strings -Wcast-qual -Wmissing-field-initializers -pedantic -Wno-long-long -Wimplicit-fallthrough -Wcovered-switch-default -Wno-noexcept-type -Wnon-virtual-dtor -Wdelete-non-virtual-dtor -Wsuggest-override -Wstring-conversion -fno-omit-frame-pointer -fsanitize=address,undefined -fno-sanitize=vptr,function -fno-sanitize-recover=all -fsanitize-address-use-after-scope -fsanitize-blacklist=/Users/buildslave/jenkins/workspace/clang-stage2-cmake-RgSan/llvm-project/llvm/utils/sanitizers/ubsan_blacklist.txt -fdiagnostics-color -O2 -g -DNDEBUG -isysroot /Applications/Xcode.app/Contents/Developer/Platforms/MacOSX.platform/Developer/SDKs/MacOSX10.15.sdk   -std=c++14  -fno-exceptions -fno-rtti -MD -MT lib/Support/CMakeFiles/LLVMSupport.dir/LineIterator.cpp.o -MF lib/Support/CMakeFiles/LLVMSupport.dir/LineIterator.cpp.o.d -o lib/Support/CMakeFiles/LLVMSupport.dir/LineIterator.cpp.o -c /Users/buildslave/jenkins/workspace/clang-stage2-cmake-RgSan/llvm-project/llvm/lib/Support/LineIterator.cpp
[75/4672] /usr/local/bin/sccache /Users/buildslave/jenkins/workspace/clang-stage2-cmake-RgSan/host-compiler/bin/clang++  -DBUILD_EXAMPLES -DGTEST_HAS_RTTI=0 -D__STDC_CONSTANT_MACROS -D__STDC_FORMAT_MACROS -D__STDC_LIMIT_MACROS -Ilib/Support -I/Users/buildslave/jenkins/workspace/clang-stage2-cmake-RgSan/llvm-project/llvm/lib/Support -Iinclude -I/Users/buildslave/jenkins/workspace/clang-stage2-cmake-RgSan/llvm-project/llvm/include -fPIC -fvisibility-inlines-hidden -Werror=date-time -Werror=unguarded-availability-new -Wall -Wextra -Wno-unused-parameter -Wwrite-strings -Wcast-qual -Wmissing-field-initializers -pedantic -Wno-long-long -Wimplicit-fallthrough -Wcovered-switch-default -Wno-noexcept-type -Wnon-virtual-dtor -Wdelete-non-virtual-dtor -Wsuggest-override -Wstring-conversion -fno-omit-frame-pointer -fsanitize=address,undefined -fno-sanitize=vptr,function -fno-sanitize-recover=all -fsanitize-address-use-after-scope -fsanitize-blacklist=/Users/buildslave/jenkins/workspace/clang-stage2-cmake-RgSan/llvm-project/llvm/utils/sanitizers/ubsan_blacklist.txt -fdiagnostics-color -O2 -g -DNDEBUG -isysroot /Applications/Xcode.app/Contents/Developer/Platforms/MacOSX.platform/Developer/SDKs/MacOSX10.15.sdk   -std=c++14  -fno-exceptions -fno-rtti -MD -MT lib/Support/CMakeFiles/LLVMSupport.dir/GraphWriter.cpp.o -MF lib/Support/CMakeFiles/LLVMSupport.dir/GraphWriter.cpp.o.d -o lib/Support/CMakeFiles/LLVMSupport.dir/GraphWriter.cpp.o -c /Users/buildslave/jenkins/workspace/clang-stage2-cmake-RgSan/llvm-project/llvm/lib/Support/GraphWriter.cpp
[76/4672] /usr/local/bin/sccache /Users/buildslave/jenkins/workspace/clang-stage2-cmake-RgSan/host-compiler/bin/clang++  -DBUILD_EXAMPLES -DGTEST_HAS_RTTI=0 -D__STDC_CONSTANT_MACROS -D__STDC_FORMAT_MACROS -D__STDC_LIMIT_MACROS -Ilib/Support -I/Users/buildslave/jenkins/workspace/clang-stage2-cmake-RgSan/llvm-project/llvm/lib/Support -Iinclude -I/Users/buildslave/jenkins/workspace/clang-stage2-cmake-RgSan/llvm-project/llvm/include -fPIC -fvisibility-inlines-hidden -Werror=date-time -Werror=unguarded-availability-new -Wall -Wextra -Wno-unused-parameter -Wwrite-strings -Wcast-qual -Wmissing-field-initializers -pedantic -Wno-long-long -Wimplicit-fallthrough -Wcovered-switch-default -Wno-noexcept-type -Wnon-virtual-dtor -Wdelete-non-virtual-dtor -Wsuggest-override -Wstring-conversion -fno-omit-frame-pointer -fsanitize=address,undefined -fno-sanitize=vptr,function -fno-sanitize-recover=all -fsanitize-address-use-after-scope -fsanitize-blacklist=/Users/buildslave/jenkins/workspace/clang-stage2-cmake-RgSan/llvm-project/llvm/utils/sanitizers/ubsan_blacklist.txt -fdiagnostics-color -O2 -g -DNDEBUG -isysroot /Applications/Xcode.app/Contents/Developer/Platforms/MacOSX.platform/Developer/SDKs/MacOSX10.15.sdk   -std=c++14  -fno-exceptions -fno-rtti -MD -MT lib/Support/CMakeFiles/LLVMSupport.dir/LowLevelType.cpp.o -MF lib/Support/CMakeFiles/LLVMSupport.dir/LowLevelType.cpp.o.d -o lib/Support/CMakeFiles/LLVMSupport.dir/LowLevelType.cpp.o -c /Users/buildslave/jenkins/workspace/clang-stage2-cmake-RgSan/llvm-project/llvm/lib/Support/LowLevelType.cpp
[77/4672] /usr/local/bin/sccache /Users/buildslave/jenkins/workspace/clang-stage2-cmake-RgSan/host-compiler/bin/clang++  -DBUILD_EXAMPLES -DGTEST_HAS_RTTI=0 -D__STDC_CONSTANT_MACROS -D__STDC_FORMAT_MACROS -D__STDC_LIMIT_MACROS -Ilib/Support -I/Users/buildslave/jenkins/workspace/clang-stage2-cmake-RgSan/llvm-project/llvm/lib/Support -Iinclude -I/Users/buildslave/jenkins/workspace/clang-stage2-cmake-RgSan/llvm-project/llvm/include -fPIC -fvisibility-inlines-hidden -Werror=date-time -Werror=unguarded-availability-new -Wall -Wextra -Wno-unused-parameter -Wwrite-strings -Wcast-qual -Wmissing-field-initializers -pedantic -Wno-long-long -Wimplicit-fallthrough -Wcovered-switch-default -Wno-noexcept-type -Wnon-virtual-dtor -Wdelete-non-virtual-dtor -Wsuggest-override -Wstring-conversion -fno-omit-frame-pointer -fsanitize=address,undefined -fno-sanitize=vptr,function -fno-sanitize-recover=all -fsanitize-address-use-after-scope -fsanitize-blacklist=/Users/buildslave/jenkins/workspace/clang-stage2-cmake-RgSan/llvm-project/llvm/utils/sanitizers/ubsan_blacklist.txt -fdiagnostics-color -O2 -g -DNDEBUG -isysroot /Applications/Xcode.app/Contents/Developer/Platforms/MacOSX.platform/Developer/SDKs/MacOSX10.15.sdk   -std=c++14  -fno-exceptions -fno-rtti -MD -MT lib/Support/CMakeFiles/LLVMSupport.dir/MathExtras.cpp.o -MF lib/Support/CMakeFiles/LLVMSupport.dir/MathExtras.cpp.o.d -o lib/Support/CMakeFiles/LLVMSupport.dir/MathExtras.cpp.o -c /Users/buildslave/jenkins/workspace/clang-stage2-cmake-RgSan/llvm-project/llvm/lib/Support/MathExtras.cpp
[78/4672] /usr/local/bin/sccache /Users/buildslave/jenkins/workspace/clang-stage2-cmake-RgSan/host-compiler/bin/clang++  -DBUILD_EXAMPLES -DGTEST_HAS_RTTI=0 -D__STDC_CONSTANT_MACROS -D__STDC_FORMAT_MACROS -D__STDC_LIMIT_MACROS -Ilib/Support -I/Users/buildslave/jenkins/workspace/clang-stage2-cmake-RgSan/llvm-project/llvm/lib/Support -Iinclude -I/Users/buildslave/jenkins/workspace/clang-stage2-cmake-RgSan/llvm-project/llvm/include -fPIC -fvisibility-inlines-hidden -Werror=date-time -Werror=unguarded-availability-new -Wall -Wextra -Wno-unused-parameter -Wwrite-strings -Wcast-qual -Wmissing-field-initializers -pedantic -Wno-long-long -Wimplicit-fallthrough -Wcovered-switch-default -Wno-noexcept-type -Wnon-virtual-dtor -Wdelete-non-virtual-dtor -Wsuggest-override -Wstring-conversion -fno-omit-frame-pointer -fsanitize=address,undefined -fno-sanitize=vptr,function -fno-sanitize-recover=all -fsanitize-address-use-after-scope -fsanitize-blacklist=/Users/buildslave/jenkins/workspace/clang-stage2-cmake-RgSan/llvm-project/llvm/utils/sanitizers/ubsan_blacklist.txt -fdiagnostics-color -O2 -g -DNDEBUG -isysroot /Applications/Xcode.app/Contents/Developer/Platforms/MacOSX.platform/Developer/SDKs/MacOSX10.15.sdk   -std=c++14  -fno-exceptions -fno-rtti -MD -MT lib/Support/CMakeFiles/LLVMSupport.dir/MemAlloc.cpp.o -MF lib/Support/CMakeFiles/LLVMSupport.dir/MemAlloc.cpp.o.d -o lib/Support/CMakeFiles/LLVMSupport.dir/MemAlloc.cpp.o -c /Users/buildslave/jenkins/workspace/clang-stage2-cmake-RgSan/llvm-project/llvm/lib/Support/MemAlloc.cpp
[79/4672] /usr/local/bin/sccache /Users/buildslave/jenkins/workspace/clang-stage2-cmake-RgSan/host-compiler/bin/clang++  -DBUILD_EXAMPLES -DGTEST_HAS_RTTI=0 -D__STDC_CONSTANT_MACROS -D__STDC_FORMAT_MACROS -D__STDC_LIMIT_MACROS -Ilib/Support -I/Users/buildslave/jenkins/workspace/clang-stage2-cmake-RgSan/llvm-project/llvm/lib/Support -Iinclude -I/Users/buildslave/jenkins/workspace/clang-stage2-cmake-RgSan/llvm-project/llvm/include -fPIC -fvisibility-inlines-hidden -Werror=date-time -Werror=unguarded-availability-new -Wall -Wextra -Wno-unused-parameter -Wwrite-strings -Wcast-qual -Wmissing-field-initializers -pedantic -Wno-long-long -Wimplicit-fallthrough -Wcovered-switch-default -Wno-noexcept-type -Wnon-virtual-dtor -Wdelete-non-virtual-dtor -Wsuggest-override -Wstring-conversion -fno-omit-frame-pointer -fsanitize=address,undefined -fno-sanitize=vptr,function -fno-sanitize-recover=all -fsanitize-address-use-after-scope -fsanitize-blacklist=/Users/buildslave/jenkins/workspace/clang-stage2-cmake-RgSan/llvm-project/llvm/utils/sanitizers/ubsan_blacklist.txt -fdiagnostics-color -O2 -g -DNDEBUG -isysroot /Applications/Xcode.app/Contents/Developer/Platforms/MacOSX.platform/Developer/SDKs/MacOSX10.15.sdk   -std=c++14  -fno-exceptions -fno-rtti -MD -MT lib/Support/CMakeFiles/LLVMSupport.dir/ManagedStatic.cpp.o -MF lib/Support/CMakeFiles/LLVMSupport.dir/ManagedStatic.cpp.o.d -o lib/Support/CMakeFiles/LLVMSupport.dir/ManagedStatic.cpp.o -c /Users/buildslave/jenkins/workspace/clang-stage2-cmake-RgSan/llvm-project/llvm/lib/Support/ManagedStatic.cpp
[80/4672] /usr/local/bin/sccache /Users/buildslave/jenkins/workspace/clang-stage2-cmake-RgSan/host-compiler/bin/clang++  -DBUILD_EXAMPLES -DGTEST_HAS_RTTI=0 -D__STDC_CONSTANT_MACROS -D__STDC_FORMAT_MACROS -D__STDC_LIMIT_MACROS -Ilib/Support -I/Users/buildslave/jenkins/workspace/clang-stage2-cmake-RgSan/llvm-project/llvm/lib/Support -Iinclude -I/Users/buildslave/jenkins/workspace/clang-stage2-cmake-RgSan/llvm-project/llvm/include -fPIC -fvisibility-inlines-hidden -Werror=date-time -Werror=unguarded-availability-new -Wall -Wextra -Wno-unused-parameter -Wwrite-strings -Wcast-qual -Wmissing-field-initializers -pedantic -Wno-long-long -Wimplicit-fallthrough -Wcovered-switch-default -Wno-noexcept-type -Wnon-virtual-dtor -Wdelete-non-virtual-dtor -Wsuggest-override -Wstring-conversion -fno-omit-frame-pointer -fsanitize=address,undefined -fno-sanitize=vptr,function -fno-sanitize-recover=all -fsanitize-address-use-after-scope -fsanitize-blacklist=/Users/buildslave/jenkins/workspace/clang-stage2-cmake-RgSan/llvm-project/llvm/utils/sanitizers/ubsan_blacklist.txt -fdiagnostics-color -O2 -g -DNDEBUG -isysroot /Applications/Xcode.app/Contents/Developer/Platforms/MacOSX.platform/Developer/SDKs/MacOSX10.15.sdk   -std=c++14  -fno-exceptions -fno-rtti -MD -MT lib/Support/CMakeFiles/LLVMSupport.dir/NativeFormatting.cpp.o -MF lib/Support/CMakeFiles/LLVMSupport.dir/NativeFormatting.cpp.o.d -o lib/Support/CMakeFiles/LLVMSupport.dir/NativeFormatting.cpp.o -c /Users/buildslave/jenkins/workspace/clang-stage2-cmake-RgSan/llvm-project/llvm/lib/Support/NativeFormatting.cpp
[81/4672] /usr/local/bin/sccache /Users/buildslave/jenkins/workspace/clang-stage2-cmake-RgSan/host-compiler/bin/clang++  -DBUILD_EXAMPLES -DGTEST_HAS_RTTI=0 -D__STDC_CONSTANT_MACROS -D__STDC_FORMAT_MACROS -D__STDC_LIMIT_MACROS -Ilib/Support -I/Users/buildslave/jenkins/workspace/clang-stage2-cmake-RgSan/llvm-project/llvm/lib/Support -Iinclude -I/Users/buildslave/jenkins/workspace/clang-stage2-cmake-RgSan/llvm-project/llvm/include -fPIC -fvisibility-inlines-hidden -Werror=date-time -Werror=unguarded-availability-new -Wall -Wextra -Wno-unused-parameter -Wwrite-strings -Wcast-qual -Wmissing-field-initializers -pedantic -Wno-long-long -Wimplicit-fallthrough -Wcovered-switch-default -Wno-noexcept-type -Wnon-virtual-dtor -Wdelete-non-virtual-dtor -Wsuggest-override -Wstring-conversion -fno-omit-frame-pointer -fsanitize=address,undefined -fno-sanitize=vptr,function -fno-sanitize-recover=all -fsanitize-address-use-after-scope -fsanitize-blacklist=/Users/buildslave/jenkins/workspace/clang-stage2-cmake-RgSan/llvm-project/llvm/utils/sanitizers/ubsan_blacklist.txt -fdiagnostics-color -O2 -g -DNDEBUG -isysroot /Applications/Xcode.app/Contents/Developer/Platforms/MacOSX.platform/Developer/SDKs/MacOSX10.15.sdk   -std=c++14  -fno-exceptions -fno-rtti -MD -MT lib/Support/CMakeFiles/LLVMSupport.dir/OptimizedStructLayout.cpp.o -MF lib/Support/CMakeFiles/LLVMSupport.dir/OptimizedStructLayout.cpp.o.d -o lib/Support/CMakeFiles/LLVMSupport.dir/OptimizedStructLayout.cpp.o -c /Users/buildslave/jenkins/workspace/clang-stage2-cmake-RgSan/llvm-project/llvm/lib/Support/OptimizedStructLayout.cpp
[82/4672] /usr/local/bin/sccache /Users/buildslave/jenkins/workspace/clang-stage2-cmake-RgSan/host-compiler/bin/clang++  -DBUILD_EXAMPLES -DGTEST_HAS_RTTI=0 -D__STDC_CONSTANT_MACROS -D__STDC_FORMAT_MACROS -D__STDC_LIMIT_MACROS -Ilib/Support -I/Users/buildslave/jenkins/workspace/clang-stage2-cmake-RgSan/llvm-project/llvm/lib/Support -Iinclude -I/Users/buildslave/jenkins/workspace/clang-stage2-cmake-RgSan/llvm-project/llvm/include -fPIC -fvisibility-inlines-hidden -Werror=date-time -Werror=unguarded-availability-new -Wall -Wextra -Wno-unused-parameter -Wwrite-strings -Wcast-qual -Wmissing-field-initializers -pedantic -Wno-long-long -Wimplicit-fallthrough -Wcovered-switch-default -Wno-noexcept-type -Wnon-virtual-dtor -Wdelete-non-virtual-dtor -Wsuggest-override -Wstring-conversion -fno-omit-frame-pointer -fsanitize=address,undefined -fno-sanitize=vptr,function -fno-sanitize-recover=all -fsanitize-address-use-after-scope -fsanitize-blacklist=/Users/buildslave/jenkins/workspace/clang-stage2-cmake-RgSan/llvm-project/llvm/utils/sanitizers/ubsan_blacklist.txt -fdiagnostics-color -O2 -g -DNDEBUG -isysroot /Applications/Xcode.app/Contents/Developer/Platforms/MacOSX.platform/Developer/SDKs/MacOSX10.15.sdk   -std=c++14  -fno-exceptions -fno-rtti -MD -MT lib/Support/CMakeFiles/LLVMSupport.dir/LockFileManager.cpp.o -MF lib/Support/CMakeFiles/LLVMSupport.dir/LockFileManager.cpp.o.d -o lib/Support/CMakeFiles/LLVMSupport.dir/LockFileManager.cpp.o -c /Users/buildslave/jenkins/workspace/clang-stage2-cmake-RgSan/llvm-project/llvm/lib/Support/LockFileManager.cpp
[83/4672] /usr/local/bin/sccache /Users/buildslave/jenkins/workspace/clang-stage2-cmake-RgSan/host-compiler/bin/clang++  -DBUILD_EXAMPLES -DGTEST_HAS_RTTI=0 -D__STDC_CONSTANT_MACROS -D__STDC_FORMAT_MACROS -D__STDC_LIMIT_MACROS -Ilib/Support -I/Users/buildslave/jenkins/workspace/clang-stage2-cmake-RgSan/llvm-project/llvm/lib/Support -Iinclude -I/Users/buildslave/jenkins/workspace/clang-stage2-cmake-RgSan/llvm-project/llvm/include -fPIC -fvisibility-inlines-hidden -Werror=date-time -Werror=unguarded-availability-new -Wall -Wextra -Wno-unused-parameter -Wwrite-strings -Wcast-qual -Wmissing-field-initializers -pedantic -Wno-long-long -Wimplicit-fallthrough -Wcovered-switch-default -Wno-noexcept-type -Wnon-virtual-dtor -Wdelete-non-virtual-dtor -Wsuggest-override -Wstring-conversion -fno-omit-frame-pointer -fsanitize=address,undefined -fno-sanitize=vptr,function -fno-sanitize-recover=all -fsanitize-address-use-after-scope -fsanitize-blacklist=/Users/buildslave/jenkins/workspace/clang-stage2-cmake-RgSan/llvm-project/llvm/utils/sanitizers/ubsan_blacklist.txt -fdiagnostics-color -O2 -g -DNDEBUG -isysroot /Applications/Xcode.app/Contents/Developer/Platforms/MacOSX.platform/Developer/SDKs/MacOSX10.15.sdk   -std=c++14  -fno-exceptions -fno-rtti -MD -MT lib/Support/CMakeFiles/LLVMSupport.dir/MD5.cpp.o -MF lib/Support/CMakeFiles/LLVMSupport.dir/MD5.cpp.o.d -o lib/Support/CMakeFiles/LLVMSupport.dir/MD5.cpp.o -c /Users/buildslave/jenkins/workspace/clang-stage2-cmake-RgSan/llvm-project/llvm/lib/Support/MD5.cpp
[84/4672] /usr/local/bin/sccache /Users/buildslave/jenkins/workspace/clang-stage2-cmake-RgSan/host-compiler/bin/clang++  -DBUILD_EXAMPLES -DGTEST_HAS_RTTI=0 -D__STDC_CONSTANT_MACROS -D__STDC_FORMAT_MACROS -D__STDC_LIMIT_MACROS -Ilib/Support -I/Users/buildslave/jenkins/workspace/clang-stage2-cmake-RgSan/llvm-project/llvm/lib/Support -Iinclude -I/Users/buildslave/jenkins/workspace/clang-stage2-cmake-RgSan/llvm-project/llvm/include -fPIC -fvisibility-inlines-hidden -Werror=date-time -Werror=unguarded-availability-new -Wall -Wextra -Wno-unused-parameter -Wwrite-strings -Wcast-qual -Wmissing-field-initializers -pedantic -Wno-long-long -Wimplicit-fallthrough -Wcovered-switch-default -Wno-noexcept-type -Wnon-virtual-dtor -Wdelete-non-virtual-dtor -Wsuggest-override -Wstring-conversion -fno-omit-frame-pointer -fsanitize=address,undefined -fno-sanitize=vptr,function -fno-sanitize-recover=all -fsanitize-address-use-after-scope -fsanitize-blacklist=/Users/buildslave/jenkins/workspace/clang-stage2-cmake-RgSan/llvm-project/llvm/utils/sanitizers/ubsan_blacklist.txt -fdiagnostics-color -O2 -g -DNDEBUG -isysroot /Applications/Xcode.app/Contents/Developer/Platforms/MacOSX.platform/Developer/SDKs/MacOSX10.15.sdk   -std=c++14  -fno-exceptions -fno-rtti -MD -MT lib/Support/CMakeFiles/LLVMSupport.dir/Optional.cpp.o -MF lib/Support/CMakeFiles/LLVMSupport.dir/Optional.cpp.o.d -o lib/Support/CMakeFiles/LLVMSupport.dir/Optional.cpp.o -c /Users/buildslave/jenkins/workspace/clang-stage2-cmake-RgSan/llvm-project/llvm/lib/Support/Optional.cpp
[85/4672] /usr/local/bin/sccache /Users/buildslave/jenkins/workspace/clang-stage2-cmake-RgSan/host-compiler/bin/clang++  -DBUILD_EXAMPLES -DGTEST_HAS_RTTI=0 -D__STDC_CONSTANT_MACROS -D__STDC_FORMAT_MACROS -D__STDC_LIMIT_MACROS -Ilib/Support -I/Users/buildslave/jenkins/workspace/clang-stage2-cmake-RgSan/llvm-project/llvm/lib/Support -Iinclude -I/Users/buildslave/jenkins/workspace/clang-stage2-cmake-RgSan/llvm-project/llvm/include -fPIC -fvisibility-inlines-hidden -Werror=date-time -Werror=unguarded-availability-new -Wall -Wextra -Wno-unused-parameter -Wwrite-strings -Wcast-qual -Wmissing-field-initializers -pedantic -Wno-long-long -Wimplicit-fallthrough -Wcovered-switch-default -Wno-noexcept-type -Wnon-virtual-dtor -Wdelete-non-virtual-dtor -Wsuggest-override -Wstring-conversion -fno-omit-frame-pointer -fsanitize=address,undefined -fno-sanitize=vptr,function -fno-sanitize-recover=all -fsanitize-address-use-after-scope -fsanitize-blacklist=/Users/buildslave/jenkins/workspace/clang-stage2-cmake-RgSan/llvm-project/llvm/utils/sanitizers/ubsan_blacklist.txt -fdiagnostics-color -O2 -g -DNDEBUG -isysroot /Applications/Xcode.app/Contents/Developer/Platforms/MacOSX.platform/Developer/SDKs/MacOSX10.15.sdk   -std=c++14  -fno-exceptions -fno-rtti -MD -MT lib/Support/CMakeFiles/LLVMSupport.dir/PluginLoader.cpp.o -MF lib/Support/CMakeFiles/LLVMSupport.dir/PluginLoader.cpp.o.d -o lib/Support/CMakeFiles/LLVMSupport.dir/PluginLoader.cpp.o -c /Users/buildslave/jenkins/workspace/clang-stage2-cmake-RgSan/llvm-project/llvm/lib/Support/PluginLoader.cpp
[86/4672] /usr/local/bin/sccache /Users/buildslave/jenkins/workspace/clang-stage2-cmake-RgSan/host-compiler/bin/clang++  -DBUILD_EXAMPLES -DGTEST_HAS_RTTI=0 -D__STDC_CONSTANT_MACROS -D__STDC_FORMAT_MACROS -D__STDC_LIMIT_MACROS -Ilib/Support -I/Users/buildslave/jenkins/workspace/clang-stage2-cmake-RgSan/llvm-project/llvm/lib/Support -Iinclude -I/Users/buildslave/jenkins/workspace/clang-stage2-cmake-RgSan/llvm-project/llvm/include -fPIC -fvisibility-inlines-hidden -Werror=date-time -Werror=unguarded-availability-new -Wall -Wextra -Wno-unused-parameter -Wwrite-strings -Wcast-qual -Wmissing-field-initializers -pedantic -Wno-long-long -Wimplicit-fallthrough -Wcovered-switch-default -Wno-noexcept-type -Wnon-virtual-dtor -Wdelete-non-virtual-dtor -Wsuggest-override -Wstring-conversion -fno-omit-frame-pointer -fsanitize=address,undefined -fno-sanitize=vptr,function -fno-sanitize-recover=all -fsanitize-address-use-after-scope -fsanitize-blacklist=/Users/buildslave/jenkins/workspace/clang-stage2-cmake-RgSan/llvm-project/llvm/utils/sanitizers/ubsan_blacklist.txt -fdiagnostics-color -O2 -g -DNDEBUG -isysroot /Applications/Xcode.app/Contents/Developer/Platforms/MacOSX.platform/Developer/SDKs/MacOSX10.15.sdk   -std=c++14  -fno-exceptions -fno-rtti -MD -MT lib/Support/CMakeFiles/LLVMSupport.dir/PrettyStackTrace.cpp.o -MF lib/Support/CMakeFiles/LLVMSupport.dir/PrettyStackTrace.cpp.o.d -o lib/Support/CMakeFiles/LLVMSupport.dir/PrettyStackTrace.cpp.o -c /Users/buildslave/jenkins/workspace/clang-stage2-cmake-RgSan/llvm-project/llvm/lib/Support/PrettyStackTrace.cpp
[87/4672] /usr/local/bin/sccache /Users/buildslave/jenkins/workspace/clang-stage2-cmake-RgSan/host-compiler/bin/clang++  -DBUILD_EXAMPLES -DGTEST_HAS_RTTI=0 -D__STDC_CONSTANT_MACROS -D__STDC_FORMAT_MACROS -D__STDC_LIMIT_MACROS -Ilib/Support -I/Users/buildslave/jenkins/workspace/clang-stage2-cmake-RgSan/llvm-project/llvm/lib/Support -Iinclude -I/Users/buildslave/jenkins/workspace/clang-stage2-cmake-RgSan/llvm-project/llvm/include -fPIC -fvisibility-inlines-hidden -Werror=date-time -Werror=unguarded-availability-new -Wall -Wextra -Wno-unused-parameter -Wwrite-strings -Wcast-qual -Wmissing-field-initializers -pedantic -Wno-long-long -Wimplicit-fallthrough -Wcovered-switch-default -Wno-noexcept-type -Wnon-virtual-dtor -Wdelete-non-virtual-dtor -Wsuggest-override -Wstring-conversion -fno-omit-frame-pointer -fsanitize=address,undefined -fno-sanitize=vptr,function -fno-sanitize-recover=all -fsanitize-address-use-after-scope -fsanitize-blacklist=/Users/buildslave/jenkins/workspace/clang-stage2-cmake-RgSan/llvm-project/llvm/utils/sanitizers/ubsan_blacklist.txt -fdiagnostics-color -O2 -g -DNDEBUG -isysroot /Applications/Xcode.app/Contents/Developer/Platforms/MacOSX.platform/Developer/SDKs/MacOSX10.15.sdk   -std=c++14  -fno-exceptions -fno-rtti -MD -MT lib/Support/CMakeFiles/LLVMSupport.dir/MemoryBuffer.cpp.o -MF lib/Support/CMakeFiles/LLVMSupport.dir/MemoryBuffer.cpp.o.d -o lib/Support/CMakeFiles/LLVMSupport.dir/MemoryBuffer.cpp.o -c /Users/buildslave/jenkins/workspace/clang-stage2-cmake-RgSan/llvm-project/llvm/lib/Support/MemoryBuffer.cpp
[88/4672] /usr/local/bin/sccache /Users/buildslave/jenkins/workspace/clang-stage2-cmake-RgSan/host-compiler/bin/clang++  -DBUILD_EXAMPLES -DGTEST_HAS_RTTI=0 -D__STDC_CONSTANT_MACROS -D__STDC_FORMAT_MACROS -D__STDC_LIMIT_MACROS -Ilib/Support -I/Users/buildslave/jenkins/workspace/clang-stage2-cmake-RgSan/llvm-project/llvm/lib/Support -Iinclude -I/Users/buildslave/jenkins/workspace/clang-stage2-cmake-RgSan/llvm-project/llvm/include -fPIC -fvisibility-inlines-hidden -Werror=date-time -Werror=unguarded-availability-new -Wall -Wextra -Wno-unused-parameter -Wwrite-strings -Wcast-qual -Wmissing-field-initializers -pedantic -Wno-long-long -Wimplicit-fallthrough -Wcovered-switch-default -Wno-noexcept-type -Wnon-virtual-dtor -Wdelete-non-virtual-dtor -Wsuggest-override -Wstring-conversion -fno-omit-frame-pointer -fsanitize=address,undefined -fno-sanitize=vptr,function -fno-sanitize-recover=all -fsanitize-address-use-after-scope -fsanitize-blacklist=/Users/buildslave/jenkins/workspace/clang-stage2-cmake-RgSan/llvm-project/llvm/utils/sanitizers/ubsan_blacklist.txt -fdiagnostics-color -O2 -g -DNDEBUG -isysroot /Applications/Xcode.app/Contents/Developer/Platforms/MacOSX.platform/Developer/SDKs/MacOSX10.15.sdk   -std=c++14  -fno-exceptions -fno-rtti -MD -MT lib/Support/CMakeFiles/LLVMSupport.dir/RISCVAttributes.cpp.o -MF lib/Support/CMakeFiles/LLVMSupport.dir/RISCVAttributes.cpp.o.d -o lib/Support/CMakeFiles/LLVMSupport.dir/RISCVAttributes.cpp.o -c /Users/buildslave/jenkins/workspace/clang-stage2-cmake-RgSan/llvm-project/llvm/lib/Support/RISCVAttributes.cpp
[89/4672] /usr/local/bin/sccache /Users/buildslave/jenkins/workspace/clang-stage2-cmake-RgSan/host-compiler/bin/clang++  -DBUILD_EXAMPLES -DGTEST_HAS_RTTI=0 -D__STDC_CONSTANT_MACROS -D__STDC_FORMAT_MACROS -D__STDC_LIMIT_MACROS -Ilib/Support -I/Users/buildslave/jenkins/workspace/clang-stage2-cmake-RgSan/llvm-project/llvm/lib/Support -Iinclude -I/Users/buildslave/jenkins/workspace/clang-stage2-cmake-RgSan/llvm-project/llvm/include -fPIC -fvisibility-inlines-hidden -Werror=date-time -Werror=unguarded-availability-new -Wall -Wextra -Wno-unused-parameter -Wwrite-strings -Wcast-qual -Wmissing-field-initializers -pedantic -Wno-long-long -Wimplicit-fallthrough -Wcovered-switch-default -Wno-noexcept-type -Wnon-virtual-dtor -Wdelete-non-virtual-dtor -Wsuggest-override -Wstring-conversion -fno-omit-frame-pointer -fsanitize=address,undefined -fno-sanitize=vptr,function -fno-sanitize-recover=all -fsanitize-address-use-after-scope -fsanitize-blacklist=/Users/buildslave/jenkins/workspace/clang-stage2-cmake-RgSan/llvm-project/llvm/utils/sanitizers/ubsan_blacklist.txt -fdiagnostics-color -O2 -g -DNDEBUG -isysroot /Applications/Xcode.app/Contents/Developer/Platforms/MacOSX.platform/Developer/SDKs/MacOSX10.15.sdk   -std=c++14  -fno-exceptions -fno-rtti -MD -MT lib/Support/CMakeFiles/LLVMSupport.dir/Regex.cpp.o -MF lib/Support/CMakeFiles/LLVMSupport.dir/Regex.cpp.o.d -o lib/Support/CMakeFiles/LLVMSupport.dir/Regex.cpp.o -c /Users/buildslave/jenkins/workspace/clang-stage2-cmake-RgSan/llvm-project/llvm/lib/Support/Regex.cpp
[90/4672] /usr/local/bin/sccache /Users/buildslave/jenkins/workspace/clang-stage2-cmake-RgSan/host-compiler/bin/clang++  -DBUILD_EXAMPLES -DGTEST_HAS_RTTI=0 -D__STDC_CONSTANT_MACROS -D__STDC_FORMAT_MACROS -D__STDC_LIMIT_MACROS -Ilib/Support -I/Users/buildslave/jenkins/workspace/clang-stage2-cmake-RgSan/llvm-project/llvm/lib/Support -Iinclude -I/Users/buildslave/jenkins/workspace/clang-stage2-cmake-RgSan/llvm-project/llvm/include -fPIC -fvisibility-inlines-hidden -Werror=date-time -Werror=unguarded-availability-new -Wall -Wextra -Wno-unused-parameter -Wwrite-strings -Wcast-qual -Wmissing-field-initializers -pedantic -Wno-long-long -Wimplicit-fallthrough -Wcovered-switch-default -Wno-noexcept-type -Wnon-virtual-dtor -Wdelete-non-virtual-dtor -Wsuggest-override -Wstring-conversion -fno-omit-frame-pointer -fsanitize=address,undefined -fno-sanitize=vptr,function -fno-sanitize-recover=all -fsanitize-address-use-after-scope -fsanitize-blacklist=/Users/buildslave/jenkins/workspace/clang-stage2-cmake-RgSan/llvm-project/llvm/utils/sanitizers/ubsan_blacklist.txt -fdiagnostics-color -O2 -g -DNDEBUG -isysroot /Applications/Xcode.app/Contents/Developer/Platforms/MacOSX.platform/Developer/SDKs/MacOSX10.15.sdk   -std=c++14  -fno-exceptions -fno-rtti -MD -MT lib/Support/CMakeFiles/LLVMSupport.dir/JSON.cpp.o -MF lib/Support/CMakeFiles/LLVMSupport.dir/JSON.cpp.o.d -o lib/Support/CMakeFiles/LLVMSupport.dir/JSON.cpp.o -c /Users/buildslave/jenkins/workspace/clang-stage2-cmake-RgSan/llvm-project/llvm/lib/Support/JSON.cpp
[91/4672] /usr/local/bin/sccache /Users/buildslave/jenkins/workspace/clang-stage2-cmake-RgSan/host-compiler/bin/clang++  -DBUILD_EXAMPLES -DGTEST_HAS_RTTI=0 -D__STDC_CONSTANT_MACROS -D__STDC_FORMAT_MACROS -D__STDC_LIMIT_MACROS -Ilib/Support -I/Users/buildslave/jenkins/workspace/clang-stage2-cmake-RgSan/llvm-project/llvm/lib/Support -Iinclude -I/Users/buildslave/jenkins/workspace/clang-stage2-cmake-RgSan/llvm-project/llvm/include -fPIC -fvisibility-inlines-hidden -Werror=date-time -Werror=unguarded-availability-new -Wall -Wextra -Wno-unused-parameter -Wwrite-strings -Wcast-qual -Wmissing-field-initializers -pedantic -Wno-long-long -Wimplicit-fallthrough -Wcovered-switch-default -Wno-noexcept-type -Wnon-virtual-dtor -Wdelete-non-virtual-dtor -Wsuggest-override -Wstring-conversion -fno-omit-frame-pointer -fsanitize=address,undefined -fno-sanitize=vptr,function -fno-sanitize-recover=all -fsanitize-address-use-after-scope -fsanitize-blacklist=/Users/buildslave/jenkins/workspace/clang-stage2-cmake-RgSan/llvm-project/llvm/utils/sanitizers/ubsan_blacklist.txt -fdiagnostics-color -O2 -g -DNDEBUG -isysroot /Applications/Xcode.app/Contents/Developer/Platforms/MacOSX.platform/Developer/SDKs/MacOSX10.15.sdk   -std=c++14  -fno-exceptions -fno-rtti -MD -MT lib/Support/CMakeFiles/LLVMSupport.dir/Parallel.cpp.o -MF lib/Support/CMakeFiles/LLVMSupport.dir/Parallel.cpp.o.d -o lib/Support/CMakeFiles/LLVMSupport.dir/Parallel.cpp.o -c /Users/buildslave/jenkins/workspace/clang-stage2-cmake-RgSan/llvm-project/llvm/lib/Support/Parallel.cpp
[92/4672] /usr/local/bin/sccache /Users/buildslave/jenkins/workspace/clang-stage2-cmake-RgSan/host-compiler/bin/clang++  -DBUILD_EXAMPLES -DGTEST_HAS_RTTI=0 -D__STDC_CONSTANT_MACROS -D__STDC_FORMAT_MACROS -D__STDC_LIMIT_MACROS -Ilib/Support -I/Users/buildslave/jenkins/workspace/clang-stage2-cmake-RgSan/llvm-project/llvm/lib/Support -Iinclude -I/Users/buildslave/jenkins/workspace/clang-stage2-cmake-RgSan/llvm-project/llvm/include -fPIC -fvisibility-inlines-hidden -Werror=date-time -Werror=unguarded-availability-new -Wall -Wextra -Wno-unused-parameter -Wwrite-strings -Wcast-qual -Wmissing-field-initializers -pedantic -Wno-long-long -Wimplicit-fallthrough -Wcovered-switch-default -Wno-noexcept-type -Wnon-virtual-dtor -Wdelete-non-virtual-dtor -Wsuggest-override -Wstring-conversion -fno-omit-frame-pointer -fsanitize=address,undefined -fno-sanitize=vptr,function -fno-sanitize-recover=all -fsanitize-address-use-after-scope -fsanitize-blacklist=/Users/buildslave/jenkins/workspace/clang-stage2-cmake-RgSan/llvm-project/llvm/utils/sanitizers/ubsan_blacklist.txt -fdiagnostics-color -O2 -g -DNDEBUG -isysroot /Applications/Xcode.app/Contents/Developer/Platforms/MacOSX.platform/Developer/SDKs/MacOSX10.15.sdk   -std=c++14  -fno-exceptions -fno-rtti -MD -MT lib/Support/CMakeFiles/LLVMSupport.dir/CommandLine.cpp.o -MF lib/Support/CMakeFiles/LLVMSupport.dir/CommandLine.cpp.o.d -o lib/Support/CMakeFiles/LLVMSupport.dir/CommandLine.cpp.o -c /Users/buildslave/jenkins/workspace/clang-stage2-cmake-RgSan/llvm-project/llvm/lib/Support/CommandLine.cpp
[93/4672] /usr/local/bin/sccache /Users/buildslave/jenkins/workspace/clang-stage2-cmake-RgSan/host-compiler/bin/clang++  -DBUILD_EXAMPLES -DGTEST_HAS_RTTI=0 -D__STDC_CONSTANT_MACROS -D__STDC_FORMAT_MACROS -D__STDC_LIMIT_MACROS -Ilib/Support -I/Users/buildslave/jenkins/workspace/clang-stage2-cmake-RgSan/llvm-project/llvm/lib/Support -Iinclude -I/Users/buildslave/jenkins/workspace/clang-stage2-cmake-RgSan/llvm-project/llvm/include -fPIC -fvisibility-inlines-hidden -Werror=date-time -Werror=unguarded-availability-new -Wall -Wextra -Wno-unused-parameter -Wwrite-strings -Wcast-qual -Wmissing-field-initializers -pedantic -Wno-long-long -Wimplicit-fallthrough -Wcovered-switch-default -Wno-noexcept-type -Wnon-virtual-dtor -Wdelete-non-virtual-dtor -Wsuggest-override -Wstring-conversion -fno-omit-frame-pointer -fsanitize=address,undefined -fno-sanitize=vptr,function -fno-sanitize-recover=all -fsanitize-address-use-after-scope -fsanitize-blacklist=/Users/buildslave/jenkins/workspace/clang-stage2-cmake-RgSan/llvm-project/llvm/utils/sanitizers/ubsan_blacklist.txt -fdiagnostics-color -O2 -g -DNDEBUG -isysroot /Applications/Xcode.app/Contents/Developer/Platforms/MacOSX.platform/Developer/SDKs/MacOSX10.15.sdk   -std=c++14  -fno-exceptions -fno-rtti -MD -MT lib/Support/CMakeFiles/LLVMSupport.dir/RISCVAttributeParser.cpp.o -MF lib/Support/CMakeFiles/LLVMSupport.dir/RISCVAttributeParser.cpp.o.d -o lib/Support/CMakeFiles/LLVMSupport.dir/RISCVAttributeParser.cpp.o -c /Users/buildslave/jenkins/workspace/clang-stage2-cmake-RgSan/llvm-project/llvm/lib/Support/RISCVAttributeParser.cpp
[94/4672] /usr/local/bin/sccache /Users/buildslave/jenkins/workspace/clang-stage2-cmake-RgSan/host-compiler/bin/clang++  -DBUILD_EXAMPLES -DGTEST_HAS_RTTI=0 -D__STDC_CONSTANT_MACROS -D__STDC_FORMAT_MACROS -D__STDC_LIMIT_MACROS -Ilib/Support -I/Users/buildslave/jenkins/workspace/clang-stage2-cmake-RgSan/llvm-project/llvm/lib/Support -Iinclude -I/Users/buildslave/jenkins/workspace/clang-stage2-cmake-RgSan/llvm-project/llvm/include -fPIC -fvisibility-inlines-hidden -Werror=date-time -Werror=unguarded-availability-new -Wall -Wextra -Wno-unused-parameter -Wwrite-strings -Wcast-qual -Wmissing-field-initializers -pedantic -Wno-long-long -Wimplicit-fallthrough -Wcovered-switch-default -Wno-noexcept-type -Wnon-virtual-dtor -Wdelete-non-virtual-dtor -Wsuggest-override -Wstring-conversion -fno-omit-frame-pointer -fsanitize=address,undefined -fno-sanitize=vptr,function -fno-sanitize-recover=all -fsanitize-address-use-after-scope -fsanitize-blacklist=/Users/buildslave/jenkins/workspace/clang-stage2-cmake-RgSan/llvm-project/llvm/utils/sanitizers/ubsan_blacklist.txt -fdiagnostics-color -O2 -g -DNDEBUG -isysroot /Applications/Xcode.app/Contents/Developer/Platforms/MacOSX.platform/Developer/SDKs/MacOSX10.15.sdk   -std=c++14  -fno-exceptions -fno-rtti -MD -MT lib/Support/CMakeFiles/LLVMSupport.dir/RandomNumberGenerator.cpp.o -MF lib/Support/CMakeFiles/LLVMSupport.dir/RandomNumberGenerator.cpp.o.d -o lib/Support/CMakeFiles/LLVMSupport.dir/RandomNumberGenerator.cpp.o -c /Users/buildslave/jenkins/workspace/clang-stage2-cmake-RgSan/llvm-project/llvm/lib/Support/RandomNumberGenerator.cpp
[95/4672] /usr/local/bin/sccache /Users/buildslave/jenkins/workspace/clang-stage2-cmake-RgSan/host-compiler/bin/clang++  -DBUILD_EXAMPLES -DGTEST_HAS_RTTI=0 -D__STDC_CONSTANT_MACROS -D__STDC_FORMAT_MACROS -D__STDC_LIMIT_MACROS -Ilib/Support -I/Users/buildslave/jenkins/workspace/clang-stage2-cmake-RgSan/llvm-project/llvm/lib/Support -Iinclude -I/Users/buildslave/jenkins/workspace/clang-stage2-cmake-RgSan/llvm-project/llvm/include -fPIC -fvisibility-inlines-hidden -Werror=date-time -Werror=unguarded-availability-new -Wall -Wextra -Wno-unused-parameter -Wwrite-strings -Wcast-qual -Wmissing-field-initializers -pedantic -Wno-long-long -Wimplicit-fallthrough -Wcovered-switch-default -Wno-noexcept-type -Wnon-virtual-dtor -Wdelete-non-virtual-dtor -Wsuggest-override -Wstring-conversion -fno-omit-frame-pointer -fsanitize=address,undefined -fno-sanitize=vptr,function -fno-sanitize-recover=all -fsanitize-address-use-after-scope -fsanitize-blacklist=/Users/buildslave/jenkins/workspace/clang-stage2-cmake-RgSan/llvm-project/llvm/utils/sanitizers/ubsan_blacklist.txt -fdiagnostics-color -O2 -g -DNDEBUG -isysroot /Applications/Xcode.app/Contents/Developer/Platforms/MacOSX.platform/Developer/SDKs/MacOSX10.15.sdk   -std=c++14  -fno-exceptions -fno-rtti -MD -MT lib/Support/CMakeFiles/LLVMSupport.dir/ScopedPrinter.cpp.o -MF lib/Support/CMakeFiles/LLVMSupport.dir/ScopedPrinter.cpp.o.d -o lib/Support/CMakeFiles/LLVMSupport.dir/ScopedPrinter.cpp.o -c /Users/buildslave/jenkins/workspace/clang-stage2-cmake-RgSan/llvm-project/llvm/lib/Support/ScopedPrinter.cpp
[96/4672] /usr/local/bin/sccache /Users/buildslave/jenkins/workspace/clang-stage2-cmake-RgSan/host-compiler/bin/clang++  -DBUILD_EXAMPLES -DGTEST_HAS_RTTI=0 -D__STDC_CONSTANT_MACROS -D__STDC_FORMAT_MACROS -D__STDC_LIMIT_MACROS -Ilib/Support -I/Users/buildslave/jenkins/workspace/clang-stage2-cmake-RgSan/llvm-project/llvm/lib/Support -Iinclude -I/Users/buildslave/jenkins/workspace/clang-stage2-cmake-RgSan/llvm-project/llvm/include -fPIC -fvisibility-inlines-hidden -Werror=date-time -Werror=unguarded-availability-new -Wall -Wextra -Wno-unused-parameter -Wwrite-strings -Wcast-qual -Wmissing-field-initializers -pedantic -Wno-long-long -Wimplicit-fallthrough -Wcovered-switch-default -Wno-noexcept-type -Wnon-virtual-dtor -Wdelete-non-virtual-dtor -Wsuggest-override -Wstring-conversion -fno-omit-frame-pointer -fsanitize=address,undefined -fno-sanitize=vptr,function -fno-sanitize-recover=all -fsanitize-address-use-after-scope -fsanitize-blacklist=/Users/buildslave/jenkins/workspace/clang-stage2-cmake-RgSan/llvm-project/llvm/utils/sanitizers/ubsan_blacklist.txt -fdiagnostics-color -O2 -g -DNDEBUG -isysroot /Applications/Xcode.app/Contents/Developer/Platforms/MacOSX.platform/Developer/SDKs/MacOSX10.15.sdk   -std=c++14  -fno-exceptions -fno-rtti -MD -MT lib/Support/CMakeFiles/LLVMSupport.dir/Signposts.cpp.o -MF lib/Support/CMakeFiles/LLVMSupport.dir/Signposts.cpp.o.d -o lib/Support/CMakeFiles/LLVMSupport.dir/Signposts.cpp.o -c /Users/buildslave/jenkins/workspace/clang-stage2-cmake-RgSan/llvm-project/llvm/lib/Support/Signposts.cpp
[97/4672] /usr/local/bin/sccache /Users/buildslave/jenkins/workspace/clang-stage2-cmake-RgSan/host-compiler/bin/clang++  -DBUILD_EXAMPLES -DGTEST_HAS_RTTI=0 -D__STDC_CONSTANT_MACROS -D__STDC_FORMAT_MACROS -D__STDC_LIMIT_MACROS -Ilib/Support -I/Users/buildslave/jenkins/workspace/clang-stage2-cmake-RgSan/llvm-project/llvm/lib/Support -Iinclude -I/Users/buildslave/jenkins/workspace/clang-stage2-cmake-RgSan/llvm-project/llvm/include -fPIC -fvisibility-inlines-hidden -Werror=date-time -Werror=unguarded-availability-new -Wall -Wextra -Wno-unused-parameter -Wwrite-strings -Wcast-qual -Wmissing-field-initializers -pedantic -Wno-long-long -Wimplicit-fallthrough -Wcovered-switch-default -Wno-noexcept-type -Wnon-virtual-dtor -Wdelete-non-virtual-dtor -Wsuggest-override -Wstring-conversion -fno-omit-frame-pointer -fsanitize=address,undefined -fno-sanitize=vptr,function -fno-sanitize-recover=all -fsanitize-address-use-after-scope -fsanitize-blacklist=/Users/buildslave/jenkins/workspace/clang-stage2-cmake-RgSan/llvm-project/llvm/utils/sanitizers/ubsan_blacklist.txt -fdiagnostics-color -O2 -g -DNDEBUG -isysroot /Applications/Xcode.app/Contents/Developer/Platforms/MacOSX.platform/Developer/SDKs/MacOSX10.15.sdk   -std=c++14  -fno-exceptions -fno-rtti -MD -MT lib/Support/CMakeFiles/LLVMSupport.dir/SHA1.cpp.o -MF lib/Support/CMakeFiles/LLVMSupport.dir/SHA1.cpp.o.d -o lib/Support/CMakeFiles/LLVMSupport.dir/SHA1.cpp.o -c /Users/buildslave/jenkins/workspace/clang-stage2-cmake-RgSan/llvm-project/llvm/lib/Support/SHA1.cpp
[98/4672] /usr/local/bin/sccache /Users/buildslave/jenkins/workspace/clang-stage2-cmake-RgSan/host-compiler/bin/clang++  -DBUILD_EXAMPLES -DGTEST_HAS_RTTI=0 -D__STDC_CONSTANT_MACROS -D__STDC_FORMAT_MACROS -D__STDC_LIMIT_MACROS -Ilib/Support -I/Users/buildslave/jenkins/workspace/clang-stage2-cmake-RgSan/llvm-project/llvm/lib/Support -Iinclude -I/Users/buildslave/jenkins/workspace/clang-stage2-cmake-RgSan/llvm-project/llvm/include -fPIC -fvisibility-inlines-hidden -Werror=date-time -Werror=unguarded-availability-new -Wall -Wextra -Wno-unused-parameter -Wwrite-strings -Wcast-qual -Wmissing-field-initializers -pedantic -Wno-long-long -Wimplicit-fallthrough -Wcovered-switch-default -Wno-noexcept-type -Wnon-virtual-dtor -Wdelete-non-virtual-dtor -Wsuggest-override -Wstring-conversion -fno-omit-frame-pointer -fsanitize=address,undefined -fno-sanitize=vptr,function -fno-sanitize-recover=all -fsanitize-address-use-after-scope -fsanitize-blacklist=/Users/buildslave/jenkins/workspace/clang-stage2-cmake-RgSan/llvm-project/llvm/utils/sanitizers/ubsan_blacklist.txt -fdiagnostics-color -O2 -g -DNDEBUG -isysroot /Applications/Xcode.app/Contents/Developer/Platforms/MacOSX.platform/Developer/SDKs/MacOSX10.15.sdk   -std=c++14  -fno-exceptions -fno-rtti -MD -MT lib/Support/CMakeFiles/LLVMSupport.dir/ScaledNumber.cpp.o -MF lib/Support/CMakeFiles/LLVMSupport.dir/ScaledNumber.cpp.o.d -o lib/Support/CMakeFiles/LLVMSupport.dir/ScaledNumber.cpp.o -c /Users/buildslave/jenkins/workspace/clang-stage2-cmake-RgSan/llvm-project/llvm/lib/Support/ScaledNumber.cpp
[99/4672] /usr/local/bin/sccache /Users/buildslave/jenkins/workspace/clang-stage2-cmake-RgSan/host-compiler/bin/clang++  -DBUILD_EXAMPLES -DGTEST_HAS_RTTI=0 -D__STDC_CONSTANT_MACROS -D__STDC_FORMAT_MACROS -D__STDC_LIMIT_MACROS -Ilib/Support -I/Users/buildslave/jenkins/workspace/clang-stage2-cmake-RgSan/llvm-project/llvm/lib/Support -Iinclude -I/Users/buildslave/jenkins/workspace/clang-stage2-cmake-RgSan/llvm-project/llvm/include -fPIC -fvisibility-inlines-hidden -Werror=date-time -Werror=unguarded-availability-new -Wall -Wextra -Wno-unused-parameter -Wwrite-strings -Wcast-qual -Wmissing-field-initializers -pedantic -Wno-long-long -Wimplicit-fallthrough -Wcovered-switch-default -Wno-noexcept-type -Wnon-virtual-dtor -Wdelete-non-virtual-dtor -Wsuggest-override -Wstring-conversion -fno-omit-frame-pointer -fsanitize=address,undefined -fno-sanitize=vptr,function -fno-sanitize-recover=all -fsanitize-address-use-after-scope -fsanitize-blacklist=/Users/buildslave/jenkins/workspace/clang-stage2-cmake-RgSan/llvm-project/llvm/utils/sanitizers/ubsan_blacklist.txt -fdiagnostics-color -O2 -g -DNDEBUG -isysroot /Applications/Xcode.app/Contents/Developer/Platforms/MacOSX.platform/Developer/SDKs/MacOSX10.15.sdk   -std=c++14  -fno-exceptions -fno-rtti -MD -MT lib/Support/CMakeFiles/LLVMSupport.dir/SmallVector.cpp.o -MF lib/Support/CMakeFiles/LLVMSupport.dir/SmallVector.cpp.o.d -o lib/Support/CMakeFiles/LLVMSupport.dir/SmallVector.cpp.o -c /Users/buildslave/jenkins/workspace/clang-stage2-cmake-RgSan/llvm-project/llvm/lib/Support/SmallVector.cpp
[100/4672] /usr/local/bin/sccache /Users/buildslave/jenkins/workspace/clang-stage2-cmake-RgSan/host-compiler/bin/clang++  -DBUILD_EXAMPLES -DGTEST_HAS_RTTI=0 -D__STDC_CONSTANT_MACROS -D__STDC_FORMAT_MACROS -D__STDC_LIMIT_MACROS -Ilib/Support -I/Users/buildslave/jenkins/workspace/clang-stage2-cmake-RgSan/llvm-project/llvm/lib/Support -Iinclude -I/Users/buildslave/jenkins/workspace/clang-stage2-cmake-RgSan/llvm-project/llvm/include -fPIC -fvisibility-inlines-hidden -Werror=date-time -Werror=unguarded-availability-new -Wall -Wextra -Wno-unused-parameter -Wwrite-strings -Wcast-qual -Wmissing-field-initializers -pedantic -Wno-long-long -Wimplicit-fallthrough -Wcovered-switch-default -Wno-noexcept-type -Wnon-virtual-dtor -Wdelete-non-virtual-dtor -Wsuggest-override -Wstring-conversion -fno-omit-frame-pointer -fsanitize=address,undefined -fno-sanitize=vptr,function -fno-sanitize-recover=all -fsanitize-address-use-after-scope -fsanitize-blacklist=/Users/buildslave/jenkins/workspace/clang-stage2-cmake-RgSan/llvm-project/llvm/utils/sanitizers/ubsan_blacklist.txt -fdiagnostics-color -O2 -g -DNDEBUG -isysroot /Applications/Xcode.app/Contents/Developer/Platforms/MacOSX.platform/Developer/SDKs/MacOSX10.15.sdk   -std=c++14  -fno-exceptions -fno-rtti -MD -MT lib/Support/CMakeFiles/LLVMSupport.dir/SmallPtrSet.cpp.o -MF lib/Support/CMakeFiles/LLVMSupport.dir/SmallPtrSet.cpp.o.d -o lib/Support/CMakeFiles/LLVMSupport.dir/SmallPtrSet.cpp.o -c /Users/buildslave/jenkins/workspace/clang-stage2-cmake-RgSan/llvm-project/llvm/lib/Support/SmallPtrSet.cpp
[101/4672] /usr/local/bin/sccache /Users/buildslave/jenkins/workspace/clang-stage2-cmake-RgSan/host-compiler/bin/clang++  -DBUILD_EXAMPLES -DGTEST_HAS_RTTI=0 -D__STDC_CONSTANT_MACROS -D__STDC_FORMAT_MACROS -D__STDC_LIMIT_MACROS -Ilib/Support -I/Users/buildslave/jenkins/workspace/clang-stage2-cmake-RgSan/llvm-project/llvm/lib/Support -Iinclude -I/Users/buildslave/jenkins/workspace/clang-stage2-cmake-RgSan/llvm-project/llvm/include -fPIC -fvisibility-inlines-hidden -Werror=date-time -Werror=unguarded-availability-new -Wall -Wextra -Wno-unused-parameter -Wwrite-strings -Wcast-qual -Wmissing-field-initializers -pedantic -Wno-long-long -Wimplicit-fallthrough -Wcovered-switch-default -Wno-noexcept-type -Wnon-virtual-dtor -Wdelete-non-virtual-dtor -Wsuggest-override -Wstring-conversion -fno-omit-frame-pointer -fsanitize=address,undefined -fno-sanitize=vptr,function -fno-sanitize-recover=all -fsanitize-address-use-after-scope -fsanitize-blacklist=/Users/buildslave/jenkins/workspace/clang-stage2-cmake-RgSan/llvm-project/llvm/utils/sanitizers/ubsan_blacklist.txt -fdiagnostics-color -O2 -g -DNDEBUG -isysroot /Applications/Xcode.app/Contents/Developer/Platforms/MacOSX.platform/Developer/SDKs/MacOSX10.15.sdk   -std=c++14  -fno-exceptions -fno-rtti -MD -MT lib/Support/CMakeFiles/LLVMSupport.dir/StringMap.cpp.o -MF lib/Support/CMakeFiles/LLVMSupport.dir/StringMap.cpp.o.d -o lib/Support/CMakeFiles/LLVMSupport.dir/StringMap.cpp.o -c /Users/buildslave/jenkins/workspace/clang-stage2-cmake-RgSan/llvm-project/llvm/lib/Support/StringMap.cpp
[102/4672] /usr/local/bin/sccache /Users/buildslave/jenkins/workspace/clang-stage2-cmake-RgSan/host-compiler/bin/clang++  -DBUILD_EXAMPLES -DGTEST_HAS_RTTI=0 -D__STDC_CONSTANT_MACROS -D__STDC_FORMAT_MACROS -D__STDC_LIMIT_MACROS -Ilib/Support -I/Users/buildslave/jenkins/workspace/clang-stage2-cmake-RgSan/llvm-project/llvm/lib/Support -Iinclude -I/Users/buildslave/jenkins/workspace/clang-stage2-cmake-RgSan/llvm-project/llvm/include -fPIC -fvisibility-inlines-hidden -Werror=date-time -Werror=unguarded-availability-new -Wall -Wextra -Wno-unused-parameter -Wwrite-strings -Wcast-qual -Wmissing-field-initializers -pedantic -Wno-long-long -Wimplicit-fallthrough -Wcovered-switch-default -Wno-noexcept-type -Wnon-virtual-dtor -Wdelete-non-virtual-dtor -Wsuggest-override -Wstring-conversion -fno-omit-frame-pointer -fsanitize=address,undefined -fno-sanitize=vptr,function -fno-sanitize-recover=all -fsanitize-address-use-after-scope -fsanitize-blacklist=/Users/buildslave/jenkins/workspace/clang-stage2-cmake-RgSan/llvm-project/llvm/utils/sanitizers/ubsan_blacklist.txt -fdiagnostics-color -O2 -g -DNDEBUG -isysroot /Applications/Xcode.app/Contents/Developer/Platforms/MacOSX.platform/Developer/SDKs/MacOSX10.15.sdk   -std=c++14  -fno-exceptions -fno-rtti -MD -MT lib/Support/CMakeFiles/LLVMSupport.dir/StringExtras.cpp.o -MF lib/Support/CMakeFiles/LLVMSupport.dir/StringExtras.cpp.o.d -o lib/Support/CMakeFiles/LLVMSupport.dir/StringExtras.cpp.o -c /Users/buildslave/jenkins/workspace/clang-stage2-cmake-RgSan/llvm-project/llvm/lib/Support/StringExtras.cpp
[103/4672] /usr/local/bin/sccache /Users/buildslave/jenkins/workspace/clang-stage2-cmake-RgSan/host-compiler/bin/clang++  -DBUILD_EXAMPLES -DGTEST_HAS_RTTI=0 -D__STDC_CONSTANT_MACROS -D__STDC_FORMAT_MACROS -D__STDC_LIMIT_MACROS -Ilib/Support -I/Users/buildslave/jenkins/workspace/clang-stage2-cmake-RgSan/llvm-project/llvm/lib/Support -Iinclude -I/Users/buildslave/jenkins/workspace/clang-stage2-cmake-RgSan/llvm-project/llvm/include -fPIC -fvisibility-inlines-hidden -Werror=date-time -Werror=unguarded-availability-new -Wall -Wextra -Wno-unused-parameter -Wwrite-strings -Wcast-qual -Wmissing-field-initializers -pedantic -Wno-long-long -Wimplicit-fallthrough -Wcovered-switch-default -Wno-noexcept-type -Wnon-virtual-dtor -Wdelete-non-virtual-dtor -Wsuggest-override -Wstring-conversion -fno-omit-frame-pointer -fsanitize=address,undefined -fno-sanitize=vptr,function -fno-sanitize-recover=all -fsanitize-address-use-after-scope -fsanitize-blacklist=/Users/buildslave/jenkins/workspace/clang-stage2-cmake-RgSan/llvm-project/llvm/utils/sanitizers/ubsan_blacklist.txt -fdiagnostics-color -O2 -g -DNDEBUG -isysroot /Applications/Xcode.app/Contents/Developer/Platforms/MacOSX.platform/Developer/SDKs/MacOSX10.15.sdk   -std=c++14  -fno-exceptions -fno-rtti -MD -MT lib/Support/CMakeFiles/LLVMSupport.dir/StringSaver.cpp.o -MF lib/Support/CMakeFiles/LLVMSupport.dir/StringSaver.cpp.o.d -o lib/Support/CMakeFiles/LLVMSupport.dir/StringSaver.cpp.o -c /Users/buildslave/jenkins/workspace/clang-stage2-cmake-RgSan/llvm-project/llvm/lib/Support/StringSaver.cpp
[104/4672] /usr/local/bin/sccache /Users/buildslave/jenkins/workspace/clang-stage2-cmake-RgSan/host-compiler/bin/clang++  -DBUILD_EXAMPLES -DGTEST_HAS_RTTI=0 -D__STDC_CONSTANT_MACROS -D__STDC_FORMAT_MACROS -D__STDC_LIMIT_MACROS -Ilib/Support -I/Users/buildslave/jenkins/workspace/clang-stage2-cmake-RgSan/llvm-project/llvm/lib/Support -Iinclude -I/Users/buildslave/jenkins/workspace/clang-stage2-cmake-RgSan/llvm-project/llvm/include -fPIC -fvisibility-inlines-hidden -Werror=date-time -Werror=unguarded-availability-new -Wall -Wextra -Wno-unused-parameter -Wwrite-strings -Wcast-qual -Wmissing-field-initializers -pedantic -Wno-long-long -Wimplicit-fallthrough -Wcovered-switch-default -Wno-noexcept-type -Wnon-virtual-dtor -Wdelete-non-virtual-dtor -Wsuggest-override -Wstring-conversion -fno-omit-frame-pointer -fsanitize=address,undefined -fno-sanitize=vptr,function -fno-sanitize-recover=all -fsanitize-address-use-after-scope -fsanitize-blacklist=/Users/buildslave/jenkins/workspace/clang-stage2-cmake-RgSan/llvm-project/llvm/utils/sanitizers/ubsan_blacklist.txt -fdiagnostics-color -O2 -g -DNDEBUG -isysroot /Applications/Xcode.app/Contents/Developer/Platforms/MacOSX.platform/Developer/SDKs/MacOSX10.15.sdk   -std=c++14  -fno-exceptions -fno-rtti -MD -MT lib/Support/CMakeFiles/LLVMSupport.dir/SystemUtils.cpp.o -MF lib/Support/CMakeFiles/LLVMSupport.dir/SystemUtils.cpp.o.d -o lib/Support/CMakeFiles/LLVMSupport.dir/SystemUtils.cpp.o -c /Users/buildslave/jenkins/workspace/clang-stage2-cmake-RgSan/llvm-project/llvm/lib/Support/SystemUtils.cpp
[105/4672] /usr/local/bin/sccache /Users/buildslave/jenkins/workspace/clang-stage2-cmake-RgSan/host-compiler/bin/clang++  -DBUILD_EXAMPLES -DGTEST_HAS_RTTI=0 -D__STDC_CONSTANT_MACROS -D__STDC_FORMAT_MACROS -D__STDC_LIMIT_MACROS -Ilib/Support -I/Users/buildslave/jenkins/workspace/clang-stage2-cmake-RgSan/llvm-project/llvm/lib/Support -Iinclude -I/Users/buildslave/jenkins/workspace/clang-stage2-cmake-RgSan/llvm-project/llvm/include -fPIC -fvisibility-inlines-hidden -Werror=date-time -Werror=unguarded-availability-new -Wall -Wextra -Wno-unused-parameter -Wwrite-strings -Wcast-qual -Wmissing-field-initializers -pedantic -Wno-long-long -Wimplicit-fallthrough -Wcovered-switch-default -Wno-noexcept-type -Wnon-virtual-dtor -Wdelete-non-virtual-dtor -Wsuggest-override -Wstring-conversion -fno-omit-frame-pointer -fsanitize=address,undefined -fno-sanitize=vptr,function -fno-sanitize-recover=all -fsanitize-address-use-after-scope -fsanitize-blacklist=/Users/buildslave/jenkins/workspace/clang-stage2-cmake-RgSan/llvm-project/llvm/utils/sanitizers/ubsan_blacklist.txt -fdiagnostics-color -O2 -g -DNDEBUG -isysroot /Applications/Xcode.app/Contents/Developer/Platforms/MacOSX.platform/Developer/SDKs/MacOSX10.15.sdk   -std=c++14  -fno-exceptions -fno-rtti -MD -MT lib/Support/CMakeFiles/LLVMSupport.dir/SuffixTree.cpp.o -MF lib/Support/CMakeFiles/LLVMSupport.dir/SuffixTree.cpp.o.d -o lib/Support/CMakeFiles/LLVMSupport.dir/SuffixTree.cpp.o -c /Users/buildslave/jenkins/workspace/clang-stage2-cmake-RgSan/llvm-project/llvm/lib/Support/SuffixTree.cpp
[106/4672] /usr/local/bin/sccache /Users/buildslave/jenkins/workspace/clang-stage2-cmake-RgSan/host-compiler/bin/clang++  -DBUILD_EXAMPLES -DGTEST_HAS_RTTI=0 -D__STDC_CONSTANT_MACROS -D__STDC_FORMAT_MACROS -D__STDC_LIMIT_MACROS -Ilib/Support -I/Users/buildslave/jenkins/workspace/clang-stage2-cmake-RgSan/llvm-project/llvm/lib/Support -Iinclude -I/Users/buildslave/jenkins/workspace/clang-stage2-cmake-RgSan/llvm-project/llvm/include -fPIC -fvisibility-inlines-hidden -Werror=date-time -Werror=unguarded-availability-new -Wall -Wextra -Wno-unused-parameter -Wwrite-strings -Wcast-qual -Wmissing-field-initializers -pedantic -Wno-long-long -Wimplicit-fallthrough -Wcovered-switch-default -Wno-noexcept-type -Wnon-virtual-dtor -Wdelete-non-virtual-dtor -Wsuggest-override -Wstring-conversion -fno-omit-frame-pointer -fsanitize=address,undefined -fno-sanitize=vptr,function -fno-sanitize-recover=all -fsanitize-address-use-after-scope -fsanitize-blacklist=/Users/buildslave/jenkins/workspace/clang-stage2-cmake-RgSan/llvm-project/llvm/utils/sanitizers/ubsan_blacklist.txt -fdiagnostics-color -O2 -g -DNDEBUG -isysroot /Applications/Xcode.app/Contents/Developer/Platforms/MacOSX.platform/Developer/SDKs/MacOSX10.15.sdk   -std=c++14  -fno-exceptions -fno-rtti -MD -MT lib/Support/CMakeFiles/LLVMSupport.dir/SymbolRemappingReader.cpp.o -MF lib/Support/CMakeFiles/LLVMSupport.dir/SymbolRemappingReader.cpp.o.d -o lib/Support/CMakeFiles/LLVMSupport.dir/SymbolRemappingReader.cpp.o -c /Users/buildslave/jenkins/workspace/clang-stage2-cmake-RgSan/llvm-project/llvm/lib/Support/SymbolRemappingReader.cpp
[107/4672] /usr/local/bin/sccache /Users/buildslave/jenkins/workspace/clang-stage2-cmake-RgSan/host-compiler/bin/clang++  -DBUILD_EXAMPLES -DGTEST_HAS_RTTI=0 -D__STDC_CONSTANT_MACROS -D__STDC_FORMAT_MACROS -D__STDC_LIMIT_MACROS -Ilib/Support -I/Users/buildslave/jenkins/workspace/clang-stage2-cmake-RgSan/llvm-project/llvm/lib/Support -Iinclude -I/Users/buildslave/jenkins/workspace/clang-stage2-cmake-RgSan/llvm-project/llvm/include -fPIC -fvisibility-inlines-hidden -Werror=date-time -Werror=unguarded-availability-new -Wall -Wextra -Wno-unused-parameter -Wwrite-strings -Wcast-qual -Wmissing-field-initializers -pedantic -Wno-long-long -Wimplicit-fallthrough -Wcovered-switch-default -Wno-noexcept-type -Wnon-virtual-dtor -Wdelete-non-virtual-dtor -Wsuggest-override -Wstring-conversion -fno-omit-frame-pointer -fsanitize=address,undefined -fno-sanitize=vptr,function -fno-sanitize-recover=all -fsanitize-address-use-after-scope -fsanitize-blacklist=/Users/buildslave/jenkins/workspace/clang-stage2-cmake-RgSan/llvm-project/llvm/utils/sanitizers/ubsan_blacklist.txt -fdiagnostics-color -O2 -g -DNDEBUG -isysroot /Applications/Xcode.app/Contents/Developer/Platforms/MacOSX.platform/Developer/SDKs/MacOSX10.15.sdk   -std=c++14  -fno-exceptions -fno-rtti -MD -MT lib/Support/CMakeFiles/LLVMSupport.dir/StringRef.cpp.o -MF lib/Support/CMakeFiles/LLVMSupport.dir/StringRef.cpp.o.d -o lib/Support/CMakeFiles/LLVMSupport.dir/StringRef.cpp.o -c /Users/buildslave/jenkins/workspace/clang-stage2-cmake-RgSan/llvm-project/llvm/lib/Support/StringRef.cpp
[108/4672] /usr/local/bin/sccache /Users/buildslave/jenkins/workspace/clang-stage2-cmake-RgSan/host-compiler/bin/clang++  -DBUILD_EXAMPLES -DGTEST_HAS_RTTI=0 -D__STDC_CONSTANT_MACROS -D__STDC_FORMAT_MACROS -D__STDC_LIMIT_MACROS -Ilib/Support -I/Users/buildslave/jenkins/workspace/clang-stage2-cmake-RgSan/llvm-project/llvm/lib/Support -Iinclude -I/Users/buildslave/jenkins/workspace/clang-stage2-cmake-RgSan/llvm-project/llvm/include -fPIC -fvisibility-inlines-hidden -Werror=date-time -Werror=unguarded-availability-new -Wall -Wextra -Wno-unused-parameter -Wwrite-strings -Wcast-qual -Wmissing-field-initializers -pedantic -Wno-long-long -Wimplicit-fallthrough -Wcovered-switch-default -Wno-noexcept-type -Wnon-virtual-dtor -Wdelete-non-virtual-dtor -Wsuggest-override -Wstring-conversion -fno-omit-frame-pointer -fsanitize=address,undefined -fno-sanitize=vptr,function -fno-sanitize-recover=all -fsanitize-address-use-after-scope -fsanitize-blacklist=/Users/buildslave/jenkins/workspace/clang-stage2-cmake-RgSan/llvm-project/llvm/utils/sanitizers/ubsan_blacklist.txt -fdiagnostics-color -O2 -g -DNDEBUG -isysroot /Applications/Xcode.app/Contents/Developer/Platforms/MacOSX.platform/Developer/SDKs/MacOSX10.15.sdk   -std=c++14  -fno-exceptions -fno-rtti -MD -MT lib/Support/CMakeFiles/LLVMSupport.dir/SpecialCaseList.cpp.o -MF lib/Support/CMakeFiles/LLVMSupport.dir/SpecialCaseList.cpp.o.d -o lib/Support/CMakeFiles/LLVMSupport.dir/SpecialCaseList.cpp.o -c /Users/buildslave/jenkins/workspace/clang-stage2-cmake-RgSan/llvm-project/llvm/lib/Support/SpecialCaseList.cpp
[109/4672] /usr/local/bin/sccache /Users/buildslave/jenkins/workspace/clang-stage2-cmake-RgSan/host-compiler/bin/clang++  -DBUILD_EXAMPLES -DGTEST_HAS_RTTI=0 -D__STDC_CONSTANT_MACROS -D__STDC_FORMAT_MACROS -D__STDC_LIMIT_MACROS -Ilib/Support -I/Users/buildslave/jenkins/workspace/clang-stage2-cmake-RgSan/llvm-project/llvm/lib/Support -Iinclude -I/Users/buildslave/jenkins/workspace/clang-stage2-cmake-RgSan/llvm-project/llvm/include -fPIC -fvisibility-inlines-hidden -Werror=date-time -Werror=unguarded-availability-new -Wall -Wextra -Wno-unused-parameter -Wwrite-strings -Wcast-qual -Wmissing-field-initializers -pedantic -Wno-long-long -Wimplicit-fallthrough -Wcovered-switch-default -Wno-noexcept-type -Wnon-virtual-dtor -Wdelete-non-virtual-dtor -Wsuggest-override -Wstring-conversion -fno-omit-frame-pointer -fsanitize=address,undefined -fno-sanitize=vptr,function -fno-sanitize-recover=all -fsanitize-address-use-after-scope -fsanitize-blacklist=/Users/buildslave/jenkins/workspace/clang-stage2-cmake-RgSan/llvm-project/llvm/utils/sanitizers/ubsan_blacklist.txt -fdiagnostics-color -O2 -g -DNDEBUG -isysroot /Applications/Xcode.app/Contents/Developer/Platforms/MacOSX.platform/Developer/SDKs/MacOSX10.15.sdk   -std=c++14  -fno-exceptions -fno-rtti -MD -MT lib/Support/CMakeFiles/LLVMSupport.dir/TarWriter.cpp.o -MF lib/Support/CMakeFiles/LLVMSupport.dir/TarWriter.cpp.o.d -o lib/Support/CMakeFiles/LLVMSupport.dir/TarWriter.cpp.o -c /Users/buildslave/jenkins/workspace/clang-stage2-cmake-RgSan/llvm-project/llvm/lib/Support/TarWriter.cpp
[110/4672] /usr/local/bin/sccache /Users/buildslave/jenkins/workspace/clang-stage2-cmake-RgSan/host-compiler/bin/clang++  -DBUILD_EXAMPLES -DGTEST_HAS_RTTI=0 -D__STDC_CONSTANT_MACROS -D__STDC_FORMAT_MACROS -D__STDC_LIMIT_MACROS -Ilib/Support -I/Users/buildslave/jenkins/workspace/clang-stage2-cmake-RgSan/llvm-project/llvm/lib/Support -Iinclude -I/Users/buildslave/jenkins/workspace/clang-stage2-cmake-RgSan/llvm-project/llvm/include -fPIC -fvisibility-inlines-hidden -Werror=date-time -Werror=unguarded-availability-new -Wall -Wextra -Wno-unused-parameter -Wwrite-strings -Wcast-qual -Wmissing-field-initializers -pedantic -Wno-long-long -Wimplicit-fallthrough -Wcovered-switch-default -Wno-noexcept-type -Wnon-virtual-dtor -Wdelete-non-virtual-dtor -Wsuggest-override -Wstring-conversion -fno-omit-frame-pointer -fsanitize=address,undefined -fno-sanitize=vptr,function -fno-sanitize-recover=all -fsanitize-address-use-after-scope -fsanitize-blacklist=/Users/buildslave/jenkins/workspace/clang-stage2-cmake-RgSan/llvm-project/llvm/utils/sanitizers/ubsan_blacklist.txt -fdiagnostics-color -O2 -g -DNDEBUG -isysroot /Applications/Xcode.app/Contents/Developer/Platforms/MacOSX.platform/Developer/SDKs/MacOSX10.15.sdk   -std=c++14  -fno-exceptions -fno-rtti -MD -MT lib/Support/CMakeFiles/LLVMSupport.dir/Statistic.cpp.o -MF lib/Support/CMakeFiles/LLVMSupport.dir/Statistic.cpp.o.d -o lib/Support/CMakeFiles/LLVMSupport.dir/Statistic.cpp.o -c /Users/buildslave/jenkins/workspace/clang-stage2-cmake-RgSan/llvm-project/llvm/lib/Support/Statistic.cpp
[111/4672] /usr/local/bin/sccache /Users/buildslave/jenkins/workspace/clang-stage2-cmake-RgSan/host-compiler/bin/clang++  -DBUILD_EXAMPLES -DGTEST_HAS_RTTI=0 -D__STDC_CONSTANT_MACROS -D__STDC_FORMAT_MACROS -D__STDC_LIMIT_MACROS -Ilib/Support -I/Users/buildslave/jenkins/workspace/clang-stage2-cmake-RgSan/llvm-project/llvm/lib/Support -Iinclude -I/Users/buildslave/jenkins/workspace/clang-stage2-cmake-RgSan/llvm-project/llvm/include -fPIC -fvisibility-inlines-hidden -Werror=date-time -Werror=unguarded-availability-new -Wall -Wextra -Wno-unused-parameter -Wwrite-strings -Wcast-qual -Wmissing-field-initializers -pedantic -Wno-long-long -Wimplicit-fallthrough -Wcovered-switch-default -Wno-noexcept-type -Wnon-virtual-dtor -Wdelete-non-virtual-dtor -Wsuggest-override -Wstring-conversion -fno-omit-frame-pointer -fsanitize=address,undefined -fno-sanitize=vptr,function -fno-sanitize-recover=all -fsanitize-address-use-after-scope -fsanitize-blacklist=/Users/buildslave/jenkins/workspace/clang-stage2-cmake-RgSan/llvm-project/llvm/utils/sanitizers/ubsan_blacklist.txt -fdiagnostics-color -O2 -g -DNDEBUG -isysroot /Applications/Xcode.app/Contents/Developer/Platforms/MacOSX.platform/Developer/SDKs/MacOSX10.15.sdk   -std=c++14  -fno-exceptions -fno-rtti -MD -MT lib/Support/CMakeFiles/LLVMSupport.dir/SourceMgr.cpp.o -MF lib/Support/CMakeFiles/LLVMSupport.dir/SourceMgr.cpp.o.d -o lib/Support/CMakeFiles/LLVMSupport.dir/SourceMgr.cpp.o -c /Users/buildslave/jenkins/workspace/clang-stage2-cmake-RgSan/llvm-project/llvm/lib/Support/SourceMgr.cpp
[112/4672] /usr/local/bin/sccache /Users/buildslave/jenkins/workspace/clang-stage2-cmake-RgSan/host-compiler/bin/clang++  -DBUILD_EXAMPLES -DGTEST_HAS_RTTI=0 -D__STDC_CONSTANT_MACROS -D__STDC_FORMAT_MACROS -D__STDC_LIMIT_MACROS -Ilib/Support -I/Users/buildslave/jenkins/workspace/clang-stage2-cmake-RgSan/llvm-project/llvm/lib/Support -Iinclude -I/Users/buildslave/jenkins/workspace/clang-stage2-cmake-RgSan/llvm-project/llvm/include -fPIC -fvisibility-inlines-hidden -Werror=date-time -Werror=unguarded-availability-new -Wall -Wextra -Wno-unused-parameter -Wwrite-strings -Wcast-qual -Wmissing-field-initializers -pedantic -Wno-long-long -Wimplicit-fallthrough -Wcovered-switch-default -Wno-noexcept-type -Wnon-virtual-dtor -Wdelete-non-virtual-dtor -Wsuggest-override -Wstring-conversion -fno-omit-frame-pointer -fsanitize=address,undefined -fno-sanitize=vptr,function -fno-sanitize-recover=all -fsanitize-address-use-after-scope -fsanitize-blacklist=/Users/buildslave/jenkins/workspace/clang-stage2-cmake-RgSan/llvm-project/llvm/utils/sanitizers/ubsan_blacklist.txt -fdiagnostics-color -O2 -g -DNDEBUG -isysroot /Applications/Xcode.app/Contents/Developer/Platforms/MacOSX.platform/Developer/SDKs/MacOSX10.15.sdk   -std=c++14  -fno-exceptions -fno-rtti -MD -MT lib/Support/CMakeFiles/LLVMSupport.dir/TargetParser.cpp.o -MF lib/Support/CMakeFiles/LLVMSupport.dir/TargetParser.cpp.o.d -o lib/Support/CMakeFiles/LLVMSupport.dir/TargetParser.cpp.o -c /Users/buildslave/jenkins/workspace/clang-stage2-cmake-RgSan/llvm-project/llvm/lib/Support/TargetParser.cpp
[113/4672] /usr/local/bin/sccache /Users/buildslave/jenkins/workspace/clang-stage2-cmake-RgSan/host-compiler/bin/clang++  -DBUILD_EXAMPLES -DGTEST_HAS_RTTI=0 -D__STDC_CONSTANT_MACROS -D__STDC_FORMAT_MACROS -D__STDC_LIMIT_MACROS -Ilib/Support -I/Users/buildslave/jenkins/workspace/clang-stage2-cmake-RgSan/llvm-project/llvm/lib/Support -Iinclude -I/Users/buildslave/jenkins/workspace/clang-stage2-cmake-RgSan/llvm-project/llvm/include -fPIC -fvisibility-inlines-hidden -Werror=date-time -Werror=unguarded-availability-new -Wall -Wextra -Wno-unused-parameter -Wwrite-strings -Wcast-qual -Wmissing-field-initializers -pedantic -Wno-long-long -Wimplicit-fallthrough -Wcovered-switch-default -Wno-noexcept-type -Wnon-virtual-dtor -Wdelete-non-virtual-dtor -Wsuggest-override -Wstring-conversion -fno-omit-frame-pointer -fsanitize=address,undefined -fno-sanitize=vptr,function -fno-sanitize-recover=all -fsanitize-address-use-after-scope -fsanitize-blacklist=/Users/buildslave/jenkins/workspace/clang-stage2-cmake-RgSan/llvm-project/llvm/utils/sanitizers/ubsan_blacklist.txt -fdiagnostics-color -O2 -g -DNDEBUG -isysroot /Applications/Xcode.app/Contents/Developer/Platforms/MacOSX.platform/Developer/SDKs/MacOSX10.15.sdk   -std=c++14  -fno-exceptions -fno-rtti -MD -MT lib/Support/CMakeFiles/LLVMSupport.dir/ToolOutputFile.cpp.o -MF lib/Support/CMakeFiles/LLVMSupport.dir/ToolOutputFile.cpp.o.d -o lib/Support/CMakeFiles/LLVMSupport.dir/ToolOutputFile.cpp.o -c /Users/buildslave/jenkins/workspace/clang-stage2-cmake-RgSan/llvm-project/llvm/lib/Support/ToolOutputFile.cpp
[114/4672] /usr/local/bin/sccache /Users/buildslave/jenkins/workspace/clang-stage2-cmake-RgSan/host-compiler/bin/clang++  -DBUILD_EXAMPLES -DGTEST_HAS_RTTI=0 -D__STDC_CONSTANT_MACROS -D__STDC_FORMAT_MACROS -D__STDC_LIMIT_MACROS -Ilib/Support -I/Users/buildslave/jenkins/workspace/clang-stage2-cmake-RgSan/llvm-project/llvm/lib/Support -Iinclude -I/Users/buildslave/jenkins/workspace/clang-stage2-cmake-RgSan/llvm-project/llvm/include -fPIC -fvisibility-inlines-hidden -Werror=date-time -Werror=unguarded-availability-new -Wall -Wextra -Wno-unused-parameter -Wwrite-strings -Wcast-qual -Wmissing-field-initializers -pedantic -Wno-long-long -Wimplicit-fallthrough -Wcovered-switch-default -Wno-noexcept-type -Wnon-virtual-dtor -Wdelete-non-virtual-dtor -Wsuggest-override -Wstring-conversion -fno-omit-frame-pointer -fsanitize=address,undefined -fno-sanitize=vptr,function -fno-sanitize-recover=all -fsanitize-address-use-after-scope -fsanitize-blacklist=/Users/buildslave/jenkins/workspace/clang-stage2-cmake-RgSan/llvm-project/llvm/utils/sanitizers/ubsan_blacklist.txt -fdiagnostics-color -O2 -g -DNDEBUG -isysroot /Applications/Xcode.app/Contents/Developer/Platforms/MacOSX.platform/Developer/SDKs/MacOSX10.15.sdk   -std=c++14  -fno-exceptions -fno-rtti -MD -MT lib/Support/CMakeFiles/LLVMSupport.dir/Twine.cpp.o -MF lib/Support/CMakeFiles/LLVMSupport.dir/Twine.cpp.o.d -o lib/Support/CMakeFiles/LLVMSupport.dir/Twine.cpp.o -c /Users/buildslave/jenkins/workspace/clang-stage2-cmake-RgSan/llvm-project/llvm/lib/Support/Twine.cpp
[115/4672] /usr/local/bin/sccache /Users/buildslave/jenkins/workspace/clang-stage2-cmake-RgSan/host-compiler/bin/clang++  -DBUILD_EXAMPLES -DGTEST_HAS_RTTI=0 -D__STDC_CONSTANT_MACROS -D__STDC_FORMAT_MACROS -D__STDC_LIMIT_MACROS -Ilib/Support -I/Users/buildslave/jenkins/workspace/clang-stage2-cmake-RgSan/llvm-project/llvm/lib/Support -Iinclude -I/Users/buildslave/jenkins/workspace/clang-stage2-cmake-RgSan/llvm-project/llvm/include -fPIC -fvisibility-inlines-hidden -Werror=date-time -Werror=unguarded-availability-new -Wall -Wextra -Wno-unused-parameter -Wwrite-strings -Wcast-qual -Wmissing-field-initializers -pedantic -Wno-long-long -Wimplicit-fallthrough -Wcovered-switch-default -Wno-noexcept-type -Wnon-virtual-dtor -Wdelete-non-virtual-dtor -Wsuggest-override -Wstring-conversion -fno-omit-frame-pointer -fsanitize=address,undefined -fno-sanitize=vptr,function -fno-sanitize-recover=all -fsanitize-address-use-after-scope -fsanitize-blacklist=/Users/buildslave/jenkins/workspace/clang-stage2-cmake-RgSan/llvm-project/llvm/utils/sanitizers/ubsan_blacklist.txt -fdiagnostics-color -O2 -g -DNDEBUG -isysroot /Applications/Xcode.app/Contents/Developer/Platforms/MacOSX.platform/Developer/SDKs/MacOSX10.15.sdk   -std=c++14  -fno-exceptions -fno-rtti -MD -MT lib/Support/CMakeFiles/LLVMSupport.dir/ThreadPool.cpp.o -MF lib/Support/CMakeFiles/LLVMSupport.dir/ThreadPool.cpp.o.d -o lib/Support/CMakeFiles/LLVMSupport.dir/ThreadPool.cpp.o -c /Users/buildslave/jenkins/workspace/clang-stage2-cmake-RgSan/llvm-project/llvm/lib/Support/ThreadPool.cpp
[116/4672] /usr/local/bin/sccache /Users/buildslave/jenkins/workspace/clang-stage2-cmake-RgSan/host-compiler/bin/clang++  -DBUILD_EXAMPLES -DGTEST_HAS_RTTI=0 -D__STDC_CONSTANT_MACROS -D__STDC_FORMAT_MACROS -D__STDC_LIMIT_MACROS -Ilib/Support -I/Users/buildslave/jenkins/workspace/clang-stage2-cmake-RgSan/llvm-project/llvm/lib/Support -Iinclude -I/Users/buildslave/jenkins/workspace/clang-stage2-cmake-RgSan/llvm-project/llvm/include -fPIC -fvisibility-inlines-hidden -Werror=date-time -Werror=unguarded-availability-new -Wall -Wextra -Wno-unused-parameter -Wwrite-strings -Wcast-qual -Wmissing-field-initializers -pedantic -Wno-long-long -Wimplicit-fallthrough -Wcovered-switch-default -Wno-noexcept-type -Wnon-virtual-dtor -Wdelete-non-virtual-dtor -Wsuggest-override -Wstring-conversion -fno-omit-frame-pointer -fsanitize=address,undefined -fno-sanitize=vptr,function -fno-sanitize-recover=all -fsanitize-address-use-after-scope -fsanitize-blacklist=/Users/buildslave/jenkins/workspace/clang-stage2-cmake-RgSan/llvm-project/llvm/utils/sanitizers/ubsan_blacklist.txt -fdiagnostics-color -O2 -g -DNDEBUG -isysroot /Applications/Xcode.app/Contents/Developer/Platforms/MacOSX.platform/Developer/SDKs/MacOSX10.15.sdk   -std=c++14  -fno-exceptions -fno-rtti -MD -MT lib/Support/CMakeFiles/LLVMSupport.dir/UnicodeCaseFold.cpp.o -MF lib/Support/CMakeFiles/LLVMSupport.dir/UnicodeCaseFold.cpp.o.d -o lib/Support/CMakeFiles/LLVMSupport.dir/UnicodeCaseFold.cpp.o -c /Users/buildslave/jenkins/workspace/clang-stage2-cmake-RgSan/llvm-project/llvm/lib/Support/UnicodeCaseFold.cpp
[117/4672] /usr/local/bin/sccache /Users/buildslave/jenkins/workspace/clang-stage2-cmake-RgSan/host-compiler/bin/clang++  -DBUILD_EXAMPLES -DGTEST_HAS_RTTI=0 -D__STDC_CONSTANT_MACROS -D__STDC_FORMAT_MACROS -D__STDC_LIMIT_MACROS -Ilib/Support -I/Users/buildslave/jenkins/workspace/clang-stage2-cmake-RgSan/llvm-project/llvm/lib/Support -Iinclude -I/Users/buildslave/jenkins/workspace/clang-stage2-cmake-RgSan/llvm-project/llvm/include -fPIC -fvisibility-inlines-hidden -Werror=date-time -Werror=unguarded-availability-new -Wall -Wextra -Wno-unused-parameter -Wwrite-strings -Wcast-qual -Wmissing-field-initializers -pedantic -Wno-long-long -Wimplicit-fallthrough -Wcovered-switch-default -Wno-noexcept-type -Wnon-virtual-dtor -Wdelete-non-virtual-dtor -Wsuggest-override -Wstring-conversion -fno-omit-frame-pointer -fsanitize=address,undefined -fno-sanitize=vptr,function -fno-sanitize-recover=all -fsanitize-address-use-after-scope -fsanitize-blacklist=/Users/buildslave/jenkins/workspace/clang-stage2-cmake-RgSan/llvm-project/llvm/utils/sanitizers/ubsan_blacklist.txt -fdiagnostics-color -O2 -g -DNDEBUG -isysroot /Applications/Xcode.app/Contents/Developer/Platforms/MacOSX.platform/Developer/SDKs/MacOSX10.15.sdk   -std=c++14  -fno-exceptions -fno-rtti -MD -MT lib/Support/CMakeFiles/LLVMSupport.dir/Unicode.cpp.o -MF lib/Support/CMakeFiles/LLVMSupport.dir/Unicode.cpp.o.d -o lib/Support/CMakeFiles/LLVMSupport.dir/Unicode.cpp.o -c /Users/buildslave/jenkins/workspace/clang-stage2-cmake-RgSan/llvm-project/llvm/lib/Support/Unicode.cpp
[118/4672] /usr/local/bin/sccache /Users/buildslave/jenkins/workspace/clang-stage2-cmake-RgSan/host-compiler/bin/clang++  -DBUILD_EXAMPLES -DGTEST_HAS_RTTI=0 -D__STDC_CONSTANT_MACROS -D__STDC_FORMAT_MACROS -D__STDC_LIMIT_MACROS -Ilib/Support -I/Users/buildslave/jenkins/workspace/clang-stage2-cmake-RgSan/llvm-project/llvm/lib/Support -Iinclude -I/Users/buildslave/jenkins/workspace/clang-stage2-cmake-RgSan/llvm-project/llvm/include -fPIC -fvisibility-inlines-hidden -Werror=date-time -Werror=unguarded-availability-new -Wall -Wextra -Wno-unused-parameter -Wwrite-strings -Wcast-qual -Wmissing-field-initializers -pedantic -Wno-long-long -Wimplicit-fallthrough -Wcovered-switch-default -Wno-noexcept-type -Wnon-virtual-dtor -Wdelete-non-virtual-dtor -Wsuggest-override -Wstring-conversion -fno-omit-frame-pointer -fsanitize=address,undefined -fno-sanitize=vptr,function -fno-sanitize-recover=all -fsanitize-address-use-after-scope -fsanitize-blacklist=/Users/buildslave/jenkins/workspace/clang-stage2-cmake-RgSan/llvm-project/llvm/utils/sanitizers/ubsan_blacklist.txt -fdiagnostics-color -O2 -g -DNDEBUG -isysroot /Applications/Xcode.app/Contents/Developer/Platforms/MacOSX.platform/Developer/SDKs/MacOSX10.15.sdk   -std=c++14  -fno-exceptions -fno-rtti -MD -MT lib/Support/CMakeFiles/LLVMSupport.dir/TrigramIndex.cpp.o -MF lib/Support/CMakeFiles/LLVMSupport.dir/TrigramIndex.cpp.o.d -o lib/Support/CMakeFiles/LLVMSupport.dir/TrigramIndex.cpp.o -c /Users/buildslave/jenkins/workspace/clang-stage2-cmake-RgSan/llvm-project/llvm/lib/Support/TrigramIndex.cpp
[119/4672] /usr/local/bin/sccache /Users/buildslave/jenkins/workspace/clang-stage2-cmake-RgSan/host-compiler/bin/clang++  -DBUILD_EXAMPLES -DGTEST_HAS_RTTI=0 -D__STDC_CONSTANT_MACROS -D__STDC_FORMAT_MACROS -D__STDC_LIMIT_MACROS -Ilib/Support -I/Users/buildslave/jenkins/workspace/clang-stage2-cmake-RgSan/llvm-project/llvm/lib/Support -Iinclude -I/Users/buildslave/jenkins/workspace/clang-stage2-cmake-RgSan/llvm-project/llvm/include -fPIC -fvisibility-inlines-hidden -Werror=date-time -Werror=unguarded-availability-new -Wall -Wextra -Wno-unused-parameter -Wwrite-strings -Wcast-qual -Wmissing-field-initializers -pedantic -Wno-long-long -Wimplicit-fallthrough -Wcovered-switch-default -Wno-noexcept-type -Wnon-virtual-dtor -Wdelete-non-virtual-dtor -Wsuggest-override -Wstring-conversion -fno-omit-frame-pointer -fsanitize=address,undefined -fno-sanitize=vptr,function -fno-sanitize-recover=all -fsanitize-address-use-after-scope -fsanitize-blacklist=/Users/buildslave/jenkins/workspace/clang-stage2-cmake-RgSan/llvm-project/llvm/utils/sanitizers/ubsan_blacklist.txt -fdiagnostics-color -O2 -g -DNDEBUG -isysroot /Applications/Xcode.app/Contents/Developer/Platforms/MacOSX.platform/Developer/SDKs/MacOSX10.15.sdk   -std=c++14  -fno-exceptions -fno-rtti -MD -MT lib/Support/CMakeFiles/LLVMSupport.dir/VersionTuple.cpp.o -MF lib/Support/CMakeFiles/LLVMSupport.dir/VersionTuple.cpp.o.d -o lib/Support/CMakeFiles/LLVMSupport.dir/VersionTuple.cpp.o -c /Users/buildslave/jenkins/workspace/clang-stage2-cmake-RgSan/llvm-project/llvm/lib/Support/VersionTuple.cpp
[120/4672] /usr/local/bin/sccache /Users/buildslave/jenkins/workspace/clang-stage2-cmake-RgSan/host-compiler/bin/clang++  -DBUILD_EXAMPLES -DGTEST_HAS_RTTI=0 -D__STDC_CONSTANT_MACROS -D__STDC_FORMAT_MACROS -D__STDC_LIMIT_MACROS -Ilib/Support -I/Users/buildslave/jenkins/workspace/clang-stage2-cmake-RgSan/llvm-project/llvm/lib/Support -Iinclude -I/Users/buildslave/jenkins/workspace/clang-stage2-cmake-RgSan/llvm-project/llvm/include -fPIC -fvisibility-inlines-hidden -Werror=date-time -Werror=unguarded-availability-new -Wall -Wextra -Wno-unused-parameter -Wwrite-strings -Wcast-qual -Wmissing-field-initializers -pedantic -Wno-long-long -Wimplicit-fallthrough -Wcovered-switch-default -Wno-noexcept-type -Wnon-virtual-dtor -Wdelete-non-virtual-dtor -Wsuggest-override -Wstring-conversion -fno-omit-frame-pointer -fsanitize=address,undefined -fno-sanitize=vptr,function -fno-sanitize-recover=all -fsanitize-address-use-after-scope -fsanitize-blacklist=/Users/buildslave/jenkins/workspace/clang-stage2-cmake-RgSan/llvm-project/llvm/utils/sanitizers/ubsan_blacklist.txt -fdiagnostics-color -O2 -g -DNDEBUG -isysroot /Applications/Xcode.app/Contents/Developer/Platforms/MacOSX.platform/Developer/SDKs/MacOSX10.15.sdk   -std=c++14  -fno-exceptions -fno-rtti -MD -MT lib/Support/CMakeFiles/LLVMSupport.dir/Triple.cpp.o -MF lib/Support/CMakeFiles/LLVMSupport.dir/Triple.cpp.o.d -o lib/Support/CMakeFiles/LLVMSupport.dir/Triple.cpp.o -c /Users/buildslave/jenkins/workspace/clang-stage2-cmake-RgSan/llvm-project/llvm/lib/Support/Triple.cpp
[121/4672] /usr/local/bin/sccache /Users/buildslave/jenkins/workspace/clang-stage2-cmake-RgSan/host-compiler/bin/clang++  -DBUILD_EXAMPLES -DGTEST_HAS_RTTI=0 -D__STDC_CONSTANT_MACROS -D__STDC_FORMAT_MACROS -D__STDC_LIMIT_MACROS -Ilib/Support -I/Users/buildslave/jenkins/workspace/clang-stage2-cmake-RgSan/llvm-project/llvm/lib/Support -Iinclude -I/Users/buildslave/jenkins/workspace/clang-stage2-cmake-RgSan/llvm-project/llvm/include -fPIC -fvisibility-inlines-hidden -Werror=date-time -Werror=unguarded-availability-new -Wall -Wextra -Wno-unused-parameter -Wwrite-strings -Wcast-qual -Wmissing-field-initializers -pedantic -Wno-long-long -Wimplicit-fallthrough -Wcovered-switch-default -Wno-noexcept-type -Wnon-virtual-dtor -Wdelete-non-virtual-dtor -Wsuggest-override -Wstring-conversion -fno-omit-frame-pointer -fsanitize=address,undefined -fno-sanitize=vptr,function -fno-sanitize-recover=all -fsanitize-address-use-after-scope -fsanitize-blacklist=/Users/buildslave/jenkins/workspace/clang-stage2-cmake-RgSan/llvm-project/llvm/utils/sanitizers/ubsan_blacklist.txt -fdiagnostics-color -O2 -g -DNDEBUG -isysroot /Applications/Xcode.app/Contents/Developer/Platforms/MacOSX.platform/Developer/SDKs/MacOSX10.15.sdk   -std=c++14  -fno-exceptions -fno-rtti -MD -MT lib/Support/CMakeFiles/LLVMSupport.dir/X86TargetParser.cpp.o -MF lib/Support/CMakeFiles/LLVMSupport.dir/X86TargetParser.cpp.o.d -o lib/Support/CMakeFiles/LLVMSupport.dir/X86TargetParser.cpp.o -c /Users/buildslave/jenkins/workspace/clang-stage2-cmake-RgSan/llvm-project/llvm/lib/Support/X86TargetParser.cpp
[122/4672] /usr/local/bin/sccache /Users/buildslave/jenkins/workspace/clang-stage2-cmake-RgSan/host-compiler/bin/clang++  -DBUILD_EXAMPLES -DGTEST_HAS_RTTI=0 -D__STDC_CONSTANT_MACROS -D__STDC_FORMAT_MACROS -D__STDC_LIMIT_MACROS -Ilib/Support -I/Users/buildslave/jenkins/workspace/clang-stage2-cmake-RgSan/llvm-project/llvm/lib/Support -Iinclude -I/Users/buildslave/jenkins/workspace/clang-stage2-cmake-RgSan/llvm-project/llvm/include -fPIC -fvisibility-inlines-hidden -Werror=date-time -Werror=unguarded-availability-new -Wall -Wextra -Wno-unused-parameter -Wwrite-strings -Wcast-qual -Wmissing-field-initializers -pedantic -Wno-long-long -Wimplicit-fallthrough -Wcovered-switch-default -Wno-noexcept-type -Wnon-virtual-dtor -Wdelete-non-virtual-dtor -Wsuggest-override -Wstring-conversion -fno-omit-frame-pointer -fsanitize=address,undefined -fno-sanitize=vptr,function -fno-sanitize-recover=all -fsanitize-address-use-after-scope -fsanitize-blacklist=/Users/buildslave/jenkins/workspace/clang-stage2-cmake-RgSan/llvm-project/llvm/utils/sanitizers/ubsan_blacklist.txt -fdiagnostics-color -O2 -g -DNDEBUG -isysroot /Applications/Xcode.app/Contents/Developer/Platforms/MacOSX.platform/Developer/SDKs/MacOSX10.15.sdk   -std=c++14  -fno-exceptions -fno-rtti -MD -MT lib/Support/CMakeFiles/LLVMSupport.dir/TimeProfiler.cpp.o -MF lib/Support/CMakeFiles/LLVMSupport.dir/TimeProfiler.cpp.o.d -o lib/Support/CMakeFiles/LLVMSupport.dir/TimeProfiler.cpp.o -c /Users/buildslave/jenkins/workspace/clang-stage2-cmake-RgSan/llvm-project/llvm/lib/Support/TimeProfiler.cpp
[123/4672] /usr/local/bin/sccache /Users/buildslave/jenkins/workspace/clang-stage2-cmake-RgSan/host-compiler/bin/clang++  -DBUILD_EXAMPLES -DGTEST_HAS_RTTI=0 -D__STDC_CONSTANT_MACROS -D__STDC_FORMAT_MACROS -D__STDC_LIMIT_MACROS -Ilib/Support -I/Users/buildslave/jenkins/workspace/clang-stage2-cmake-RgSan/llvm-project/llvm/lib/Support -Iinclude -I/Users/buildslave/jenkins/workspace/clang-stage2-cmake-RgSan/llvm-project/llvm/include -fPIC -fvisibility-inlines-hidden -Werror=date-time -Werror=unguarded-availability-new -Wall -Wextra -Wno-unused-parameter -Wwrite-strings -Wcast-qual -Wmissing-field-initializers -pedantic -Wno-long-long -Wimplicit-fallthrough -Wcovered-switch-default -Wno-noexcept-type -Wnon-virtual-dtor -Wdelete-non-virtual-dtor -Wsuggest-override -Wstring-conversion -fno-omit-frame-pointer -fsanitize=address,undefined -fno-sanitize=vptr,function -fno-sanitize-recover=all -fsanitize-address-use-after-scope -fsanitize-blacklist=/Users/buildslave/jenkins/workspace/clang-stage2-cmake-RgSan/llvm-project/llvm/utils/sanitizers/ubsan_blacklist.txt -fdiagnostics-color -O2 -g -DNDEBUG -isysroot /Applications/Xcode.app/Contents/Developer/Platforms/MacOSX.platform/Developer/SDKs/MacOSX10.15.sdk   -std=c++14  -fno-exceptions -fno-rtti -MD -MT lib/Support/CMakeFiles/LLVMSupport.dir/raw_os_ostream.cpp.o -MF lib/Support/CMakeFiles/LLVMSupport.dir/raw_os_ostream.cpp.o.d -o lib/Support/CMakeFiles/LLVMSupport.dir/raw_os_ostream.cpp.o -c /Users/buildslave/jenkins/workspace/clang-stage2-cmake-RgSan/llvm-project/llvm/lib/Support/raw_os_ostream.cpp
[124/4672] /usr/local/bin/sccache /Users/buildslave/jenkins/workspace/clang-stage2-cmake-RgSan/host-compiler/bin/clang++  -DBUILD_EXAMPLES -DGTEST_HAS_RTTI=0 -D__STDC_CONSTANT_MACROS -D__STDC_FORMAT_MACROS -D__STDC_LIMIT_MACROS -Ilib/Support -I/Users/buildslave/jenkins/workspace/clang-stage2-cmake-RgSan/llvm-project/llvm/lib/Support -Iinclude -I/Users/buildslave/jenkins/workspace/clang-stage2-cmake-RgSan/llvm-project/llvm/include -fPIC -fvisibility-inlines-hidden -Werror=date-time -Werror=unguarded-availability-new -Wall -Wextra -Wno-unused-parameter -Wwrite-strings -Wcast-qual -Wmissing-field-initializers -pedantic -Wno-long-long -Wimplicit-fallthrough -Wcovered-switch-default -Wno-noexcept-type -Wnon-virtual-dtor -Wdelete-non-virtual-dtor -Wsuggest-override -Wstring-conversion -fno-omit-frame-pointer -fsanitize=address,undefined -fno-sanitize=vptr,function -fno-sanitize-recover=all -fsanitize-address-use-after-scope -fsanitize-blacklist=/Users/buildslave/jenkins/workspace/clang-stage2-cmake-RgSan/llvm-project/llvm/utils/sanitizers/ubsan_blacklist.txt -fdiagnostics-color -O2 -g -DNDEBUG -isysroot /Applications/Xcode.app/Contents/Developer/Platforms/MacOSX.platform/Developer/SDKs/MacOSX10.15.sdk   -std=c++14  -fno-exceptions -fno-rtti -MD -MT lib/Support/CMakeFiles/LLVMSupport.dir/Timer.cpp.o -MF lib/Support/CMakeFiles/LLVMSupport.dir/Timer.cpp.o.d -o lib/Support/CMakeFiles/LLVMSupport.dir/Timer.cpp.o -c /Users/buildslave/jenkins/workspace/clang-stage2-cmake-RgSan/llvm-project/llvm/lib/Support/Timer.cpp
[125/4672] /usr/local/bin/sccache /Users/buildslave/jenkins/workspace/clang-stage2-cmake-RgSan/host-compiler/bin/clang -DBUILD_EXAMPLES -DGTEST_HAS_RTTI=0 -D__STDC_CONSTANT_MACROS -D__STDC_FORMAT_MACROS -D__STDC_LIMIT_MACROS -Ilib/Support -I/Users/buildslave/jenkins/workspace/clang-stage2-cmake-RgSan/llvm-project/llvm/lib/Support -Iinclude -I/Users/buildslave/jenkins/workspace/clang-stage2-cmake-RgSan/llvm-project/llvm/include -fPIC -Werror=date-time -Werror=unguarded-availability-new -Wall -Wextra -Wno-unused-parameter -Wwrite-strings -Wmissing-field-initializers -pedantic -Wno-long-long -Wimplicit-fallthrough -Wcovered-switch-default -Wdelete-non-virtual-dtor -Wstring-conversion -fno-omit-frame-pointer -fsanitize=address,undefined -fno-sanitize=vptr,function -fno-sanitize-recover=all -fsanitize-address-use-after-scope -fsanitize-blacklist=/Users/buildslave/jenkins/workspace/clang-stage2-cmake-RgSan/llvm-project/llvm/utils/sanitizers/ubsan_blacklist.txt -fdiagnostics-color -O2 -g -DNDEBUG -isysroot /Applications/Xcode.app/Contents/Developer/Platforms/MacOSX.platform/Developer/SDKs/MacOSX10.15.sdk -MD -MT lib/Support/CMakeFiles/LLVMSupport.dir/regerror.c.o -MF lib/Support/CMakeFiles/LLVMSupport.dir/regerror.c.o.d -o lib/Support/CMakeFiles/LLVMSupport.dir/regerror.c.o   -c /Users/buildslave/jenkins/workspace/clang-stage2-cmake-RgSan/llvm-project/llvm/lib/Support/regerror.c
[126/4672] /usr/local/bin/sccache /Users/buildslave/jenkins/workspace/clang-stage2-cmake-RgSan/host-compiler/bin/clang++  -DBUILD_EXAMPLES -DGTEST_HAS_RTTI=0 -D__STDC_CONSTANT_MACROS -D__STDC_FORMAT_MACROS -D__STDC_LIMIT_MACROS -Ilib/Support -I/Users/buildslave/jenkins/workspace/clang-stage2-cmake-RgSan/llvm-project/llvm/lib/Support -Iinclude -I/Users/buildslave/jenkins/workspace/clang-stage2-cmake-RgSan/llvm-project/llvm/include -fPIC -fvisibility-inlines-hidden -Werror=date-time -Werror=unguarded-availability-new -Wall -Wextra -Wno-unused-parameter -Wwrite-strings -Wcast-qual -Wmissing-field-initializers -pedantic -Wno-long-long -Wimplicit-fallthrough -Wcovered-switch-default -Wno-noexcept-type -Wnon-virtual-dtor -Wdelete-non-virtual-dtor -Wsuggest-override -Wstring-conversion -fno-omit-frame-pointer -fsanitize=address,undefined -fno-sanitize=vptr,function -fno-sanitize-recover=all -fsanitize-address-use-after-scope -fsanitize-blacklist=/Users/buildslave/jenkins/workspace/clang-stage2-cmake-RgSan/llvm-project/llvm/utils/sanitizers/ubsan_blacklist.txt -fdiagnostics-color -O2 -g -DNDEBUG -isysroot /Applications/Xcode.app/Contents/Developer/Platforms/MacOSX.platform/Developer/SDKs/MacOSX10.15.sdk   -std=c++14  -fno-exceptions -fno-rtti -MD -MT lib/Support/CMakeFiles/LLVMSupport.dir/WithColor.cpp.o -MF lib/Support/CMakeFiles/LLVMSupport.dir/WithColor.cpp.o.d -o lib/Support/CMakeFiles/LLVMSupport.dir/WithColor.cpp.o -c /Users/buildslave/jenkins/workspace/clang-stage2-cmake-RgSan/llvm-project/llvm/lib/Support/WithColor.cpp
[127/4672] /usr/local/bin/sccache /Users/buildslave/jenkins/workspace/clang-stage2-cmake-RgSan/host-compiler/bin/clang -DBUILD_EXAMPLES -DGTEST_HAS_RTTI=0 -D__STDC_CONSTANT_MACROS -D__STDC_FORMAT_MACROS -D__STDC_LIMIT_MACROS -Ilib/Support -I/Users/buildslave/jenkins/workspace/clang-stage2-cmake-RgSan/llvm-project/llvm/lib/Support -Iinclude -I/Users/buildslave/jenkins/workspace/clang-stage2-cmake-RgSan/llvm-project/llvm/include -fPIC -Werror=date-time -Werror=unguarded-availability-new -Wall -Wextra -Wno-unused-parameter -Wwrite-strings -Wmissing-field-initializers -pedantic -Wno-long-long -Wimplicit-fallthrough -Wcovered-switch-default -Wdelete-non-virtual-dtor -Wstring-conversion -fno-omit-frame-pointer -fsanitize=address,undefined -fno-sanitize=vptr,function -fno-sanitize-recover=all -fsanitize-address-use-after-scope -fsanitize-blacklist=/Users/buildslave/jenkins/workspace/clang-stage2-cmake-RgSan/llvm-project/llvm/utils/sanitizers/ubsan_blacklist.txt -fdiagnostics-color -O2 -g -DNDEBUG -isysroot /Applications/Xcode.app/Contents/Developer/Platforms/MacOSX.platform/Developer/SDKs/MacOSX10.15.sdk -MD -MT lib/Support/CMakeFiles/LLVMSupport.dir/regfree.c.o -MF lib/Support/CMakeFiles/LLVMSupport.dir/regfree.c.o.d -o lib/Support/CMakeFiles/LLVMSupport.dir/regfree.c.o   -c /Users/buildslave/jenkins/workspace/clang-stage2-cmake-RgSan/llvm-project/llvm/lib/Support/regfree.c
[128/4672] /usr/local/bin/sccache /Users/buildslave/jenkins/workspace/clang-stage2-cmake-RgSan/host-compiler/bin/clang -DBUILD_EXAMPLES -DGTEST_HAS_RTTI=0 -D__STDC_CONSTANT_MACROS -D__STDC_FORMAT_MACROS -D__STDC_LIMIT_MACROS -Ilib/Support -I/Users/buildslave/jenkins/workspace/clang-stage2-cmake-RgSan/llvm-project/llvm/lib/Support -Iinclude -I/Users/buildslave/jenkins/workspace/clang-stage2-cmake-RgSan/llvm-project/llvm/include -fPIC -Werror=date-time -Werror=unguarded-availability-new -Wall -Wextra -Wno-unused-parameter -Wwrite-strings -Wmissing-field-initializers -pedantic -Wno-long-long -Wimplicit-fallthrough -Wcovered-switch-default -Wdelete-non-virtual-dtor -Wstring-conversion -fno-omit-frame-pointer -fsanitize=address,undefined -fno-sanitize=vptr,function -fno-sanitize-recover=all -fsanitize-address-use-after-scope -fsanitize-blacklist=/Users/buildslave/jenkins/workspace/clang-stage2-cmake-RgSan/llvm-project/llvm/utils/sanitizers/ubsan_blacklist.txt -fdiagnostics-color -O2 -g -DNDEBUG -isysroot /Applications/Xcode.app/Contents/Developer/Platforms/MacOSX.platform/Developer/SDKs/MacOSX10.15.sdk -MD -MT lib/Support/CMakeFiles/LLVMSupport.dir/regstrlcpy.c.o -MF lib/Support/CMakeFiles/LLVMSupport.dir/regstrlcpy.c.o.d -o lib/Support/CMakeFiles/LLVMSupport.dir/regstrlcpy.c.o   -c /Users/buildslave/jenkins/workspace/clang-stage2-cmake-RgSan/llvm-project/llvm/lib/Support/regstrlcpy.c
[129/4672] /usr/local/bin/sccache /Users/buildslave/jenkins/workspace/clang-stage2-cmake-RgSan/host-compiler/bin/clang -DBUILD_EXAMPLES -DGTEST_HAS_RTTI=0 -D__STDC_CONSTANT_MACROS -D__STDC_FORMAT_MACROS -D__STDC_LIMIT_MACROS -Ilib/Support -I/Users/buildslave/jenkins/workspace/clang-stage2-cmake-RgSan/llvm-project/llvm/lib/Support -Iinclude -I/Users/buildslave/jenkins/workspace/clang-stage2-cmake-RgSan/llvm-project/llvm/include -fPIC -Werror=date-time -Werror=unguarded-availability-new -Wall -Wextra -Wno-unused-parameter -Wwrite-strings -Wmissing-field-initializers -pedantic -Wno-long-long -Wimplicit-fallthrough -Wcovered-switch-default -Wdelete-non-virtual-dtor -Wstring-conversion -fno-omit-frame-pointer -fsanitize=address,undefined -fno-sanitize=vptr,function -fno-sanitize-recover=all -fsanitize-address-use-after-scope -fsanitize-blacklist=/Users/buildslave/jenkins/workspace/clang-stage2-cmake-RgSan/llvm-project/llvm/utils/sanitizers/ubsan_blacklist.txt -fdiagnostics-color -O2 -g -DNDEBUG -isysroot /Applications/Xcode.app/Contents/Developer/Platforms/MacOSX.platform/Developer/SDKs/MacOSX10.15.sdk -MD -MT lib/Support/CMakeFiles/LLVMSupport.dir/regcomp.c.o -MF lib/Support/CMakeFiles/LLVMSupport.dir/regcomp.c.o.d -o lib/Support/CMakeFiles/LLVMSupport.dir/regcomp.c.o   -c /Users/buildslave/jenkins/workspace/clang-stage2-cmake-RgSan/llvm-project/llvm/lib/Support/regcomp.c
[130/4672] /usr/local/bin/sccache /Users/buildslave/jenkins/workspace/clang-stage2-cmake-RgSan/host-compiler/bin/clang++  -DBUILD_EXAMPLES -DGTEST_HAS_RTTI=0 -D__STDC_CONSTANT_MACROS -D__STDC_FORMAT_MACROS -D__STDC_LIMIT_MACROS -Ilib/Support -I/Users/buildslave/jenkins/workspace/clang-stage2-cmake-RgSan/llvm-project/llvm/lib/Support -Iinclude -I/Users/buildslave/jenkins/workspace/clang-stage2-cmake-RgSan/llvm-project/llvm/include -fPIC -fvisibility-inlines-hidden -Werror=date-time -Werror=unguarded-availability-new -Wall -Wextra -Wno-unused-parameter -Wwrite-strings -Wcast-qual -Wmissing-field-initializers -pedantic -Wno-long-long -Wimplicit-fallthrough -Wcovered-switch-default -Wno-noexcept-type -Wnon-virtual-dtor -Wdelete-non-virtual-dtor -Wsuggest-override -Wstring-conversion -fno-omit-frame-pointer -fsanitize=address,undefined -fno-sanitize=vptr,function -fno-sanitize-recover=all -fsanitize-address-use-after-scope -fsanitize-blacklist=/Users/buildslave/jenkins/workspace/clang-stage2-cmake-RgSan/llvm-project/llvm/utils/sanitizers/ubsan_blacklist.txt -fdiagnostics-color -O2 -g -DNDEBUG -isysroot /Applications/Xcode.app/Contents/Developer/Platforms/MacOSX.platform/Developer/SDKs/MacOSX10.15.sdk   -std=c++14  -fno-exceptions -fno-rtti -MD -MT lib/Support/CMakeFiles/LLVMSupport.dir/raw_ostream.cpp.o -MF lib/Support/CMakeFiles/LLVMSupport.dir/raw_ostream.cpp.o.d -o lib/Support/CMakeFiles/LLVMSupport.dir/raw_ostream.cpp.o -c /Users/buildslave/jenkins/workspace/clang-stage2-cmake-RgSan/llvm-project/llvm/lib/Support/raw_ostream.cpp
[131/4672] /usr/local/bin/sccache /Users/buildslave/jenkins/workspace/clang-stage2-cmake-RgSan/host-compiler/bin/clang++  -DBUILD_EXAMPLES -DGTEST_HAS_RTTI=0 -D__STDC_CONSTANT_MACROS -D__STDC_FORMAT_MACROS -D__STDC_LIMIT_MACROS -Ilib/Support -I/Users/buildslave/jenkins/workspace/clang-stage2-cmake-RgSan/llvm-project/llvm/lib/Support -Iinclude -I/Users/buildslave/jenkins/workspace/clang-stage2-cmake-RgSan/llvm-project/llvm/include -fPIC -fvisibility-inlines-hidden -Werror=date-time -Werror=unguarded-availability-new -Wall -Wextra -Wno-unused-parameter -Wwrite-strings -Wcast-qual -Wmissing-field-initializers -pedantic -Wno-long-long -Wimplicit-fallthrough -Wcovered-switch-default -Wno-noexcept-type -Wnon-virtual-dtor -Wdelete-non-virtual-dtor -Wsuggest-override -Wstring-conversion -fno-omit-frame-pointer -fsanitize=address,undefined -fno-sanitize=vptr,function -fno-sanitize-recover=all -fsanitize-address-use-after-scope -fsanitize-blacklist=/Users/buildslave/jenkins/workspace/clang-stage2-cmake-RgSan/llvm-project/llvm/utils/sanitizers/ubsan_blacklist.txt -fdiagnostics-color -O2 -g -DNDEBUG -isysroot /Applications/Xcode.app/Contents/Developer/Platforms/MacOSX.platform/Developer/SDKs/MacOSX10.15.sdk   -std=c++14  -fno-exceptions -fno-rtti -MD -MT lib/Support/CMakeFiles/LLVMSupport.dir/Atomic.cpp.o -MF lib/Support/CMakeFiles/LLVMSupport.dir/Atomic.cpp.o.d -o lib/Support/CMakeFiles/LLVMSupport.dir/Atomic.cpp.o -c /Users/buildslave/jenkins/workspace/clang-stage2-cmake-RgSan/llvm-project/llvm/lib/Support/Atomic.cpp
FATAL: command execution failed
java.io.IOException
	at hudson.remoting.Channel.close(Channel.java:1490)
	at hudson.remoting.Channel.close(Channel.java:1446)
	at hudson.slaves.SlaveComputer.closeChannel(SlaveComputer.java:872)
	at hudson.slaves.SlaveComputer.kill(SlaveComputer.java:839)
	at hudson.model.AbstractCIBase.killComputer(AbstractCIBase.java:86)
	at jenkins.model.Jenkins.access$2000(Jenkins.java:318)
	at jenkins.model.Jenkins$19.run(Jenkins.java:3545)
	at hudson.model.Queue._withLock(Queue.java:1398)
	at hudson.model.Queue.withLock(Queue.java:1275)
	at jenkins.model.Jenkins._cleanUpDisconnectComputers(Jenkins.java:3539)
	at jenkins.model.Jenkins.cleanUp(Jenkins.java:3421)
	at hudson.WebAppMain.contextDestroyed(WebAppMain.java:408)
	at org.eclipse.jetty.server.handler.ContextHandler.callContextDestroyed(ContextHandler.java:1009)
	at org.eclipse.jetty.servlet.ServletContextHandler.callContextDestroyed(ServletContextHandler.java:565)
	at org.eclipse.jetty.server.handler.ContextHandler.contextDestroyed(ContextHandler.java:972)
	at org.eclipse.jetty.servlet.ServletHandler.doStop(ServletHandler.java:313)
	at org.eclipse.jetty.util.component.AbstractLifeCycle.stop(AbstractLifeCycle.java:93)
	at org.eclipse.jetty.util.component.ContainerLifeCycle.stop(ContainerLifeCycle.java:180)
	at org.eclipse.jetty.util.component.ContainerLifeCycle.doStop(ContainerLifeCycle.java:201)
	at org.eclipse.jetty.server.handler.AbstractHandler.doStop(AbstractHandler.java:108)
	at org.eclipse.jetty.security.SecurityHandler.doStop(SecurityHandler.java:437)
	at org.eclipse.jetty.security.ConstraintSecurityHandler.doStop(ConstraintSecurityHandler.java:425)
	at org.eclipse.jetty.util.component.AbstractLifeCycle.stop(AbstractLifeCycle.java:93)
	at org.eclipse.jetty.util.component.ContainerLifeCycle.stop(ContainerLifeCycle.java:180)
	at org.eclipse.jetty.util.component.ContainerLifeCycle.doStop(ContainerLifeCycle.java:201)
	at org.eclipse.jetty.server.handler.AbstractHandler.doStop(AbstractHandler.java:108)
	at org.eclipse.jetty.server.session.SessionHandler.doStop(SessionHandler.java:519)
	at org.eclipse.jetty.util.component.AbstractLifeCycle.stop(AbstractLifeCycle.java:93)
	at org.eclipse.jetty.util.component.ContainerLifeCycle.stop(ContainerLifeCycle.java:180)
	at org.eclipse.jetty.util.component.ContainerLifeCycle.doStop(ContainerLifeCycle.java:201)
	at org.eclipse.jetty.server.handler.AbstractHandler.doStop(AbstractHandler.java:108)
	at org.eclipse.jetty.server.handler.ContextHandler.stopContext(ContextHandler.java:995)
	at org.eclipse.jetty.servlet.ServletContextHandler.stopContext(ServletContextHandler.java:367)
	at org.eclipse.jetty.webapp.WebAppContext.stopWebapp(WebAppContext.java:1450)
	at org.eclipse.jetty.webapp.WebAppContext.stopContext(WebAppContext.java:1415)
	at org.eclipse.jetty.server.handler.ContextHandler.doStop(ContextHandler.java:1049)
	at org.eclipse.jetty.servlet.ServletContextHandler.doStop(ServletContextHandler.java:284)
	at org.eclipse.jetty.webapp.WebAppContext.doStop(WebAppContext.java:547)
	at org.eclipse.jetty.util.component.AbstractLifeCycle.stop(AbstractLifeCycle.java:93)
	at org.eclipse.jetty.util.component.ContainerLifeCycle.stop(ContainerLifeCycle.java:180)
	at org.eclipse.jetty.util.component.ContainerLifeCycle.doStop(ContainerLifeCycle.java:201)
	at org.eclipse.jetty.server.handler.AbstractHandler.doStop(AbstractHandler.java:108)
	at org.eclipse.jetty.server.Server.doStop(Server.java:455)
	at org.eclipse.jetty.util.component.AbstractLifeCycle.stop(AbstractLifeCycle.java:93)
	at winstone.Launcher.shutdown(Launcher.java:304)
	at winstone.ShutdownHook.run(ShutdownHook.java:25)
Caused: hudson.remoting.ChannelClosedException: Channel "hudson.remoting.Channel@31486745:green-dragon-06": Remote call on green-dragon-06 failed. The channel is closing down or has closed down
	at hudson.remoting.Channel.call(Channel.java:991)
	at hudson.remoting.RemoteInvocationHandler.invoke(RemoteInvocationHandler.java:285)
	at com.sun.proxy.$Proxy88.isAlive(Unknown Source)
	at hudson.Launcher$RemoteLauncher$ProcImpl.isAlive(Launcher.java:1147)
	at hudson.Launcher$RemoteLauncher$ProcImpl.join(Launcher.java:1139)
	at hudson.tasks.CommandInterpreter.join(CommandInterpreter.java:155)
	at hudson.tasks.CommandInterpreter.perform(CommandInterpreter.java:109)
	at hudson.tasks.CommandInterpreter.perform(CommandInterpreter.java:66)
	at hudson.tasks.BuildStepMonitor$1.perform(BuildStepMonitor.java:20)
	at hudson.model.AbstractBuild$AbstractBuildExecution.perform(AbstractBuild.java:741)
	at hudson.model.Build$BuildExecution.build(Build.java:206)
	at hudson.model.Build$BuildExecution.doRun(Build.java:163)
	at hudson.model.AbstractBuild$AbstractBuildExecution.run(AbstractBuild.java:504)
	at hudson.model.Run.execute(Run.java:1880)
	at hudson.model.FreeStyleBuild.run(FreeStyleBuild.java:43)
	at hudson.model.ResourceController.execute(ResourceController.java:97)
	at hudson.model.Executor.run(Executor.java:428)
FATAL: Unable to delete script file /var/folders/09/r4vw4v8n5kb67jl66zvlbljw0000gn/T/jenkins3356496201984076663.sh
java.io.IOException
	at hudson.remoting.Channel.close(Channel.java:1490)
	at hudson.remoting.Channel.close(Channel.java:1446)
	at hudson.slaves.SlaveComputer.closeChannel(SlaveComputer.java:872)
	at hudson.slaves.SlaveComputer.kill(SlaveComputer.java:839)
	at hudson.model.AbstractCIBase.killComputer(AbstractCIBase.java:86)
	at jenkins.model.Jenkins.access$2000(Jenkins.java:318)
	at jenkins.model.Jenkins$19.run(Jenkins.java:3545)
	at hudson.model.Queue._withLock(Queue.java:1398)
	at hudson.model.Queue.withLock(Queue.java:1275)
	at jenkins.model.Jenkins._cleanUpDisconnectComputers(Jenkins.java:3539)
	at jenkins.model.Jenkins.cleanUp(Jenkins.java:3421)
	at hudson.WebAppMain.contextDestroyed(WebAppMain.java:408)
	at org.eclipse.jetty.server.handler.ContextHandler.callContextDestroyed(ContextHandler.java:1009)
	at org.eclipse.jetty.servlet.ServletContextHandler.callContextDestroyed(ServletContextHandler.java:565)
	at org.eclipse.jetty.server.handler.ContextHandler.contextDestroyed(ContextHandler.java:972)
	at org.eclipse.jetty.servlet.ServletHandler.doStop(ServletHandler.java:313)
	at org.eclipse.jetty.util.component.AbstractLifeCycle.stop(AbstractLifeCycle.java:93)
	at org.eclipse.jetty.util.component.ContainerLifeCycle.stop(ContainerLifeCycle.java:180)
	at org.eclipse.jetty.util.component.ContainerLifeCycle.doStop(ContainerLifeCycle.java:201)
	at org.eclipse.jetty.server.handler.AbstractHandler.doStop(AbstractHandler.java:108)
	at org.eclipse.jetty.security.SecurityHandler.doStop(SecurityHandler.java:437)
	at org.eclipse.jetty.security.ConstraintSecurityHandler.doStop(ConstraintSecurityHandler.java:425)
	at org.eclipse.jetty.util.component.AbstractLifeCycle.stop(AbstractLifeCycle.java:93)
	at org.eclipse.jetty.util.component.ContainerLifeCycle.stop(ContainerLifeCycle.java:180)
	at org.eclipse.jetty.util.component.ContainerLifeCycle.doStop(ContainerLifeCycle.java:201)
	at org.eclipse.jetty.server.handler.AbstractHandler.doStop(AbstractHandler.java:108)
	at org.eclipse.jetty.server.session.SessionHandler.doStop(SessionHandler.java:519)
	at org.eclipse.jetty.util.component.AbstractLifeCycle.stop(AbstractLifeCycle.java:93)
	at org.eclipse.jetty.util.component.ContainerLifeCycle.stop(ContainerLifeCycle.java:180)
	at org.eclipse.jetty.util.component.ContainerLifeCycle.doStop(ContainerLifeCycle.java:201)
	at org.eclipse.jetty.server.handler.AbstractHandler.doStop(AbstractHandler.java:108)
	at org.eclipse.jetty.server.handler.ContextHandler.stopContext(ContextHandler.java:995)
	at org.eclipse.jetty.servlet.ServletContextHandler.stopContext(ServletContextHandler.java:367)
	at org.eclipse.jetty.webapp.WebAppContext.stopWebapp(WebAppContext.java:1450)
	at org.eclipse.jetty.webapp.WebAppContext.stopContext(WebAppContext.java:1415)
	at org.eclipse.jetty.server.handler.ContextHandler.doStop(ContextHandler.java:1049)
	at org.eclipse.jetty.servlet.ServletContextHandler.doStop(ServletContextHandler.java:284)
	at org.eclipse.jetty.webapp.WebAppContext.doStop(WebAppContext.java:547)
	at org.eclipse.jetty.util.component.AbstractLifeCycle.stop(AbstractLifeCycle.java:93)
	at org.eclipse.jetty.util.component.ContainerLifeCycle.stop(ContainerLifeCycle.java:180)
	at org.eclipse.jetty.util.component.ContainerLifeCycle.doStop(ContainerLifeCycle.java:201)
	at org.eclipse.jetty.server.handler.AbstractHandler.doStop(AbstractHandler.java:108)
	at org.eclipse.jetty.server.Server.doStop(Server.java:455)
	at org.eclipse.jetty.util.component.AbstractLifeCycle.stop(AbstractLifeCycle.java:93)
	at winstone.Launcher.shutdown(Launcher.java:304)
	at winstone.ShutdownHook.run(ShutdownHook.java:25)
Caused: hudson.remoting.ChannelClosedException: Channel "hudson.remoting.Channel@31486745:green-dragon-06": Remote call on green-dragon-06 failed. The channel is closing down or has closed down
	at hudson.remoting.Channel.call(Channel.java:991)
	at hudson.FilePath.act(FilePath.java:1069)
	at hudson.FilePath.act(FilePath.java:1058)
	at hudson.FilePath.delete(FilePath.java:1543)
	at hudson.tasks.CommandInterpreter.perform(CommandInterpreter.java:123)
	at hudson.tasks.CommandInterpreter.perform(CommandInterpreter.java:66)
	at hudson.tasks.BuildStepMonitor$1.perform(BuildStepMonitor.java:20)
	at hudson.model.AbstractBuild$AbstractBuildExecution.perform(AbstractBuild.java:741)
	at hudson.model.Build$BuildExecution.build(Build.java:206)
	at hudson.model.Build$BuildExecution.doRun(Build.java:163)
	at hudson.model.AbstractBuild$AbstractBuildExecution.run(AbstractBuild.java:504)
	at hudson.model.Run.execute(Run.java:1880)
	at hudson.model.FreeStyleBuild.run(FreeStyleBuild.java:43)
	at hudson.model.ResourceController.execute(ResourceController.java:97)
	at hudson.model.Executor.run(Executor.java:428)
Build step 'Execute shell' marked build as failure
ERROR: Step ‘[Deprecated] Scan for compiler warnings’ failed: no workspace for clang-stage2-cmake-RgSan #7403
ERROR: Step ‘Publish JUnit test result report’ failed: no workspace for clang-stage2-cmake-RgSan #7403
Extended Email Publisher is currently disabled in project settings
Finished: FAILURE