FailedConsole Output

Skipping 819 KB.. Full Log
lldb-Suite :: functionalities/frame-diagnose/complicated-expression/TestComplicatedExpression.py (488 of 1675)
PASS: lldb-Suite :: functionalities/frame-diagnose/bad-reference/TestBadReference.py (489 of 1675)
PASS: lldb-Suite :: functionalities/frame-diagnose/dereference-function-return/TestDiagnoseDereferenceFunctionReturn.py (490 of 1675)
PASS: lldb-Suite :: functionalities/frame-diagnose/dereference-argument/TestDiagnoseDereferenceArgument.py (491 of 1675)
PASS: lldb-Suite :: functionalities/frame-diagnose/dereference-this/TestDiagnoseDereferenceThis.py (492 of 1675)
PASS: lldb-Suite :: functionalities/frame-language/TestGuessLanguage.py (493 of 1675)
PASS: lldb-Suite :: functionalities/frame-diagnose/inheritance/TestDiagnoseInheritance.py (494 of 1675)
PASS: lldb-Suite :: functionalities/frame-diagnose/local-variable/TestLocalVariable.py (495 of 1675)
PASS: lldb-Suite :: functionalities/gdb_remote_client/TestArmRegisterDefinition.py (496 of 1675)
PASS: lldb-Suite :: functionalities/gdb_remote_client/TestGDBRemoteClient.py (497 of 1675)
PASS: lldb-Suite :: functionalities/format/TestFormats.py (498 of 1675)
PASS: lldb-Suite :: functionalities/data-formatter/synthupdate/TestSyntheticFilterRecompute.py (499 of 1675)
PASS: lldb-Suite :: functionalities/gdb_remote_client/TestNestedRegDefinitions.py (500 of 1675)
PASS: lldb-Suite :: functionalities/gdb_remote_client/TestNoWatchpointSupportInfo.py (501 of 1675)
PASS: lldb-Suite :: functionalities/gdb_remote_client/TestGDBRemoteLoad.py (502 of 1675)
PASS: lldb-Suite :: functionalities/expr-doesnt-deadlock/TestExprDoesntBlock.py (503 of 1675)
PASS: lldb-Suite :: functionalities/gdb_remote_client/TestRestartBug.py (504 of 1675)
PASS: lldb-Suite :: functionalities/frame_var/TestFrameVar.py (505 of 1675)
PASS: lldb-Suite :: functionalities/gdb_remote_client/TestRecognizeBreakpoint.py (506 of 1675)
PASS: lldb-Suite :: functionalities/gdb_remote_client/TestStopPCs.py (507 of 1675)
PASS: lldb-Suite :: functionalities/gdb_remote_client/TestWriteMemory.py (508 of 1675)
PASS: lldb-Suite :: functionalities/history/TestHistoryRecall.py (509 of 1675)
PASS: lldb-Suite :: functionalities/gdb_remote_client/TestThreadSelectionBug.py (510 of 1675)
PASS: lldb-Suite :: functionalities/frame-diagnose/virtual-method-call/TestDiagnoseDereferenceVirtualMethodCall.py (511 of 1675)
PASS: lldb-Suite :: functionalities/gdb_remote_client/TestTargetXMLArch.py (512 of 1675)
PASS: lldb-Suite :: functionalities/longjmp/TestLongjmp.py (513 of 1675)
PASS: lldb-Suite :: functionalities/frame_var_scope/TestFrameVariableScope.py (514 of 1675)
PASS: lldb-Suite :: functionalities/frame-recognizer/TestFrameRecognizer.py (515 of 1675)
PASS: lldb-Suite :: functionalities/load_using_paths/TestLoadUsingPaths.py (516 of 1675)
PASS: lldb-Suite :: functionalities/memory-region/TestMemoryRegion.py (517 of 1675)
PASS: lldb-Suite :: functionalities/inferior-changed/TestInferiorChanged.py (518 of 1675)
PASS: lldb-Suite :: functionalities/multidebugger_commands/TestMultipleDebuggersCommands.py (519 of 1675)
PASS: lldb-Suite :: functionalities/memory/cache/TestMemoryCache.py (520 of 1675)
PASS: lldb-Suite :: functionalities/launch_with_shellexpand/TestLaunchWithShellExpand.py (521 of 1675)
PASS: lldb-Suite :: functionalities/memory/find/TestMemoryFind.py (522 of 1675)
PASS: lldb-Suite :: functionalities/memory/read/TestMemoryRead.py (523 of 1675)
PASS: lldb-Suite :: functionalities/nosucharch/TestNoSuchArch.py (524 of 1675)
PASS: lldb-Suite :: functionalities/object-file/TestImageListMultiArchitecture.py (525 of 1675)
PASS: lldb-Suite :: functionalities/paths/TestPaths.py (526 of 1675)
PASS: lldb-Suite :: functionalities/platform/TestPlatformCommand.py (527 of 1675)
PASS: lldb-Suite :: functionalities/platform/TestPlatformPython.py (528 of 1675)
PASS: lldb-Suite :: functionalities/nested_alias/TestNestedAlias.py (529 of 1675)
PASS: lldb-Suite :: functionalities/jitloader_gdb/TestJITLoaderGDB.py (530 of 1675)
PASS: lldb-Suite :: functionalities/non-overlapping-index-variable-i/TestIndexVariable.py (531 of 1675)
PASS: lldb-Suite :: functionalities/postmortem/elf-core/gcore/TestGCore.py (532 of 1675)
PASS: lldb-Suite :: functionalities/plugins/python_os_plugin/TestPythonOSPlugin.py (533 of 1675)
PASS: lldb-Suite :: functionalities/postmortem/elf-core/thread_crash/TestLinuxCoreThreads.py (534 of 1675)
PASS: lldb-Suite :: functionalities/postmortem/minidump-new/TestMiniDumpUUID.py (535 of 1675)
PASS: lldb-Suite :: functionalities/postmortem/minidump-new/TestMiniDumpNew.py (536 of 1675)
PASS: lldb-Suite :: functionalities/postmortem/minidump/TestMiniDump.py (537 of 1675)
PASS: lldb-Suite :: functionalities/postmortem/wow64_minidump/TestWow64MiniDump.py (538 of 1675)
PASS: lldb-Suite :: functionalities/postmortem/netbsd-core/TestNetBSDCore.py (539 of 1675)
PASS: lldb-Suite :: functionalities/inferior-crashing/recursive-inferior/TestRecursiveInferiorStep.py (540 of 1675)
PASS: lldb-Suite :: functionalities/pre_run_dylibs/TestPreRunDylibs.py (541 of 1675)
PASS: lldb-Suite :: functionalities/plugins/commands/TestPluginCommands.py (542 of 1675)
PASS: lldb-Suite :: functionalities/postmortem/elf-core/TestLinuxCore.py (543 of 1675)
PASS: lldb-Suite :: functionalities/process_save_core/TestProcessSaveCore.py (544 of 1675)
PASS: lldb-Suite :: functionalities/postmortem/mach-core/TestMachCore.py (545 of 1675)
PASS: lldb-Suite :: functionalities/process_attach/attach_denied/TestAttachDenied.py (546 of 1675)
PASS: lldb-Suite :: functionalities/inferior-crashing/recursive-inferior/TestRecursiveInferior.py (547 of 1675)
PASS: lldb-Suite :: functionalities/register/intel_xtended_registers/TestMPXRegisters.py (548 of 1675)
PASS: lldb-Suite :: functionalities/register/intel_xtended_registers/mpx_bound_violation/TestBoundViolation.py (549 of 1675)
PASS: lldb-Suite :: functionalities/process_group/TestChangeProcessGroup.py (550 of 1675)
PASS: lldb-Suite :: functionalities/inferior-crashing/TestInferiorCrashing.py (551 of 1675)
PASS: lldb-Suite :: functionalities/show_location/TestShowLocationDwarf5.py (552 of 1675)
PASS: lldb-Suite :: functionalities/signal/handle-abrt/TestHandleAbort.py (553 of 1675)
PASS: lldb-Suite :: functionalities/inline-stepping/TestInlineStepping.py (554 of 1675)
PASS: lldb-Suite :: functionalities/mtc/simple/TestMTCSimple.py (555 of 1675)
PASS: lldb-Suite :: functionalities/signal/handle-segv/TestHandleSegv.py (556 of 1675)
PASS: lldb-Suite :: functionalities/process_launch/TestProcessLaunch.py (557 of 1675)
PASS: lldb-Suite :: functionalities/ptr_refs/TestPtrRefs.py (558 of 1675)
PASS: lldb-Suite :: functionalities/source-map/TestTargetSourceMap.py (559 of 1675)
PASS: lldb-Suite :: functionalities/process_attach/TestProcessAttach.py (560 of 1675)
PASS: lldb-Suite :: functionalities/signal/TestSendSignal.py (561 of 1675)
PASS: lldb-Suite :: functionalities/rerun/TestRerun.py (562 of 1675)
PASS: lldb-Suite :: functionalities/stats_api/TestStatisticsAPI.py (563 of 1675)
PASS: lldb-Suite :: functionalities/step_scripted/TestStepScripted.py (564 of 1675)
PASS: lldb-Suite :: functionalities/inferior-assert/TestInferiorAssert.py (565 of 1675)
PASS: lldb-Suite :: functionalities/tail_call_frames/ambiguous_tail_call_seq1/TestAmbiguousTailCallSeq1.py (566 of 1675)
PASS: lldb-Suite :: functionalities/stats/TestStats.py (567 of 1675)
PASS: lldb-Suite :: functionalities/tail_call_frames/ambiguous_tail_call_seq2/TestAmbiguousTailCallSeq2.py (568 of 1675)
PASS: lldb-Suite :: functionalities/tail_call_frames/disambiguate_call_site/TestDisambiguateCallSite.py (569 of 1675)
PASS: lldb-Suite :: functionalities/signal/raise/TestRaise.py (570 of 1675)
PASS: lldb-Suite :: functionalities/tail_call_frames/disambiguate_paths_to_common_sink/TestDisambiguatePathsToCommonSink.py (571 of 1675)
PASS: lldb-Suite :: functionalities/tail_call_frames/disambiguate_tail_call_seq/TestDisambiguateTailCallSeq.py (572 of 1675)
PASS: lldb-Suite :: functionalities/tail_call_frames/sbapi_support/TestTailCallFrameSBAPI.py (573 of 1675)
PASS: lldb-Suite :: functionalities/tail_call_frames/thread_step_out_or_return/TestSteppingOutWithArtificialFrames.py (574 of 1675)
PASS: lldb-Suite :: functionalities/load_unload/TestLoadUnload.py (575 of 1675)
PASS: lldb-Suite :: functionalities/target-new-solib-notifications/TestModuleLoadedNotifys.py (576 of 1675)
PASS: lldb-Suite :: functionalities/testid/TestTestId.py (577 of 1675)
PASS: lldb-Suite :: functionalities/tail_call_frames/inlining_and_tail_calls/TestInliningAndTailCalls.py (578 of 1675)
PASS: lldb-Suite :: functionalities/tail_call_frames/thread_step_out_message/TestArtificialFrameStepOutMessage.py (579 of 1675)
PASS: lldb-Suite :: functionalities/inferior-crashing/TestInferiorCrashingStep.py (580 of 1675)
PASS: lldb-Suite :: functionalities/set-data/TestSetData.py (581 of 1675)
PASS: lldb-Suite :: functionalities/tail_call_frames/unambiguous_sequence/TestUnambiguousTailCalls.py (582 of 1675)
PASS: lldb-Suite :: functionalities/thread/backtrace_limit/TestBacktraceLimit.py (583 of 1675)
PASS: lldb-Suite :: functionalities/target_var/TestTargetVar.py (584 of 1675)
PASS: lldb-Suite :: functionalities/return-value/TestReturnValue.py (585 of 1675)
PASS: lldb-Suite :: functionalities/step-avoids-no-debug/TestStepNoDebug.py (586 of 1675)
PASS: lldb-Suite :: functionalities/thread/concurrent_events/TestConcurrentCrashWithBreak.py (587 of 1675)
PASS: lldb-Suite :: functionalities/thread/concurrent_events/TestConcurrentCrashWithSignal.py (588 of 1675)
PASS: lldb-Suite :: functionalities/register/register_command/TestRegisters.py (589 of 1675)
PASS: lldb-Suite :: functionalities/thread/concurrent_events/TestConcurrentBreakpointDelayBreakpointOneSignal.py (590 of 1675)
PASS: lldb-Suite :: functionalities/thread/concurrent_events/TestConcurrentBreakpointOneDelayBreakpointThreads.py (591 of 1675)
PASS: lldb-Suite :: functionalities/thread/concurrent_events/TestConcurrentCrashWithWatchpoint.py (592 of 1675)
PASS: lldb-Suite :: functionalities/thread/concurrent_events/TestConcurrentBreakpointsDelayedBreakpointOneWatchpoint.py (593 of 1675)
PASS: lldb-Suite :: functionalities/thread/concurrent_events/TestConcurrentCrashWithWatchpointBreakpointSignal.py (594 of 1675)
PASS: lldb-Suite :: functionalities/thread/concurrent_events/TestConcurrentManyBreakpoints.py (595 of 1675)
PASS: lldb-Suite :: functionalities/thread/concurrent_events/TestConcurrentManyCrash.py (596 of 1675)
PASS: lldb-Suite :: functionalities/thread/concurrent_events/TestConcurrentManySignals.py (597 of 1675)
PASS: lldb-Suite :: functionalities/thread/concurrent_events/TestConcurrentManyWatchpoints.py (598 of 1675)
PASS: lldb-Suite :: functionalities/target_create_deps/TestTargetCreateDeps.py (599 of 1675)
PASS: lldb-Suite :: functionalities/thread/break_after_join/TestBreakAfterJoin.py (600 of 1675)
PASS: lldb-Suite :: functionalities/thread/concurrent_events/TestConcurrentDelaySignalBreak.py (601 of 1675)
PASS: lldb-Suite :: functionalities/thread/concurrent_events/TestConcurrentDelaySignalWatch.py (602 of 1675)
PASS: lldb-Suite :: functionalities/thread/concurrent_events/TestConcurrentNWatchNBreak.py (603 of 1675)
PASS: lldb-Suite :: functionalities/thread/concurrent_events/TestConcurrentSignalBreak.py (604 of 1675)
PASS: lldb-Suite :: functionalities/thread/concurrent_events/TestConcurrentDelayWatchBreak.py (605 of 1675)
PASS: lldb-Suite :: functionalities/thread/concurrent_events/TestConcurrentDelayedCrashWithBreakpointSignal.py (606 of 1675)
PASS: lldb-Suite :: functionalities/thread/concurrent_events/TestConcurrentDelayedCrashWithBreakpointWatchpoint.py (607 of 1675)
PASS: lldb-Suite :: functionalities/thread/concurrent_events/TestConcurrentSignalNWatchNBreak.py (608 of 1675)
PASS: lldb-Suite :: functionalities/thread/concurrent_events/TestConcurrentSignalWatch.py (609 of 1675)
PASS: lldb-Suite :: functionalities/thread/concurrent_events/TestConcurrentSignalDelayWatch.py (610 of 1675)
PASS: lldb-Suite :: functionalities/thread/concurrent_events/TestConcurrentSignalDelayBreak.py (611 of 1675)
PASS: lldb-Suite :: functionalities/thread/concurrent_events/TestConcurrentSignalWatchBreak.py (612 of 1675)
PASS: lldb-Suite :: functionalities/thread/concurrent_events/TestConcurrentTwoBreakpointThreads.py (613 of 1675)
PASS: lldb-Suite :: functionalities/thread/concurrent_events/TestConcurrentTwoBreakpointsOneSignal.py (614 of 1675)
PASS: lldb-Suite :: functionalities/thread/concurrent_events/TestConcurrentTwoWatchpointThreads.py (615 of 1675)
PASS: lldb-Suite :: functionalities/thread/concurrent_events/TestConcurrentTwoBreakpointsOneDelaySignal.py (616 of 1675)
PASS: lldb-Suite :: functionalities/thread/concurrent_events/TestConcurrentTwoBreakpointsOneWatchpoint.py (617 of 1675)
PASS: lldb-Suite :: functionalities/thread/concurrent_events/TestConcurrentTwoWatchpointsOneBreakpoint.py (618 of 1675)
PASS: lldb-Suite :: functionalities/thread/concurrent_events/TestConcurrentTwoWatchpointsOneSignal.py (619 of 1675)
PASS: lldb-Suite :: functionalities/thread/concurrent_events/TestConcurrentWatchBreak.py (620 of 1675)
PASS: lldb-Suite :: functionalities/thread/concurrent_events/TestConcurrentTwoWatchpointsOneDelayBreakpoint.py (621 of 1675)
PASS: lldb-Suite :: functionalities/target_command/TestTargetCommand.py (622 of 1675)
PASS: lldb-Suite :: functionalities/thread/state/TestThreadStates.py (623 of 1675)
PASS: lldb-Suite :: functionalities/thread/concurrent_events/TestConcurrentWatchpointDelayWatchpointOneBreakpoint.py (624 of 1675)
PASS: lldb-Suite :: functionalities/thread/concurrent_events/TestConcurrentWatchBreakDelay.py (625 of 1675)
PASS: lldb-Suite :: functionalities/thread/concurrent_events/TestConcurrentWatchpointWithDelayWatchpointThreads.py (626 of 1675)
PASS: lldb-Suite :: functionalities/thread/crash_during_step/TestCrashDuringStep.py (627 of 1675)
PASS: lldb-Suite :: functionalities/thread/thread_specific_break_plus_condition/TestThreadSpecificBpPlusCondition.py (628 of 1675)
PASS: lldb-Suite :: functionalities/thread/backtrace_all/TestBacktraceAll.py (629 of 1675)
PASS: lldb-Suite :: functionalities/thread/num_threads/TestNumThreads.py (630 of 1675)
PASS: lldb-Suite :: functionalities/thread/jump/TestThreadJump.py (631 of 1675)
PASS: lldb-Suite :: functionalities/thread/exit_during_break/TestExitDuringBreak.py (632 of 1675)
PASS: lldb-Suite :: functionalities/thread/multi_break/TestMultipleBreakpoints.py (633 of 1675)
PASS: lldb-Suite :: functionalities/thread/thread_specific_break/TestThreadSpecificBreakpoint.py (634 of 1675)
PASS: lldb-Suite :: functionalities/tty/TestTerminal.py (635 of 1675)
PASS: lldb-Suite :: functionalities/thread/thread_exit/TestThreadExit.py (636 of 1675)
PASS: lldb-Suite :: functionalities/recursion/TestValueObjectRecursion.py (637 of 1675)
PASS: lldb-Suite :: functionalities/thread/create_after_attach/TestCreateAfterAttach.py (638 of 1675)
PASS: lldb-Suite :: functionalities/ubsan/basic/TestUbsanBasic.py (639 of 1675)
PASS: lldb-Suite :: functionalities/unwind/ehframe/TestEhFrameUnwind.py (640 of 1675)
PASS: lldb-Suite :: functionalities/type_completion/TestTypeCompletion.py (641 of 1675)
PASS: lldb-Suite :: functionalities/thread/step_until/TestStepUntil.py (642 of 1675)
PASS: lldb-Suite :: functionalities/unwind/noreturn/module-end/TestNoReturnModuleEnd.py (643 of 1675)
PASS: lldb-Suite :: functionalities/ubsan/user-expression/TestUbsanUserExpression.py (644 of 1675)
PASS: lldb-Suite :: functionalities/unwind/standard/TestStandardUnwind.py (645 of 1675)
PASS: lldb-Suite :: functionalities/watchpoint/hello_watchlocation/TestWatchLocation.py (646 of 1675)
PASS: lldb-Suite :: functionalities/thread/exit_during_step/TestExitDuringStep.py (647 of 1675)
PASS: lldb-Suite :: functionalities/var_path/TestVarPath.py (648 of 1675)
PASS: lldb-Suite :: functionalities/watchpoint/multi_watchpoint_slots/TestWatchpointMultipleSlots.py (649 of 1675)
PASS: lldb-Suite :: functionalities/thread/create_during_step/TestCreateDuringStep.py (650 of 1675)
PASS: lldb-Suite :: functionalities/unwind/sigtramp/TestSigtrampUnwind.py (651 of 1675)
PASS: lldb-Suite :: functionalities/unwind/noreturn/TestNoreturnUnwind.py (652 of 1675)
PASS: lldb-Suite :: functionalities/thread/step_out/TestThreadStepOut.py (653 of 1675)
PASS: lldb-Suite :: functionalities/tsan/basic/TestTsanBasic.py (654 of 1675)
PASS: lldb-Suite :: functionalities/tsan/global_location/TestTsanGlobalLocation.py (655 of 1675)
PASS: lldb-Suite :: functionalities/value_md5_crash/TestValueMD5Crash.py (656 of 1675)
PASS: lldb-Suite :: functionalities/watchpoint/variable_out_of_scope/TestWatchedVarHitWhenInScope.py (657 of 1675)
PASS: lldb-Suite :: functionalities/watchpoint/multiple_hits/TestMultipleHits.py (658 of 1675)
PASS: lldb-Suite :: functionalities/watchpoint/hello_watchpoint/TestMyFirstWatchpoint.py (659 of 1675)
PASS: lldb-Suite :: functionalities/type_lookup/TestTypeLookup.py (660 of 1675)
PASS: lldb-Suite :: functionalities/tsan/thread_leak/TestTsanThreadLeak.py (661 of 1675)
PASS: lldb-Suite :: functionalities/wrong_commands/TestWrongCommands.py (662 of 1675)
PASS: lldb-Suite :: functionalities/watchpoint/step_over_watchpoint/TestStepOverWatchpoint.py (663 of 1675)
PASS: lldb-Suite :: help/TestApropos.py (664 of 1675)
PASS: lldb-Suite :: functionalities/tsan/thread_numbers/TestTsanThreadNumbers.py (665 of 1675)
PASS: lldb-Suite :: functionalities/tsan/cpp_global_location/TestTsanCPPGlobalLocation.py (666 of 1675)
PASS: lldb-Suite :: help/TestHelp.py (667 of 1675)
PASS: lldb-Suite :: functionalities/watchpoint/watchpoint_on_vectors/TestValueOfVectorVariable.py (668 of 1675)
PASS: lldb-Suite :: functionalities/watchpoint/watchpoint_events/TestWatchpointEvents.py (669 of 1675)
PASS: lldb-Suite :: functionalities/watchpoint/watchpoint_commands/condition/TestWatchpointConditionCmd.py (670 of 1675)
PASS: lldb-Suite :: functionalities/watchpoint/watchpoint_size/TestWatchpointSizes.py (671 of 1675)
PASS: lldb-Suite :: functionalities/watchpoint/multiple_threads/TestWatchpointMultipleThreads.py (672 of 1675)
PASS: lldb-Suite :: lang/c/find_struct_type/TestFindStructTypes.py (673 of 1675)
PASS: lldb-Suite :: functionalities/watchpoint/watchpoint_disable/TestWatchpointDisable.py (674 of 1675)
PASS: lldb-Suite :: functionalities/watchpoint/watchpoint_commands/command/TestWatchpointCommandLLDB.py (675 of 1675)
PASS: lldb-Suite :: lang/c/conflicting-symbol/TestConflictingSymbol.py (676 of 1675)
PASS: lldb-Suite :: functionalities/watchpoint/watchpoint_commands/command/TestWatchpointCommandPython.py (677 of 1675)
PASS: lldb-Suite :: lang/c/local_types/TestUseClosestType.py (678 of 1675)
PASS: lldb-Suite :: lang/c/enum_types/TestEnumTypes.py (679 of 1675)
PASS: lldb-Suite :: lang/c/array_types/TestArrayTypes.py (680 of 1675)
PASS: lldb-Suite :: lang/c/const_variables/TestConstVariables.py (681 of 1675)
PASS: lldb-Suite :: lang/c/forward/TestForwardDeclaration.py (682 of 1675)
PASS: lldb-Suite :: functionalities/tsan/multiple/TestTsanMultiple.py (683 of 1675)
PASS: lldb-Suite :: lang/c/inlines/TestRedefinitionsInInlines.py (684 of 1675)
PASS: lldb-Suite :: lang/c/local_variables/TestLocalVariables.py (685 of 1675)
PASS: lldb-Suite :: lang/c/global_variables/TestGlobalVariables.py (686 of 1675)
PASS: lldb-Suite :: lang/c/offsetof/TestOffsetof.py (687 of 1675)
PASS: lldb-Suite :: lang/c/blocks/TestBlocks.py (688 of 1675)
PASS: lldb-Suite :: lang/c/function_types/TestFunctionTypes.py (689 of 1675)
PASS: lldb-Suite :: lang/c/bitfields/TestBitfields.py (690 of 1675)
PASS: lldb-Suite :: functionalities/watchpoint/watchpoint_commands/TestWatchpointCommands.py (691 of 1675)
PASS: lldb-Suite :: lang/c/modules/TestCModules.py (692 of 1675)
PASS: lldb-Suite :: lang/c/set_values/TestSetValues.py (693 of 1675)
PASS: lldb-Suite :: lang/c/register_variables/TestRegisterVariables.py (694 of 1675)
PASS: lldb-Suite :: lang/c/stepping/TestThreadStepping.py (695 of 1675)
PASS: lldb-Suite :: lang/c/unicode/TestUnicodeSymbols.py (696 of 1675)
PASS: lldb-Suite :: lang/c/typedef/Testtypedef.py (697 of 1675)
PASS: lldb-Suite :: lang/c/stepping/TestStepAndBreakpoints.py (698 of 1675)
PASS: lldb-Suite :: lang/c/struct_types/TestStructTypes.py (699 of 1675)
PASS: lldb-Suite :: lang/c/strings/TestCStrings.py (700 of 1675)
PASS: lldb-Suite :: lang/cpp/breakpoint-commands/TestCPPBreakpointCommands.py (701 of 1675)
PASS: lldb-Suite :: lang/c/tls_globals/TestTlsGlobals.py (702 of 1675)
PASS: lldb-Suite :: lang/cpp/breakpoint_in_member_func_w_non_primitive_params/TestBreakpointInMemberFuncWNonPrimitiveParams.py (703 of 1675)
PASS: lldb-Suite :: lang/c/unions/TestUnionMembers.py (704 of 1675)
PASS: lldb-Suite :: lang/cpp/bool/TestCPPBool.py (705 of 1675)
PASS: lldb-Suite :: lang/c/shared_lib_stripped_symbols/TestSharedLibStrippedSymbols.py (706 of 1675)
PASS: lldb-Suite :: lang/cpp/call-function/TestCallCPPFunction.py (707 of 1675)
PASS: lldb-Suite :: lang/cpp/auto/TestCPPAuto.py (708 of 1675)
PASS: lldb-Suite :: lang/cpp/chained-calls/TestCppChainedCalls.py (709 of 1675)
PASS: lldb-Suite :: lang/c/vla/TestVLA.py (710 of 1675)
PASS: lldb-Suite :: lang/cpp/class-template-parameter-pack/TestClassTemplateParameterPack.py (711 of 1675)
PASS: lldb-Suite :: lang/cpp/dynamic-value-same-basename/TestDynamicValueSameBase.py (712 of 1675)
PASS: lldb-Suite :: lang/cpp/const_this/TestConstThis.py (713 of 1675)
PASS: lldb-Suite :: lang/cpp/diamond/TestDiamond.py (714 of 1675)
PASS: lldb-Suite :: lang/cpp/function-template-parameter-pack/TestFunctionTemplateParameterPack.py (715 of 1675)
PASS: lldb-Suite :: lang/c/shared_lib/TestSharedLib.py (716 of 1675)
PASS: lldb-Suite :: lang/cpp/dynamic-value/TestCppValueCast.py (717 of 1675)
PASS: lldb-Suite :: lang/cpp/class_types/TestClassTypesDisassembly.py (718 of 1675)
PASS: lldb-Suite :: lang/cpp/dynamic-value/TestDynamicValue.py (719 of 1675)
PASS: lldb-Suite :: lang/cpp/class_static/TestStaticVariables.py (720 of 1675)
PASS: lldb-Suite :: lang/c/step-target/TestStepTarget.py (721 of 1675)
PASS: lldb-Suite :: lang/cpp/exceptions/TestCPPExceptionBreakpoints.py (722 of 1675)
PASS: lldb-Suite :: lang/cpp/frame-var-anon-unions/TestFrameVariableAnonymousUnions.py (723 of 1675)
PASS: lldb-Suite :: lang/cpp/extern_c/TestExternCSymbols.py (724 of 1675)
PASS: lldb-Suite :: lang/cpp/function_refs/TestFunctionRefs.py (725 of 1675)
PASS: lldb-Suite :: lang/cpp/gmodules/TestWithModuleDebugging.py (726 of 1675)
PASS: lldb-Suite :: lang/c/anonymous/TestAnonymous.py (727 of 1675)
PASS: lldb-Suite :: lang/cpp/char1632_t/TestChar1632T.py (728 of 1675)
PASS: lldb-Suite :: lang/cpp/limit-debug-info/TestWithLimitDebugInfo.py (729 of 1675)
PASS: lldb-Suite :: lang/cpp/global_variables/TestCPPGlobalVariables.py (730 of 1675)
PASS: lldb-Suite :: lang/cpp/gmodules-templates/TestGModules.py (731 of 1675)
PASS: lldb-Suite :: lang/cpp/llvm-style/TestLLVMStyle.py (732 of 1675)
PASS: lldb-Suite :: lang/cpp/lambdas/TestLambdas.py (733 of 1675)
PASS: lldb-Suite :: lang/cpp/inlines/TestInlines.py (734 of 1675)
PASS: lldb-Suite :: lang/cpp/class_types/TestClassTypes.py (735 of 1675)
PASS: lldb-Suite :: lang/cpp/namespace_conflicts/TestNamespaceConflicts.py (736 of 1675)
PASS: lldb-Suite :: lang/cpp/nsimport/TestCppNsImport.py (737 of 1675)
PASS: lldb-Suite :: lang/cpp/global_operators/TestCppGlobalOperators.py (738 of 1675)
PASS: lldb-Suite :: lang/cpp/offsetof/TestOffsetofCpp.py (739 of 1675)
PASS: lldb-Suite :: lang/cpp/printf/TestPrintf.py (740 of 1675)
PASS: lldb-Suite :: lang/cpp/namespace_definitions/TestNamespaceDefinitions.py (741 of 1675)
PASS: lldb-Suite :: lang/cpp/operator-overload/TestOperatorOverload.py (742 of 1675)
PASS: lldb-Suite :: lang/cpp/modules-import/TestCXXModulesImport.py (743 of 1675)
PASS: lldb-Suite :: lang/cpp/member-and-local-vars-with-same-name/TestMembersAndLocalsWithSameName.py (744 of 1675)
PASS: lldb-Suite :: lang/cpp/overloaded-functions/TestOverloadedFunctions.py (745 of 1675)
PASS: lldb-Suite :: lang/cpp/stl/TestStdCXXDisassembly.py (746 of 1675)
PASS: lldb-Suite :: lang/cpp/incomplete-types/TestCppIncompleteTypes.py (747 of 1675)
PASS: lldb-Suite :: lang/cpp/rvalue-references/TestRvalueReferences.py (748 of 1675)
PASS: lldb-Suite :: lang/cpp/signed_types/TestSignedTypes.py (749 of 1675)
PASS: lldb-Suite :: lang/cpp/std-function-step-into-callable/TestStdFunctionStepIntoCallable.py (750 of 1675)
PASS: lldb-Suite :: lang/cpp/static_members/TestCPPStaticMembers.py (751 of 1675)
PASS: lldb-Suite :: lang/cpp/static_methods/TestCPPStaticMethods.py (752 of 1675)
PASS: lldb-Suite :: lang/cpp/symbols/TestSymbols.py (753 of 1675)
PASS: lldb-Suite :: lang/cpp/scope/TestCppScope.py (754 of 1675)
PASS: lldb-Suite :: lang/cpp/trivial_abi/TestTrivialABI.py (755 of 1675)
PASS: lldb-Suite :: lang/cpp/this/TestCPPThis.py (756 of 1675)
PASS: lldb-Suite :: lang/cpp/type_lookup/TestCppTypeLookup.py (757 of 1675)
PASS: lldb-Suite :: lang/cpp/stl/TestSTL.py (758 of 1675)
PASS: lldb-Suite :: lang/cpp/unsigned_types/TestUnsignedTypes.py (759 of 1675)
PASS: lldb-Suite :: lang/cpp/virtual-overload/TestVirtualOverload.py (760 of 1675)
PASS: lldb-Suite :: lang/cpp/template-function/TestTemplateFunctions.py (761 of 1675)
PASS: lldb-Suite :: lang/cpp/unique-types/TestUniqueTypes.py (762 of 1675)
PASS: lldb-Suite :: lang/cpp/namespace/TestNamespace.py (763 of 1675)
PASS: lldb-Suite :: lang/cpp/wchar_t/TestCxxWCharT.py (764 of 1675)
PASS: lldb-Suite :: lang/mixed/TestMixedLanguages.py (765 of 1675)
PASS: lldb-Suite :: lang/cpp/virtual/TestVirtual.py (766 of 1675)
PASS: lldb-Suite :: lang/cpp/unicode-literals/TestUnicodeLiterals.py (767 of 1675)
PASS: lldb-Suite :: lang/cpp/template/TestTemplateArgs.py (768 of 1675)
PASS: lldb-Suite :: lang/objc/blocks/TestObjCIvarsInBlocks.py (769 of 1675)
PASS: lldb-Suite :: lang/objc/bitfield_ivars/TestBitfieldIvars.py (770 of 1675)
PASS: lldb-Suite :: lang/objc/foundation/TestConstStrings.py (771 of 1675)
FAIL: lldb-Suite :: functionalities/watchpoint/watchpoint_set_command/TestWatchLocationWithWatchSet.py (772 of 1675)
******************** TEST 'lldb-Suite :: functionalities/watchpoint/watchpoint_set_command/TestWatchLocationWithWatchSet.py' FAILED ********************
lldb version 10.0.99 (http://labmaster3.local/git/llvm-project.git revision a7f7d852d04895363e22d7f2cdd970887461c0f5)
  clang revision 59fabf9c606ecc69342463e514faefdfa2361be6
  llvm revision 59fabf9c606ecc69342463e514faefdfa2361be6
LLDB library dir: /Users/buildslave/jenkins/workspace/lldb-cmake-monorepo-python3/lldb-build/bin
LLDB import library dir: /Users/buildslave/jenkins/workspace/lldb-cmake-monorepo-python3/lldb-build/bin
libstdcxx tests will not be run because: Don't know how to build with libstdcxx on macosx
Skipping following debug info categories: ['dwo']

Hide Details

Session logs for test failures/errors/unexpected successes will go into directory '/Users/buildslave/jenkins/workspace/lldb-cmake-monorepo-python3/test/logs' Command invoked: /Users/buildslave/jenkins/workspace/lldb-cmake-monorepo-python3/llvm-project/lldb/test/dotest.py -q --arch=x86_64 -s /Users/buildslave/jenkins/workspace/lldb-cmake-monorepo-python3/lldb-build/lldb-test-traces --build-dir /Users/buildslave/jenkins/workspace/lldb-cmake-monorepo-python3/lldb-build/lldb-test-build.noindex -S nm -u CXXFLAGS -u CFLAGS --executable /Users/buildslave/jenkins/workspace/lldb-cmake-monorepo-python3/lldb-build/./bin/lldb --dsymutil /Users/buildslave/jenkins/workspace/lldb-cmake-monorepo-python3/lldb-build/./bin/dsymutil --filecheck /Users/buildslave/jenkins/workspace/lldb-cmake-monorepo-python3/lldb-build/./bin/FileCheck -C /Users/buildslave/jenkins/workspace/lldb-cmake-monorepo-python3/lldb-build/./bin/clang --codesign-identity lldb_codesign --server /Users/buildslave/jenkins/workspace/lldb-cmake-monorepo-python3/lldb-build/./bin/debugserver --arch x86_64 --build-dir /Users/buildslave/jenkins/workspace/lldb-cmake-monorepo-python3/lldb-build/lldb-test-build.noindex -s=/Users/buildslave/jenkins/workspace/lldb-cmake-monorepo-python3/test/logs -t --env TERM=vt100 --env LLVM_LIBS_DIR=/Users/buildslave/jenkins/workspace/lldb-cmake-monorepo-python3/lldb-build/./lib /Users/buildslave/jenkins/workspace/lldb-cmake-monorepo-python3/llvm-project/lldb/packages/Python/lldbsuite/test/functionalities/watchpoint/watchpoint_set_command -p TestWatchLocationWithWatchSet.py Change dir to: /Users/buildslave/jenkins/workspace/lldb-cmake-monorepo-python3/llvm-project/lldb/packages/Python/lldbsuite/test/functionalities/watchpoint/watchpoint_set_command runCmd: settings set symbols.clang-modules-cache-path "/Users/buildslave/jenkins/workspace/lldb-cmake-monorepo-python3/lldb-build/lldb-test-build.noindex/module-cache-lldb" output: None

Hide Details

runCmd: settings set symbols.enable-external-lookup false output: None

Hide Details

runCmd: settings set plugin.process.gdb-remote.packet-timeout 60 output: None

Hide Details

runCmd: settings set use-color false output: None

Hide Details

runCmd: settings set target.env-vars DYLD_LIBRARY_PATH= output: None

Hide Details

runCmd: file /Users/buildslave/jenkins/workspace/lldb-cmake-monorepo-python3/lldb-build/lldb-test-build.noindex/functionalities/watchpoint/watchpoint_set_command/TestWatchLocationWithWatchSet.test_watchlocation_using_watchpoint_set_dsym/a.out output: Current executable set to '/Users/buildslave/jenkins/workspace/lldb-cmake-monorepo-python3/lldb-build/lldb-test-build.noindex/functionalities/watchpoint/watchpoint_set_command/TestWatchLocationWithWatchSet.test_watchlocation_using_watchpoint_set_dsym/a.out' (x86_64).

Hide Details

Hide Details

runCmd: breakpoint set -l 105 output: Breakpoint 1: where = a.out`main + 391 at main.cpp:105:5, address = 0x0000000100001207

Hide Details

Hide Details

Expecting pattern: ^Breakpoint (?P<bpno>[0-9]+): (?P<num_locations>[0-9]+) locations\.$ Not matched

Hide Details

Expecting pattern: ^Breakpoint (?P<bpno>[0-9]+): (?P<num_locations>no) locations \(pending\)\. Not matched

Hide Details

Expecting pattern: ^Breakpoint (?P<bpno>[0-9]+): where = (?P<module>.*)`(?P<symbol>[+\-]{0,1}[^+]+)( \+ (?P<offset>[0-9]+)){0,1}( \[inlined\] (?P<inline_symbol>.*)){0,1} at (?P<file>[^:]+):(?P<line_no>[0-9]+)(?P<column>(:[0-9]+)?), address = (?P<address>0x[0-9a-fA-F]+)$ Matched

Hide Details

runCmd: run output: Process 2146 stopped * thread #1, queue = 'com.apple.main-thread', stop reason = breakpoint 1.1 frame #0: 0x0000000100001207 a.out`main(argc=1, argv=0x00007ffeefbff428) at main.cpp:105:5 102 int c; 103 } MyAggregateDataType; 104 -> 105 printf ("Before turning all three threads loose...\n"); // Set break point at this line. ^ 106 barrier_wait(); 107 108 // Join all of our threads

Hide Details

Process 2146 launched: '/Users/buildslave/jenkins/workspace/lldb-cmake-monorepo-python3/lldb-build/lldb-test-build.noindex/functionalities/watchpoint/watchpoint_set_command/TestWatchLocationWithWatchSet.test_watchlocation_using_watchpoint_set_dsym/a.out' (x86_64)

Hide Details

Hide Details

runCmd: thread list output: Process 2146 stopped * thread #1: tid = 0x454ced, 0x0000000100001207 a.out`main(argc=1, argv=0x00007ffeefbff428) at main.cpp:105:5, queue = 'com.apple.main-thread', stop reason = breakpoint 1.1 thread #2: tid = 0x454e9b, 0x00007fff7c594872 libsystem_kernel.dylib`__psynch_mutexwait + 10 thread #3: tid = 0x454e9c, 0x00007fff7c4d80ff libsystem_c.dylib`localeconv_l + 89 thread #4: tid = 0x454e9d, 0x00007fff7c594872 libsystem_kernel.dylib`__psynch_mutexwait + 10

Hide Details

Hide Details

Expecting sub string: stopped Matched

Hide Details

Expecting sub string: stop reason = breakpoint Matched

Hide Details

runCmd: watchpoint set expression -w write -s 1 -- g_char_ptr + 7 output: Watchpoint created: Watchpoint 1: addr = 0x100200367 size = 1 state = enabled type = w new value: 0x0000000000000000

Hide Details

Hide Details

Expecting sub string: Watchpoint created Matched

Hide Details

Expecting sub string: size = 1 Matched

Hide Details

Expecting sub string: type = w Matched

Hide Details

runCmd: expr unsigned val = g_char_ptr[7]; val output: (unsigned int) $1 = 0

Hide Details

Hide Details

looking at: (unsigned int) $1 = 0

Hide Details

Expecting end string: = 0 Matched

Hide Details

runCmd: watchpoint list -v output: Number of supported hardware watchpoints: 4 Current watchpoints: Watchpoint 1: addr = 0x100200367 size = 1 state = enabled type = w new value: 0x0000000000000000 hw_index = -1 hit_count = 0 ignore_count = 0

Hide Details

Hide Details

Expecting sub string: hit_count = 0 Matched

Hide Details

runCmd: process continue output: Process 2146 resuming Process 2146 stopped * thread #3, stop reason = watchpoint 1 frame #0: 0x0000000100000d92 a.out`do_bad_thing_with_location(index=7, char_ptr="", new_val='c') at main.cpp:36:1 33 unsigned what = new_val; 34 printf("new value written to array(%p) and index(%u) = %u\n", char_ptr, index, what); 35 char_ptr[index] = new_val; -> 36 } ^ 37 38 uint32_t 39 access_pool (bool flag = false) thread #4, stop reason = watchpoint 1 frame #0: 0x0000000100000d92 a.out`do_bad_thing_with_location(index=7, char_ptr="", new_val='c') at main.cpp:36:1 33 unsigned what = new_val; 34 printf("new value written to array(%p) and index(%u) = %u\n", char_ptr, index, what); 35 char_ptr[index] = new_val; -> 36 } ^ 37 38 uint32_t 39 access_pool (bool flag = false)

Hide Details

Hide Details

Hide Details

runCmd: thread list output: Process 2146 stopped thread #1: tid = 0x454ced, 0x00007fff7c59436a libsystem_kernel.dylib`__ulock_wait + 10, queue = 'com.apple.main-thread' thread #2: tid = 0x454e9b, 0x00007fff7c594872 libsystem_kernel.dylib`__psynch_mutexwait + 10 * thread #3: tid = 0x454e9c, 0x0000000100000d92 a.out`do_bad_thing_with_location(index=7, char_ptr="", new_val='c') at main.cpp:36:1, stop reason = watchpoint 1 thread #4: tid = 0x454e9d, 0x0000000100000d92 a.out`do_bad_thing_with_location(index=7, char_ptr="", new_val='c') at main.cpp:36:1, stop reason = watchpoint 1

Hide Details

Hide Details

Expecting sub string: stopped Matched

Hide Details

Expecting sub string: stop reason = watchpoint Matched

Hide Details

Expecting sub string: do_bad_thing_with_location Matched

Hide Details

runCmd: thread list output: Process 2146 stopped thread #1: tid = 0x454ced, 0x00007fff7c59436a libsystem_kernel.dylib`__ulock_wait + 10, queue = 'com.apple.main-thread' thread #2: tid = 0x454e9b, 0x00007fff7c594872 libsystem_kernel.dylib`__psynch_mutexwait + 10 * thread #3: tid = 0x454e9c, 0x0000000100000d92 a.out`do_bad_thing_with_location(index=7, char_ptr="", new_val='c') at main.cpp:36:1, stop reason = watchpoint 1 thread #4: tid = 0x454e9d, 0x0000000100000d92 a.out`do_bad_thing_with_location(index=7, char_ptr="", new_val='c') at main.cpp:36:1, stop reason = watchpoint 1

Hide Details

Hide Details

runCmd: thread select 3 output: None

Hide Details

runCmd: thread select 4 output: None

Hide Details

runCmd: thread backtrace output: * thread #4, stop reason = watchpoint 1 * frame #0: 0x0000000100000d92 a.out`do_bad_thing_with_location(index=7, char_ptr="", new_val='c') at main.cpp:36:1 frame #1: 0x0000000100000e4e a.out`access_pool(flag=true) at main.cpp:53:9 frame #2: 0x0000000100000f35 a.out`thread_func(thread_index=2) at main.cpp:80:19 frame #3: 0x00000001000027c4 a.out`decltype(__f=0x0000000100202348, __args=0x0000000100202350)(unsigned int)>(fp)(std::__1::forward<long>(fp0))) std::__1::__invoke<void (*)(unsigned int), long>(void (*&&)(unsigned int), long&&) at type_traits:3501:1 frame #4: 0x000000010000270e a.out`void std::__1::__thread_execute<std::__1::unique_ptr<std::__1::__thread_struct, std::__1::default_delete<std::__1::__thread_struct> >, void (*)(unsigned int), long, 2ul>(__t=size=3, (null)=__tuple_indices<2> @ 0x00007000007c8eb8)(unsigned int), long>&, std::__1::__tuple_indices<2ul>) at thread:337:5 frame #5: 0x0000000100001f16 a.out`void* std::__1::__thread_proxy<std::__1::tuple<std::__1::unique_ptr<std::__1::__thread_struct, std::__1::default_delete<std::__1::__thread_struct> >, void (*)(unsigned int), long> >(__vp=0x0000000100202340) at thread:347:5 frame #6: 0x00007fff7c64b33d libsystem_pthread.dylib`_pthread_body + 126 frame #7: 0x00007fff7c64e2a7 libsystem_pthread.dylib`_pthread_start + 70 frame #8: 0x00007fff7c64a425 libsystem_pthread.dylib`thread_start + 13

Hide Details

Hide Details

runCmd: expr unsigned val = g_char_ptr[7]; val output: (unsigned int) $2 = 99

Hide Details

Hide Details

looking at: (unsigned int) $2 = 99

Hide Details

Expecting end string: = 99 Matched

Hide Details

runCmd: watchpoint list -v output: Number of supported hardware watchpoints: 4 Current watchpoints: Watchpoint 1: addr = 0x100200367 size = 1 state = enabled type = w old value: 0x0000000000000063 new value: 0x0000000000000063 hw_index = 0 hit_count = 2 ignore_count = 0

Hide Details

Hide Details

Expecting sub string: hit_count = 2 Matched

Hide Details

runCmd: thread backtrace all output: thread #1, queue = 'com.apple.main-thread' frame #0: 0x00007fff7c59436a libsystem_kernel.dylib`__ulock_wait + 10 frame #1: 0x00007fff7c64f70b libsystem_pthread.dylib`_pthread_join + 356 frame #2: 0x00007fff79b79978 libc++.1.dylib`std::__1::thread::join() + 24 frame #3: 0x000000010000127f a.out`main(argc=1, argv=0x00007ffeefbff428) at main.cpp:110:16 frame #4: 0x00007fff7c459085 libdyld.dylib`start + 1 frame #5: 0x00007fff7c459085 libdyld.dylib`start + 1 thread #2 frame #0: 0x00007fff7c594872 libsystem_kernel.dylib`__psynch_mutexwait + 10 frame #1: 0x00007fff7c64bda0 libsystem_pthread.dylib`_pthread_mutex_firstfit_lock_wait + 96 frame #2: 0x00007fff7c6494c7 libsystem_pthread.dylib`_pthread_mutex_firstfit_lock_slow + 226 frame #3: 0x00007fff7c4dfe6c libsystem_c.dylib`flockfile + 31 frame #4: 0x00007fff7c4e8868 libsystem_c.dylib`vfprintf_l + 28 frame #5: 0x00007fff7c4e699a libsystem_c.dylib`printf + 174 frame #6: 0x0000000100000d81 a.out`do_bad_thing_with_location(index=7, char_ptr="", new_val='c') at main.cpp:34:5 frame #7: 0x0000000100000e4e a.out`access_pool(flag=true) at main.cpp:53:9 frame #8: 0x0000000100000f35 a.out`thread_func(thread_index=0) at main.cpp:80:19 frame #9: 0x00000001000027c4 a.out`decltype(__f=0x00000001002021d8, __args=0x00000001002021e0)(unsigned int)>(fp)(std::__1::forward<long>(fp0))) std::__1::__invoke<void (*)(unsigned int), long>(void (*&&)(unsigned int), long&&) at type_traits:3501:1 frame #10: 0x000000010000270e a.out`void std::__1::__thread_execute<std::__1::unique_ptr<std::__1::__thread_struct, std::__1::default_delete<std::__1::__thread_struct> >, void (*)(unsigned int), long, 2ul>(__t=size=3, (null)=__tuple_indices<2> @ 0x00007000006c2eb8)(unsigned int), long>&, std::__1::__tuple_indices<2ul>) at thread:337:5 frame #11: 0x0000000100001f16 a.out`void* std::__1::__thread_proxy<std::__1::tuple<std::__1::unique_ptr<std::__1::__thread_struct, std::__1::default_delete<std::__1::__thread_struct> >, void (*)(unsigned int), long> >(__vp=0x00000001002021d0) at thread:347:5 frame #12: 0x00007fff7c64b33d libsystem_pthread.dylib`_pthread_body + 126 frame #13: 0x00007fff7c64e2a7 libsystem_pthread.dylib`_pthread_start + 70 frame #14: 0x00007fff7c64a425 libsystem_pthread.dylib`thread_start + 13 thread #3, stop reason = watchpoint 1 frame #0: 0x0000000100000d92 a.out`do_bad_thing_with_location(index=7, char_ptr="", new_val='c') at main.cpp:36:1 frame #1: 0x0000000100000e4e a.out`access_pool(flag=true) at main.cpp:53:9 frame #2: 0x0000000100000f35 a.out`thread_func(thread_index=1) at main.cpp:80:19 frame #3: 0x00000001000027c4 a.out`decltype(__f=0x00000001002022e8, __args=0x00000001002022f0)(unsigned int)>(fp)(std::__1::forward<long>(fp0))) std::__1::__invoke<void (*)(unsigned int), long>(void (*&&)(unsigned int), long&&) at type_traits:3501:1 frame #4: 0x000000010000270e a.out`void std::__1::__thread_execute<std::__1::unique_ptr<std::__1::__thread_struct, std::__1::default_delete<std::__1::__thread_struct> >, void (*)(unsigned int), long, 2ul>(__t=size=3, (null)=__tuple_indices<2> @ 0x0000700000745eb8)(unsigned int), long>&, std::__1::__tuple_indices<2ul>) at thread:337:5 frame #5: 0x0000000100001f16 a.out`void* std::__1::__thread_proxy<std::__1::tuple<std::__1::unique_ptr<std::__1::__thread_struct, std::__1::default_delete<std::__1::__thread_struct> >, void (*)(unsigned int), long> >(__vp=0x00000001002022e0) at thread:347:5 frame #6: 0x00007fff7c64b33d libsystem_pthread.dylib`_pthread_body + 126 frame #7: 0x00007fff7c64e2a7 libsystem_pthread.dylib`_pthread_start + 70 frame #8: 0x00007fff7c64a425 libsystem_pthread.dylib`thread_start + 13 * thread #4, stop reason = watchpoint 1 * frame #0: 0x0000000100000d92 a.out`do_bad_thing_with_location(index=7, char_ptr="", new_val='c') at main.cpp:36:1 frame #1: 0x0000000100000e4e a.out`access_pool(flag=true) at main.cpp:53:9 frame #2: 0x0000000100000f35 a.out`thread_func(thread_index=2) at main.cpp:80:19 frame #3: 0x00000001000027c4 a.out`decltype(__f=0x0000000100202348, __args=0x0000000100202350)(unsigned int)>(fp)(std::__1::forward<long>(fp0))) std::__1::__invoke<void (*)(unsigned int), long>(void (*&&)(unsigned int), long&&) at type_traits:3501:1 frame #4: 0x000000010000270e a.out`void std::__1::__thread_execute<std::__1::unique_ptr<std::__1::__thread_struct, std::__1::default_delete<std::__1::__thread_struct> >, void (*)(unsigned int), long, 2ul>(__t=size=3, (null)=__tuple_indices<2> @ 0x00007000007c8eb8)(unsigned int), long>&, std::__1::__tuple_indices<2ul>) at thread:337:5 frame #5: 0x0000000100001f16 a.out`void* std::__1::__thread_proxy<std::__1::tuple<std::__1::unique_ptr<std::__1::__thread_struct, std::__1::default_delete<std::__1::__thread_struct> >, void (*)(unsigned int), long> >(__vp=0x0000000100202340) at thread:347:5 frame #6: 0x00007fff7c64b33d libsystem_pthread.dylib`_pthread_body + 126 frame #7: 0x00007fff7c64e2a7 libsystem_pthread.dylib`_pthread_start + 70 frame #8: 0x00007fff7c64a425 libsystem_pthread.dylib`thread_start + 13

Hide Details

Hide Details

<bound method SBProcess.Kill of <lldb.SBProcess; proxy of <Swig Object of type 'lldb::SBProcess *' at 0x107facc60> >>: success

Hide Details

PASS: LLDB (/Users/buildslave/jenkins/workspace/lldb-cmake-monorepo-python3/lldb-build/bin/clang-10-x86_64) :: test_watchlocation_using_watchpoint_set_dsym (TestWatchLocationWithWatchSet.WatchLocationUsingWatchpointSetTestCase) runCmd: settings set symbols.clang-modules-cache-path "/Users/buildslave/jenkins/workspace/lldb-cmake-monorepo-python3/lldb-build/lldb-test-build.noindex/module-cache-lldb" output: None

Hide Details

runCmd: settings set symbols.enable-external-lookup false output: None

Hide Details

runCmd: settings set plugin.process.gdb-remote.packet-timeout 60 output: None

Hide Details

runCmd: settings set use-color false output: None

Hide Details

runCmd: settings set target.env-vars DYLD_LIBRARY_PATH= output: None

Hide Details

runCmd: file /Users/buildslave/jenkins/workspace/lldb-cmake-monorepo-python3/lldb-build/lldb-test-build.noindex/functionalities/watchpoint/watchpoint_set_command/TestWatchLocationWithWatchSet.test_watchlocation_using_watchpoint_set_dwarf/a.out output: Current executable set to '/Users/buildslave/jenkins/workspace/lldb-cmake-monorepo-python3/lldb-build/lldb-test-build.noindex/functionalities/watchpoint/watchpoint_set_command/TestWatchLocationWithWatchSet.test_watchlocation_using_watchpoint_set_dwarf/a.out' (x86_64).

Hide Details

Hide Details

runCmd: breakpoint set -l 105 output: Breakpoint 1: where = a.out`main + 391 at main.cpp:105:5, address = 0x0000000100001207

Hide Details

Hide Details

Expecting pattern: ^Breakpoint (?P<bpno>[0-9]+): (?P<num_locations>[0-9]+) locations\.$ Not matched

Hide Details

Expecting pattern: ^Breakpoint (?P<bpno>[0-9]+): (?P<num_locations>no) locations \(pending\)\. Not matched

Hide Details

Expecting pattern: ^Breakpoint (?P<bpno>[0-9]+): where = (?P<module>.*)`(?P<symbol>[+\-]{0,1}[^+]+)( \+ (?P<offset>[0-9]+)){0,1}( \[inlined\] (?P<inline_symbol>.*)){0,1} at (?P<file>[^:]+):(?P<line_no>[0-9]+)(?P<column>(:[0-9]+)?), address = (?P<address>0x[0-9a-fA-F]+)$ Matched

Hide Details

runCmd: run output: Process 17073 stopped * thread #1, queue = 'com.apple.main-thread', stop reason = breakpoint 1.1 frame #0: 0x0000000100001207 a.out`main(argc=1, argv=0x00007ffeefbff428) at main.cpp:105:5 102 int c; 103 } MyAggregateDataType; 104 -> 105 printf ("Before turning all three threads loose...\n"); // Set break point at this line. ^ 106 barrier_wait(); 107 108 // Join all of our threads

Hide Details

Process 17073 launched: '/Users/buildslave/jenkins/workspace/lldb-cmake-monorepo-python3/lldb-build/lldb-test-build.noindex/functionalities/watchpoint/watchpoint_set_command/TestWatchLocationWithWatchSet.test_watchlocation_using_watchpoint_set_dwarf/a.out' (x86_64)

Hide Details

Hide Details

runCmd: thread list output: Process 17073 stopped * thread #1: tid = 0x45ae14, 0x0000000100001207 a.out`main(argc=1, argv=0x00007ffeefbff428) at main.cpp:105:5, queue = 'com.apple.main-thread', stop reason = breakpoint 1.1 thread #2: tid = 0x45afe6, 0x00007fff7c642607 libsystem_platform.dylib`_platform_memmove$VARIANT$Nehalem + 71 thread #3: tid = 0x45afe7, 0x00007fff7c594872 libsystem_kernel.dylib`__psynch_mutexwait + 10 thread #4: tid = 0x45afe8, 0x00007fff7c594872 libsystem_kernel.dylib`__psynch_mutexwait + 10

Hide Details

Hide Details

Expecting sub string: stopped Matched

Hide Details

Expecting sub string: stop reason = breakpoint Matched

Hide Details

runCmd: watchpoint set expression -w write -s 1 -- g_char_ptr + 7 output: Watchpoint created: Watchpoint 1: addr = 0x100400087 size = 1 state = enabled type = w new value: 0x0000000000000000

Hide Details

Hide Details

Expecting sub string: Watchpoint created Matched

Hide Details

Expecting sub string: size = 1 Matched

Hide Details

Expecting sub string: type = w Matched

Hide Details

runCmd: expr unsigned val = g_char_ptr[7]; val output: (unsigned int) $1 = 0

Hide Details

Hide Details

looking at: (unsigned int) $1 = 0

Hide Details

Expecting end string: = 0 Matched

Hide Details

runCmd: watchpoint list -v output: Number of supported hardware watchpoints: 4 Current watchpoints: Watchpoint 1: addr = 0x100400087 size = 1 state = enabled type = w new value: 0x0000000000000000 hw_index = -1 hit_count = 0 ignore_count = 0

Hide Details

Hide Details

Expecting sub string: hit_count = 0 Matched

Hide Details

runCmd: process continue output: Process 17073 resuming Process 17073 stopped * thread #2, stop reason = watchpoint 1 frame #0: 0x0000000100000d92 a.out`do_bad_thing_with_location(index=7, char_ptr="", new_val='c') at main.cpp:36:1 33 unsigned what = new_val; 34 printf("new value written to array(%p) and index(%u) = %u\n", char_ptr, index, what); 35 char_ptr[index] = new_val; -> 36 } ^ 37 38 uint32_t 39 access_pool (bool flag = false) thread #3, stop reason = watchpoint 1 frame #0: 0x0000000100000d92 a.out`do_bad_thing_with_location(index=7, char_ptr="", new_val='c') at main.cpp:36:1 33 unsigned what = new_val; 34 printf("new value written to array(%p) and index(%u) = %u\n", char_ptr, index, what); 35 char_ptr[index] = new_val; -> 36 } ^ 37 38 uint32_t 39 access_pool (bool flag = false)

Hide Details

Hide Details

Hide Details

runCmd: thread list output: Process 17073 stopped thread #1: tid = 0x45ae14, 0x00007fff7c59436a libsystem_kernel.dylib`__ulock_wait + 10, queue = 'com.apple.main-thread' * thread #2: tid = 0x45afe6, 0x0000000100000d92 a.out`do_bad_thing_with_location(index=7, char_ptr="", new_val='c') at main.cpp:36:1, stop reason = watchpoint 1 thread #3: tid = 0x45afe7, 0x0000000100000d92 a.out`do_bad_thing_with_location(index=7, char_ptr="", new_val='c') at main.cpp:36:1, stop reason = watchpoint 1 thread #4: tid = 0x45afe8, 0x00007fff7c595876 libsystem_kernel.dylib`__semwait_signal + 10

Hide Details

Hide Details

Expecting sub string: stopped Matched

Hide Details

Expecting sub string: stop reason = watchpoint Matched

Hide Details

Expecting sub string: do_bad_thing_with_location Matched

Hide Details

runCmd: thread list output: Process 17073 stopped thread #1: tid = 0x45ae14, 0x00007fff7c59436a libsystem_kernel.dylib`__ulock_wait + 10, queue = 'com.apple.main-thread' * thread #2: tid = 0x45afe6, 0x0000000100000d92 a.out`do_bad_thing_with_location(index=7, char_ptr="", new_val='c') at main.cpp:36:1, stop reason = watchpoint 1 thread #3: tid = 0x45afe7, 0x0000000100000d92 a.out`do_bad_thing_with_location(index=7, char_ptr="", new_val='c') at main.cpp:36:1, stop reason = watchpoint 1 thread #4: tid = 0x45afe8, 0x00007fff7c595876 libsystem_kernel.dylib`__semwait_signal + 10

Hide Details

Hide Details

runCmd: thread select 2 output: None

Hide Details

runCmd: thread select 3 output: None

Hide Details

runCmd: thread backtrace output: * thread #3, stop reason = watchpoint 1 * frame #0: 0x0000000100000d92 a.out`do_bad_thing_with_location(index=7, char_ptr="", new_val='c') at main.cpp:36:1 frame #1: 0x0000000100000e4e a.out`access_pool(flag=true) at main.cpp:53:9 frame #2: 0x0000000100000f35 a.out`thread_func(thread_index=1) at main.cpp:80:19 frame #3: 0x00000001000027c4 a.out`decltype(__f=0x00000001004001f8, __args=0x0000000100400200)(unsigned int)>(fp)(std::__1::forward<long>(fp0))) std::__1::__invoke<void (*)(unsigned int), long>(void (*&&)(unsigned int), long&&) at type_traits:3501:1 frame #4: 0x000000010000270e a.out`void std::__1::__thread_execute<std::__1::unique_ptr<std::__1::__thread_struct, std::__1::default_delete<std::__1::__thread_struct> >, void (*)(unsigned int), long, 2ul>(__t=size=3, (null)=__tuple_indices<2> @ 0x000070000c932eb8)(unsigned int), long>&, std::__1::__tuple_indices<2ul>) at thread:337:5 frame #5: 0x0000000100001f16 a.out`void* std::__1::__thread_proxy<std::__1::tuple<std::__1::unique_ptr<std::__1::__thread_struct, std::__1::default_delete<std::__1::__thread_struct> >, void (*)(unsigned int), long> >(__vp=0x00000001004001f0) at thread:347:5 frame #6: 0x00007fff7c64b33d libsystem_pthread.dylib`_pthread_body + 126 frame #7: 0x00007fff7c64e2a7 libsystem_pthread.dylib`_pthread_start + 70 frame #8: 0x00007fff7c64a425 libsystem_pthread.dylib`thread_start + 13

Hide Details

Hide Details

runCmd: expr unsigned val = g_char_ptr[7]; val output: (unsigned int) $2 = 99

Hide Details

Hide Details

looking at: (unsigned int) $2 = 99

Hide Details

Expecting end string: = 99 Matched

Hide Details

runCmd: watchpoint list -v output: Number of supported hardware watchpoints: 4 Current watchpoints: Watchpoint 1: addr = 0x100400087 size = 1 state = enabled type = w old value: 0x0000000000000063 new value: 0x0000000000000063 hw_index = 0 hit_count = 2 ignore_count = 0

Hide Details

Hide Details

Expecting sub string: hit_count = 2 Matched

Hide Details

runCmd: thread backtrace all output: thread #1, queue = 'com.apple.main-thread' frame #0: 0x00007fff7c59436a libsystem_kernel.dylib`__ulock_wait + 10 frame #1: 0x00007fff7c64f70b libsystem_pthread.dylib`_pthread_join + 356 frame #2: 0x00007fff79b79978 libc++.1.dylib`std::__1::thread::join() + 24 frame #3: 0x000000010000127f a.out`main(argc=1, argv=0x00007ffeefbff428) at main.cpp:110:16 frame #4: 0x00007fff7c459085 libdyld.dylib`start + 1 frame #5: 0x00007fff7c459085 libdyld.dylib`start + 1 thread #2, stop reason = watchpoint 1 frame #0: 0x0000000100000d92 a.out`do_bad_thing_with_location(index=7, char_ptr="", new_val='c') at main.cpp:36:1 frame #1: 0x0000000100000e4e a.out`access_pool(flag=true) at main.cpp:53:9 frame #2: 0x0000000100000f35 a.out`thread_func(thread_index=0) at main.cpp:80:19 frame #3: 0x00000001000027c4 a.out`decltype(__f=0x00000001004001a8, __args=0x00000001004001b0)(unsigned int)>(fp)(std::__1::forward<long>(fp0))) std::__1::__invoke<void (*)(unsigned int), long>(void (*&&)(unsigned int), long&&) at type_traits:3501:1 frame #4: 0x000000010000270e a.out`void std::__1::__thread_execute<std::__1::unique_ptr<std::__1::__thread_struct, std::__1::default_delete<std::__1::__thread_struct> >, void (*)(unsigned int), long, 2ul>(__t=size=3, (null)=__tuple_indices<2> @ 0x000070000c8afeb8)(unsigned int), long>&, std::__1::__tuple_indices<2ul>) at thread:337:5 frame #5: 0x0000000100001f16 a.out`void* std::__1::__thread_proxy<std::__1::tuple<std::__1::unique_ptr<std::__1::__thread_struct, std::__1::default_delete<std::__1::__thread_struct> >, void (*)(unsigned int), long> >(__vp=0x00000001004001a0) at thread:347:5 frame #6: 0x00007fff7c64b33d libsystem_pthread.dylib`_pthread_body + 126 frame #7: 0x00007fff7c64e2a7 libsystem_pthread.dylib`_pthread_start + 70 frame #8: 0x00007fff7c64a425 libsystem_pthread.dylib`thread_start + 13 * thread #3, stop reason = watchpoint 1 * frame #0: 0x0000000100000d92 a.out`do_bad_thing_with_location(index=7, char_ptr="", new_val='c') at main.cpp:36:1 frame #1: 0x0000000100000e4e a.out`access_pool(flag=true) at main.cpp:53:9 frame #2: 0x0000000100000f35 a.out`thread_func(thread_index=1) at main.cpp:80:19 frame #3: 0x00000001000027c4 a.out`decltype(__f=0x00000001004001f8, __args=0x0000000100400200)(unsigned int)>(fp)(std::__1::forward<long>(fp0))) std::__1::__invoke<void (*)(unsigned int), long>(void (*&&)(unsigned int), long&&) at type_traits:3501:1 frame #4: 0x000000010000270e a.out`void std::__1::__thread_execute<std::__1::unique_ptr<std::__1::__thread_struct, std::__1::default_delete<std::__1::__thread_struct> >, void (*)(unsigned int), long, 2ul>(__t=size=3, (null)=__tuple_indices<2> @ 0x000070000c932eb8)(unsigned int), long>&, std::__1::__tuple_indices<2ul>) at thread:337:5 frame #5: 0x0000000100001f16 a.out`void* std::__1::__thread_proxy<std::__1::tuple<std::__1::unique_ptr<std::__1::__thread_struct, std::__1::default_delete<std::__1::__thread_struct> >, void (*)(unsigned int), long> >(__vp=0x00000001004001f0) at thread:347:5 frame #6: 0x00007fff7c64b33d libsystem_pthread.dylib`_pthread_body + 126 frame #7: 0x00007fff7c64e2a7 libsystem_pthread.dylib`_pthread_start + 70 frame #8: 0x00007fff7c64a425 libsystem_pthread.dylib`thread_start + 13 thread #4 frame #0: 0x00007fff7c595876 libsystem_kernel.dylib`__semwait_signal + 10 frame #1: 0x00007fff7c520830 libsystem_c.dylib`nanosleep + 199 frame #2: 0x00007fff79b3bfe1 libc++.1.dylib`std::__1::this_thread::sleep_for(std::__1::chrono::duration<long long, std::__1::ratio<1l, 1000000000l> > const&) + 70 frame #3: 0x000000010000103e a.out`void std::__1::this_thread::sleep_for<long long, std::__1::ratio<1l, 1l> >(__d=0x000070000c9b5e48) at thread:448:9 frame #4: 0x0000000100000f12 a.out`thread_func(thread_index=2) at main.cpp:75:9 frame #5: 0x00000001000027c4 a.out`decltype(__f=0x0000000100400258, __args=0x0000000100400260)(unsigned int)>(fp)(std::__1::forward<long>(fp0))) std::__1::__invoke<void (*)(unsigned int), long>(void (*&&)(unsigned int), long&&) at type_traits:3501:1 frame #6: 0x000000010000270e a.out`void std::__1::__thread_execute<std::__1::unique_ptr<std::__1::__thread_struct, std::__1::default_delete<std::__1::__thread_struct> >, void (*)(unsigned int), long, 2ul>(__t=size=3, (null)=__tuple_indices<2> @ 0x000070000c9b5eb8)(unsigned int), long>&, std::__1::__tuple_indices<2ul>) at thread:337:5 frame #7: 0x0000000100001f16 a.out`void* std::__1::__thread_proxy<std::__1::tuple<std::__1::unique_ptr<std::__1::__thread_struct, std::__1::default_delete<std::__1::__thread_struct> >, void (*)(unsigned int), long> >(__vp=0x0000000100400250) at thread:347:5 frame #8: 0x00007fff7c64b33d libsystem_pthread.dylib`_pthread_body + 126 frame #9: 0x00007fff7c64e2a7 libsystem_pthread.dylib`_pthread_start + 70 frame #10: 0x00007fff7c64a425 libsystem_pthread.dylib`thread_start + 13

Hide Details

Hide Details

<bound method SBProcess.Kill of <lldb.SBProcess; proxy of <Swig Object of type 'lldb::SBProcess *' at 0x107fac7b0> >>: success

Hide Details

PASS: LLDB (/Users/buildslave/jenkins/workspace/lldb-cmake-monorepo-python3/lldb-build/bin/clang-10-x86_64) :: test_watchlocation_using_watchpoint_set_dwarf (TestWatchLocationWithWatchSet.WatchLocationUsingWatchpointSetTestCase) UNSUPPORTED: LLDB (/Users/buildslave/jenkins/workspace/lldb-cmake-monorepo-python3/lldb-build/bin/clang-10-x86_64) :: test_watchlocation_using_watchpoint_set_dwo (TestWatchLocationWithWatchSet.WatchLocationUsingWatchpointSetTestCase) (test case does not fall in any category of interest for this run) runCmd: settings set symbols.clang-modules-cache-path "/Users/buildslave/jenkins/workspace/lldb-cmake-monorepo-python3/lldb-build/lldb-test-build.noindex/module-cache-lldb" output: None

Hide Details

runCmd: settings set symbols.enable-external-lookup false output: None

Hide Details

runCmd: settings set plugin.process.gdb-remote.packet-timeout 60 output: None

Hide Details

runCmd: settings set use-color false output: None

Hide Details

runCmd: settings set target.env-vars DYLD_LIBRARY_PATH= output: None

Hide Details

runCmd: file /Users/buildslave/jenkins/workspace/lldb-cmake-monorepo-python3/lldb-build/lldb-test-build.noindex/functionalities/watchpoint/watchpoint_set_command/TestWatchLocationWithWatchSet.test_watchlocation_using_watchpoint_set_gmodules/a.out output: Current executable set to '/Users/buildslave/jenkins/workspace/lldb-cmake-monorepo-python3/lldb-build/lldb-test-build.noindex/functionalities/watchpoint/watchpoint_set_command/TestWatchLocationWithWatchSet.test_watchlocation_using_watchpoint_set_gmodules/a.out' (x86_64).

Hide Details

Hide Details

runCmd: breakpoint set -l 105 output: Breakpoint 1: where = a.out`main + 391 at main.cpp:105:5, address = 0x0000000100001207

Hide Details

Hide Details

Expecting pattern: ^Breakpoint (?P<bpno>[0-9]+): (?P<num_locations>[0-9]+) locations\.$ Not matched

Hide Details

Expecting pattern: ^Breakpoint (?P<bpno>[0-9]+): (?P<num_locations>no) locations \(pending\)\. Not matched

Hide Details

Expecting pattern: ^Breakpoint (?P<bpno>[0-9]+): where = (?P<module>.*)`(?P<symbol>[+\-]{0,1}[^+]+)( \+ (?P<offset>[0-9]+)){0,1}( \[inlined\] (?P<inline_symbol>.*)){0,1} at (?P<file>[^:]+):(?P<line_no>[0-9]+)(?P<column>(:[0-9]+)?), address = (?P<address>0x[0-9a-fA-F]+)$ Matched

Hide Details

runCmd: run output: Process 22546 stopped * thread #1, queue = 'com.apple.main-thread', stop reason = breakpoint 1.1 frame #0: 0x0000000100001207 a.out`main(argc=1, argv=0x00007ffeefbff418) at main.cpp:105:5 102 int c; 103 } MyAggregateDataType; 104 -> 105 printf ("Before turning all three threads loose...\n"); // Set break point at this line. ^ 106 barrier_wait(); 107 108 // Join all of our threads

Hide Details

Process 22546 launched: '/Users/buildslave/jenkins/workspace/lldb-cmake-monorepo-python3/lldb-build/lldb-test-build.noindex/functionalities/watchpoint/watchpoint_set_command/TestWatchLocationWithWatchSet.test_watchlocation_using_watchpoint_set_gmodules/a.out' (x86_64)

Hide Details

Hide Details

runCmd: thread list output: Process 22546 stopped * thread #1: tid = 0x45d152, 0x0000000100001207 a.out`main(argc=1, argv=0x00007ffeefbff418) at main.cpp:105:5, queue = 'com.apple.main-thread', stop reason = breakpoint 1.1 thread #2: tid = 0x45d326, 0x00007fff7c4d80ff libsystem_c.dylib`localeconv_l + 89 thread #3: tid = 0x45d327, 0x00007fff7c594872 libsystem_kernel.dylib`__psynch_mutexwait + 10 thread #4: tid = 0x45d328, 0x00007fff7c594872 libsystem_kernel.dylib`__psynch_mutexwait + 10

Hide Details

Hide Details

Expecting sub string: stopped Matched

Hide Details

Expecting sub string: stop reason = breakpoint Matched

Hide Details

runCmd: watchpoint set expression -w write -s 1 -- g_char_ptr + 7 runCmd failed! error: expression evaluation of address to watch failed expression evaluated: g_char_ptr + 7

Hide Details

Hide Details

FAIL: LLDB (/Users/buildslave/jenkins/workspace/lldb-cmake-monorepo-python3/lldb-build/bin/clang-10-x86_64) :: test_watchlocation_using_watchpoint_set_gmodules (TestWatchLocationWithWatchSet.WatchLocationUsingWatchpointSetTestCase) <bound method SBProcess.Kill of <lldb.SBProcess; proxy of <Swig Object of type 'lldb::SBProcess *' at 0x107facc60> >>: success

Hide Details

Restore dir to: /Users/buildslave/jenkins/workspace/lldb-cmake-monorepo-python3/lldb-build/tools/lldb/lit ====================================================================== FAIL: test_watchlocation_using_watchpoint_set_gmodules (TestWatchLocationWithWatchSet.WatchLocationUsingWatchpointSetTestCase) Test watching a location with 'watchpoint set expression -w write -s size' option. ---------------------------------------------------------------------- Traceback (most recent call last): File "/Users/buildslave/jenkins/workspace/lldb-cmake-monorepo-python3/llvm-project/lldb/packages/Python/lldbsuite/test/lldbtest.py", line 1740, in test_method return attrvalue(self) File "/Users/buildslave/jenkins/workspace/lldb-cmake-monorepo-python3/llvm-project/lldb/packages/Python/lldbsuite/test/decorators.py", line 111, in wrapper func(*args, **kwargs) File "/Users/buildslave/jenkins/workspace/lldb-cmake-monorepo-python3/llvm-project/lldb/packages/Python/lldbsuite/test/decorators.py", line 111, in wrapper func(*args, **kwargs) File "/Users/buildslave/jenkins/workspace/lldb-cmake-monorepo-python3/llvm-project/lldb/packages/Python/lldbsuite/test/decorators.py", line 111, in wrapper func(*args, **kwargs) File "/Users/buildslave/jenkins/workspace/lldb-cmake-monorepo-python3/llvm-project/lldb/packages/Python/lldbsuite/test/functionalities/watchpoint/watchpoint_set_command/TestWatchLocationWithWatchSet.py", line 72, in test_watchlocation_using_watchpoint_set 'type = w']) File "/Users/buildslave/jenkins/workspace/lldb-cmake-monorepo-python3/llvm-project/lldb/packages/Python/lldbsuite/test/lldbtest.py", line 2303, in expect inHistory=inHistory) File "/Users/buildslave/jenkins/workspace/lldb-cmake-monorepo-python3/llvm-project/lldb/packages/Python/lldbsuite/test/lldbtest.py", line 2076, in runCmd msg if (msg) else CMD_MSG(cmd)) AssertionError: False is not True : Watchpoint created successfully Error output: error: expression evaluation of address to watch failed expression evaluated: g_char_ptr + 7

Hide Details

Config=x86_64-/Users/buildslave/jenkins/workspace/lldb-cmake-monorepo-python3/lldb-build/bin/clang-10 ---------------------------------------------------------------------- Ran 4 tests in 65.851s

Hide Details

RESULT: FAILED (2 passes, 1 failures, 0 errors, 1 skipped, 0 expected failures, 0 unexpected successes)

Hide Details

******************** PASS: lldb-Suite :: lang/objc/foundation/TestFoundationDisassembly.py (773 of 1675) PASS: LLDB :: Reproducer/Modules/TestModuleCXX.test (774 of 1675) PASS: lldb-Suite :: lang/objc/foundation/TestObjCMethods2.py (775 of 1675) PASS: lldb-Suite :: lang/objc/foundation/TestObjCMethodsNSArray.py (776 of 1675) PASS: lldb-Suite :: lang/objc/modules-cache/TestClangModulesCache.py (777 of 1675) PASS: lldb-Suite :: lang/objc/conflicting-definition/TestConflictingDefinition.py (778 of 1675) PASS: lldb-Suite :: lang/objc/forward-decl/TestForwardDecl.py (779 of 1675) PASS: lldb-Suite :: lang/objc/ivar-IMP/TestObjCiVarIMP.py (780 of 1675) PASS: lldb-Suite :: lang/objc/modules-incomplete/TestIncompleteModules.py (781 of 1675) PASS: lldb-Suite :: lang/objc/modules-auto-import/TestModulesAutoImport.py (782 of 1675) PASS: lldb-Suite :: lang/objc/foundation/TestObjectDescriptionAPI.py (783 of 1675) PASS: lldb-Suite :: lang/objc/foundation/TestRuntimeTypes.py (784 of 1675) PASS: lldb-Suite :: lang/objc/modules-inline-functions/TestModulesInlineFunctions.py (785 of 1675) PASS: lldb-Suite :: lang/objc/global_ptrs/TestGlobalObjects.py (786 of 1675) PASS: lldb-Suite :: lang/objc/foundation/TestSymbolTable.py (787 of 1675) PASS: lldb-Suite :: lang/objc/objc-builtin-types/TestObjCBuiltinTypes.py (788 of 1675) PASS: lldb-Suite :: lang/objc/objc-checker/TestObjCCheckers.py (789 of 1675) PASS: lldb-Suite :: lang/objc/objc++/TestObjCXX.py (790 of 1675) PASS: lldb-Suite :: lang/cpp/enum_types/TestCPP11EnumTypes.py (791 of 1675) PASS: lldb-Suite :: lang/objc/objc-baseclass-sbtype/TestObjCBaseClassSBType.py (792 of 1675) PASS: lldb-Suite :: lang/cpp/namespace/TestNamespaceLookup.py (793 of 1675) PASS: lldb-Suite :: lang/objc/foundation/TestObjCMethodsNSError.py (794 of 1675) PASS: lldb-Suite :: lang/objc/modules/TestObjCModules.py (795 of 1675) PASS: lldb-Suite :: lang/objc/foundation/TestObjCMethodsString.py (796 of 1675) PASS: lldb-Suite :: lang/objc/objc-ivar-stripped/TestObjCIvarStripped.py (797 of 1675) PASS: lldb-Suite :: lang/objc/objc-class-method/TestObjCClassMethod.py (798 of 1675) PASS: lldb-Suite :: lang/objc/objc-dyn-sbtype/TestObjCDynamicSBType.py (799 of 1675) PASS: lldb-Suite :: lang/objc/objc-dynamic-value/TestObjCDynamicValue.py (800 of 1675) PASS: lldb-Suite :: lang/objc/objc-foundation-dictionary-empty/TestNSDictionary0.py (801 of 1675) PASS: lldb-Suite :: lang/objc/objc-ivar-protocols/TestIvarProtocols.py (802 of 1675) PASS: lldb-Suite :: lang/objc/exceptions/TestObjCExceptions.py (803 of 1675) PASS: lldb-Suite :: lang/objc/objc-static-method-stripped/TestObjCStaticMethodStripped.py (804 of 1675) PASS: lldb-Suite :: lang/objc/objc-ivar-offsets/TestObjCIvarOffsets.py (805 of 1675) PASS: lldb-Suite :: lang/objc/objc-runtime-ivars/TestRuntimeIvars.py (806 of 1675) PASS: lldb-Suite :: lang/objc/objc-static-method/TestObjCStaticMethod.py (807 of 1675) PASS: lldb-Suite :: lang/objc/objc-property/TestObjCProperty.py (808 of 1675) PASS: lldb-Suite :: lang/objc/objc-stepping/TestObjCStepping.py (809 of 1675) PASS: lldb-Suite :: lang/objc/rdar-12408181/TestRdar12408181.py (810 of 1675) PASS: lldb-Suite :: lang/objc/objc-struct-argument/TestObjCStructArgument.py (811 of 1675) PASS: lldb-Suite :: lang/objc/objc-struct-return/TestObjCStructReturn.py (812 of 1675) PASS: lldb-Suite :: lang/objc/ptr_refs/TestPtrRefsObjC.py (813 of 1675) PASS: lldb-Suite :: lang/objc/objc-optimized/TestObjcOptimized.py (814 of 1675) PASS: lldb-Suite :: lang/objc/objc-super/TestObjCSuper.py (815 of 1675) PASS: lldb-Suite :: lang/objc/orderedset/TestOrderedSet.py (816 of 1675) PASS: lldb-Suite :: lang/objc/print-obj/TestPrintObj.py (817 of 1675) PASS: lldb-Suite :: lang/objcxx/cxx-bridged-po/TestObjCXXBridgedPO.py (818 of 1675) PASS: lldb-Suite :: lang/objc/rdar-10967107/TestRdar10967107.py (819 of 1675) PASS: lldb-Suite :: lang/objc/foundation/TestObjCMethods.py (820 of 1675) PASS: lldb-Suite :: linux/add-symbols/TestTargetSymbolsAddCommand.py (821 of 1675) PASS: lldb-Suite :: lang/objc/radar-9691614/TestObjCMethodReturningBOOL.py (822 of 1675) PASS: lldb-Suite :: linux/mix-dwo-and-regular-objects/TestMixedDwarfBinary.py (823 of 1675) PASS: lldb-Suite :: linux/sepdebugsymlink/TestTargetSymbolsSepDebugSymlink.py (824 of 1675) PASS: lldb-Suite :: linux/thread/create_during_instruction_step/TestCreateDuringInstructionStep.py (825 of 1675) PASS: lldb-Suite :: lang/objc/rdar-11355592/TestRdar11355592.py (826 of 1675) PASS: lldb-Suite :: lang/objc/single-entry-dictionary/TestObjCSingleEntryDictionary.py (827 of 1675) PASS: lldb-Suite :: lang/objc/self/TestObjCSelf.py (828 of 1675) PASS: lldb-Suite :: lang/objc/unicode-string/TestUnicodeString.py (829 of 1675) PASS: lldb-Suite :: macosx/add-dsym/TestAddDsymMidExecutionCommand.py (830 of 1675) PASS: lldb-Suite :: macosx/find-app-in-bundle/TestFindAppInBundle.py (831 of 1675) PASS: lldb-Suite :: lang/objc/variadic_methods/TestVariadicMethods.py (832 of 1675) PASS: lldb-Suite :: logging/TestLogging.py (833 of 1675) PASS: lldb-Suite :: linux/builtin_trap/TestBuiltinTrap.py (834 of 1675) PASS: lldb-Suite :: macosx/load-kext/TestLoadKext.py (835 of 1675) PASS: lldb-Suite :: macosx/duplicate-archive-members/TestDuplicateMembers.py (836 of 1675) PASS: lldb-Suite :: macosx/lc-note/kern-ver-str/TestKernVerStrLCNOTE.py (837 of 1675) PASS: lldb-Suite :: lang/objcxx/class-name-clash/TestNameClash.py (838 of 1675) PASS: lldb-Suite :: lang/objcxx/hide-runtime-values/TestObjCXXHideRuntimeValues.py (839 of 1675) PASS: lldb-Suite :: lang/objc/objc-new-syntax/TestObjCNewSyntaxArray.py (840 of 1675) PASS: lldb-Suite :: macosx/indirect_symbol/TestIndirectSymbols.py (841 of 1675) PASS: lldb-Suite :: macosx/function-starts/TestFunctionStarts.py (842 of 1675) PASS: lldb-Suite :: macosx/version_zero/TestGetVersionZeroVersion.py (843 of 1675) PASS: lldb-Suite :: lang/objc/objc-new-syntax/TestObjCNewSyntaxDictionary.py (844 of 1675) PASS: lldb-Suite :: macosx/order/TestOrderFile.py (845 of 1675) PASS: lldb-Suite :: python_api/debugger/TestDebuggerAPI.py (846 of 1675) PASS: lldb-Suite :: macosx/universal/TestUniversal.py (847 of 1675) PASS: lldb-Suite :: python_api/breakpoint/TestBreakpointAPI.py (848 of 1675) PASS: lldb-Suite :: python_api/default-constructor/TestDefaultConstructorForAPIObjects.py (849 of 1675) PASS: lldb-Suite :: python_api/disassemble-raw-data/TestDisassembleRawData.py (850 of 1675) PASS: lldb-Suite :: python_api/disassemble-raw-data/TestDisassemble_VST1_64.py (851 of 1675) PASS: lldb-Suite :: python_api/event/TestEvents.py (852 of 1675) PASS: lldb-Suite :: python_api/file_handle/TestFileHandle.py (853 of 1675) PASS: lldb-Suite :: python_api/findvalue_duplist/TestSBFrameFindValue.py (854 of 1675) PASS: lldb-Suite :: macosx/safe-to-func-call/TestSafeFuncCalls.py (855 of 1675) PASS: lldb-Suite :: lang/objcxx/objcxx-ivar-vector/TestIvarVector.py (856 of 1675) PASS: lldb-Suite :: python_api/frame/get-variables/TestGetVariables.py (857 of 1675) PASS: lldb-Suite :: macosx/queues/TestQueues.py (858 of 1675) PASS: lldb-Suite :: macosx/thread-names/TestInterruptThreadNames.py (859 of 1675) PASS: lldb-Suite :: macosx/nslog/TestDarwinNSLogOutput.py (860 of 1675) PASS: lldb-Suite :: python_api/lldbutil/TestSwigVersion.py (861 of 1675) PASS: lldb-Suite :: python_api/interpreter/TestRunCommandInterpreterAPI.py (862 of 1675) PASS: lldb-Suite :: python_api/class_members/TestSBTypeClassMembers.py (863 of 1675) PASS: lldb-Suite :: python_api/frame/inlines/TestInlinedFrame.py (864 of 1675) PASS: lldb-Suite :: python_api/function_symbol/TestDisasmAPI.py (865 of 1675) PASS: lldb-Suite :: python_api/function_symbol/TestSymbolAPI.py (866 of 1675) PASS: lldb-Suite :: python_api/interpreter/TestCommandInterpreterAPI.py (867 of 1675) PASS: lldb-Suite :: python_api/hello_world/TestHelloWorld.py (868 of 1675) PASS: lldb-Suite :: lang/objc/objc-new-syntax/TestObjCNewSyntaxLiteral.py (869 of 1675) PASS: lldb-Suite :: python_api/name_lookup/TestNameLookup.py (870 of 1675) PASS: lldb-Suite :: python_api/lldbutil/frame/TestFrameUtils.py (871 of 1675) PASS: lldb-Suite :: python_api/frame/TestFrames.py (872 of 1675) PASS: lldb-Suite :: lang/objc/hidden-ivars/TestHiddenIvars.py (873 of 1675) PASS: lldb-Suite :: python_api/formatters/TestFormattersSBAPI.py (874 of 1675) PASS: lldb-Suite :: macosx/find-dsym/bundle-with-dot-in-filename/TestBundleWithDotInFilename.py (875 of 1675) PASS: lldb-Suite :: python_api/lldbutil/process/TestPrintStackTraces.py (876 of 1675) PASS: lldb-Suite :: python_api/sblaunchinfo/TestSBLaunchInfo.py (877 of 1675) PASS: lldb-Suite :: macosx/find-dsym/deep-bundle/TestDeepBundle.py (878 of 1675) PASS: lldb-Suite :: python_api/sbstructureddata/TestStructuredDataAPI.py (879 of 1675) PASS: lldb-Suite :: python_api/process/read-mem-cstring/TestReadMemCString.py (880 of 1675) PASS: lldb-Suite :: python_api/section/TestSectionAPI.py (881 of 1675) PASS: lldb-Suite :: python_api/sbdata/TestSBData.py (882 of 1675) PASS: lldb-Suite :: python_api/exprpath_synthetic/TestExprPathSynthetic.py (883 of 1675) PASS: lldb-Suite :: python_api/rdar-12481949/Test-rdar-12481949.py (884 of 1675) PASS: lldb-Suite :: python_api/sbvalue_const_addrof/TestSBValueConstAddrOf.py (885 of 1675) PASS: lldb-Suite :: python_api/signals/TestSignalsAPI.py (886 of 1675) PASS: lldb-Suite :: python_api/symbol-context/TestSymbolContext.py (887 of 1675) PASS: lldb-Suite :: lang/objc/real-definition/TestRealDefinition.py (888 of 1675) PASS: lldb-Suite :: python_api/sbvalue_persist/TestSBValuePersist.py (889 of 1675) PASS: lldb-Suite :: python_api/lldbutil/iter/TestRegistersIterator.py (890 of 1675) PASS: lldb-Suite :: python_api/type/TestTypeList.py (891 of 1675) PASS: lldb-Suite :: python_api/symbol-context/two-files/TestSymbolContextTwoFiles.py (892 of 1675) PASS: lldb-Suite :: python_api/value/change_values/TestChangeValueAPI.py (893 of 1675) PASS: lldb-Suite :: python_api/value/empty_class/TestValueAPIEmptyClass.py (894 of 1675) PASS: lldb-Suite :: python_api/objc_type/TestObjCType.py (895 of 1675) PASS: lldb-Suite :: python_api/value/TestValueAPI.py (896 of 1675) PASS: lldb-Suite :: quit/TestQuit.py (897 of 1675) PASS: lldb-Suite :: python_api/value_var_update/TestValueVarUpdate.py (898 of 1675) PASS: lldb-Suite :: python_api/value/linked_list/TestValueAPILinkedList.py (899 of 1675) PASS: lldb-Suite :: python_api/watchpoint/TestSetWatchpoint.py (900 of 1675) PASS: lldb-Suite :: python_api/sbtype_typeclass/TestSBTypeTypeClass.py (901 of 1675) PASS: lldb-Suite :: python_api/watchpoint/TestWatchpointIgnoreCount.py (902 of 1675) PASS: lldb-Suite :: sample_test/TestSampleTest.py (903 of 1675) PASS: lldb-Suite :: python_api/watchpoint/TestWatchpointIter.py (904 of 1675) PASS: lldb-Suite :: terminal/TestSTTYBeforeAndAfter.py (905 of 1675) PASS: lldb-Suite :: python_api/watchpoint/condition/TestWatchpointConditionAPI.py (906 of 1675) PASS: lldb-Suite :: sample_test/TestSampleInlineTest.py (907 of 1675) PASS: lldb-Suite :: python_api/process/io/TestProcessIO.py (908 of 1675) PASS: lldb-Suite :: python_api/process/TestProcessAPI.py (909 of 1675) PASS: lldb-Suite :: tools/lldb-server/TestGdbRemoteAttach.py (910 of 1675) PASS: lldb-Suite :: tools/lldb-server/TestGdbRemoteModuleInfo.py (911 of 1675) PASS: lldb-Suite :: tools/lldb-server/TestGdbRemoteHostInfo.py (912 of 1675) PASS: lldb-Suite :: tools/lldb-server/TestGdbRemoteKill.py (913 of 1675) PASS: lldb-Suite :: python_api/lldbutil/iter/TestLLDBIterator.py (914 of 1675) PASS: lldb-Suite :: tools/lldb-server/TestGdbRemoteAuxvSupport.py (915 of 1675) PASS: lldb-Suite :: tools/lldb-server/TestGdbRemoteExitCode.py (916 of 1675) PASS: lldb-Suite :: source-manager/TestSourceManager.py (917 of 1675) PASS: lldb-Suite :: python_api/thread/TestThreadAPI.py (918 of 1675) PASS: lldb-Suite :: tools/lldb-server/commandline/TestStubReverseConnect.py (919 of 1675) PASS: lldb-Suite :: tools/lldb-server/TestGdbRemoteSingleStep.py (920 of 1675) PASS: lldb-Suite :: settings/quoting/TestQuoting.py (921 of 1675) PASS: lldb-Suite :: tools/lldb-server/commandline/TestStubSetSID.py (922 of 1675) PASS: lldb-Suite :: tools/lldb-server/libraries-svr4/TestGdbRemoteLibrariesSvr4Support.py (923 of 1675) PASS: lldb-Suite :: tools/lldb-server/TestGdbRemoteRegisterState.py (924 of 1675) PASS: lldb-Suite :: tools/lldb-server/platform-process-connect/TestPlatformProcessConnect.py (925 of 1675) PASS: lldb-Suite :: tools/lldb-server/TestGdbRemoteExpeditedRegisters.py (926 of 1675) PASS: lldb-Suite :: python_api/target/TestTargetAPI.py (927 of 1675) PASS: lldb-Suite :: python_api/module_section/TestModuleAndSection.py (928 of 1675) PASS: lldb-Suite :: tools/lldb-server/signal-filtering/TestGdbRemote_QPassSignals.py (929 of 1675) PASS: lldb-Suite :: tools/lldb-server/thread-name/TestGdbRemoteThreadName.py (930 of 1675) PASS: lldb-Suite :: tools/lldb-vscode/attach/TestVSCode_attach.py (931 of 1675) PASS: lldb-Suite :: tools/lldb-server/inferior-crash/TestGdbRemoteAbort.py (932 of 1675) PASS: lldb-Suite :: tools/lldb-server/inferior-crash/TestGdbRemoteSegFault.py (933 of 1675) PASS: lldb-Suite :: tools/lldb-server/register-reading/TestGdbRemoteGPacket.py (934 of 1675) PASS: lldb-Suite :: tools/lldb-vscode/breakpoint/TestVSCode_setBreakpoints.py (935 of 1675) PASS: lldb-Suite :: tools/lldb-vscode/breakpoint/TestVSCode_setExceptionBreakpoints.py (936 of 1675) PASS: lldb-Suite :: tools/lldb-vscode/breakpoint/TestVSCode_setFunctionBreakpoints.py (937 of 1675) PASS: lldb-Suite :: tools/lldb-vscode/launch/TestVSCode_launch.py (938 of 1675) PASS: lldb-Suite :: tools/lldb-vscode/stackTrace/TestVSCode_stackTrace.py (939 of 1675) PASS: lldb-Suite :: tools/lldb-vscode/step/TestVSCode_step.py (940 of 1675) PASS: lldb-Suite :: tools/lldb-vscode/variables/TestVSCode_variables.py (941 of 1675) PASS: lldb-Suite :: tools/lldb-server/TestGdbRemote_qThreadStopInfo.py (942 of 1675) PASS: lldb-Suite :: settings/TestSettings.py (943 of 1675) PASS: lldb-Unit :: Breakpoint/./LLDBBreakpointTests/BreakpointIDTest.StringIsBreakpointName (944 of 1675) PASS: lldb-Unit :: Core/./LLDBCoreTests/MangledTest.EmptyForInvalidName (945 of 1675) PASS: lldb-Unit :: Core/./LLDBCoreTests/MangledTest.NameIndexes_FindFunctionSymbols (946 of 1675) PASS: lldb-Unit :: Core/./LLDBCoreTests/MangledTest.ResultForValidName (947 of 1675) PASS: lldb-Unit :: Core/./LLDBCoreTests/RichManglingContextTest.Basic (948 of 1675) PASS: lldb-Unit :: Core/./LLDBCoreTests/RichManglingContextTest.FromCxxMethodName (949 of 1675) PASS: lldb-Unit :: Core/./LLDBCoreTests/RichManglingContextTest.IPDRealloc (950 of 1675) PASS: lldb-Unit :: Core/./LLDBCoreTests/RichManglingContextTest.SwitchProvider (951 of 1675) PASS: lldb-Unit :: Core/./LLDBCoreTests/StreamCallbackTest.Callback (952 of 1675) PASS: lldb-Unit :: Core/./LLDBCoreTests/UniqueCStringMap.NoDefaultConstructor (953 of 1675) PASS: lldb-Suite :: tools/lldb-server/TestGdbRemoteProcessInfo.py (954 of 1675) PASS: lldb-Unit :: Disassembler/./DisassemblerTests/TestArm64Disassembly.TestArmv81Instruction (955 of 1675) PASS: lldb-Unit :: Disassembler/./DisassemblerTests/TestArmv7Disassembly.TestCortexFPDisass (956 of 1675) PASS: lldb-Unit :: Editline/./EditlineTests/EditlineTestFixture.EditlineReceivesMultiLineText (957 of 1675) PASS: lldb-Unit :: Editline/./EditlineTests/EditlineTestFixture.EditlineReceivesSingleLineText (958 of 1675) PASS: lldb-Unit :: Expression/./ExpressionTests/ClangHostTest.ComputeClangResourceDirectory (959 of 1675) PASS: lldb-Unit :: Expression/./ExpressionTests/ClangHostTest.MacOSX (960 of 1675) PASS: lldb-Unit :: Expression/./ExpressionTests/DWARFExpression.DW_OP_pick (961 of 1675) PASS: lldb-Unit :: Host/./HostTests/ConnectionFileDescriptorTest.TCPGetURIv4 (962 of 1675) PASS: lldb-Unit :: Host/./HostTests/ConnectionFileDescriptorTest.TCPGetURIv6 (963 of 1675) PASS: lldb-Unit :: Host/./HostTests/FileActionTest.Open (964 of 1675) PASS: lldb-Unit :: Host/./HostTests/FileSystemTest.EnumerateDirectory (965 of 1675) PASS: lldb-Unit :: Host/./HostTests/FileSystemTest.Exists (966 of 1675) PASS: lldb-Unit :: Host/./HostTests/FileSystemTest.FileAndDirectoryComponents (967 of 1675) PASS: lldb-Unit :: Host/./HostTests/FileSystemTest.GetByteSize (968 of 1675) PASS: lldb-Unit :: Host/./HostTests/FileSystemTest.GetPermissions (969 of 1675) PASS: lldb-Unit :: Host/./HostTests/FileSystemTest.MakeAbsolute (970 of 1675) PASS: lldb-Unit :: Host/./HostTests/FileSystemTest.Readable (971 of 1675) PASS: lldb-Unit :: Host/./HostTests/FileSystemTest.Resolve (972 of 1675) PASS: lldb-Unit :: Host/./HostTests/Host.GetEnvironment (973 of 1675) PASS: lldb-Unit :: Host/./HostTests/HostInfoTest.GetAugmentedArchSpec (974 of 1675) PASS: lldb-Unit :: Host/./HostTests/Host.WaitStatusFormat (975 of 1675) PASS: lldb-Unit :: Host/./HostTests/HostInfoTest.GetHostname (976 of 1675) PASS: lldb-Unit :: Host/./HostTests/MainLoopTest.DetectsEOF (977 of 1675) PASS: lldb-Unit :: Host/./HostTests/MainLoopTest.ReadObject (978 of 1675) PASS: lldb-Unit :: Host/./HostTests/MainLoopTest.Signal (979 of 1675) PASS: lldb-Unit :: Host/./HostTests/MainLoopTest.TerminatesImmediately (980 of 1675) PASS: lldb-Unit :: Host/./HostTests/NativeProcessProtocolTest.ReadCStringFromMemory (981 of 1675) PASS: lldb-Unit :: Host/./HostTests/NativeProcessProtocolTest.ReadCStringFromMemory_CrossPageBoundary (982 of 1675) PASS: lldb-Unit :: Host/./HostTests/NativeProcessProtocolTest.ReadCStringFromMemory_MaxSize (983 of 1675) PASS: lldb-Unit :: Host/./HostTests/NativeProcessProtocolTest.ReadMemoryWithoutTrap (984 of 1675) PASS: lldb-Unit :: Host/./HostTests/NativeProcessProtocolTest.SetBreakpoint (985 of 1675) PASS: lldb-Unit :: Host/./HostTests/NativeProcessProtocolTest.SetBreakpointFailRead (986 of 1675) PASS: lldb-Unit :: Host/./HostTests/NativeProcessProtocolTest.SetBreakpointFailVerify (987 of 1675) PASS: lldb-Unit :: Host/./HostTests/NativeProcessProtocolTest.SetBreakpointFailWrite (988 of 1675) PASS: lldb-Unit :: Host/./HostTests/ProcessLaunchInfoTest.Constructor (989 of 1675) PASS: lldb-Unit :: Host/./HostTests/SocketAddressTest.GetAddressInfo (990 of 1675) PASS: lldb-Unit :: Host/./HostTests/SocketAddressTest.Set (991 of 1675) PASS: lldb-Unit :: Host/./HostTests/SocketTest.DecodeHostAndPort (992 of 1675) PASS: lldb-Unit :: Host/./HostTests/SocketTest.DomainGetConnectURI (993 of 1675) PASS: lldb-Unit :: Host/./HostTests/SocketTest.DomainListenConnectAccept (994 of 1675) PASS: lldb-Unit :: Host/./HostTests/SocketTest.TCPGetAddress (995 of 1675) PASS: lldb-Unit :: Host/./HostTests/SocketTest.TCPGetConnectURI (996 of 1675) PASS: lldb-Unit :: Host/./HostTests/SocketTest.TCPListen0ConnectAccept (997 of 1675) PASS: lldb-Unit :: Host/./HostTests/SocketTest.TCPListen0GetPort (998 of 1675) PASS: lldb-Unit :: Host/./HostTests/SocketTest.UDPConnect (999 of 1675) PASS: lldb-Unit :: Host/./HostTests/SocketTest.UDPGetConnectURI (1000 of 1675) PASS: lldb-Unit :: Host/./HostTests/TaskPoolTest.AddTask (1001 of 1675) PASS: lldb-Unit :: Host/./HostTests/TaskPoolTest.RunTasks (1002 of 1675) PASS: lldb-Unit :: Host/./HostTests/TaskPoolTest.TaskMap (1003 of 1675) PASS: lldb-Unit :: Interpreter/./InterpreterTests/CompletionTest.DirCompletionAbsolute (1004 of 1675) PASS: lldb-Unit :: Interpreter/./InterpreterTests/CompletionTest.DirCompletionUsername (1005 of 1675) PASS: lldb-Unit :: Interpreter/./InterpreterTests/CompletionTest.FileCompletionAbsolute (1006 of 1675) PASS: lldb-Unit :: Interpreter/./InterpreterTests/OptionArgParserTest.toBoolean (1007 of 1675) PASS: lldb-Unit :: Interpreter/./InterpreterTests/OptionArgParserTest.toChar (1008 of 1675) PASS: lldb-Unit :: Interpreter/./InterpreterTests/OptionArgParserTest.toScriptLanguage (1009 of 1675) PASS: lldb-Unit :: Language/CPlusPlus/./LanguageCPlusPlusTests/CPlusPlusLanguage.CPlusPlusNameParser (1010 of 1675) PASS: lldb-Unit :: Language/CPlusPlus/./LanguageCPlusPlusTests/CPlusPlusLanguage.ExtractContextAndIdentifier (1011 of 1675) PASS: lldb-Unit :: Language/CPlusPlus/./LanguageCPlusPlusTests/CPlusPlusLanguage.FindAlternateFunctionManglings (1012 of 1675) PASS: lldb-Unit :: Language/CPlusPlus/./LanguageCPlusPlusTests/CPlusPlusLanguage.MethodNameParsing (1013 of 1675) PASS: lldb-Unit :: Language/Highlighting/./HighlighterTests/HighlighterTest.ClangBraces (1014 of 1675) PASS: lldb-Unit :: Language/Highlighting/./HighlighterTests/HighlighterTest.ClangCommas (1015 of 1675) PASS: lldb-Unit :: Language/Highlighting/./HighlighterTests/HighlighterTest.ClangComments (1016 of 1675) PASS: lldb-Unit :: Language/Highlighting/./HighlighterTests/HighlighterTest.ClangCursorOutOfBounds (1017 of 1675) PASS: lldb-Unit :: Language/Highlighting/./HighlighterTests/HighlighterTest.ClangCursorPos (1018 of 1675) PASS: lldb-Unit :: Language/Highlighting/./HighlighterTests/HighlighterTest.ClangCursorPosAfterOtherToken (1019 of 1675) PASS: lldb-Unit :: Language/Highlighting/./HighlighterTests/HighlighterTest.ClangCursorPosBeforeOtherToken (1020 of 1675) PASS: lldb-Unit :: Language/Highlighting/./HighlighterTests/HighlighterTest.ClangCursorPosEndOfLine (1021 of 1675) PASS: lldb-Unit :: Language/Highlighting/./HighlighterTests/HighlighterTest.ClangCursorPosInOtherToken (1022 of 1675) PASS: lldb-Unit :: Language/Highlighting/./HighlighterTests/HighlighterTest.ClangEmptyInput (1023 of 1675) PASS: lldb-Unit :: Language/Highlighting/./HighlighterTests/HighlighterTest.ClangIdentifiers (1024 of 1675) PASS: lldb-Unit :: Language/Highlighting/./HighlighterTests/HighlighterTest.ClangOperators (1025 of 1675) PASS: lldb-Unit :: Language/Highlighting/./HighlighterTests/HighlighterTest.ClangPPDirectives (1026 of 1675) PASS: lldb-Unit :: Language/Highlighting/./HighlighterTests/HighlighterTest.ClangScalarLiterals (1027 of 1675) PASS: lldb-Unit :: Language/Highlighting/./HighlighterTests/HighlighterTest.ClangSquareBrackets (1028 of 1675) PASS: lldb-Unit :: Language/Highlighting/./HighlighterTests/HighlighterTest.ClangStringLiterals (1029 of 1675) PASS: lldb-Unit :: Language/Highlighting/./HighlighterTests/HighlighterTest.ClangUnterminatedString (1030 of 1675) PASS: lldb-Unit :: Language/Highlighting/./HighlighterTests/HighlighterTest.Colons (1031 of 1675) PASS: lldb-Unit :: Language/Highlighting/./HighlighterTests/HighlighterTest.DefaultHighlighter (1032 of 1675) PASS: lldb-Unit :: Language/Highlighting/./HighlighterTests/HighlighterTest.DefaultHighlighterWithCursor (1033 of 1675) PASS: lldb-Unit :: Language/Highlighting/./HighlighterTests/HighlighterTest.DefaultHighlighterWithCursorOutOfBounds (1034 of 1675) PASS: lldb-Unit :: Language/Highlighting/./HighlighterTests/HighlighterTest.FallbackHighlighter (1035 of 1675) PASS: lldb-Unit :: Language/Highlighting/./HighlighterTests/HighlighterTest.HighlighterSelectionPath (1036 of 1675) PASS: lldb-Unit :: Language/Highlighting/./HighlighterTests/HighlighterTest.HighlighterSelectionType (1037 of 1675) PASS: lldb-Unit :: Language/Highlighting/./HighlighterTests/HighlighterTest.Keywords (1038 of 1675) PASS: lldb-Unit :: ObjectFile/Breakpad/./ObjectFileBreakpadTests/FileRecord.parse (1039 of 1675) PASS: lldb-Unit :: ObjectFile/Breakpad/./ObjectFileBreakpadTests/FuncRecord.parse (1040 of 1675) PASS: lldb-Unit :: ObjectFile/Breakpad/./ObjectFileBreakpadTests/InfoRecord.parse (1041 of 1675) PASS: lldb-Unit :: ObjectFile/Breakpad/./ObjectFileBreakpadTests/LineRecord.parse (1042 of 1675) PASS: lldb-Unit :: ObjectFile/Breakpad/./ObjectFileBreakpadTests/ModuleRecord.parse (1043 of 1675) PASS: lldb-Unit :: ObjectFile/Breakpad/./ObjectFileBreakpadTests/PublicRecord.parse (1044 of 1675) PASS: lldb-Unit :: ObjectFile/Breakpad/./ObjectFileBreakpadTests/Record.classify (1045 of 1675) PASS: lldb-Unit :: ObjectFile/Breakpad/./ObjectFileBreakpadTests/StackCFIRecord.parse (1046 of 1675) PASS: lldb-Unit :: ObjectFile/ELF/./ObjectFileELFTests/ObjectFileELFTest.GetModuleSpecifications_EarlySectionHeaders (1047 of 1675) PASS: lldb-Unit :: ObjectFile/ELF/./ObjectFileELFTests/ObjectFileELFTest.SectionsResolveConsistently (1048 of 1675) PASS: lldb-Unit :: Platform/./LLDBPlatformTests/PlatformDarwinTest.TestParseVersionBuildDir (1049 of 1675) PASS: lldb-Unit :: Host/./HostTests/MainLoopTest.UnmonitoredSignal (1050 of 1675) PASS: lldb-Unit :: Process/gdb-remote/./ProcessGdbRemoteTests/GDBRemoteClientBaseTest.SendContinueAndAsyncPacket (1051 of 1675) PASS: lldb-Unit :: Process/gdb-remote/./ProcessGdbRemoteTests/GDBRemoteClientBaseTest.SendContinueAndAsyncSignal (1052 of 1675) PASS: lldb-Unit :: Process/gdb-remote/./ProcessGdbRemoteTests/GDBRemoteClientBaseTest.SendContinueAndInterrupt (1053 of 1675) PASS: lldb-Unit :: Process/gdb-remote/./ProcessGdbRemoteTests/GDBRemoteClientBaseTest.SendContinueAndInterrupt2PacketBug (1054 of 1675) PASS: lldb-Unit :: Process/gdb-remote/./ProcessGdbRemoteTests/GDBRemoteClientBaseTest.SendContinueAndLateInterrupt (1055 of 1675) PASS: lldb-Unit :: Process/gdb-remote/./ProcessGdbRemoteTests/GDBRemoteClientBaseTest.SendContinueAndWait (1056 of 1675) PASS: lldb-Unit :: Process/gdb-remote/./ProcessGdbRemoteTests/GDBRemoteClientBaseTest.SendContinueDelegateInterface (1057 of 1675) PASS: lldb-Unit :: Process/gdb-remote/./ProcessGdbRemoteTests/GDBRemoteClientBaseTest.SendContinueDelegateStructuredDataReceipt (1058 of 1675) PASS: lldb-Unit :: Process/gdb-remote/./ProcessGdbRemoteTests/GDBRemoteClientBaseTest.SendPacketAndReceiveResponseWithOutputSupport (1059 of 1675) PASS: lldb-Unit :: Process/gdb-remote/./ProcessGdbRemoteTests/GDBRemoteCommunicationClientTest.GetMemoryRegionInfo (1060 of 1675) PASS: lldb-Unit :: Process/gdb-remote/./ProcessGdbRemoteTests/GDBRemoteCommunicationClientTest.GetMemoryRegionInfoInvalidResponse (1061 of 1675) PASS: lldb-Unit :: Process/gdb-remote/./ProcessGdbRemoteTests/GDBRemoteCommunicationClientTest.GetModulesInfo (1062 of 1675) PASS: lldb-Unit :: Process/gdb-remote/./ProcessGdbRemoteTests/GDBRemoteCommunicationClientTest.GetModulesInfoInvalidResponse (1063 of 1675) PASS: lldb-Unit :: Process/gdb-remote/./ProcessGdbRemoteTests/GDBRemoteCommunicationClientTest.GetModulesInfo_UUID20 (1064 of 1675) PASS: lldb-Unit :: Process/gdb-remote/./ProcessGdbRemoteTests/GDBRemoteCommunicationClientTest.ReadRegister (1065 of 1675) PASS: lldb-Unit :: Process/gdb-remote/./ProcessGdbRemoteTests/GDBRemoteCommunicationClientTest.SaveRestoreRegistersNoSuffix (1066 of 1675) PASS: lldb-Unit :: Process/gdb-remote/./ProcessGdbRemoteTests/GDBRemoteCommunicationClientTest.SendGetDataPacket (1067 of 1675) PASS: lldb-Unit :: Process/gdb-remote/./ProcessGdbRemoteTests/GDBRemoteCommunicationClientTest.SendGetMetaDataPacket (1068 of 1675) PASS: lldb-Unit :: Process/gdb-remote/./ProcessGdbRemoteTests/GDBRemoteCommunicationClientTest.SendGetTraceConfigPacket (1069 of 1675) PASS: lldb-Unit :: Process/gdb-remote/./ProcessGdbRemoteTests/GDBRemoteCommunicationClientTest.SendSignalsToIgnore (1070 of 1675) PASS: lldb-Unit :: Process/gdb-remote/./ProcessGdbRemoteTests/GDBRemoteCommunicationClientTest.SendStartTracePacket (1071 of 1675) PASS: lldb-Unit :: Process/gdb-remote/./ProcessGdbRemoteTests/GDBRemoteCommunicationClientTest.SendStopTracePacket (1072 of 1675) PASS: lldb-Unit :: Process/gdb-remote/./ProcessGdbRemoteTests/GDBRemoteCommunicationClientTest.SyncThreadState (1073 of 1675) PASS: lldb-Unit :: Process/gdb-remote/./ProcessGdbRemoteTests/GDBRemoteCommunicationClientTest.TestPacketSpeedJSON (1074 of 1675) PASS: lldb-Unit :: Process/gdb-remote/./ProcessGdbRemoteTests/GDBRemoteCommunicationClientTest.WriteRegister (1075 of 1675) PASS: lldb-Unit :: Process/gdb-remote/./ProcessGdbRemoteTests/GDBRemoteCommunicationClientTest.WriteRegisterNoSuffix (1076 of 1675) PASS: lldb-Unit :: Process/gdb-remote/./ProcessGdbRemoteTests/GDBRemoteCommunicationServerTest.SendErrorResponse_ErrorList (1077 of 1675) PASS: lldb-Unit :: Process/gdb-remote/./ProcessGdbRemoteTests/GDBRemoteCommunicationServerTest.SendErrorResponse_ErrorNumber (1078 of 1675) PASS: lldb-Unit :: Process/gdb-remote/./ProcessGdbRemoteTests/GDBRemoteCommunicationServerTest.SendErrorResponse_Status (1079 of 1675) PASS: lldb-Unit :: Process/gdb-remote/./ProcessGdbRemoteTests/GDBRemoteCommunicationServerTest.SendErrorResponse_StringError (1080 of 1675) PASS: lldb-Unit :: Process/gdb-remote/./ProcessGdbRemoteTests/GDBRemoteCommunicationServerTest.SendErrorResponse_UnimplementedError (1081 of 1675) PASS: lldb-Unit :: Process/gdb-remote/./ProcessGdbRemoteTests/GDBRemoteCommunicationTest.ReadPacket_checksum (1082 of 1675) PASS: lldb-Unit :: Process/minidump/./LLDBMinidumpTests/MinidumpParserTest.FindMemoryRange (1083 of 1675) PASS: lldb-Unit :: Process/minidump/./LLDBMinidumpTests/MinidumpParserTest.FindMemoryRangeWithFullMemoryMinidump (1084 of 1675) PASS: lldb-Unit :: Process/minidump/./LLDBMinidumpTests/MinidumpParserTest.GetArchitecture (1085 of 1675) PASS: lldb-Unit :: Process/minidump/./LLDBMinidumpTests/MinidumpParserTest.GetArchitectureWindows (1086 of 1675) PASS: lldb-Unit :: Process/minidump/./LLDBMinidumpTests/MinidumpParserTest.GetExceptionStream (1087 of 1675) PASS: lldb-Unit :: Process/minidump/./LLDBMinidumpTests/MinidumpParserTest.GetFilteredModuleList (1088 of 1675) PASS: lldb-Unit :: Process/minidump/./LLDBMinidumpTests/MinidumpParserTest.GetLinuxProcStatus (1089 of 1675) PASS: lldb-Unit :: Process/minidump/./LLDBMinidumpTests/MinidumpParserTest.GetLinuxProcStatus_no_stream (1090 of 1675) PASS: lldb-Unit :: Process/minidump/./LLDBMinidumpTests/MinidumpParserTest.GetMemory (1091 of 1675) PASS: lldb-Unit :: Process/minidump/./LLDBMinidumpTests/MinidumpParserTest.GetMemoryRegionInfo (1092 of 1675) PASS: lldb-Unit :: Process/minidump/./LLDBMinidumpTests/MinidumpParserTest.GetMemoryRegionInfoFromMemory64List (1093 of 1675) PASS: lldb-Unit :: Process/minidump/./LLDBMinidumpTests/MinidumpParserTest.GetMemoryRegionInfoFromMemoryList (1094 of 1675) PASS: lldb-Unit :: Process/minidump/./LLDBMinidumpTests/MinidumpParserTest.GetMemoryRegionInfoLinuxMaps (1095 of 1675) PASS: lldb-Unit :: Process/minidump/./LLDBMinidumpTests/MinidumpParserTest.GetMiscInfoWindows (1096 of 1675) PASS: lldb-Unit :: Process/minidump/./LLDBMinidumpTests/MinidumpParserTest.GetMiscInfo_no_stream (1097 of 1675) PASS: lldb-Unit :: Process/minidump/./LLDBMinidumpTests/MinidumpParserTest.GetPid (1098 of 1675) PASS: lldb-Unit :: Process/minidump/./LLDBMinidumpTests/MinidumpParserTest.GetPidWindows (1099 of 1675) PASS: lldb-Unit :: Process/minidump/./LLDBMinidumpTests/MinidumpParserTest.GetPidWow64 (1100 of 1675) PASS: lldb-Unit :: Process/minidump/./LLDBMinidumpTests/MinidumpParserTest.GetThreadContext_x86_32 (1101 of 1675) PASS: lldb-Unit :: Process/minidump/./LLDBMinidumpTests/MinidumpParserTest.GetThreadContext_x86_32_wow64 (1102 of 1675) PASS: lldb-Unit :: Process/minidump/./LLDBMinidumpTests/MinidumpParserTest.GetThreadContext_x86_64 (1103 of 1675) PASS: lldb-Unit :: Process/minidump/./LLDBMinidumpTests/MinidumpParserTest.GetThreadsAndGetThreadContext (1104 of 1675) PASS: lldb-Unit :: Process/minidump/./LLDBMinidumpTests/MinidumpParserTest.InvalidMinidump (1105 of 1675) PASS: lldb-Unit :: Process/minidump/./LLDBMinidumpTests/MinidumpParserTest.MinidumpDuplicateModuleMinAddress (1106 of 1675) PASS: lldb-Unit :: Process/minidump/./LLDBMinidumpTests/MinidumpParserTest.MinidumpModuleOrder (1107 of 1675) PASS: lldb-Unit :: Process/minidump/./LLDBMinidumpTests/RegisterContextMinidump.ConvertMinidumpContext_x86_32 (1108 of 1675) PASS: lldb-Unit :: Process/minidump/./LLDBMinidumpTests/RegisterContextMinidump.ConvertMinidumpContext_x86_64 (1109 of 1675) PASS: lldb-Unit :: ScriptInterpreter/Python/./ScriptInterpreterPythonTests/PythonDataObjectsTest.TestBorrowedReferences (1110 of 1675) PASS: lldb-Unit :: ScriptInterpreter/Python/./ScriptInterpreterPythonTests/PythonDataObjectsTest.TestDictionaryResolutionWithDot (1111 of 1675) PASS: lldb-Unit :: ScriptInterpreter/Python/./ScriptInterpreterPythonTests/PythonDataObjectsTest.TestExtractingUInt64ThroughStructuredData (1112 of 1675) PASS: lldb-Unit :: ScriptInterpreter/Python/./ScriptInterpreterPythonTests/PythonDataObjectsTest.TestGlobalNameResolutionNoDot (1113 of 1675) PASS: lldb-Unit :: ScriptInterpreter/Python/./ScriptInterpreterPythonTests/PythonDataObjectsTest.TestGlobalNameResolutionWithDot (1114 of 1675) PASS: lldb-Unit :: ScriptInterpreter/Python/./ScriptInterpreterPythonTests/PythonDataObjectsTest.TestInstanceNameResolutionNoDot (1115 of 1675) PASS: lldb-Unit :: ScriptInterpreter/Python/./ScriptInterpreterPythonTests/PythonDataObjectsTest.TestModuleNameResolutionNoDot (1116 of 1675) PASS: lldb-Unit :: ScriptInterpreter/Python/./ScriptInterpreterPythonTests/PythonDataObjectsTest.TestObjectAttributes (1117 of 1675) PASS: lldb-Unit :: ScriptInterpreter/Python/./ScriptInterpreterPythonTests/PythonDataObjectsTest.TestOwnedReferences (1118 of 1675) PASS: lldb-Unit :: ScriptInterpreter/Python/./ScriptInterpreterPythonTests/PythonDataObjectsTest.TestPythonBoolean (1119 of 1675) PASS: lldb-Unit :: ScriptInterpreter/Python/./ScriptInterpreterPythonTests/PythonDataObjectsTest.TestPythonByteArray (1120 of 1675) PASS: lldb-Unit :: ScriptInterpreter/Python/./ScriptInterpreterPythonTests/PythonDataObjectsTest.TestPythonBytes (1121 of 1675) PASS: lldb-Unit :: ScriptInterpreter/Python/./ScriptInterpreterPythonTests/PythonDataObjectsTest.TestPythonCallableCheck (1122 of 1675) PASS: lldb-Unit :: ScriptInterpreter/Python/./ScriptInterpreterPythonTests/PythonDataObjectsTest.TestPythonCallableInvoke (1123 of 1675) PASS: lldb-Unit :: ScriptInterpreter/Python/./ScriptInterpreterPythonTests/PythonDataObjectsTest.TestPythonDictionaryManipulation (1124 of 1675) PASS: lldb-Unit :: ScriptInterpreter/Python/./ScriptInterpreterPythonTests/PythonDataObjectsTest.TestPythonDictionaryToStructuredDictionary (1125 of 1675) PASS: lldb-Unit :: ScriptInterpreter/Python/./ScriptInterpreterPythonTests/PythonDataObjectsTest.TestPythonDictionaryValueEquality (1126 of 1675) PASS: lldb-Unit :: ScriptInterpreter/Python/./ScriptInterpreterPythonTests/PythonDataObjectsTest.TestPythonFile (1127 of 1675) PASS: lldb-Unit :: ScriptInterpreter/Python/./ScriptInterpreterPythonTests/PythonDataObjectsTest.TestPythonInteger (1128 of 1675) PASS: lldb-Unit :: ScriptInterpreter/Python/./ScriptInterpreterPythonTests/PythonDataObjectsTest.TestPythonIntegerToStr (1129 of 1675) PASS: lldb-Unit :: ScriptInterpreter/Python/./ScriptInterpreterPythonTests/PythonDataObjectsTest.TestPythonIntegerToStructuredInteger (1130 of 1675) PASS: lldb-Unit :: ScriptInterpreter/Python/./ScriptInterpreterPythonTests/PythonDataObjectsTest.TestPythonListManipulation (1131 of 1675) PASS: lldb-Unit :: ScriptInterpreter/Python/./ScriptInterpreterPythonTests/PythonDataObjectsTest.TestPythonListToStructuredList (1132 of 1675) PASS: lldb-Unit :: ScriptInterpreter/Python/./ScriptInterpreterPythonTests/PythonDataObjectsTest.TestPythonListValueEquality (1133 of 1675) PASS: lldb-Unit :: ScriptInterpreter/Python/./ScriptInterpreterPythonTests/PythonDataObjectsTest.TestPythonString (1134 of 1675) PASS: lldb-Unit :: ScriptInterpreter/Python/./ScriptInterpreterPythonTests/PythonDataObjectsTest.TestPythonStringToStr (1135 of 1675) PASS: lldb-Unit :: ScriptInterpreter/Python/./ScriptInterpreterPythonTests/PythonDataObjectsTest.TestPythonStringToStructuredString (1136 of 1675) PASS: lldb-Unit :: ScriptInterpreter/Python/./ScriptInterpreterPythonTests/PythonDataObjectsTest.TestPythonTupleInitializerList (1137 of 1675) PASS: lldb-Unit :: ScriptInterpreter/Python/./ScriptInterpreterPythonTests/PythonDataObjectsTest.TestPythonTupleInitializerList2 (1138 of 1675) PASS: lldb-Unit :: ScriptInterpreter/Python/./ScriptInterpreterPythonTests/PythonDataObjectsTest.TestPythonTupleSize (1139 of 1675) PASS: lldb-Unit :: ScriptInterpreter/Python/./ScriptInterpreterPythonTests/PythonDataObjectsTest.TestPythonTupleToStructuredList (1140 of 1675) PASS: lldb-Unit :: ScriptInterpreter/Python/./ScriptInterpreterPythonTests/PythonDataObjectsTest.TestPythonTupleValues (1141 of 1675) PASS: lldb-Unit :: ScriptInterpreter/Python/./ScriptInterpreterPythonTests/PythonDataObjectsTest.TestResetting (1142 of 1675) PASS: lldb-Unit :: ScriptInterpreter/Python/./ScriptInterpreterPythonTests/PythonDataObjectsTest.TestTypeNameResolutionNoDot (1143 of 1675) PASS: lldb-Unit :: ScriptInterpreter/Python/./ScriptInterpreterPythonTests/PythonExceptionStateTest.TestAcquisitionSemantics (1144 of 1675) PASS: lldb-Unit :: ScriptInterpreter/Python/./ScriptInterpreterPythonTests/PythonExceptionStateTest.TestAutoRestoreChanged (1145 of 1675) PASS: lldb-Unit :: ScriptInterpreter/Python/./ScriptInterpreterPythonTests/PythonExceptionStateTest.TestAutoRestoreSemantics (1146 of 1675) PASS: lldb-Unit :: ScriptInterpreter/Python/./ScriptInterpreterPythonTests/PythonExceptionStateTest.TestDiscardSemantics (1147 of 1675) PASS: lldb-Unit :: ScriptInterpreter/Python/./ScriptInterpreterPythonTests/PythonExceptionStateTest.TestExceptionStateChecking (1148 of 1675) PASS: lldb-Unit :: ScriptInterpreter/Python/./ScriptInterpreterPythonTests/PythonExceptionStateTest.TestManualRestoreSemantics (1149 of 1675) PASS: lldb-Unit :: ScriptInterpreter/Python/./ScriptInterpreterPythonTests/PythonExceptionStateTest.TestResetSemantics (1150 of 1675) PASS: lldb-Suite :: tools/lldb-server/TestAppleSimulatorOSType.py (1151 of 1675) PASS: lldb-Unit :: Signals/./SignalsTests/UnixSignalsTest.GetFilteredSignals (1152 of 1675) PASS: lldb-Unit :: Signals/./SignalsTests/UnixSignalsTest.GetInfo (1153 of 1675) PASS: lldb-Unit :: Signals/./SignalsTests/UnixSignalsTest.Iteration (1154 of 1675) PASS: lldb-Unit :: Signals/./SignalsTests/UnixSignalsTest.VersionChange (1155 of 1675) PASS: lldb-Unit :: Symbol/./SymbolTests/DWARFCallFrameInfoTest.Basic_dwarf3 (1156 of 1675) PASS: lldb-Unit :: Symbol/./SymbolTests/DWARFCallFrameInfoTest.Basic_dwarf4 (1157 of 1675) PASS: lldb-Unit :: Symbol/./SymbolTests/DWARFCallFrameInfoTest.Basic_eh (1158 of 1675) PASS: lldb-Unit :: Symbol/./SymbolTests/LineEntryTest.GetSameLineContiguousAddressRangeNestedInline (1159 of 1675) PASS: lldb-Unit :: Symbol/./SymbolTests/LineEntryTest.GetSameLineContiguousAddressRangeNoInlines (1160 of 1675) PASS: lldb-Unit :: Symbol/./SymbolTests/LineEntryTest.GetSameLineContiguousAddressRangeOneInline (1161 of 1675) PASS: lldb-Unit :: Symbol/./SymbolTests/PostfixExpression.Parse (1162 of 1675) PASS: lldb-Unit :: Symbol/./SymbolTests/PostfixExpression.ToDWARF (1163 of 1675) PASS: lldb-Unit :: Symbol/./SymbolTests/SymbolsTest.LocateExecutableSymbolFileForUnknownExecutableAndMissingSymbolFile (1164 of 1675) PASS: lldb-Unit :: Symbol/./SymbolTests/SymbolsTest.TerminateLocateExecutableSymbolFileForUnknownExecutableAndUnknownSymbolFile (1165 of 1675) PASS: lldb-Unit :: Symbol/./SymbolTests/TestClangASTContext.TemplateArguments (1166 of 1675) PASS: lldb-Unit :: Symbol/./SymbolTests/TestClangASTContext.TestConvertAccessTypeToAccessSpecifier (1167 of 1675) PASS: lldb-Unit :: Symbol/./SymbolTests/TestClangASTContext.TestBuiltinTypeForEncodingAndBitSize (1168 of 1675) PASS: lldb-Unit :: Symbol/./SymbolTests/TestClangASTContext.TestGetBasicTypeFromEnum (1169 of 1675) PASS: lldb-Unit :: Symbol/./SymbolTests/TestClangASTContext.TestGetBasicTypeFromName (1170 of 1675) PASS: lldb-Unit :: Symbol/./SymbolTests/TestClangASTContext.TestIsClangType (1171 of 1675) PASS: lldb-Unit :: Symbol/./SymbolTests/TestClangASTContext.TestRecordHasFields (1172 of 1675) PASS: lldb-Unit :: Symbol/./SymbolTests/TestClangASTContext.TestUnifyAccessSpecifiers (1173 of 1675) PASS: lldb-Unit :: Symbol/./SymbolTests/TestClangASTContext.TestRemoveFastQualifiers (1174 of 1675) PASS: lldb-Unit :: Symbol/./SymbolTests/Type.GetTypeScopeAndBasename (1175 of 1675) PASS: lldb-Unit :: SymbolFile/DWARF/./SymbolFileDWARFTests/SymbolFileDWARFTests.TestAbbrevInvalidNULLTag (1176 of 1675) PASS: lldb-Unit :: SymbolFile/DWARF/./SymbolFileDWARFTests/SymbolFileDWARFTests.TestAbbrevNullAttrValidForm (1177 of 1675) PASS: lldb-Unit :: SymbolFile/DWARF/./SymbolFileDWARFTests/SymbolFileDWARFTests.TestAbbrevMissingTerminator (1178 of 1675) PASS: lldb-Unit :: SymbolFile/DWARF/./SymbolFileDWARFTests/SymbolFileDWARFTests.TestAbbrevOrder1Start1 (1179 of 1675) PASS: lldb-Unit :: SymbolFile/DWARF/./SymbolFileDWARFTests/SymbolFileDWARFTests.TestAbbrevOrder1Start5 (1180 of 1675) PASS: lldb-Unit :: SymbolFile/DWARF/./SymbolFileDWARFTests/SymbolFileDWARFTests.TestAbbrevOutOfOrder (1181 of 1675) PASS: lldb-Unit :: SymbolFile/DWARF/./SymbolFileDWARFTests/SymbolFileDWARFTests.TestAbbrevValidAttrNullForm (1182 of 1675) PASS: lldb-Unit :: SymbolFile/NativePDB/./SymbolFileNativePDBTests/PDBFPOProgramToDWARFExpressionTests.DependencyChain (1183 of 1675) PASS: lldb-Unit :: SymbolFile/DWARF/./SymbolFileDWARFTests/SymbolFileDWARFTests.TestAbilitiesForDWARF (1184 of 1675) PASS: lldb-Unit :: SymbolFile/NativePDB/./SymbolFileNativePDBTests/PDBFPOProgramToDWARFExpressionTests.InvalidAssignmentSingle (1185 of 1675) PASS: lldb-Unit :: SymbolFile/NativePDB/./SymbolFileNativePDBTests/PDBFPOProgramToDWARFExpressionTests.InvalidAssignmentMultiple (1186 of 1675) PASS: lldb-Unit :: SymbolFile/NativePDB/./SymbolFileNativePDBTests/PDBFPOProgramToDWARFExpressionTests.InvalidOpBinary (1187 of 1675) PASS: lldb-Unit :: SymbolFile/NativePDB/./SymbolFileNativePDBTests/PDBFPOProgramToDWARFExpressionTests.InvalidOpUnary (1188 of 1675) PASS: lldb-Unit :: SymbolFile/NativePDB/./SymbolFileNativePDBTests/PDBFPOProgramToDWARFExpressionTests.MultipleDependentAssignments (1189 of 1675) PASS: lldb-Unit :: SymbolFile/NativePDB/./SymbolFileNativePDBTests/PDBFPOProgramToDWARFExpressionTests.MissingTargetRegister (1190 of 1675) PASS: lldb-Unit :: SymbolFile/NativePDB/./SymbolFileNativePDBTests/PDBFPOProgramToDWARFExpressionTests.MultipleIndependentAssignments (1191 of 1675) PASS: lldb-Unit :: SymbolFile/NativePDB/./SymbolFileNativePDBTests/PDBFPOProgramToDWARFExpressionTests.SingleAssignmentRegisterRef (1192 of 1675) PASS: lldb-Unit :: SymbolFile/NativePDB/./SymbolFileNativePDBTests/PDBFPOProgramToDWARFExpressionTests.UnknownOp (1193 of 1675) PASS: lldb-Unit :: SymbolFile/NativePDB/./SymbolFileNativePDBTests/PDBFPOProgramToDWARFExpressionTests.UnresolvedCyclicRegisterAssignmentReference (1194 of 1675) PASS: lldb-Unit :: SymbolFile/NativePDB/./SymbolFileNativePDBTests/PDBFPOProgramToDWARFExpressionTests.UnresolvedRegisterAssignmentReference (1195 of 1675) PASS: lldb-Unit :: SymbolFile/NativePDB/./SymbolFileNativePDBTests/PDBFPOProgramToDWARFExpressionTests.UnresolvedDependentCyclicRegisterAssignmentReference (1196 of 1675) PASS: lldb-Unit :: SymbolFile/NativePDB/./SymbolFileNativePDBTests/PDBFPOProgramToDWARFExpressionTests.UnresolvedRegisterReference (1197 of 1675) PASS: lldb-Unit :: SymbolFile/NativePDB/./SymbolFileNativePDBTests/PDBFPOProgramToDWARFExpressionTests.UnsupportedRASearch (1198 of 1675) PASS: lldb-Unit :: Target/./TargetTests/ExecutionContextTest.GetByteOrder (1199 of 1675) PASS: lldb-Unit :: Target/./TargetTests/ExecutionContextTest.GetByteOrderProcess (1200 of 1675) PASS: lldb-Unit :: Target/./TargetTests/ExecutionContextTest.GetByteOrderTarget (1201 of 1675) PASS: lldb-Unit :: Target/./TargetTests/MemoryRegionInfoTest.Formatv (1202 of 1675) PASS: lldb-Unit :: Target/./TargetTests/ModuleCacheTest.GetAndPut (1203 of 1675) PASS: lldb-Unit :: Target/./TargetTests/ModuleCacheTest.GetAndPutStrangeHostname (1204 of 1675) PASS: lldb-Unit :: Target/./TargetTests/ModuleCacheTest.GetAndPutUuidExists (1205 of 1675) PASS: lldb-Unit :: Target/./TargetTests/PathMappingListTest.AbsoluteTests (1206 of 1675) PASS: lldb-Unit :: Target/./TargetTests/PathMappingListTest.RelativeTests (1207 of 1675) PASS: lldb-Unit :: Target/./TargetTests/PathMappingListTest.RemapRoot (1208 of 1675) PASS: lldb-Unit :: Target/./TargetTests/ProcessInstanceInfo.Dump (1209 of 1675) PASS: lldb-Unit :: Target/./TargetTests/ProcessInstanceInfo.DumpTable (1210 of 1675) PASS: lldb-Unit :: UnwindAssembly/ARM64/./Arm64InstEmulationTests/TestArm64InstEmulation.TestMediumDarwinFunction (1211 of 1675) PASS: lldb-Unit :: UnwindAssembly/ARM64/./Arm64InstEmulationTests/TestArm64InstEmulation.TestFramelessThreeEpilogueFunction (1212 of 1675) PASS: lldb-Unit :: UnwindAssembly/ARM64/./Arm64InstEmulationTests/TestArm64InstEmulation.TestRegisterDoubleSpills (1213 of 1675) PASS: lldb-Unit :: UnwindAssembly/ARM64/./Arm64InstEmulationTests/TestArm64InstEmulation.TestRegisterSavedTwice (1214 of 1675) PASS: lldb-Unit :: UnwindAssembly/ARM64/./Arm64InstEmulationTests/TestArm64InstEmulation.TestSimpleDarwinFunction (1215 of 1675) PASS: lldb-Unit :: UnwindAssembly/PPC64/./PPC64InstEmulationTests/TestPPC64InstEmulation.TestMediumFunction (1216 of 1675) PASS: lldb-Unit :: UnwindAssembly/PPC64/./PPC64InstEmulationTests/TestPPC64InstEmulation.TestSimpleFunction (1217 of 1675) PASS: lldb-Unit :: Process/gdb-remote/./ProcessGdbRemoteTests/GDBRemoteClientBaseTest.InterruptNoResponse (1218 of 1675) PASS: lldb-Unit :: UnwindAssembly/x86/./UnwindAssemblyx86Tests/Testx86AssemblyInspectionEngine.Test32BitOnlyInstruction (1219 of 1675) PASS: lldb-Unit :: UnwindAssembly/x86/./UnwindAssemblyx86Tests/Testx86AssemblyInspectionEngine.Test32bitFramelessBigStackFrame (1220 of 1675) PASS: lldb-Unit :: UnwindAssembly/x86/./UnwindAssemblyx86Tests/Testx86AssemblyInspectionEngine.Test64bitFramelessBigStackFrame (1221 of 1675) PASS: lldb-Unit :: UnwindAssembly/x86/./UnwindAssemblyx86Tests/Testx86AssemblyInspectionEngine.Test32bitFramelessSmallStackFrame (1222 of 1675) PASS: lldb-Unit :: UnwindAssembly/x86/./UnwindAssemblyx86Tests/Testx86AssemblyInspectionEngine.Test64bitFramelessSmallStackFrame (1223 of 1675) PASS: lldb-Unit :: UnwindAssembly/x86/./UnwindAssemblyx86Tests/Testx86AssemblyInspectionEngine.TestAddRSP (1224 of 1675) PASS: lldb-Unit :: UnwindAssembly/x86/./UnwindAssemblyx86Tests/Testx86AssemblyInspectionEngine.TestAddESP (1225 of 1675) PASS: lldb-Unit :: UnwindAssembly/x86/./UnwindAssemblyx86Tests/Testx86AssemblyInspectionEngine.TestCALLNextInsn (1226 of 1675) PASS: lldb-Unit :: UnwindAssembly/x86/./UnwindAssemblyx86Tests/Testx86AssemblyInspectionEngine.TestDisassemblyJunkBytes (1227 of 1675) PASS: lldb-Unit :: UnwindAssembly/x86/./UnwindAssemblyx86Tests/Testx86AssemblyInspectionEngine.TestDisassemblyMidFunctionEpilogues (1228 of 1675) PASS: lldb-Unit :: UnwindAssembly/x86/./UnwindAssemblyx86Tests/Testx86AssemblyInspectionEngine.TestLEAVE (1229 of 1675) PASS: lldb-Unit :: UnwindAssembly/x86/./UnwindAssemblyx86Tests/Testx86AssemblyInspectionEngine.TestPopEBP (1230 of 1675) PASS: lldb-Unit :: UnwindAssembly/x86/./UnwindAssemblyx86Tests/Testx86AssemblyInspectionEngine.TestMovRSPtoRBP (1231 of 1675) PASS: lldb-Unit :: UnwindAssembly/x86/./UnwindAssemblyx86Tests/Testx86AssemblyInspectionEngine.TestPopEDI (1232 of 1675) PASS: lldb-Unit :: UnwindAssembly/x86/./UnwindAssemblyx86Tests/Testx86AssemblyInspectionEngine.TestPopESI (1233 of 1675) PASS: lldb-Unit :: UnwindAssembly/x86/./UnwindAssemblyx86Tests/Testx86AssemblyInspectionEngine.TestPopEBX (1234 of 1675) PASS: lldb-Unit :: UnwindAssembly/x86/./UnwindAssemblyx86Tests/Testx86AssemblyInspectionEngine.TestPopR13 (1235 of 1675) PASS: lldb-Unit :: UnwindAssembly/x86/./UnwindAssemblyx86Tests/Testx86AssemblyInspectionEngine.TestPopR12 (1236 of 1675) PASS: lldb-Unit :: UnwindAssembly/x86/./UnwindAssemblyx86Tests/Testx86AssemblyInspectionEngine.TestPopR14 (1237 of 1675) PASS: lldb-Unit :: UnwindAssembly/x86/./UnwindAssemblyx86Tests/Testx86AssemblyInspectionEngine.TestPopR15 (1238 of 1675) PASS: lldb-Unit :: UnwindAssembly/x86/./UnwindAssemblyx86Tests/Testx86AssemblyInspectionEngine.TestPopRBP (1239 of 1675) PASS: lldb-Unit :: UnwindAssembly/x86/./UnwindAssemblyx86Tests/Testx86AssemblyInspectionEngine.TestPopRBPWithREX (1240 of 1675) PASS: lldb-Unit :: UnwindAssembly/x86/./UnwindAssemblyx86Tests/Testx86AssemblyInspectionEngine.TestPopRBX (1241 of 1675) PASS: lldb-Unit :: UnwindAssembly/x86/./UnwindAssemblyx86Tests/Testx86AssemblyInspectionEngine.TestPush0 (1242 of 1675) PASS: lldb-Unit :: UnwindAssembly/x86/./UnwindAssemblyx86Tests/Testx86AssemblyInspectionEngine.TestPushEAX (1243 of 1675) PASS: lldb-Unit :: UnwindAssembly/x86/./UnwindAssemblyx86Tests/Testx86AssemblyInspectionEngine.TestPushEBP (1244 of 1675) PASS: lldb-Unit :: UnwindAssembly/x86/./UnwindAssemblyx86Tests/Testx86AssemblyInspectionEngine.TestPushEBX (1245 of 1675) PASS: lldb-Unit :: UnwindAssembly/x86/./UnwindAssemblyx86Tests/Testx86AssemblyInspectionEngine.TestPushECX (1246 of 1675) PASS: lldb-Unit :: UnwindAssembly/x86/./UnwindAssemblyx86Tests/Testx86AssemblyInspectionEngine.TestPushEDI (1247 of 1675) PASS: lldb-Unit :: UnwindAssembly/x86/./UnwindAssemblyx86Tests/Testx86AssemblyInspectionEngine.TestPushEDX (1248 of 1675) PASS: lldb-Unit :: UnwindAssembly/x86/./UnwindAssemblyx86Tests/Testx86AssemblyInspectionEngine.TestPushESI (1249 of 1675) PASS: lldb-Unit :: UnwindAssembly/x86/./UnwindAssemblyx86Tests/Testx86AssemblyInspectionEngine.TestPushImm (1250 of 1675) PASS: lldb-Unit :: UnwindAssembly/x86/./UnwindAssemblyx86Tests/Testx86AssemblyInspectionEngine.TestPushExtended (1251 of 1675) PASS: lldb-Unit :: UnwindAssembly/x86/./UnwindAssemblyx86Tests/Testx86AssemblyInspectionEngine.TestPushR12 (1252 of 1675) PASS: lldb-Unit :: UnwindAssembly/x86/./UnwindAssemblyx86Tests/Testx86AssemblyInspectionEngine.TestPushR13 (1253 of 1675) PASS: lldb-Unit :: UnwindAssembly/x86/./UnwindAssemblyx86Tests/Testx86AssemblyInspectionEngine.TestPushR15 (1254 of 1675) PASS: lldb-Unit :: UnwindAssembly/x86/./UnwindAssemblyx86Tests/Testx86AssemblyInspectionEngine.TestPushR14 (1255 of 1675) PASS: lldb-Suite :: tools/lldb-server/TestGdbRemote_vCont.py (1256 of 1675) PASS: lldb-Unit :: UnwindAssembly/x86/./UnwindAssemblyx86Tests/Testx86AssemblyInspectionEngine.TestPushRBX (1257 of 1675) PASS: lldb-Unit :: UnwindAssembly/x86/./UnwindAssemblyx86Tests/Testx86AssemblyInspectionEngine.TestPushRBP (1258 of 1675) PASS: lldb-Unit :: UnwindAssembly/x86/./UnwindAssemblyx86Tests/Testx86AssemblyInspectionEngine.TestPushRBPWithREX (1259 of 1675) PASS: lldb-Unit :: UnwindAssembly/x86/./UnwindAssemblyx86Tests/Testx86AssemblyInspectionEngine.TestReturnDetect (1260 of 1675) PASS: lldb-Unit :: UnwindAssembly/x86/./UnwindAssemblyx86Tests/Testx86AssemblyInspectionEngine.TestSimple64bitFrameFunction (1261 of 1675) PASS: lldb-Unit :: UnwindAssembly/x86/./UnwindAssemblyx86Tests/Testx86AssemblyInspectionEngine.TestSimple32bitFrameFunction (1262 of 1675) PASS: lldb-Unit :: UnwindAssembly/x86/./UnwindAssemblyx86Tests/Testx86AssemblyInspectionEngine.TestSimplei386ugmented (1263 of 1675) PASS: lldb-Unit :: UnwindAssembly/x86/./UnwindAssemblyx86Tests/Testx86AssemblyInspectionEngine.TestSimplex86_64Augmented (1264 of 1675) PASS: lldb-Unit :: UnwindAssembly/x86/./UnwindAssemblyx86Tests/Testx86AssemblyInspectionEngine.TestStackRealign32BitDisp_x86_64 (1265 of 1675) PASS: lldb-Unit :: UnwindAssembly/x86/./UnwindAssemblyx86Tests/Testx86AssemblyInspectionEngine.TestSpillRegToStackViaMOVi386 (1266 of 1675) PASS: lldb-Unit :: UnwindAssembly/x86/./UnwindAssemblyx86Tests/Testx86AssemblyInspectionEngine.TestSpillRegToStackViaMOVx86_64 (1267 of 1675) PASS: lldb-Unit :: UnwindAssembly/x86/./UnwindAssemblyx86Tests/Testx86AssemblyInspectionEngine.TestStackRealign8BitDisp_i386 (1268 of 1675) PASS: lldb-Unit :: UnwindAssembly/x86/./UnwindAssemblyx86Tests/Testx86AssemblyInspectionEngine.TestSubESP (1269 of 1675) PASS: lldb-Unit :: UnwindAssembly/x86/./UnwindAssemblyx86Tests/Testx86AssemblyInspectionEngine.TestStackRealignMSVC_i386 (1270 of 1675) PASS: lldb-Unit :: UnwindAssembly/x86/./UnwindAssemblyx86Tests/Testx86AssemblyInspectionEngine.Testi386IgnoredRegisters (1271 of 1675) PASS: lldb-Unit :: UnwindAssembly/x86/./UnwindAssemblyx86Tests/Testx86AssemblyInspectionEngine.TestSubRSP (1272 of 1675) PASS: lldb-Unit :: Utility/./UtilityTests/AnsiTerminal.AtEnd (1273 of 1675) PASS: lldb-Unit :: Utility/./UtilityTests/AnsiTerminal.AtStart (1274 of 1675) PASS: lldb-Unit :: Utility/./UtilityTests/AnsiTerminal.Empty (1275 of 1675) PASS: lldb-Unit :: Utility/./UtilityTests/AnsiTerminal.Basic (1276 of 1675) PASS: lldb-Unit :: Utility/./UtilityTests/AnsiTerminal.KnownPrefix (1277 of 1675) PASS: lldb-Unit :: Utility/./UtilityTests/AnsiTerminal.Twice (1278 of 1675) PASS: lldb-Unit :: Utility/./UtilityTests/AnsiTerminal.Incomplete (1279 of 1675) PASS: lldb-Unit :: Utility/./UtilityTests/AnsiTerminal.Unknown (1280 of 1675) PASS: lldb-Unit :: Utility/./UtilityTests/ArchSpecTest.Compatibility (1281 of 1675) PASS: lldb-Unit :: Utility/./UtilityTests/AnsiTerminal.WhiteSpace (1282 of 1675) PASS: lldb-Unit :: Utility/./UtilityTests/ArchSpecTest.MergeFromMachOUnknown (1283 of 1675) PASS: lldb-Unit :: Utility/./UtilityTests/ArchSpecTest.MergeFrom (1284 of 1675) PASS: lldb-Suite :: warnings/uuid/TestAddDsymCommand.py (1285 of 1675) PASS: lldb-Unit :: Utility/./UtilityTests/ArchSpecTest.TestParseMachCPUDashSubtypeTripleSimple (1286 of 1675) PASS: lldb-Unit :: Utility/./UtilityTests/ArchSpecTest.OperatorBool (1287 of 1675) PASS: lldb-Unit :: Utility/./UtilityTests/ArchSpecTest.TestSetTriple (1288 of 1675) PASS: lldb-Unit :: Utility/./UtilityTests/ArchSpecTest.TestParseMachCPUDashSubtypeTripleExtra (1289 of 1675) PASS: lldb-Unit :: Utility/./UtilityTests/ArchSpecTest.TripleComponentsWereSpecified (1290 of 1675) PASS: lldb-Unit :: Utility/./UtilityTests/ArgsTest.BareSingleQuote (1291 of 1675) PASS: lldb-Unit :: Utility/./UtilityTests/ArgsTest.AppendArguments (1292 of 1675) PASS: lldb-Unit :: Utility/./UtilityTests/ArgsTest.DoubleQuotedItem (1293 of 1675) PASS: lldb-Unit :: Utility/./UtilityTests/ArgsTest.GetArgumentArrayRef (1294 of 1675) PASS: lldb-Unit :: Utility/./UtilityTests/ArgsTest.EscapeLLDBCommandArgument (1295 of 1675) PASS: lldb-Unit :: Utility/./UtilityTests/ArgsTest.GetQuotedCommandString (1296 of 1675) PASS: lldb-Unit :: Utility/./UtilityTests/ArgsTest.TestAppendArg (1297 of 1675) PASS: lldb-Unit :: Utility/./UtilityTests/ArgsTest.StringListConstructor (1298 of 1675) PASS: lldb-Unit :: Utility/./UtilityTests/ArgsTest.TestArgv (1299 of 1675) PASS: lldb-Unit :: Utility/./UtilityTests/ArgsTest.TestInsertArg (1300 of 1675) PASS: lldb-Unit :: Utility/./UtilityTests/ArgsTest.TestSingleArg (1301 of 1675) PASS: lldb-Unit :: Utility/./UtilityTests/ArgsTest.TestOverwriteArgs (1302 of 1675) PASS: lldb-Unit :: Utility/./UtilityTests/ArgsTest.TestSingleArgWithQuotedSpace (1303 of 1675) PASS: lldb-Unit :: Utility/./UtilityTests/ArgsTest.TestMultipleArgs (1304 of 1675) PASS: lldb-Unit :: Utility/./UtilityTests/ArgsTest.TestSingleQuotedArgWithSpace (1305 of 1675) PASS: lldb-Unit :: Utility/./UtilityTests/BinaryStreamTest.PutSLEB128FourBytes (1306 of 1675) PASS: lldb-Unit :: Utility/./UtilityTests/BinaryStreamTest.PutSLEB128NineBytes (1307 of 1675) PASS: lldb-Unit :: Utility/./UtilityTests/BinaryStreamTest.PutSLEB128FiveBytes (1308 of 1675) PASS: lldb-Suite :: tools/lldb-server/TestGdbRemoteThreadsInStopReply.py (1309 of 1675) PASS: lldb-Unit :: Utility/./UtilityTests/BinaryStreamTest.PutSLEB128MaxValue (1310 of 1675) PASS: lldb-Unit :: Utility/./UtilityTests/BinaryStreamTest.PutSLEB128EightBytes (1311 of 1675) PASS: lldb-Unit :: Utility/./UtilityTests/BinaryStreamTest.PutSLEB128SevenBytes (1312 of 1675) PASS: lldb-Unit :: Utility/./UtilityTests/BinaryStreamTest.PutSLEB128TwoBytes (1313 of 1675) PASS: lldb-Unit :: Utility/./UtilityTests/BinaryStreamTest.PutSLEB128One (1314 of 1675) PASS: lldb-Unit :: Utility/./UtilityTests/BinaryStreamTest.PutSLEB128ThreeBytes (1315 of 1675) PASS: lldb-Unit :: Utility/./UtilityTests/BinaryStreamTest.PutSLEB128OneByte (1316 of 1675) PASS: lldb-Unit :: Utility/./UtilityTests/BinaryStreamTest.PutSLEB128SixBytes (1317 of 1675) PASS: lldb-Unit :: Utility/./UtilityTests/BinaryStreamTest.PutSLEB128Zero (1318 of 1675) PASS: lldb-Unit :: Utility/./UtilityTests/BinaryStreamTest.PutULEB128FiveBytes (1319 of 1675) PASS: lldb-Unit :: Utility/./UtilityTests/BinaryStreamTest.PutULEB128FourBytes (1320 of 1675) PASS: lldb-Unit :: Utility/./UtilityTests/BinaryStreamTest.PutULEB128EightBytes (1321 of 1675) PASS: lldb-Unit :: Utility/./UtilityTests/BinaryStreamTest.PutULEB128NineBytes (1322 of 1675) PASS: lldb-Unit :: Utility/./UtilityTests/BinaryStreamTest.PutULEB128MaxValue (1323 of 1675) PASS: lldb-Unit :: Utility/./UtilityTests/BinaryStreamTest.PutULEB128SixBytes (1324 of 1675) PASS: lldb-Unit :: Utility/./UtilityTests/BinaryStreamTest.PutULEB128ThreeBytes (1325 of 1675) PASS: lldb-Unit :: Utility/./UtilityTests/BinaryStreamTest.PutULEB128One (1326 of 1675) PASS: lldb-Unit :: Utility/./UtilityTests/BinaryStreamTest.PutULEB128SevenBytes (1327 of 1675) PASS: lldb-Unit :: Utility/./UtilityTests/BinaryStreamTest.PutULEB128OneByte (1328 of 1675) PASS: lldb-Unit :: Utility/./UtilityTests/BinaryStreamTest.PutULEB128TwoBytes (1329 of 1675) PASS: lldb-Unit :: Utility/./UtilityTests/CleanUpTest.disable (1330 of 1675) PASS: lldb-Unit :: Utility/./UtilityTests/CleanUpTest.multiple_args (1331 of 1675) PASS: lldb-Unit :: Utility/./UtilityTests/BroadcasterTest.BroadcastEvent (1332 of 1675) PASS: lldb-Unit :: Utility/./UtilityTests/BroadcasterTest.EventTypeHasListeners (1333 of 1675) PASS: lldb-Unit :: Utility/./UtilityTests/BinaryStreamTest.PutULEB128Zero (1334 of 1675) PASS: lldb-Unit :: Utility/./UtilityTests/CleanUpTest.no_args (1335 of 1675) PASS: lldb-Unit :: Utility/./UtilityTests/CompletionRequest.TestCompletionOwnership (1336 of 1675) PASS: lldb-Unit :: Utility/./UtilityTests/ConstStringTest.CompareStringRef (1337 of 1675) PASS: lldb-Unit :: Utility/./UtilityTests/CompletionRequest.DuplicateFilteringWithComments (1338 of 1675) PASS: lldb-Unit :: Utility/./UtilityTests/CompletionRequest.DuplicateFiltering (1339 of 1675) PASS: lldb-Unit :: Utility/./UtilityTests/CompletionRequest.Constructor (1340 of 1675) PASS: lldb-Unit :: Utility/./UtilityTests/ConstStringTest.CompareConstString (1341 of 1675) PASS: lldb-Unit :: Utility/./UtilityTests/ConstStringTest.UpdateMangledCounterpart (1342 of 1675) PASS: lldb-Unit :: Utility/./UtilityTests/ConstStringTest.NullAndEmptyStates (1343 of 1675) PASS: lldb-Unit :: Utility/./UtilityTests/ConstStringTest.FromMidOfBufferStringRef (1344 of 1675) PASS: lldb-Unit :: Utility/./UtilityTests/ConstStringTest.MangledCounterpart (1345 of 1675) PASS: lldb-Unit :: Utility/./UtilityTests/DataExtractorTest.GetBitfield (1346 of 1675) PASS: lldb-Unit :: Utility/./UtilityTests/ConstStringTest.format_provider (1347 of 1675) PASS: lldb-Unit :: Utility/./UtilityTests/DataExtractorTest.PeekData (1348 of 1675) PASS: lldb-Unit :: Utility/./UtilityTests/DataExtractorTest.GetMaxS64 (1349 of 1675) PASS: lldb-Unit :: Utility/./UtilityTests/DeserializerTest.HasData (1350 of 1675) PASS: lldb-Unit :: Utility/./UtilityTests/EnvironmentTest.EnvpConstruction (1351 of 1675) PASS: lldb-Unit :: Utility/./UtilityTests/DataExtractorTest.GetMaxU64 (1352 of 1675) PASS: lldb-Unit :: Utility/./UtilityTests/DataExtractorTest.GetMaxU64_unchecked (1353 of 1675) PASS: lldb-Unit :: Utility/./UtilityTests/FileSpecTest.EqualDotsPosix (1354 of 1675) PASS: lldb-Unit :: Utility/./UtilityTests/EnvironmentTest.EnvpConversion (1355 of 1675) PASS: lldb-Unit :: Utility/./UtilityTests/EventTest.DumpEventDataBytes (1356 of 1675) PASS: lldb-Unit :: Utility/./UtilityTests/FileSpecTest.AppendPathComponent (1357 of 1675) PASS: lldb-Unit :: Utility/./UtilityTests/FileSpecTest.CopyByAppendingPathComponent (1358 of 1675) PASS: lldb-Unit :: Utility/./UtilityTests/FileSpecTest.EqualDotsPosixRoot (1359 of 1675) PASS: lldb-Unit :: Utility/./UtilityTests/FileSpecTest.EqualDotsWindows (1360 of 1675) PASS: lldb-Unit :: Utility/./UtilityTests/FileSpecTest.FileAndDirectoryComponents (1361 of 1675) PASS: lldb-Unit :: Utility/./UtilityTests/FileSpecTest.GuessPathStyle (1362 of 1675) PASS: lldb-Unit :: Utility/./UtilityTests/FileSpecTest.FormatFileSpec (1363 of 1675) PASS: lldb-Unit :: Utility/./UtilityTests/FileSpecTest.EqualSeparator (1364 of 1675) PASS: lldb-Unit :: Utility/./UtilityTests/FileSpecTest.GetNormalizedPath (1365 of 1675) PASS: lldb-Unit :: Utility/./UtilityTests/Flags.AllClear (1366 of 1675) PASS: lldb-Unit :: Utility/./UtilityTests/FileSpecTest.PrependPathComponent (1367 of 1675) PASS: lldb-Unit :: Utility/./UtilityTests/FileSpecTest.IsRelative (1368 of 1675) PASS: lldb-Unit :: Utility/./UtilityTests/Flags.AllSet (1369 of 1675) PASS: lldb-Unit :: Utility/./UtilityTests/FileSpecTest.RemoveLastPathComponent (1370 of 1675) PASS: lldb-Unit :: Utility/./UtilityTests/Flags.AnyClear (1371 of 1675) PASS: lldb-Unit :: Utility/./UtilityTests/Flags.ClearCount (1372 of 1675) PASS: lldb-Unit :: Utility/./UtilityTests/Flags.IsClear (1373 of 1675) PASS: lldb-Unit :: Utility/./UtilityTests/Flags.GetBitSize (1374 of 1675) PASS: lldb-Unit :: Utility/./UtilityTests/Flags.Reset (1375 of 1675) PASS: lldb-Unit :: Utility/./UtilityTests/Flags.AnySet (1376 of 1675) PASS: lldb-Unit :: Utility/./UtilityTests/Flags.Clear (1377 of 1675) PASS: lldb-Unit :: Utility/./UtilityTests/IndexToObjectTest.ObjectForIndex (1378 of 1675) PASS: lldb-Unit :: Utility/./UtilityTests/GeneratorTest.Create (1379 of 1675) PASS: lldb-Unit :: Utility/./UtilityTests/GeneratorTest.GetOrCreate (1380 of 1675) PASS: lldb-Unit :: Utility/./UtilityTests/GeneratorTest.Get (1381 of 1675) PASS: lldb-Unit :: Utility/./UtilityTests/Flags.SetCount (1382 of 1675) PASS: lldb-Unit :: Utility/./UtilityTests/Flags.Test (1383 of 1675) PASS: lldb-Unit :: Utility/./UtilityTests/JSONTest.Dictionary (1384 of 1675) PASS: lldb-Unit :: Utility/./UtilityTests/JSONTest.Newlines (1385 of 1675) PASS: lldb-Unit :: Utility/./UtilityTests/LogChannelEnabledTest.LLDB_LOG_ERROR (1386 of 1675) PASS: lldb-Unit :: Utility/./UtilityTests/ListenerTest.GetEventImmediate (1387 of 1675) PASS: lldb-Unit :: Utility/./UtilityTests/LogChannelEnabledTest.LogGetLogThread (1388 of 1675) PASS: lldb-Unit :: Utility/./UtilityTests/LogChannelEnabledTest.log_options (1389 of 1675) PASS: lldb-Unit :: Utility/./UtilityTests/LogChannelEnabledTest.LogThread (1390 of 1675) PASS: lldb-Unit :: Utility/./UtilityTests/LogChannelTest.Disable (1391 of 1675) PASS: lldb-Unit :: Utility/./UtilityTests/LogChannelEnabledTest.LogVerboseThread (1392 of 1675) PASS: lldb-Unit :: Utility/./UtilityTests/LogChannelTest.Enable (1393 of 1675) PASS: lldb-Unit :: Utility/./UtilityTests/LogTest.Unregister (1394 of 1675) PASS: lldb-Unit :: Utility/./UtilityTests/LogTest.LLDB_LOG_nullptr (1395 of 1675) PASS: lldb-Unit :: Utility/./UtilityTests/LogChannelTest.List (1396 of 1675) PASS: lldb-Unit :: Utility/./UtilityTests/LogTest.Register (1397 of 1675) PASS: lldb-Unit :: Utility/./UtilityTests/LogChannelTest.EnableOptions (1398 of 1675) PASS: lldb-Unit :: Utility/./UtilityTests/ListenerTest.GetEventWait (1399 of 1675) PASS: lldb-Unit :: Utility/./UtilityTests/NameMatchesTest.Ignore (1400 of 1675) PASS: lldb-Unit :: Utility/./UtilityTests/NameMatchesTest.EndsWith (1401 of 1675) PASS: lldb-Unit :: Utility/./UtilityTests/NameMatchesTest.Contains (1402 of 1675) PASS: lldb-Unit :: Utility/./UtilityTests/NameMatchesTest.Equals (1403 of 1675) PASS: lldb-Unit :: Utility/./UtilityTests/NameMatchesTest.StartsWith (1404 of 1675) PASS: lldb-Unit :: Utility/./UtilityTests/NameMatchesTest.RegularExpression (1405 of 1675) PASS: lldb-Unit :: Utility/./UtilityTests/OptionsWithRawTest.ArgsButNoDelimiter (1406 of 1675) PASS: lldb-Unit :: Utility/./UtilityTests/OptionsWithRawTest.EmptyArgsOnlySuffix (1407 of 1675) PASS: lldb-Unit :: Utility/./UtilityTests/OptionsWithRawTest.EmptyInput (1408 of 1675) PASS: lldb-Unit :: Utility/./UtilityTests/OptionsWithRawTest.ArgsButNoLeadingDash (1409 of 1675) PASS: lldb-Unit :: Utility/./UtilityTests/OptionsWithRawTest.EmptySuffixSingleWhitespace (1410 of 1675) PASS: lldb-Unit :: Utility/./UtilityTests/OptionsWithRawTest.EmptySuffix (1411 of 1675) PASS: lldb-Unit :: Utility/./UtilityTests/OptionsWithRawTest.MultiWordSuffix (1412 of 1675) PASS: lldb-Unit :: Utility/./UtilityTests/OptionsWithRawTest.QuotedSuffix (1413 of 1675) PASS: lldb-Unit :: Utility/./UtilityTests/OptionsWithRawTest.TerminatedQuote (1414 of 1675) PASS: lldb-Unit :: Utility/./UtilityTests/OptionsWithRawTest.LeadingSpaceArgs (1415 of 1675) PASS: lldb-Unit :: Utility/./UtilityTests/OptionsWithRawTest.SingleWordSuffix (1416 of 1675) PASS: lldb-Unit :: Utility/./UtilityTests/OptionsWithRawTest.SingleWhitespaceInput (1417 of 1675) PASS: lldb-Unit :: Utility/./UtilityTests/OptionsWithRawTest.WhitespaceInput (1418 of 1675) PASS: lldb-Unit :: Utility/./UtilityTests/OptionsWithRawTest.UnterminatedQuote (1419 of 1675) PASS: lldb-Unit :: Utility/./UtilityTests/OptionsWithRawTest.WhitespaceSuffix (1420 of 1675) PASS: lldb-Unit :: Utility/./UtilityTests/ProcessInfoTest.Constructor (1421 of 1675) PASS: lldb-Unit :: Utility/./UtilityTests/Predicate.WaitForValueNotEqualTo (1422 of 1675) PASS: lldb-Unit :: Utility/./UtilityTests/RangeTest.Clear (1423 of 1675) PASS: lldb-Unit :: Utility/./UtilityTests/RangeDataVector.FindEntryThatContains_Overlap (1424 of 1675) PASS: lldb-Unit :: Utility/./UtilityTests/RangeTest.ClearWithStarAddress (1425 of 1675) PASS: lldb-Unit :: Utility/./UtilityTests/RangeDataVector.FindEntryThatContains (1426 of 1675) PASS: lldb-Unit :: Utility/./UtilityTests/RangeTest.Constructor (1427 of 1675) PASS: lldb-Unit :: Utility/./UtilityTests/RangeTest.ContainsAddrInvalid (1428 of 1675) PASS: lldb-Unit :: Utility/./UtilityTests/RangeTest.ContainsEndInclusiveInvalid (1429 of 1675) PASS: lldb-Unit :: Utility/./UtilityTests/RangeTest.ContainsAddr (1430 of 1675) PASS: lldb-Unit :: Utility/./UtilityTests/RangeTest.ContainsEndInclusive (1431 of 1675) PASS: lldb-Unit :: Utility/./UtilityTests/RangeTest.ContainsRange (1432 of 1675) PASS: lldb-Unit :: Utility/./UtilityTests/RangeTest.ContainsRangeStartingFromZero (1433 of 1675) PASS: lldb-Unit :: Utility/./UtilityTests/RangeTest.Copy (1434 of 1675) PASS: lldb-Unit :: Utility/./UtilityTests/RangeTest.DefaultConstructor (1435 of 1675) PASS: lldb-Unit :: Utility/./UtilityTests/RangeTest.DoesAdjoinOrIntersect (1436 of 1675) PASS: lldb-Unit :: Utility/./UtilityTests/RangeTest.DoesIntersect (1437 of 1675) PASS: lldb-Unit :: Utility/./UtilityTests/RangeTest.Equal (1438 of 1675) PASS: lldb-Unit :: Utility/./UtilityTests/RangeTest.EqualInvalid (1439 of 1675) PASS: lldb-Unit :: Utility/./UtilityTests/RangeTest.LessThan (1440 of 1675) PASS: lldb-Unit :: Utility/./UtilityTests/RangeTest.LessThanInvalid (1441 of 1675) PASS: lldb-Unit :: Utility/./UtilityTests/RangeTest.SetRangeBase (1442 of 1675) PASS: lldb-Unit :: Utility/./UtilityTests/RangeTest.NotEqual (1443 of 1675) PASS: lldb-Unit :: Utility/./UtilityTests/RangeTest.NotEqualInvalid (1444 of 1675) PASS: lldb-Unit :: Utility/./UtilityTests/RangeTest.Slide (1445 of 1675) PASS: lldb-Unit :: Utility/./UtilityTests/RangeTest.SizeTypes (1446 of 1675) PASS: lldb-Unit :: Utility/./UtilityTests/RecordReplayTest.InstrumentedBarPtr (1447 of 1675) PASS: lldb-Unit :: Utility/./UtilityTests/RecordReplayTest.InstrumentedBar (1448 of 1675) PASS: lldb-Unit :: Utility/./UtilityTests/RecordReplayTest.InstrumentedBarRef (1449 of 1675) PASS: lldb-Unit :: Utility/./UtilityTests/RangeTest.Union (1450 of 1675) PASS: lldb-Unit :: Utility/./UtilityTests/RangeTest.SlideZero (1451 of 1675) PASS: lldb-Unit :: Utility/./UtilityTests/Predicate.WaitForValueEqualTo (1452 of 1675) PASS: lldb-Unit :: Utility/./UtilityTests/RecordReplayTest.InstrumentedFooSameThis (1453 of 1675) PASS: lldb-Unit :: Utility/./UtilityTests/RegisterValueTest.GetSet8 (1454 of 1675) PASS: lldb-Unit :: Utility/./UtilityTests/RecordReplayTest.InstrumentedFoo (1455 of 1675) PASS: lldb-Unit :: Utility/./UtilityTests/ReproducerTest.SetCapture (1456 of 1675) PASS: lldb-Unit :: Utility/./UtilityTests/ReproducerTest.SetReplay (1457 of 1675) PASS: lldb-Unit :: Utility/./UtilityTests/ScalarTest.APIntConstructor (1458 of 1675) PASS: lldb-Unit :: Utility/./UtilityTests/ScalarTest.ComparisonFloat (1459 of 1675) PASS: lldb-Unit :: Utility/./UtilityTests/ScalarTest.Comparison (1460 of 1675) PASS: lldb-Unit :: Utility/./UtilityTests/ScalarTest.CastOperations (1461 of 1675) PASS: lldb-Unit :: Utility/./UtilityTests/ScalarTest.Equality (1462 of 1675) PASS: lldb-Unit :: Utility/./UtilityTests/ScalarTest.Division (1463 of 1675) PASS: lldb-Unit :: Utility/./UtilityTests/ScalarTest.ExtractBitfield (1464 of 1675) PASS: lldb-Unit :: Utility/./UtilityTests/ScalarTest.Promotion (1465 of 1675) PASS: lldb-Unit :: Utility/./UtilityTests/ScalarTest.GetBytes (1466 of 1675) PASS: lldb-Unit :: Utility/./UtilityTests/ScalarTest.Scalar_512 (1467 of 1675) PASS: lldb-Unit :: Utility/./UtilityTests/ScalarTest.SetValueFromCString (1468 of 1675) PASS: lldb-Unit :: Utility/./UtilityTests/ScalarTest.GetValue (1469 of 1675) PASS: lldb-Unit :: Utility/./UtilityTests/ScalarTest.RightShiftOperator (1470 of 1675) PASS: lldb-Unit :: Utility/./UtilityTests/SerializationRountripTest.SerializeDeserializeObjectReference (1471 of 1675) PASS: lldb-Unit :: Utility/./UtilityTests/SerializationRountripTest.SerializeDeserializeObjectPointer (1472 of 1675) PASS: lldb-Unit :: Utility/./UtilityTests/SerializationRountripTest.SerializeDeserializeCString (1473 of 1675) PASS: lldb-Unit :: Utility/./UtilityTests/SerializationRountripTest.SerializeDeserializePod (1474 of 1675) PASS: lldb-Unit :: Utility/./UtilityTests/SerializationRountripTest.SerializeDeserializePodPointers (1475 of 1675) PASS: lldb-Unit :: Utility/./UtilityTests/SerializationRountripTest.SerializeDeserializePodReferences (1476 of 1675) PASS: lldb-Unit :: Utility/./UtilityTests/StatusTest.ErrorConstructor (1477 of 1675) PASS: lldb-Unit :: Utility/./UtilityTests/StreamTeeTest.Assignment (1478 of 1675) PASS: lldb-Unit :: Utility/./UtilityTests/StateTest.Formatv (1479 of 1675) PASS: lldb-Unit :: Utility/./UtilityTests/StreamTeeTest.AppendStream (1480 of 1675) PASS: lldb-Unit :: Utility/./UtilityTests/StatusTest.ErrorConversion (1481 of 1675) PASS: lldb-Unit :: Utility/./UtilityTests/StatusTest.Formatv (1482 of 1675) PASS: lldb-Unit :: Utility/./UtilityTests/StreamTeeTest.Constructor2Streams (1483 of 1675) PASS: lldb-Unit :: Utility/./UtilityTests/StreamTeeTest.Constructor1Stream (1484 of 1675) PASS: lldb-Unit :: Utility/./UtilityTests/StreamTeeTest.CopyConstructor (1485 of 1675) PASS: lldb-Unit :: Utility/./UtilityTests/StreamTeeTest.DefaultConstructor (1486 of 1675) PASS: lldb-Unit :: Utility/./UtilityTests/StreamTeeTest.Flush (1487 of 1675) PASS: lldb-Unit :: Utility/./UtilityTests/StreamTeeTest.GetStreamAtIndexOutOfBounds (1488 of 1675) PASS: lldb-Unit :: Utility/./UtilityTests/StreamTeeTest.SetStreamAtIndexOutOfBounds (1489 of 1675) PASS: lldb-Unit :: Utility/./UtilityTests/StreamTeeTest.SetStreamAtIndexOverwrite (1490 of 1675) PASS: lldb-Unit :: Utility/./UtilityTests/StreamTeeTest.GetStreamAtIndexOutOfBoundsEmpty (1491 of 1675) PASS: lldb-Unit :: Utility/./UtilityTests/StreamTeeTest.Write (1492 of 1675) PASS: lldb-Unit :: Utility/./UtilityTests/StreamTest.ChangingByteOrder (1493 of 1675) PASS: lldb-Unit :: Utility/./UtilityTests/StreamTest.PutBytesAsRawHex8ToBigEndian (1494 of 1675) PASS: lldb-Unit :: Utility/./UtilityTests/StreamTest.PutCString (1495 of 1675) PASS: lldb-Unit :: Utility/./UtilityTests/StreamTest.PutBytesAsRawHex8ToLittleEndian (1496 of 1675) PASS: lldb-Unit :: Utility/./UtilityTests/StreamTest.PutBytesAsRawHex8ToMixedEndian (1497 of 1675) PASS: lldb-Unit :: Utility/./UtilityTests/StreamTest.PutChar (1498 of 1675) PASS: lldb-Unit :: Utility/./UtilityTests/StreamTest.PutCStringWithStringRef (1499 of 1675) PASS: lldb-Unit :: Utility/./UtilityTests/StreamTest.PutCharNull (1500 of 1675) PASS: lldb-Unit :: Utility/./UtilityTests/StreamTest.PutCharWhitespace (1501 of 1675) PASS: lldb-Unit :: Utility/./UtilityTests/StreamTest.PutHex32ByteOrderLittle (1502 of 1675) PASS: lldb-Unit :: Utility/./UtilityTests/StreamTest.PutHex32ByteOrderBig (1503 of 1675) PASS: lldb-Unit :: Utility/./UtilityTests/StreamTest.PutHex16ByteOrderBig (1504 of 1675) PASS: lldb-Unit :: Utility/./UtilityTests/StreamTest.PutHex16ByteOrderLittle (1505 of 1675) PASS: lldb-Unit :: Utility/./UtilityTests/StreamTest.PutHex64ByteOrderBig (1506 of 1675) PASS: lldb-Unit :: Utility/./UtilityTests/StreamTest.PutMaxHex64ByteOrderBig (1507 of 1675) PASS: lldb-Unit :: Utility/./UtilityTests/StreamTest.PutHex64ByteOrderLittle (1508 of 1675) PASS: lldb-Unit :: Utility/./UtilityTests/StreamTest.PutHex8 (1509 of 1675) PASS: lldb-Unit :: Utility/./UtilityTests/StreamTest.PutMaxHex64ByteOrderLittle (1510 of 1675) PASS: lldb-Unit :: Utility/./UtilityTests/StreamTest.PutPtr (1511 of 1675) PASS: lldb-Unit :: Utility/./UtilityTests/StreamTest.PutNHex8 (1512 of 1675) PASS: lldb-Unit :: Utility/./UtilityTests/StreamTest.PutRawBytesToLittleEndian (1513 of 1675) PASS: lldb-Unit :: Utility/./UtilityTests/StreamTest.PutRawBytesToBigEndian (1514 of 1675) PASS: lldb-Unit :: Utility/./UtilityTests/StreamTest.PutRawBytesToMixedEndian (1515 of 1675) PASS: lldb-Unit :: Utility/./UtilityTests/StreamTest.PutULEB128 (1516 of 1675) PASS: lldb-Unit :: Utility/./UtilityTests/StreamTest.PutSLEB128 (1517 of 1675) PASS: lldb-Unit :: Utility/./UtilityTests/StreamTest.PutStringAsRawHex8 (1518 of 1675) PASS: lldb-Unit :: Utility/./UtilityTests/StreamTest.QuotedCString (1519 of 1675) PASS: lldb-Unit :: Utility/./UtilityTests/StreamTest.ShiftOperatorInts (1520 of 1675) PASS: lldb-Unit :: Utility/./UtilityTests/StreamTest.ShiftOperatorChars (1521 of 1675) PASS: lldb-Unit :: Utility/./UtilityTests/StreamTest.ShiftOperatorPtr (1522 of 1675) PASS: lldb-Unit :: Utility/./UtilityTests/StreamTest.ShiftOperatorUInts (1523 of 1675) PASS: lldb-Unit :: Utility/./UtilityTests/StreamTest.ShiftOperatorStrings (1524 of 1675) PASS: lldb-Unit :: Utility/./UtilityTests/StringExtractorTest.DecodeHexU8_Exact (1525 of 1675) PASS: lldb-Unit :: Utility/./UtilityTests/StringExtractorTest.DecodeHexU8_InvalidHex (1526 of 1675) PASS: lldb-Unit :: Utility/./UtilityTests/StringExtractorTest.DecodeHexU8_Extra (1527 of 1675) PASS: lldb-Unit :: Utility/./UtilityTests/StringExtractorTest.DecodeHexU8_Underflow (1528 of 1675) PASS: lldb-Unit :: Utility/./UtilityTests/StringExtractorTest.DecodeHexU8_Underflow2 (1529 of 1675) PASS: lldb-Unit :: Utility/./UtilityTests/StringExtractorTest.DecodeHexU8_InvalidHex2 (1530 of 1675) PASS: lldb-Unit :: Utility/./UtilityTests/StringExtractorTest.GetHexBytes (1531 of 1675) PASS: lldb-Unit :: Utility/./UtilityTests/StringExtractorTest.GetHexBytesAvail (1532 of 1675) PASS: lldb-Unit :: Utility/./UtilityTests/StringExtractorTest.GetHexBytesAvail_FullString (1533 of 1675) PASS: lldb-Unit :: Utility/./UtilityTests/StringExtractorTest.GetHexBytesAvail_Partial (1534 of 1675) PASS: lldb-Unit :: Utility/./UtilityTests/StringExtractorTest.GetHexBytesAvail_OddPair (1535 of 1675) PASS: lldb-Unit :: Utility/./UtilityTests/StringExtractorTest.GetHexBytesAvail_OddPair2 (1536 of 1675) PASS: lldb-Suite :: types/TestRecursiveTypes.py (1537 of 1675) PASS: lldb-Unit :: Utility/./UtilityTests/StringExtractorTest.GetHexBytesAvail_Underflow (1538 of 1675) PASS: lldb-Unit :: Utility/./UtilityTests/StringExtractorTest.GetHexBytes_FullString (1539 of 1675) PASS: lldb-Unit :: Utility/./UtilityTests/StringExtractorTest.GetHexBytes_OddPair (1540 of 1675) PASS: lldb-Unit :: Utility/./UtilityTests/StringExtractorTest.GetHexBytes_Underflow (1541 of 1675) PASS: lldb-Unit :: Utility/./UtilityTests/StringExtractorTest.GetHexBytes_OddPair2 (1542 of 1675) PASS: lldb-Unit :: Utility/./UtilityTests/StringExtractorTest.GetHexU8_Exact (1543 of 1675) PASS: lldb-Unit :: Utility/./UtilityTests/StringExtractorTest.GetHexBytes_Partial (1544 of 1675) PASS: lldb-Unit :: Utility/./UtilityTests/StringExtractorTest.GetHexU8_Exact_NoEof (1545 of 1675) PASS: lldb-Unit :: Utility/./UtilityTests/StringExtractorTest.GetHexU8_Extra_NoEof (1546 of 1675) PASS: lldb-Unit :: Utility/./UtilityTests/StringExtractorTest.GetHexU8_Extra (1547 of 1675) PASS: lldb-Unit :: Utility/./UtilityTests/StringExtractorTest.GetHexU8_InvalidHex (1548 of 1675) PASS: lldb-Unit :: Utility/./UtilityTests/StringExtractorTest.GetHexU8_Underflow2 (1549 of 1675) PASS: lldb-Unit :: Utility/./UtilityTests/StringExtractorTest.GetHexU8_InvalidHex_NoEof (1550 of 1675) PASS: lldb-Unit :: Utility/./UtilityTests/StringExtractorTest.GetHexU8_Underflow (1551 of 1675) PASS: lldb-Unit :: Utility/./UtilityTests/StringExtractorTest.GetNameColonValueContainsColon (1552 of 1675) PASS: lldb-Unit :: Utility/./UtilityTests/StringExtractorTest.GetHexU8_Underflow_NoEof (1553 of 1675) PASS: lldb-Unit :: Utility/./UtilityTests/StringExtractorTest.GetHexU8_Underflow2_NoEof (1554 of 1675) PASS: lldb-Unit :: Utility/./UtilityTests/StringExtractorTest.GetNameColonValueNoSemicolon (1555 of 1675) PASS: lldb-Unit :: Utility/./UtilityTests/StringExtractorTest.GetNameColonValueNoColon (1556 of 1675) PASS: lldb-Unit :: Utility/./UtilityTests/StringExtractorTest.GetU32BigEndian (1557 of 1675) PASS: lldb-Unit :: Utility/./UtilityTests/StringExtractorTest.GetNameColonValueSuccess (1558 of 1675) PASS: lldb-Unit :: Utility/./UtilityTests/StringExtractorTest.GetU32LittleEndian (1559 of 1675) PASS: lldb-Unit :: Utility/./UtilityTests/StringExtractorTest.GetU64BigEndian (1560 of 1675) PASS: lldb-Unit :: Utility/./UtilityTests/StringExtractorTest.GetU64LittleEndian (1561 of 1675) PASS: lldb-Unit :: Utility/./UtilityTests/StringLexerTest.GetUnlexed (1562 of 1675) PASS: lldb-Unit :: Utility/./UtilityTests/StringLexerTest.AdvanceIf (1563 of 1675) PASS: lldb-Unit :: Utility/./UtilityTests/StringExtractorTest.InitEmpty (1564 of 1675) PASS: lldb-Unit :: Utility/./UtilityTests/StringExtractorTest.InitMisc (1565 of 1675) PASS: lldb-Unit :: Utility/./UtilityTests/StringLexerTest.Next (1566 of 1675) PASS: lldb-Unit :: Utility/./UtilityTests/StringLexerTest.NextIf (1567 of 1675) PASS: lldb-Unit :: Utility/./UtilityTests/StringLexerTest.HasAtLeast (1568 of 1675) PASS: lldb-Unit :: Utility/./UtilityTests/StringLexerTest.Peek (1569 of 1675) PASS: lldb-Unit :: Utility/./UtilityTests/StringLexerTest.NextIfList (1570 of 1675) PASS: lldb-Unit :: Utility/./UtilityTests/StringLexerTest.PutBack (1571 of 1675) PASS: lldb-Unit :: Utility/./UtilityTests/StringListTest.AppendList (1572 of 1675) PASS: lldb-Unit :: Utility/./UtilityTests/StringListTest.AppendListCStringArrayEmpty (1573 of 1675) PASS: lldb-Unit :: Utility/./UtilityTests/StringListTest.AppendStringCString (1574 of 1675) PASS: lldb-Unit :: Utility/./UtilityTests/StringListTest.AppendListCStringArray (1575 of 1675) PASS: lldb-Unit :: Utility/./UtilityTests/StringListTest.Assignment (1576 of 1675) PASS: lldb-Unit :: Utility/./UtilityTests/StringListTest.Clear (1577 of 1675) PASS: lldb-Unit :: Utility/./UtilityTests/StringListTest.AppendStringStdString (1578 of 1675) PASS: lldb-Unit :: Utility/./UtilityTests/StringListTest.AppendStringMove (1579 of 1675) PASS: lldb-Unit :: Utility/./UtilityTests/StringListTest.CopyListSingle (1580 of 1675) PASS: lldb-Unit :: Utility/./UtilityTests/StringListTest.CopyList (1581 of 1675) PASS: lldb-Unit :: Utility/./UtilityTests/StringListTest.CopyListEmpty (1582 of 1675) PASS: lldb-Unit :: Utility/./UtilityTests/StringListTest.DefaultConstructor (1583 of 1675) PASS: lldb-Unit :: Utility/./UtilityTests/StringListTest.GetMaxStringLengthDecreasingSize (1584 of 1675) PASS: lldb-Unit :: Utility/./UtilityTests/StringListTest.GetMaxStringLengthEqualSize (1585 of 1675) PASS: lldb-Unit :: Utility/./UtilityTests/StringListTest.GetMaxStringLengthEmpty (1586 of 1675) PASS: lldb-Unit :: Utility/./UtilityTests/StringListTest.GetMaxStringLengthIncreasingSize (1587 of 1675) PASS: lldb-Unit :: Utility/./UtilityTests/StringListTest.GetSize (1588 of 1675) PASS: lldb-Unit :: Utility/./UtilityTests/StringListTest.GetMaxStringLengthMixed (1589 of 1675) PASS: lldb-Unit :: Utility/./UtilityTests/StringListTest.InsertStringAtIndexEnd (1590 of 1675) PASS: lldb-Unit :: Utility/./UtilityTests/StringListTest.InsertStringAtIndexStart (1591 of 1675) PASS: lldb-Unit :: Utility/./UtilityTests/StringListTest.InsertStringAtIndexMove (1592 of 1675) PASS: lldb-Unit :: Utility/./UtilityTests/StringListTest.InsertStringAtIndexOutOfBounds (1593 of 1675) PASS: lldb-Unit :: Utility/./UtilityTests/StringListTest.Join (1594 of 1675) PASS: lldb-Unit :: Utility/./UtilityTests/StringListTest.InsertStringAtIndexStdString (1595 of 1675) PASS: lldb-Unit :: Utility/./UtilityTests/StringListTest.JoinEmpty (1596 of 1675) PASS: lldb-Unit :: Utility/./UtilityTests/StringListTest.JoinMultiCharSeparator (1597 of 1675) PASS: lldb-Unit :: Utility/./UtilityTests/StringListTest.JoinThree (1598 of 1675) PASS: lldb-Unit :: Utility/./UtilityTests/StringListTest.JoinSingle (1599 of 1675) PASS: lldb-Unit :: Utility/./UtilityTests/StringListTest.JoinNonSpace (1600 of 1675) PASS: lldb-Unit :: Utility/./UtilityTests/StringListTest.LongestCommonPrefix (1601 of 1675) PASS: lldb-Unit :: Utility/./UtilityTests/StringListTest.LongestCommonPrefixDuplicateElement (1602 of 1675) PASS: lldb-Unit :: Utility/./UtilityTests/StringListTest.LongestCommonPrefixEmpty (1603 of 1675) PASS: lldb-Unit :: Utility/./UtilityTests/StringListTest.LongestCommonPrefixNoPrefix (1604 of 1675) PASS: lldb-Unit :: Utility/./UtilityTests/StringListTest.PopBack (1605 of 1675) PASS: lldb-Unit :: Utility/./UtilityTests/StringListTest.RemoveBlankLines (1606 of 1675) PASS: lldb-Unit :: Utility/./UtilityTests/StringListTest.LongestCommonPrefixSingleElement (1607 of 1675) PASS: lldb-Unit :: Utility/./UtilityTests/StringListTest.SetSize (1608 of 1675) PASS: lldb-Unit :: Utility/./UtilityTests/StringListTest.ShiftCString (1609 of 1675) PASS: lldb-Unit :: Utility/./UtilityTests/StringListTest.ShiftMove (1610 of 1675) PASS: lldb-Unit :: Utility/./UtilityTests/StringListTest.ShiftStdString (1611 of 1675) PASS: lldb-Unit :: Utility/./UtilityTests/StringListTest.SplitIntoLines (1612 of 1675) PASS: lldb-Unit :: Utility/./UtilityTests/StringListTest.SplitIntoLinesEmpty (1613 of 1675) PASS: lldb-Unit :: Utility/./UtilityTests/StringListTest.SplitIntoLinesSingleTrailingCR (1614 of 1675) PASS: lldb-Unit :: Utility/./UtilityTests/StructuredDataTest.StringDump (1615 of 1675) PASS: lldb-Unit :: Utility/./UtilityTests/StructuredDataTest.ParseJSONFromFile (1616 of 1675) PASS: lldb-Unit :: Utility/./UtilityTests/TildeExpressionResolver.ResolveFullPath (1617 of 1675) PASS: lldb-Unit :: Utility/./UtilityTests/TimeoutTest.Format (1618 of 1675) PASS: lldb-Unit :: Utility/./UtilityTests/TimeoutTest.Construction (1619 of 1675) PASS: lldb-Unit :: Utility/./UtilityTests/TimerTest.CategoryTimes (1620 of 1675) PASS: lldb-Unit :: Utility/./UtilityTests/UUIDTest.RelationalOperators (1621 of 1675) PASS: lldb-Unit :: Utility/./UtilityTests/UUIDTest.SetFromStringRef (1622 of 1675) PASS: lldb-Unit :: Utility/./UtilityTests/UUIDTest.StringConverion (1623 of 1675) PASS: lldb-Unit :: Utility/./UtilityTests/UUIDTest.Validity (1624 of 1675) PASS: lldb-Unit :: Utility/./UtilityTests/UriParserTest.BadPort (1625 of 1675) PASS: lldb-Unit :: Utility/./UtilityTests/UriParserTest.BadPort2 (1626 of 1675) PASS: lldb-Unit :: Utility/./UtilityTests/UriParserTest.BracketedHostname (1627 of 1675) PASS: lldb-Unit :: Utility/./UtilityTests/TimerTest.CategoryTimesNested (1628 of 1675) PASS: lldb-Unit :: Utility/./UtilityTests/UriParserTest.BracketedHostnamePort (1629 of 1675) PASS: lldb-Unit :: Utility/./UtilityTests/UriParserTest.BracketedHostnameWithColon (1630 of 1675) PASS: lldb-Unit :: Utility/./UtilityTests/UriParserTest.Empty (1631 of 1675) PASS: lldb-Unit :: Utility/./UtilityTests/UriParserTest.LongPath (1632 of 1675) PASS: lldb-Unit :: Utility/./UtilityTests/UriParserTest.Minimal (1633 of 1675) PASS: lldb-Unit :: Utility/./UtilityTests/UriParserTest.MinimalPath (1634 of 1675) PASS: lldb-Unit :: Utility/./UtilityTests/UriParserTest.MinimalPort (1635 of 1675) PASS: lldb-Unit :: Utility/./UtilityTests/UriParserTest.MinimalPortPath (1636 of 1675) PASS: lldb-Unit :: Utility/./UtilityTests/UriParserTest.PortOverflow (1637 of 1675) PASS: lldb-Unit :: Utility/./UtilityTests/UriParserTest.SchemeHostSeparator (1638 of 1675) PASS: lldb-Unit :: Utility/./UtilityTests/UriParserTest.SchemeHostSeparator2 (1639 of 1675) PASS: lldb-Unit :: Utility/./UtilityTests/UriParserTest.SchemeHostSeparator3 (1640 of 1675) PASS: lldb-Unit :: Utility/./UtilityTests/UriParserTest.SchemeHostSeparator4 (1641 of 1675) PASS: lldb-Unit :: Utility/./UtilityTests/UriParserTest.TypicalPortPath (1642 of 1675) PASS: lldb-Unit :: Utility/./UtilityTests/UserIDResolver.GetGroupName (1643 of 1675) PASS: lldb-Unit :: Utility/./UtilityTests/UserIDResolver.GetUserName (1644 of 1675) PASS: lldb-Unit :: Utility/./UtilityTests/VASprintfTest.BufferResize (1645 of 1675) PASS: lldb-Unit :: Utility/./UtilityTests/VASprintfTest.EncodingError (1646 of 1675) PASS: lldb-Unit :: Utility/./UtilityTests/VASprintfTest.NoBufferResize (1647 of 1675) PASS: lldb-Unit :: Utility/./UtilityTests/VMRange.Clear (1648 of 1675) PASS: lldb-Unit :: Utility/./UtilityTests/VMRange.CollectionContains (1649 of 1675) PASS: lldb-Unit :: Utility/./UtilityTests/VMRange.Comparison (1650 of 1675) PASS: lldb-Unit :: Utility/./UtilityTests/VMRange.ContainsAddr (1651 of 1675) PASS: lldb-Unit :: Utility/./UtilityTests/VMRange.ContainsRange (1652 of 1675) PASS: lldb-Unit :: Utility/./UtilityTests/VMRange.IsValid (1653 of 1675) PASS: lldb-Unit :: Utility/./UtilityTests/TimerTest.CategoryTimes2 (1654 of 1675) PASS: lldb-Unit :: Utility/./UtilityTests/VMRange.Ordering (1655 of 1675) PASS: lldb-Unit :: Utility/./UtilityTests/VMRange.Reset (1656 of 1675) PASS: lldb-Unit :: Utility/./UtilityTests/VMRange.SetEndAddress (1657 of 1675) PASS: lldb-Unit :: debugserver/./debugserverTests/RNBSocket.LoopBackConnectIPv4 (1658 of 1675) PASS: lldb-Unit :: debugserver/./debugserverTests/RNBSocket.AnyListen (1659 of 1675) PASS: lldb-Unit :: Utility/./UtilityTests/TimerTest.CategoryTimesStats (1660 of 1675) PASS: lldb-Unit :: debugserver/./debugserverTests/RNBSocket.LoopBackConnectIPv6 (1661 of 1675) PASS: lldb-Unit :: debugserver/./debugserverTests/RNBSocket.LoopBackListenIPv4 (1662 of 1675) PASS: lldb-Unit :: debugserver/./debugserverTests/RNBSocket.LoopBackListenIPv6 (1663 of 1675) PASS: lldb-Unit :: tools/lldb-server/tests/./LLDBServerTests/TestBase.LaunchModePreservesEnvironment (1664 of 1675) PASS: lldb-Unit :: tools/lldb-server/tests/./LLDBServerTests/StandardStartupTest.TestStopReplyContainsThreadPcs (1665 of 1675) PASS: lldb-Unit :: tools/lldb-server/tests/./LLDBServerTests/TestBase.DebugserverEnv (1666 of 1675) PASS: lldb-Suite :: python_api/watchpoint/watchlocation/TestSetWatchlocation.py (1667 of 1675) PASS: lldb-Suite :: types/TestDoubleTypes.py (1668 of 1675) PASS: lldb-Suite :: types/TestFloatTypesExpr.py (1669 of 1675) PASS: lldb-Suite :: types/TestFloatTypes.py (1670 of 1675) PASS: lldb-Suite :: python_api/watchpoint/watchlocation/TestTargetWatchAddress.py (1671 of 1675) PASS: lldb-Suite :: types/TestDoubleTypesExpr.py (1672 of 1675) PASS: lldb-Suite :: tools/lldb-server/TestLldbGdbServer.py (1673 of 1675) PASS: lldb-Suite :: types/TestIntegerTypes.py (1674 of 1675) PASS: lldb-Suite :: types/TestIntegerTypesExpr.py (1675 of 1675) Testing Time: 450.41s ******************** Failing Tests (1): lldb-Suite :: functionalities/watchpoint/watchpoint_set_command/TestWatchLocationWithWatchSet.py

Hide Details

Expected Passes : 1625 Expected Failures : 6 Unsupported Tests : 43 Unexpected Failures: 1 FAILED: tools/lldb/lit/CMakeFiles/check-lldb-lit cd /Users/buildslave/jenkins/workspace/lldb-cmake-monorepo-python3/lldb-build/tools/lldb/lit && /usr/local/Cellar/python/3.7.0/bin/python3.7 /Users/buildslave/jenkins/workspace/lldb-cmake-monorepo-python3/lldb-build/./bin/llvm-lit --xunit-xml-output=/Users/buildslave/jenkins/workspace/lldb-cmake-monorepo-python3/test/results.xml -v /Users/buildslave/jenkins/workspace/lldb-cmake-monorepo-python3/lldb-build/tools/lldb/lit ninja: build stopped: subcommand failed. Command failed Command: ['/usr/bin/env', 'TERM=vt100', '/usr/local/bin/ninja', '-v', 'check-lldb'] [Pipeline] } [Pipeline] // timeout [Pipeline] } [Pipeline] // stage [Pipeline] stage [Pipeline] { (Declarative: Post Actions) [Pipeline] scanForIssues No credentials specified [Clang (LLVM based)] Sleeping for 5 seconds due to JENKINS-32191... [Clang (LLVM based)] Parsing console log (workspace: '/Users/buildslave/jenkins/workspace/lldb-cmake-monorepo-python3') [Pipeline] } [Pipeline] // stage [Pipeline] } [Pipeline] // node [Pipeline] End of Pipeline [BFA] Scanning build for known causes... [BFA] Found failure cause(s): [BFA] Ninja target failed from category Compile [BFA] Regression test failed from category Test [BFA] Done. 0s ERROR: script returned exit code 1 Finished: FAILURE