FailedConsole Output

Skipping 5,718 KB.. Full Log
stEvent (515 of 2034)
PASS: lldb-api :: functionalities/data-formatter/data-formatter-stl/libcxx/optional/TestDataFormatterLibcxxOptional.py (516 of 2034)
PASS: lldb-shell :: SymbolFile/DWARF/dir-separator-windows.s (517 of 2034)
PASS: lldb-unit :: Expression/./ExpressionTests/DiagnosticManagerTest.GetStringMultipleDiags (518 of 2034)
PASS: lldb-unit :: Utility/./UtilityTests/StreamTest.PutRawBytesToLittleEndian (519 of 2034)
PASS: lldb-unit :: Utility/./UtilityTests/StringExtractorTest.GetU32BigEndian (520 of 2034)
PASS: lldb-api :: functionalities/data-formatter/nsdictionarysynth/TestNSDictionarySynthetic.py (521 of 2034)
PASS: lldb-api :: commands/frame/select/TestFrameSelect.py (522 of 2034)
PASS: lldb-shell :: Quit/TestQuitExitCode-30.test (523 of 2034)
PASS: lldb-unit :: Process/minidump/./LLDBMinidumpTests/MinidumpParserTest.GetThreadsAndGetThreadContext (524 of 2034)
PASS: lldb-unit :: Utility/./UtilityTests/StringExtractorTest.GetHexU8_Underflow2 (525 of 2034)
PASS: lldb-api :: functionalities/breakpoint/breakpoint_hit_count/TestBreakpointHitCount.py (526 of 2034)
PASS: lldb-api :: functionalities/thread/concurrent_events/TestConcurrentSignalDelayWatch.py (527 of 2034)
PASS: lldb-unit :: UnwindAssembly/x86/./UnwindAssemblyx86Tests/Testx86AssemblyInspectionEngine.TestStackRealignMSVC_i386 (528 of 2034)
PASS: lldb-unit :: Utility/./UtilityTests/CompletionRequest.DuplicateFiltering (529 of 2034)
PASS: lldb-api :: functionalities/jitloader_gdb/TestJITLoaderGDB.py (530 of 2034)
PASS: lldb-api :: commands/settings/TestSettings.py (531 of 2034)
PASS: lldb-shell :: SymbolFile/DWARF/dwo-type-in-main-file.s (532 of 2034)
PASS: lldb-api :: lang/objc/objc-optimized/TestObjcOptimized.py (533 of 2034)
UNSUPPORTED: lldb-api :: linux/thread/create_during_instruction_step/TestCreateDuringInstructionStep.py (534 of 2034)
PASS: lldb-unit :: UnwindAssembly/x86/./UnwindAssemblyx86Tests/Testx86AssemblyInspectionEngine.TestSpillRegToStackViaMOVi386 (535 of 2034)
PASS: lldb-api :: functionalities/thread/concurrent_events/TestConcurrentBreakpointDelayBreakpointOneSignal.py (536 of 2034)
PASS: lldb-shell :: Settings/TestSettingsWrite.test (537 of 2034)
PASS: lldb-api :: lang/objc/modules/TestObjCModules.py (538 of 2034)
UNSUPPORTED: lldb-api :: functionalities/unwind/ehframe/TestEhFrameUnwind.py (539 of 2034)
PASS: lldb-unit :: ObjectFile/ELF/./ObjectFileELFTests/ObjectFileELFTest.SectionsResolveConsistently (540 of 2034)
PASS: lldb-unit :: Symbol/./SymbolTests/TestTypeSystemClang.TestGetTypeClassTypeOf (541 of 2034)
PASS: lldb-api :: tools/lldb-server/inferior-crash/TestGdbRemoteAbort.py (542 of 2034)
UNSUPPORTED: lldb-api :: functionalities/thread/concurrent_events/TestConcurrentManySignals.py (543 of 2034)
PASS: lldb-api :: commands/expression/diagnostics/TestExprDiagnostics.py (544 of 2034)
PASS: lldb-shell :: Commands/command-breakpoint-col.test (545 of 2034)
PASS: lldb-unit :: Process/gdb-remote/./ProcessGdbRemoteTests/GDBRemoteCommunicationClientTest.SendStopTracePacket (546 of 2034)
UNSUPPORTED: lldb-api :: functionalities/darwin_log/source/info/TestDarwinLogSourceInfo.py (547 of 2034)
PASS: lldb-api :: python_api/disassemble-raw-data/TestDisassembleRawData.py (548 of 2034)
PASS: lldb-unit :: Symbol/./SymbolTests/TestClangASTImporter.RecordLayout (549 of 2034)
PASS: lldb-shell :: SymbolFile/Breakpad/unwind-via-stack-cfi.test (550 of 2034)
UNSUPPORTED: lldb-api :: tools/lldb-server/TestGdbRemoteModuleInfo.py (551 of 2034)
PASS: lldb-unit :: Utility/./UtilityTests/StreamTest.PutHex32ByteOrderLittle (552 of 2034)
PASS: lldb-api :: tools/lldb-vscode/attach/TestVSCode_attach.py (553 of 2034)
PASS: lldb-unit :: ScriptInterpreter/Python/./ScriptInterpreterPythonTests/PythonDataObjectsTest.TestTypeNameResolutionNoDot (554 of 2034)
PASS: lldb-shell :: SymbolFile/Breakpad/line-table-missing-file.test (555 of 2034)
PASS: lldb-api :: functionalities/gdb_remote_client/TestThreadSelectionBug.py (556 of 2034)
PASS: lldb-api :: functionalities/multiword-commands/TestMultiWordCommands.py (557 of 2034)
PASS: lldb-api :: lang/c/bitfields/TestBitfields.py (558 of 2034)
UNSUPPORTED: lldb-api :: tools/lldb-server/libraries-svr4/TestGdbRemoteLibrariesSvr4Support.py (559 of 2034)
PASS: lldb-unit :: Process/gdb-remote/./ProcessGdbRemoteTests/GDBRemoteCommunicationTest.ReadPacket_checksum (560 of 2034)
PASS: lldb-api :: commands/expression/import-std-module/empty-module/TestEmptyStdModule.py (561 of 2034)
PASS: lldb-shell :: Expr/TestTypeOfDeclTypeExpr.test (562 of 2034)
PASS: lldb-unit :: Utility/./UtilityTests/OptionsWithRawTest.EmptySuffix (563 of 2034)
PASS: lldb-api :: functionalities/thread/concurrent_events/TestConcurrentTwoWatchpointsOneSignal.py (564 of 2034)
PASS: lldb-api :: commands/expression/radar_8638051/Test8638051.py (565 of 2034)
PASS: lldb-unit :: Utility/./UtilityTests/CompletionRequest.Constructor (566 of 2034)
PASS: lldb-unit :: Utility/./UtilityTests/ScalarTest.Scalar_512 (567 of 2034)
PASS: lldb-api :: lang/c/offsetof/TestOffsetof.py (568 of 2034)
PASS: lldb-unit :: Utility/./UtilityTests/StreamTest.PutULEB128 (569 of 2034)
PASS: lldb-unit :: Utility/./UtilityTests/StringExtractorTest.GetNameColonValueSuccess (570 of 2034)
PASS: lldb-shell :: ObjectFile/PECOFF/basic-info-arm.yaml (571 of 2034)
PASS: lldb-shell :: Quit/TestQuitExitCode0.test (572 of 2034)
PASS: lldb-api :: functionalities/tail_call_frames/cross_object/TestCrossObjectTailCalls.py (573 of 2034)
PASS: lldb-unit :: Language/Highlighting/./HighlighterTests/HighlighterTest.HighlighterSelectionType (574 of 2034)
PASS: lldb-unit :: Utility/./UtilityTests/ScalarTest.Equality (575 of 2034)
UNSUPPORTED: lldb-shell :: ObjectFile/ELF/minidebuginfo-set-and-hit-breakpoint.test (576 of 2034)
PASS: lldb-unit :: Utility/./UtilityTests/StreamTest.PutHex64ByteOrderLittle (577 of 2034)
PASS: lldb-unit :: ScriptInterpreter/Python/./ScriptInterpreterPythonTests/PythonDataObjectsTest.TestPythonListToStructuredList (578 of 2034)
UNSUPPORTED: lldb-api :: functionalities/breakpoint/breakpoint_in_delayslot/TestAvoidBreakpointInDelaySlot.py (579 of 2034)
PASS: lldb-unit :: debugserver/./debugserverTests/JSON.Parse (580 of 2034)
UNSUPPORTED: lldb-api :: lang/cpp/static_members/TestCPPStaticMembers.py (581 of 2034)
PASS: lldb-api :: commands/expression/import-std-module/shared_ptr-dbg-info-content/TestSharedPtrDbgInfoContentFromStdModule.py (582 of 2034)
PASS: lldb-unit :: Utility/./UtilityTests/StringLexerTest.Peek (583 of 2034)
PASS: lldb-unit :: Utility/./UtilityTests/ScalarTest.APIntConstructor (584 of 2034)
PASS: lldb-shell :: Minidump/no-process-id.yaml (585 of 2034)
PASS: lldb-shell :: SymbolFile/Breakpad/symtab-macho.test (586 of 2034)
PASS: lldb-api :: functionalities/data-formatter/data-formatter-synth/TestDataFormatterSynth.py (587 of 2034)
PASS: lldb-shell :: SymbolFile/DWARF/debug-types-line-tables.s (588 of 2034)
UNSUPPORTED: lldb-api :: functionalities/data-formatter/data-formatter-stl/libstdcpp/smart_ptr/TestDataFormatterStdSmartPtr.py (589 of 2034)
PASS: lldb-unit :: Process/gdb-remote/./ProcessGdbRemoteTests/GDBRemoteCommunicationClientTest.GetModulesInfo (590 of 2034)
PASS: lldb-unit :: Process/minidump/./LLDBMinidumpTests/MinidumpParserTest.GetExceptionStream (591 of 2034)
PASS: lldb-unit :: Utility/./UtilityTests/StringExtractorTest.InitMisc (592 of 2034)
PASS: lldb-api :: types/TestCharType.py (593 of 2034)
PASS: lldb-shell :: SymbolFile/DWARF/compilercontext.ll (594 of 2034)
PASS: lldb-shell :: Reproducer/TestSynchronous.test (595 of 2034)
PASS: lldb-api :: commands/target/create-deps/TestTargetCreateDeps.py (596 of 2034)
FAIL: lldb-unit :: Utility/./UtilityTests/DataExtractorTest.GetSLEB128_bit63 (597 of 2034)
******************** TEST 'lldb-unit :: Utility/./UtilityTests/DataExtractorTest.GetSLEB128_bit63' FAILED ********************
Note: Google Test filter = DataExtractorTest.GetSLEB128_bit63
[==========] Running 1 test from 1 test case.
[----------] Global test environment set-up.
[----------] 1 test from DataExtractorTest
[ RUN      ] DataExtractorTest.GetSLEB128_bit63
/Users/buildslave/jenkins/workspace/lldb-cmake-sanitized/llvm-project/lldb/source/Utility/DataExtractor.cpp:934:17: runtime error: negation of -9223372036854775808 cannot be represented in type 'int64_t' (aka 'long long'); cast to an unsigned type to negate this value to itself
SUMMARY: UndefinedBehaviorSanitizer: undefined-behavior /Users/buildslave/jenkins/workspace/lldb-cmake-sanitized/llvm-project/lldb/source/Utility/DataExtractor.cpp:934:17 in 

Hide Details

******************** PASS: lldb-shell :: SymbolFile/DWARF/inline-function-address-shared.test (598 of 2034) PASS: lldb-unit :: Process/minidump/./LLDBMinidumpTests/MinidumpParserTest.MinidumpDuplicateModuleMinAddress (599 of 2034) PASS: lldb-unit :: Language/Highlighting/./HighlighterTests/HighlighterTest.ClangTrailingBackslashWithWhitespace (600 of 2034) PASS: lldb-unit :: Utility/./UtilityTests/ReproducerTest.SetCapture (601 of 2034) PASS: lldb-unit :: UnwindAssembly/x86/./UnwindAssemblyx86Tests/Testx86AssemblyInspectionEngine.TestPopR12 (602 of 2034) PASS: lldb-unit :: Process/gdb-remote/./ProcessGdbRemoteTests/GDBRemoteCommunicationServerTest.SendErrorResponse_UnimplementedError (603 of 2034) PASS: lldb-unit :: Utility/./UtilityTests/StreamTeeTest.Write (604 of 2034) PASS: lldb-unit :: Process/gdb-remote/./ProcessGdbRemoteTests/GDBRemoteClientBaseTest.SendContinueAndLateInterrupt (605 of 2034) PASS: lldb-api :: python_api/sbvalue_const_addrof/TestSBValueConstAddrOf.py (606 of 2034) UNSUPPORTED: lldb-shell :: SymbolFile/Breakpad/stack-cfi-arm.yaml (607 of 2034) PASS: lldb-unit :: Utility/./UtilityTests/StringExtractorTest.GetNameColonValueContainsColon (608 of 2034) PASS: lldb-api :: functionalities/data-formatter/varscript_formatting/TestDataFormatterVarScriptFormatting.py (609 of 2034) PASS: lldb-shell :: ObjectFile/ELF/PT_LOAD-overlap.yaml (610 of 2034) PASS: lldb-shell :: ObjectFile/PECOFF/sections-names.yaml (611 of 2034) PASS: lldb-api :: functionalities/thread/concurrent_events/TestConcurrentSignalWatchBreak.py (612 of 2034) PASS: lldb-api :: commands/watchpoints/hello_watchpoint/TestMyFirstWatchpoint.py (613 of 2034) PASS: lldb-shell :: ObjectFile/MachO/lc_build_version.yaml (614 of 2034) PASS: lldb-shell :: ObjectFile/ELF/section-permissions.yaml (615 of 2034) PASS: lldb-unit :: Utility/./UtilityTests/UriParserTest.BadPort2 (616 of 2034) PASS: lldb-api :: lang/cpp/enum_types/TestCPP11EnumTypes.py (617 of 2034) UNSUPPORTED: lldb-shell :: Register/x86-64-zmm-read.test (618 of 2034) PASS: lldb-api :: python_api/watchpoint/condition/TestWatchpointConditionAPI.py (619 of 2034) PASS: lldb-api :: functionalities/thread/thread_specific_break/TestThreadSpecificBreakpoint.py (620 of 2034) PASS: lldb-unit :: Utility/./UtilityTests/StreamTest.PutStringAsRawHex8 (621 of 2034) PASS: lldb-unit :: ObjectFile/Breakpad/./ObjectFileBreakpadTests/PublicRecord.parse (622 of 2034) PASS: lldb-unit :: Host/./HostTests/NativeProcessProtocolTest.ReadCStringFromMemory (623 of 2034) PASS: lldb-shell :: SymbolFile/Breakpad/line-table.test (624 of 2034) PASS: lldb-shell :: Quit/TestQuitExitCode30.test (625 of 2034) PASS: lldb-unit :: Language/Highlighting/./HighlighterTests/HighlighterTest.ClangComments (626 of 2034) PASS: lldb-unit :: Utility/./UtilityTests/BinaryStreamTest.PutULEB128One (627 of 2034) PASS: lldb-unit :: Symbol/./SymbolTests/PostfixExpression.ParseOneExpression (628 of 2034) PASS: lldb-unit :: Host/./HostTests/NativeProcessProtocolTest.SetBreakpointFailVerify (629 of 2034) UNSUPPORTED: lldb-api :: functionalities/darwin_log/filter/regex/category/TestDarwinLogFilterRegexCategory.py (630 of 2034) PASS: lldb-unit :: Utility/./UtilityTests/StringListTest.GetSize (631 of 2034) PASS: lldb-unit :: Utility/./UtilityTests/ArchSpecTest.OperatorBool (632 of 2034) PASS: lldb-shell :: ObjectFile/MachO/lc_version_min.yaml (633 of 2034) PASS: lldb-unit :: Utility/./UtilityTests/BinaryStreamTest.PutULEB128SevenBytes (634 of 2034) PASS: lldb-unit :: Utility/./UtilityTests/StreamTeeTest.Constructor2Streams (635 of 2034) PASS: lldb-api :: lang/objc/objc-struct-return/TestObjCStructReturn.py (636 of 2034) PASS: lldb-unit :: UnwindAssembly/x86/./UnwindAssemblyx86Tests/Testx86AssemblyInspectionEngine.Testi386IgnoredRegisters (637 of 2034) PASS: lldb-unit :: Utility/./UtilityTests/StreamTest.PutMaxHex64ByteOrderLittle (638 of 2034) PASS: lldb-unit :: Utility/./UtilityTests/LogTest.LLDB_LOG_nullptr (639 of 2034) PASS: lldb-api :: commands/quit/TestQuit.py (640 of 2034) PASS: lldb-unit :: Process/gdb-remote/./ProcessGdbRemoteTests/GDBRemoteClientBaseTest.SendContinueDelegateInterface (641 of 2034) PASS: lldb-shell :: SymbolFile/NativePDB/function-types-calling-conv.cpp (642 of 2034) PASS: lldb-api :: lang/objc/self/TestObjCSelf.py (643 of 2034) XFAIL: lldb-shell :: Register/x86-64-write.test (644 of 2034) PASS: lldb-unit :: Utility/./UtilityTests/ProcessInstanceInfo.Dump (645 of 2034) PASS: lldb-shell :: ObjectFile/MachO/lc_build_version_notools.yaml (646 of 2034) PASS: lldb-api :: commands/expression/test/TestExprs2.py (647 of 2034) PASS: lldb-unit :: Utility/./UtilityTests/FileSpecTest.EqualSeparator (648 of 2034) PASS: lldb-unit :: Language/Highlighting/./HighlighterTests/HighlighterTest.Keywords (649 of 2034) PASS: lldb-api :: functionalities/gdb_remote_client/TestGDBRemoteClient.py (650 of 2034) PASS: lldb-unit :: ScriptInterpreter/Python/./ScriptInterpreterPythonTests/PythonDataObjectsTest.TestPythonTupleValues (651 of 2034) PASS: lldb-unit :: Utility/./UtilityTests/RangeTest.Slide (652 of 2034) PASS: lldb-unit :: Utility/./UtilityTests/StateTest.Formatv (653 of 2034) UNSUPPORTED: lldb-api :: functionalities/darwin_log/filter/exact_match/category/TestDarwinLogFilterMatchCategory.py (654 of 2034) UNSUPPORTED: lldb-api :: tools/lldb-server/TestGdbRemote_vContThreads.py (655 of 2034) PASS: lldb-unit :: Utility/./UtilityTests/DataExtractorTest.UncommonAddressSize (656 of 2034) PASS: lldb-shell :: ScriptInterpreter/None/none.test (657 of 2034) PASS: lldb-api :: commands/command/invalid-args/TestInvalidArgsCommand.py (658 of 2034) PASS: lldb-unit :: Utility/./UtilityTests/RecordReplayTest.InstrumentedBarRef (659 of 2034) PASS: lldb-unit :: Utility/./UtilityTests/ArgsTest.TestMultipleArgs (660 of 2034) PASS: lldb-unit :: Utility/./UtilityTests/BinaryStreamTest.PutSLEB128SixBytes (661 of 2034) UNSUPPORTED: lldb-api :: functionalities/darwin_log/source/debug/TestDarwinLogSourceDebug.py (662 of 2034) PASS: lldb-unit :: Utility/./UtilityTests/SerializationRountripTest.SerializeDeserializeCStringArrayNullptr (663 of 2034) PASS: lldb-shell :: Reproducer/TestRelativePath.test (664 of 2034) UNSUPPORTED: lldb-api :: functionalities/longjmp/TestLongjmp.py (665 of 2034) PASS: lldb-unit :: ScriptInterpreter/Python/./ScriptInterpreterPythonTests/PythonDataObjectsTest.TestRun (666 of 2034) PASS: lldb-unit :: tools/lldb-server/tests/./LLDBServerTests/TestBase.LaunchModePreservesEnvironment (667 of 2034) PASS: lldb-shell :: SymbolFile/DWARF/DW_TAG_basic_type_DW_ATE_UTF_nonC.ll (668 of 2034) PASS: lldb-unit :: Utility/./UtilityTests/ArgsTest.Yaml (669 of 2034) PASS: lldb-api :: lang/cpp/nested-class-other-compilation-unit/TestNestedClassWithParentInAnotherCU.py (670 of 2034) PASS: lldb-unit :: Utility/./UtilityTests/SerializationRountripTest.SerializeDeserializePodReferences (671 of 2034) PASS: lldb-api :: commands/expression/import-std-module/conflicts/TestStdModuleWithConflicts.py (672 of 2034) PASS: lldb-shell :: Commands/command-regex-unalias.test (673 of 2034) PASS: lldb-unit :: Utility/./UtilityTests/ArgsTest.TestOverwriteArgs (674 of 2034) PASS: lldb-shell :: Driver/TestFile.test (675 of 2034) PASS: lldb-shell :: ObjectFile/PECOFF/export-dllfunc.yaml (676 of 2034) PASS: lldb-unit :: Host/./HostTests/Host.GetEnvironment (677 of 2034) PASS: lldb-shell :: Reproducer/TestVersionCheck.test (678 of 2034) PASS: lldb-unit :: ScriptInterpreter/Python/./ScriptInterpreterPythonTests/PythonDataObjectsTest.TestExtractingUInt64ThroughStructuredData (679 of 2034) PASS: lldb-unit :: Utility/./UtilityTests/UriParserTest.SchemeHostSeparator2 (680 of 2034) PASS: lldb-api :: commands/expression/rdar44436068/Test128BitsInteger.py (681 of 2034) PASS: lldb-api :: functionalities/unwind/noreturn/module-end/TestNoReturnModuleEnd.py (682 of 2034) PASS: lldb-unit :: DataFormatter/./LLDBFormatterTests/FormatManagerTests.CompatibleLangs (683 of 2034) PASS: lldb-unit :: Utility/./UtilityTests/StreamTest.Indent (684 of 2034) PASS: lldb-api :: lang/objc/blocks/TestObjCIvarsInBlocks.py (685 of 2034) PASS: lldb-shell :: Reproducer/Functionalities/TestStepping.test (686 of 2034) PASS: lldb-unit :: SymbolFile/NativePDB/./SymbolFileNativePDBTests/PDBFPOProgramToDWARFExpressionTests.UnknownOp (687 of 2034) PASS: lldb-api :: macosx/version_zero/TestGetVersionZeroVersion.py (688 of 2034) PASS: lldb-unit :: Utility/./UtilityTests/StreamTest.QuotedCString (689 of 2034) UNSUPPORTED: lldb-api :: lang/objc/rdar-12408181/TestRdar12408181.py (690 of 2034) PASS: lldb-unit :: Utility/./UtilityTests/RangeTest.ContainsEndInclusiveInvalid (691 of 2034) PASS: lldb-unit :: Utility/./UtilityTests/ArgsTest.ReplaceArgumentAtIndexEqual (692 of 2034) UNSUPPORTED: lldb-shell :: Register/aarch64-gp-read.test (693 of 2034) PASS: lldb-shell :: SymbolFile/NativePDB/break-by-line.cpp (694 of 2034) PASS: lldb-unit :: Utility/./UtilityTests/Flags.GetBitSize (695 of 2034) UNSUPPORTED: lldb-api :: functionalities/darwin_log/filter/regex/activity-chain/TestDarwinLogFilterRegexActivityChain.py (696 of 2034) PASS: lldb-shell :: Unwind/thread-step-out-ret-addr-check.test (697 of 2034) UNSUPPORTED: lldb-api :: functionalities/data-formatter/data-formatter-stl/libstdcpp/iterator/TestDataFormatterStdIterator.py (698 of 2034) PASS: lldb-unit :: Process/minidump/./LLDBMinidumpTests/MinidumpParserTest.GetMiscInfo_no_stream (699 of 2034) PASS: lldb-api :: tools/lldb-vscode/breakpoint/TestVSCode_setBreakpoints.py (700 of 2034) PASS: lldb-api :: commands/watchpoints/multiple_threads/TestWatchpointMultipleThreads.py (701 of 2034) PASS: lldb-api :: lang/objc/variadic_methods/TestVariadicMethods.py (702 of 2034) PASS: lldb-unit :: Utility/./UtilityTests/StreamTest.PutHex64ByteOrderBig (703 of 2034) PASS: lldb-api :: lang/cpp/function-qualifiers/TestCppFunctionQualifiers.py (704 of 2034) PASS: lldb-api :: commands/target/create-no-such-arch/TestNoSuchArch.py (705 of 2034) PASS: lldb-api :: python_api/value/empty_class/TestValueAPIEmptyClass.py (706 of 2034) PASS: lldb-unit :: Utility/./UtilityTests/BinaryStreamTest.PutULEB128Zero (707 of 2034) PASS: lldb-api :: commands/target/dump-symtab-demangle/TestDumpSymtabDemangle.py (708 of 2034) PASS: lldb-api :: functionalities/thread/concurrent_events/TestConcurrentTwoWatchpointsOneDelayBreakpoint.py (709 of 2034) PASS: lldb-unit :: Utility/./UtilityTests/StructuredDataTest.StringDump (710 of 2034) PASS: lldb-shell :: Reproducer/TestMultipleTargets.test (711 of 2034) PASS: lldb-api :: functionalities/memory/find/TestMemoryFind.py (712 of 2034) PASS: lldb-api :: commands/expression/import-std-module/unique_ptr-dbg-info-content/TestUniquePtrDbgInfoContent.py (713 of 2034) PASS: lldb-unit :: Utility/./UtilityTests/UriParserTest.BracketedHostname (714 of 2034) PASS: lldb-unit :: Utility/./UtilityTests/StringLexerTest.HasAtLeast (715 of 2034) PASS: lldb-api :: macosx/duplicate-archive-members/TestDuplicateMembers.py (716 of 2034) UNSUPPORTED: lldb-shell :: SymbolFile/NativePDB/typedefs.cpp (717 of 2034) PASS: lldb-api :: functionalities/breakpoint/breakpoint_by_line_and_column/TestBreakpointByLineAndColumn.py (718 of 2034) PASS: lldb-shell :: Register/x86-64-ymm-read.test (719 of 2034) PASS: lldb-unit :: Host/./HostTests/FileSystemTest.MakeAbsolute (720 of 2034) PASS: lldb-api :: lang/objc/modules-compile-error/TestModulesCompileError.py (721 of 2034) PASS: lldb-api :: lang/cpp/constructors/TestCppConstructors.py (722 of 2034) PASS: lldb-unit :: UnwindAssembly/x86/./UnwindAssemblyx86Tests/Testx86AssemblyInspectionEngine.TestPopEBX (723 of 2034) PASS: lldb-shell :: Minidump/memory-region-from-module.yaml (724 of 2034) PASS: lldb-api :: functionalities/data-formatter/data-formatter-disabling/TestDataFormatterDisabling.py (725 of 2034) PASS: lldb-unit :: UnwindAssembly/x86/./UnwindAssemblyx86Tests/Testx86AssemblyInspectionEngine.TestPushRBPWithREX (726 of 2034) PASS: lldb-unit :: DataFormatter/./LLDBFormatterTests/StringPrinterTests.SwiftUTF8 (727 of 2034) PASS: lldb-api :: python_api/signals/TestSignalsAPI.py (728 of 2034) PASS: lldb-shell :: SymbolFile/DWARF/clang-ast-from-dwarf-objc-property.m (729 of 2034) PASS: lldb-unit :: Language/Highlighting/./HighlighterTests/HighlighterTest.DefaultHighlighter (730 of 2034) PASS: lldb-api :: commands/expression/timeout/TestCallWithTimeout.py (731 of 2034) PASS: lldb-unit :: Utility/./UtilityTests/GeneratorTest.Create (732 of 2034) PASS: lldb-api :: python_api/symbol-context/TestSymbolContext.py (733 of 2034) UNSUPPORTED: lldb-shell :: BuildScript/toolchain-clang-cl.test (734 of 2034) UNSUPPORTED: lldb-api :: functionalities/thread/thread_specific_break_plus_condition/TestThreadSpecificBpPlusCondition.py (735 of 2034) PASS: lldb-unit :: Utility/./UtilityTests/AnsiTerminal.AtEnd (736 of 2034) PASS: lldb-shell :: SymbolFile/DWARF/debug-types-signature-loop.s (737 of 2034) UNSUPPORTED: lldb-api :: functionalities/asan/TestMemoryHistory.py (738 of 2034) PASS: lldb-unit :: Utility/./UtilityTests/ScalarTest.ExtractBitfield (739 of 2034) PASS: lldb-unit :: Utility/./UtilityTests/ScalarTest.LongLongAssigmentOperator (740 of 2034) PASS: lldb-unit :: Process/gdb-remote/./ProcessGdbRemoteTests/GDBRemoteCommunicationClientTest.ReadRegister (741 of 2034) PASS: lldb-api :: functionalities/data-formatter/vector-types/TestVectorTypesFormatting.py (742 of 2034) PASS: lldb-api :: lang/c/vla/TestVLA.py (743 of 2034) PASS: lldb-api :: functionalities/data-formatter/data-formatter-stl/libcxx/vbool/TestDataFormatterLibcxxVBool.py (744 of 2034) PASS: lldb-api :: python_api/watchpoint/TestWatchpointIter.py (745 of 2034) PASS: lldb-api :: functionalities/data-formatter/data-formatter-objc/TestDataFormatterObjCNSError.py (746 of 2034) PASS: lldb-unit :: Utility/./UtilityTests/SerializationRountripTest.SerializeDeserializeCStringNull (747 of 2034) PASS: lldb-unit :: UnwindAssembly/x86/./UnwindAssemblyx86Tests/Testx86AssemblyInspectionEngine.Test32bitFramelessBigStackFrame (748 of 2034) PASS: lldb-api :: functionalities/paths/TestPaths.py (749 of 2034) PASS: lldb-unit :: Utility/./UtilityTests/DataExtractorTest.GetCStrUnterminated (750 of 2034) PASS: lldb-api :: lang/cpp/class_types/TestClassTypes.py (751 of 2034) PASS: lldb-api :: lang/cpp/dynamic-value/TestCppValueCast.py (752 of 2034) PASS: lldb-api :: commands/expression/import-std-module/deque-dbg-info-content/TestDbgInfoContentDequeFromStdModule.py (753 of 2034) PASS: lldb-api :: functionalities/thread/backtrace_limit/TestBacktraceLimit.py (754 of 2034) PASS: lldb-unit :: Language/CPlusPlus/./LanguageCPlusPlusTests/CPlusPlusLanguage.MethodNameParsing (755 of 2034) PASS: lldb-unit :: Expression/./ExpressionTests/DiagnosticManagerTest.GetStringSeverityLabels (756 of 2034) PASS: lldb-api :: commands/frame/recognizer/TestFrameRecognizer.py (757 of 2034) PASS: lldb-shell :: ObjectFile/ELF/basic-info.yaml (758 of 2034) PASS: lldb-api :: lang/c/forward/TestForwardDeclaration.py (759 of 2034) PASS: lldb-unit :: Process/minidump/./LLDBMinidumpTests/MinidumpParserTest.GetArchitecture (760 of 2034) PASS: lldb-unit :: Utility/./UtilityTests/StringListTest.ShiftStdString (761 of 2034) PASS: lldb-api :: macosx/find-app-in-bundle/TestFindAppInBundle.py (762 of 2034) PASS: lldb-shell :: SymbolFile/DWARF/debug_aranges-empty-section.s (763 of 2034) PASS: lldb-unit :: UnwindAssembly/x86/./UnwindAssemblyx86Tests/Testx86AssemblyInspectionEngine.TestPushR14 (764 of 2034) PASS: lldb-unit :: Host/./HostTests/HostInfoTest.GetAugmentedArchSpec (765 of 2034) PASS: lldb-api :: functionalities/inferior-crashing/recursive-inferior/TestRecursiveInferiorStep.py (766 of 2034) UNSUPPORTED: lldb-api :: functionalities/thread/break_after_join/TestBreakAfterJoin.py (767 of 2034) PASS: lldb-api :: types/TestDoubleTypesExpr.py (768 of 2034) PASS: lldb-shell :: Commands/command-script-import.test (769 of 2034) PASS: lldb-unit :: Utility/./UtilityTests/StreamTest.AddressNoSuffix (770 of 2034) UNSUPPORTED: lldb-shell :: SymbolFile/PDB/calling-conventions.test (771 of 2034) PASS: lldb-unit :: Utility/./UtilityTests/StreamTest.AddressRangeSize (772 of 2034) PASS: lldb-unit :: Utility/./UtilityTests/StreamTest.PutRawBytesToBigEndian (773 of 2034) PASS: lldb-api :: lang/cpp/unique-types/TestUniqueTypes.py (774 of 2034) PASS: lldb-unit :: ScriptInterpreter/Python/./ScriptInterpreterPythonTests/PythonDataObjectsTest.TestPythonBytes (775 of 2034) PASS: lldb-unit :: Utility/./UtilityTests/ArgsTest.ReplaceArgumentAtIndexFarOutOfRange (776 of 2034) PASS: lldb-api :: lang/c/enum_types/TestEnumTypes.py (777 of 2034) PASS: lldb-unit :: Utility/./UtilityTests/SubsystemRAIITest.SubsystemWithErrorFailure (778 of 2034) PASS: lldb-api :: commands/frame/diagnose/array/TestArray.py (779 of 2034) PASS: lldb-api :: python_api/function_symbol/TestSymbolAPI.py (780 of 2034) PASS: lldb-api :: macosx/load-kext/TestLoadKext.py (781 of 2034) PASS: lldb-unit :: Utility/./UtilityTests/RangeTest.DefaultConstructor (782 of 2034) PASS: lldb-api :: lang/cpp/virtual-overload/TestVirtualOverload.py (783 of 2034) PASS: lldb-unit :: Utility/./UtilityTests/ArgsTest.TestSingleArg (784 of 2034) PASS: lldb-api :: functionalities/data-formatter/data-formatter-objc/TestDataFormatterObjCCF.py (785 of 2034) PASS: lldb-api :: lang/objc/objc_direct-methods/TestObjCDirectMethods.py (786 of 2034) PASS: lldb-unit :: Process/minidump/./LLDBMinidumpTests/MinidumpParserTest.GetThreadContext_x86_32 (787 of 2034) PASS: lldb-api :: commands/expression/import-std-module/vector-dbg-info-content/TestDbgInfoContentVectorFromStdModule.py (788 of 2034) UNSUPPORTED: lldb-shell :: Register/x86-ymm-write.test (789 of 2034) PASS: lldb-unit :: Utility/./UtilityTests/VASprintfTest.BufferResize (790 of 2034) PASS: lldb-api :: functionalities/data-formatter/data-formatter-stl/libcxx/list/loop/TestDataFormatterLibcxxListLoop.py (791 of 2034) PASS: lldb-unit :: Utility/./UtilityTests/StringExtractorTest.GetHexU8_Extra_NoEof (792 of 2034) PASS: lldb-unit :: Utility/./UtilityTests/VMRange.ContainsAddr (793 of 2034) PASS: lldb-api :: commands/frame/language/TestGuessLanguage.py (794 of 2034) UNSUPPORTED: lldb-api :: commands/register/register/intel_xtended_registers/mpx_offset_intersection/TestMPXOffsetIntersection.py (795 of 2034) PASS: lldb-api :: lang/objc/modules-incomplete/TestIncompleteModules.py (796 of 2034) PASS: lldb-unit :: Utility/./UtilityTests/UUIDTest.StringConverion (797 of 2034) PASS: lldb-unit :: ObjectFile/Breakpad/./ObjectFileBreakpadTests/Record.classify (798 of 2034) PASS: lldb-unit :: Symbol/./SymbolTests/TestClangASTImporter.MetadataPropagationAfterCopying (799 of 2034) PASS: lldb-api :: functionalities/data-formatter/nsarraysynth/TestNSArraySynthetic.py (800 of 2034) PASS: lldb-api :: lang/cpp/class_static/TestStaticVariables.py (801 of 2034) PASS: lldb-unit :: UnwindAssembly/x86/./UnwindAssemblyx86Tests/Testx86AssemblyInspectionEngine.TestStackRealign32BitDisp_x86_64 (802 of 2034) UNSUPPORTED: lldb-api :: functionalities/thread/state/TestThreadStates.py (803 of 2034) PASS: lldb-api :: commands/expression/import-std-module/list/TestListFromStdModule.py (804 of 2034) PASS: lldb-unit :: ObjectFile/Breakpad/./ObjectFileBreakpadTests/ModuleRecord.parse (805 of 2034) PASS: lldb-unit :: UnwindAssembly/x86/./UnwindAssemblyx86Tests/Testx86AssemblyInspectionEngine.TestPopRBX (806 of 2034) PASS: lldb-unit :: Utility/./UtilityTests/ListenerTest.GetEventWait (807 of 2034) PASS: lldb-api :: lang/objc/objc-foundation-dictionary-empty/TestNSDictionary0.py (808 of 2034) PASS: lldb-api :: python_api/value/change_values/TestChangeValueAPI.py (809 of 2034) PASS: lldb-api :: lang/cpp/operators/TestCppOperators.py (810 of 2034) PASS: lldb-unit :: Utility/./UtilityTests/StreamTeeTest.AppendStream (811 of 2034) PASS: lldb-shell :: Commands/command-regex-delete.test (812 of 2034) PASS: lldb-shell :: Unwind/trap_frame_sym_ctx.test (813 of 2034) PASS: lldb-api :: functionalities/data-formatter/data-formatter-enum-format/TestDataFormatterEnumFormat.py (814 of 2034) PASS: lldb-api :: arm/emulation/TestEmulations.py (815 of 2034) PASS: lldb-api :: lang/cpp/operator-overload/TestOperatorOverload.py (816 of 2034) PASS: lldb-api :: functionalities/gdb_remote_client/TestNestedRegDefinitions.py (817 of 2034) PASS: lldb-unit :: Utility/./UtilityTests/LogChannelEnabledTest.log_options (818 of 2034) PASS: lldb-unit :: Utility/./UtilityTests/XcodeSDKTest.SDKSupportsSwift (819 of 2034) PASS: lldb-shell :: ObjectFile/PECOFF/sections.yaml (820 of 2034) PASS: lldb-shell :: SymbolFile/DWARF/dwp-debug-types.s (821 of 2034) PASS: lldb-api :: tools/lldb-vscode/coreFile/TestVSCode_coreFile.py (822 of 2034) PASS: lldb-api :: functionalities/conditional_break/TestConditionalBreak.py (823 of 2034) UNSUPPORTED: lldb-api :: python_api/event/TestEvents.py (824 of 2034) PASS: lldb-shell :: SymbolFile/Breakpad/unwind-via-stack-win-no-memory-info.yaml (825 of 2034) PASS: lldb-unit :: Host/./HostTests/File.GetWaitableHandleFileno (826 of 2034) PASS: lldb-unit :: Symbol/./SymbolTests/TestClangASTImporter.MetadataPropagation (827 of 2034) PASS: lldb-api :: python_api/watchpoint/watchlocation/TestSetWatchlocation.py (828 of 2034) UNSUPPORTED: lldb-shell :: Breakpoint/case-insensitive.test (829 of 2034) PASS: lldb-unit :: Utility/./UtilityTests/FileSpecTest.Equal (830 of 2034) PASS: lldb-shell :: Driver/TestConvenienceVariables.test (831 of 2034) PASS: lldb-shell :: SymbolFile/DWARF/split-dwarf-inlining.cpp (832 of 2034) PASS: lldb-unit :: Utility/./UtilityTests/DataExtractorTest.GetMaxS64 (833 of 2034) UNSUPPORTED: lldb-api :: functionalities/tsan/global_location/TestTsanGlobalLocation.py (834 of 2034) PASS: lldb-unit :: Utility/./UtilityTests/StringListTest.InsertStringAtIndexOutOfBounds (835 of 2034) PASS: lldb-api :: functionalities/thread_plan/TestThreadPlanCommands.py (836 of 2034) PASS: lldb-api :: lang/objc/modules-non-objc-target/TestObjCModulesNonObjCTarget.py (837 of 2034) PASS: lldb-shell :: ObjectFile/ELF/section-overlap.yaml (838 of 2034) PASS: lldb-api :: commands/frame/diagnose/dereference-this/TestDiagnoseDereferenceThis.py (839 of 2034) PASS: lldb-unit :: Utility/./UtilityTests/VMRange.Ordering (840 of 2034) PASS: lldb-unit :: UnwindAssembly/x86/./UnwindAssemblyx86Tests/Testx86AssemblyInspectionEngine.TestPushEDI (841 of 2034) PASS: lldb-api :: functionalities/set-data/TestSetData.py (842 of 2034) PASS: lldb-api :: functionalities/completion/TestCompletion.py (843 of 2034) PASS: lldb-api :: functionalities/breakpoint/cpp_exception/TestCPPExceptionBreakpoint.py (844 of 2034) PASS: lldb-api :: commands/expression/no-deadlock/TestExprDoesntBlock.py (845 of 2034) PASS: lldb-api :: functionalities/gdb_remote_client/TestJLink6Armv7RegisterDefinition.py (846 of 2034) PASS: lldb-unit :: Utility/./UtilityTests/StreamTest.PutBytesAsRawHex8ToMixedEndian (847 of 2034) PASS: lldb-api :: lang/objc/objc-ivar-stripped/TestObjCIvarStripped.py (848 of 2034) PASS: lldb-api :: functionalities/data-formatter/typedef_array/TestTypedefArray.py (849 of 2034) PASS: lldb-api :: functionalities/pointer_num_children/TestPointerNumChildren.py (850 of 2034) PASS: lldb-unit :: Utility/./UtilityTests/PassiveReplayTest.InstrumentedFooInvalid (851 of 2034) PASS: lldb-api :: lang/objc/unicode-string/TestUnicodeString.py (852 of 2034) PASS: lldb-api :: functionalities/gdb_remote_client/TestIOSSimulator.py (853 of 2034) PASS: lldb-unit :: Utility/./UtilityTests/StreamTest.ShiftOperatorChars (854 of 2034) PASS: lldb-shell :: ObjectFile/ELF/PT_LOAD-overlap-section.yaml (855 of 2034) XFAIL: lldb-shell :: Register/x86-64-ymm-write.test (856 of 2034) PASS: lldb-api :: functionalities/data-formatter/data-formatter-categories/TestDataFormatterCategories.py (857 of 2034) PASS: lldb-api :: lang/c/strings/TestCStrings.py (858 of 2034) PASS: lldb-api :: commands/frame/var-scope/TestFrameVariableScope.py (859 of 2034) PASS: lldb-api :: functionalities/data-formatter/boolreference/TestFormattersBoolRefPtr.py (860 of 2034) PASS: lldb-api :: functionalities/breakpoint/comp_dir_symlink/TestCompDirSymLink.py (861 of 2034) PASS: lldb-shell :: BuildScript/toolchain-clang.test (862 of 2034) PASS: lldb-unit :: Utility/./UtilityTests/VMRange.CollectionContains (863 of 2034) PASS: lldb-api :: functionalities/multidebugger_commands/TestMultipleDebuggersCommands.py (864 of 2034) PASS: lldb-api :: tools/lldb-server/TestLldbGdbServer.py (865 of 2034) PASS: lldb-api :: functionalities/inferior-changed/TestInferiorChanged.py (866 of 2034) PASS: lldb-api :: commands/expression/po_verbosity/TestPoVerbosity.py (867 of 2034) PASS: lldb-unit :: Utility/./UtilityTests/StringExtractorTest.GetHexBytesAvail (868 of 2034) PASS: lldb-unit :: Utility/./UtilityTests/VMRange.IsValid (869 of 2034) PASS: lldb-api :: commands/expression/issue_11588/Test11588.py (870 of 2034) PASS: lldb-unit :: ScriptInterpreter/Python/./ScriptInterpreterPythonTests/PythonDataObjectsTest.TestGlobalNameResolutionWithDot (871 of 2034) PASS: lldb-unit :: Utility/./UtilityTests/BinaryStreamTest.PutULEB128MaxValue (872 of 2034) PASS: lldb-unit :: Expression/./ExpressionTests/CppModuleConfigurationTest.UnknownLibCppFile (873 of 2034) PASS: lldb-api :: python_api/sblaunchinfo/TestSBLaunchInfo.py (874 of 2034) PASS: lldb-api :: lang/objc/foundation/TestObjCMethodsString.py (875 of 2034) PASS: lldb-api :: commands/target/basic/TestTargetCommand.py (876 of 2034) PASS: lldb-unit :: Language/Highlighting/./HighlighterTests/HighlighterTest.ClangIdentifiers (877 of 2034) PASS: lldb-unit :: Symbol/./SymbolTests/Type.CompilerContextPattern (878 of 2034) PASS: lldb-unit :: ScriptInterpreter/Python/./ScriptInterpreterPythonTests/PythonDataObjectsTest.TestPythonStringToStructuredString (879 of 2034) PASS: lldb-api :: tools/lldb-server/inferior-crash/TestGdbRemoteSegFault.py (880 of 2034) PASS: lldb-api :: sample_test/TestSampleTest.py (881 of 2034) PASS: lldb-unit :: SymbolFile/NativePDB/./SymbolFileNativePDBTests/PDBFPOProgramToDWARFExpressionTests.MultipleIndependentAssignments (882 of 2034) PASS: lldb-shell :: SymbolFile/NativePDB/function-types-builtins.cpp (883 of 2034) PASS: lldb-unit :: SymbolFile/NativePDB/./SymbolFileNativePDBTests/PDBFPOProgramToDWARFExpressionTests.InvalidAssignmentSingle (884 of 2034) PASS: lldb-unit :: Interpreter/./InterpreterTests/CompletionTest.DirCompletionUsername (885 of 2034) PASS: lldb-unit :: Host/./HostTests/FileSystemTest.GetByteSize (886 of 2034) PASS: lldb-unit :: Utility/./UtilityTests/AnsiTerminal.Twice (887 of 2034) PASS: lldb-api :: commands/frame/diagnose/local-variable/TestLocalVariable.py (888 of 2034) PASS: lldb-shell :: Settings/TestFrameFormatMangling.test (889 of 2034) PASS: lldb-unit :: Utility/./UtilityTests/AnsiTerminal.KnownPrefix (890 of 2034) PASS: lldb-unit :: Utility/./UtilityTests/StringListTest.CopyListEmpty (891 of 2034) PASS: lldb-unit :: Utility/./UtilityTests/OptionsWithRawTest.EmptyArgsOnlySuffix (892 of 2034) PASS: lldb-api :: lang/cpp/member-and-local-vars-with-same-name/TestMembersAndLocalsWithSameName.py (893 of 2034) PASS: lldb-unit :: Symbol/./SymbolTests/TestTypeSystemClang.TestGetEnumIntegerTypeUnexpectedType (894 of 2034) PASS: lldb-unit :: Host/./HostTests/FileSystemTest.GetPermissions (895 of 2034) PASS: lldb-unit :: UnwindAssembly/x86/./UnwindAssemblyx86Tests/Testx86AssemblyInspectionEngine.TestSpillRegToStackViaMOVx86_64 (896 of 2034) PASS: lldb-unit :: debugserver/./debugserverTests/RNBSocket.LoopBackConnectIPv4 (897 of 2034) PASS: lldb-api :: functionalities/backticks/TestBackticksWithoutATarget.py (898 of 2034) PASS: lldb-shell :: Minidump/Windows/Sigsegv/sigsegv.test (899 of 2034) PASS: lldb-shell :: Settings/TestModuleCacheSanity.test (900 of 2034) PASS: lldb-api :: lang/objc/objc-class-method/TestObjCClassMethod.py (901 of 2034) PASS: lldb-unit :: Utility/./UtilityTests/BinaryStreamTest.PutSLEB128FourBytes (902 of 2034) PASS: lldb-api :: commands/command/nested_alias/TestNestedAlias.py (903 of 2034) PASS: lldb-unit :: Language/Highlighting/./HighlighterTests/HighlighterTest.DefaultHighlighterWithCursorOutOfBounds (904 of 2034) UNSUPPORTED: lldb-api :: commands/expression/multiline-completion/TestMultilineCompletion.py (905 of 2034) PASS: lldb-api :: commands/expression/invalid-args/TestInvalidArgsExpression.py (906 of 2034) PASS: lldb-api :: lang/cpp/typedef/TestCppTypedef.py (907 of 2034) PASS: lldb-unit :: Utility/./UtilityTests/ArchSpecTest.TestParseMachCPUDashSubtypeTripleSimple (908 of 2034) PASS: lldb-unit :: ObjectFile/Breakpad/./ObjectFileBreakpadTests/FileRecord.parse (909 of 2034) PASS: lldb-api :: lang/cpp/unsigned_types/TestUnsignedTypes.py (910 of 2034) PASS: lldb-api :: functionalities/data-formatter/data-formatter-stl/libcxx/initializerlist/TestInitializerList.py (911 of 2034) PASS: lldb-unit :: Utility/./UtilityTests/RangeTest.ClearWithStarAddress (912 of 2034) PASS: lldb-unit :: ScriptInterpreter/Python/./ScriptInterpreterPythonTests/PythonDataObjectsTest.TestPythonFile (913 of 2034) PASS: lldb-unit :: Core/./LLDBCoreTests/MangledTest.ResultForBlockInvocation (914 of 2034) PASS: lldb-api :: sanity/TestModuleCacheSanity.py (915 of 2034) PASS: lldb-unit :: Utility/./UtilityTests/RangeTest.SizeTypes (916 of 2034) PASS: lldb-unit :: Expression/./ExpressionTests/CppModuleConfigurationTest.LinuxLocalLibCpp (917 of 2034) UNSUPPORTED: lldb-api :: functionalities/gdb_remote_client/TestWasm.py (918 of 2034) PASS: lldb-unit :: Process/minidump/./LLDBMinidumpTests/MinidumpParserTest.GetLinuxProcStatus (919 of 2034) PASS: lldb-api :: functionalities/thread/concurrent_events/TestConcurrentCrashWithBreak.py (920 of 2034) PASS: lldb-api :: lang/cpp/this/TestCPPThis.py (921 of 2034) PASS: lldb-unit :: Utility/./UtilityTests/AnsiTerminal.Unknown (922 of 2034) PASS: lldb-unit :: SymbolFile/DWARF/./SymbolFileDWARFTests/SymbolFileDWARFTests.TestAbbrevNullAttrValidForm (923 of 2034) PASS: lldb-api :: commands/expression/cast_int_to_anonymous_enum/TestCastIntToAnonymousEnum.py (924 of 2034) UNSUPPORTED: lldb-api :: lang/objc/foundation/TestFoundationDisassembly.py (925 of 2034) PASS: lldb-unit :: Utility/./UtilityTests/RangeTest.NotEqual (926 of 2034) PASS: lldb-shell :: Unwind/eh-frame-dwarf-unwind.test (927 of 2034) PASS: lldb-unit :: Utility/./UtilityTests/StringExtractorTest.DecodeHexU8_InvalidHex (928 of 2034) PASS: lldb-shell :: SymbolFile/DWARF/array-sizes.s (929 of 2034) PASS: lldb-unit :: SymbolFile/DWARF/./SymbolFileDWARFTests/SymbolFileDWARFTests.TestAbbrevOrder1Start1 (930 of 2034) PASS: lldb-unit :: Language/Highlighting/./HighlighterTests/HighlighterTest.ClangOperators (931 of 2034) UNSUPPORTED: lldb-api :: lang/c/typedef/Testtypedef.py (932 of 2034) PASS: lldb-shell :: SymbolFile/DWARF/debug-types-dwarf5.s (933 of 2034) PASS: lldb-shell :: SymbolFile/DWARF/inline-function-address.ll (934 of 2034) PASS: lldb-shell :: SymbolFile/DWARF/win-i386-line-table.s (935 of 2034) PASS: lldb-api :: macosx/add-dsym/TestAddDsymMidExecutionCommand.py (936 of 2034) PASS: lldb-api :: functionalities/tail_call_frames/ambiguous_tail_call_seq1/TestAmbiguousTailCallSeq1.py (937 of 2034) PASS: lldb-api :: functionalities/data-formatter/data-formatter-smart-array/TestDataFormatterSmartArray.py (938 of 2034) PASS: lldb-api :: commands/disassemble/basic/TestFrameDisassemble.py (939 of 2034) PASS: lldb-unit :: Process/minidump/./LLDBMinidumpTests/MinidumpParserTest.GetMemoryRegionInfo (940 of 2034) UNSUPPORTED: lldb-api :: functionalities/tsan/thread_numbers/TestTsanThreadNumbers.py (941 of 2034) PASS: lldb-api :: lang/cpp/scope/TestCppScope.py (942 of 2034) PASS: lldb-api :: lang/cpp/global_variables/TestCPPGlobalVariables.py (943 of 2034) PASS: lldb-api :: macosx/profile_vrs_detach/TestDetachVrsProfile.py (944 of 2034) PASS: lldb-unit :: Utility/./UtilityTests/ScalarTest.ComparisonFloat (945 of 2034) PASS: lldb-unit :: Utility/./UtilityTests/StreamTest.PutChar (946 of 2034) PASS: lldb-api :: functionalities/breakpoint/source_regexp/TestSourceRegexBreakpoints.py (947 of 2034) PASS: lldb-api :: functionalities/dynamic_value_child_count/TestDynamicValueChildCount.py (948 of 2034) PASS: lldb-unit :: SymbolFile/NativePDB/./SymbolFileNativePDBTests/PDBFPOProgramToDWARFExpressionTests.UnresolvedDependentCyclicRegisterAssignmentReference (949 of 2034) PASS: lldb-unit :: Utility/./UtilityTests/ConstStringTest.YAML (950 of 2034) PASS: lldb-shell :: SymbolFile/DWARF/clang-ast-from-dwarf-unamed-and-anon-structs.cpp (951 of 2034) PASS: lldb-api :: functionalities/thread/concurrent_events/TestConcurrentManyWatchpoints.py (952 of 2034) PASS: lldb-unit :: Symbol/./SymbolTests/TestTypeSystemClang.TestDeletingImplicitCopyCstrDueToMoveCStr (953 of 2034) PASS: lldb-shell :: SymbolFile/NativePDB/ast-functions.cpp (954 of 2034) UNSUPPORTED: lldb-shell :: Register/x86-64-xmm16-write.test (955 of 2034) PASS: lldb-unit :: Process/gdb-remote/./ProcessGdbRemoteTests/GDBRemoteCommunicationClientTest.GetQOffsets (956 of 2034) PASS: lldb-api :: tools/lldb-vscode/step/TestVSCode_step.py (957 of 2034) PASS: lldb-api :: lang/cpp/multiple-inheritance/TestCppMultipleInheritance.py (958 of 2034) PASS: lldb-unit :: Utility/./UtilityTests/TimerTest.CategoryTimesStats (959 of 2034) PASS: lldb-unit :: Utility/./UtilityTests/ArgsTest.TestSingleQuotedArgWithSpace (960 of 2034) PASS: lldb-api :: lang/objc/objc-new-syntax/TestObjCNewSyntaxDictionary.py (961 of 2034) PASS: lldb-shell :: Breakpoint/split-dwarf5-debug-stroffsets.test (962 of 2034) PASS: lldb-api :: functionalities/thread/concurrent_events/TestConcurrentCrashWithWatchpointBreakpointSignal.py (963 of 2034) PASS: lldb-api :: functionalities/abbreviation/TestCommonShortSpellings.py (964 of 2034) PASS: lldb-unit :: Expression/./ExpressionTests/DiagnosticManagerTest.PutStringMultiple (965 of 2034) PASS: lldb-unit :: Process/minidump/./LLDBMinidumpTests/MinidumpParserTest.GetPidWindows (966 of 2034) PASS: lldb-unit :: Utility/./UtilityTests/OptionsWithRawTest.UnterminatedQuote (967 of 2034) PASS: lldb-api :: lang/cpp/thread_local/TestThreadLocal.py (968 of 2034) PASS: lldb-api :: commands/watchpoints/watchpoint_set_command/TestWatchLocationWithWatchSet.py (969 of 2034) PASS: lldb-api :: lang/objc/single-entry-dictionary/TestObjCSingleEntryDictionary.py (970 of 2034) PASS: lldb-unit :: Utility/./UtilityTests/StreamTest.PutHex32ByteOrderBig (971 of 2034) PASS: lldb-unit :: Utility/./UtilityTests/StringListTest.RemoveBlankLines (972 of 2034) PASS: lldb-api :: commands/expression/xvalue/TestXValuePrinting.py (973 of 2034) PASS: lldb-api :: functionalities/data-formatter/data-formatter-objc/nsindexpath/TestDataFormatterNSIndexPath.py (974 of 2034) PASS: lldb-unit :: ScriptInterpreter/Python/./ScriptInterpreterPythonTests/PythonDataObjectsTest.TestBorrowedReferences (975 of 2034) PASS: lldb-unit :: Utility/./UtilityTests/UriParserTest.SchemeHostSeparator3 (976 of 2034) PASS: lldb-api :: commands/breakpoint/command/list/TestBreakpointCommandList.py (977 of 2034) PASS: lldb-unit :: Symbol/./SymbolTests/TestTypeSystemClang.TestRecordHasFields (978 of 2034) PASS: lldb-unit :: Utility/./UtilityTests/StringListTest.ShiftCString (979 of 2034) PASS: lldb-api :: functionalities/breakpoint/breakpoint_locations/TestBreakpointLocations.py (980 of 2034) PASS: lldb-api :: lang/c/unicode/TestUnicodeSymbols.py (981 of 2034) PASS: lldb-api :: commands/version/TestVersion.py (982 of 2034) UNSUPPORTED: lldb-api :: functionalities/breakpoint/breakpoint_callback_command_source/TestBreakpointCallbackCommandSource.py (983 of 2034) PASS: lldb-api :: functionalities/data-formatter/language_category_updates/TestDataFormatterLanguageCategoryUpdates.py (984 of 2034) PASS: lldb-api :: functionalities/data-formatter/data-formatter-stl/libcxx/set/TestDataFormatterLibcxxSet.py (985 of 2034) PASS: lldb-unit :: Expression/./ExpressionTests/ClangHostTest.MacOSX (986 of 2034) PASS: lldb-unit :: Core/./LLDBCoreTests/SourceFileCache.FindSourceFileFound (987 of 2034) PASS: lldb-api :: lang/objc/objc-baseclass-sbtype/TestObjCBaseClassSBType.py (988 of 2034) PASS: lldb-api :: commands/expression/call-function/TestCallUserDefinedFunction.py (989 of 2034) PASS: lldb-unit :: ObjectFile/Breakpad/./ObjectFileBreakpadTests/LineRecord.parse (990 of 2034) PASS: lldb-unit :: Symbol/./SymbolTests/TestTypeSystemClang.TestDisplayName (991 of 2034) PASS: lldb-api :: lang/objc/foundation/TestRuntimeTypes.py (992 of 2034) PASS: lldb-api :: functionalities/inferior-crashing/TestInferiorCrashing.py (993 of 2034) PASS: lldb-unit :: Utility/./UtilityTests/OptionsWithRawTest.WhitespaceInput (994 of 2034) PASS: lldb-api :: commands/platform/basic/TestPlatformCommand.py (995 of 2034) PASS: lldb-api :: commands/expression/ir-interpreter-phi-nodes/TestIRInterpreterPHINodes.py (996 of 2034) PASS: lldb-shell :: SymbolFile/DWARF/forward-declarations.s (997 of 2034) PASS: lldb-api :: macosx/thread-names/TestInterruptThreadNames.py (998 of 2034) PASS: lldb-api :: api/multiple-targets/TestMultipleTargets.py (999 of 2034) PASS: lldb-shell :: SymbolFile/DWARF/static_scope.s (1000 of 2034) PASS: lldb-shell :: Quit/TestQuitExitCodeNonInt.test (1001 of 2034) PASS: lldb-unit :: Utility/./UtilityTests/LogChannelEnabledTest.LogGetLogThread (1002 of 2034) PASS: lldb-api :: functionalities/data-formatter/data-formatter-objc/nsstring/TestDataFormatterNSString.py (1003 of 2034) PASS: lldb-unit :: ScriptInterpreter/Python/./ScriptInterpreterPythonTests/PythonDataObjectsTest.TestScript (1004 of 2034) PASS: lldb-unit :: Expression/./ExpressionTests/DiagnosticManagerTest.GetStringNoDiags (1005 of 2034) PASS: lldb-shell :: Process/Optimization.test (1006 of 2034) PASS: lldb-api :: commands/expression/persist_objc_pointeetype/TestPersistObjCPointeeType.py (1007 of 2034) PASS: lldb-api :: lang/objc/orderedset/TestOrderedSet.py (1008 of 2034) PASS: lldb-api :: lang/objc/print-obj/TestPrintObj.py (1009 of 2034) PASS: lldb-api :: macosx/lc-note/kern-ver-str/TestKernVerStrLCNOTE.py (1010 of 2034) PASS: lldb-api :: lang/cpp/char1632_t/TestChar1632T.py (1011 of 2034) PASS: lldb-unit :: Utility/./UtilityTests/LogChannelEnabledTest.LLDB_LOG_ERROR (1012 of 2034) PASS: lldb-unit :: ScriptInterpreter/Python/./ScriptInterpreterPythonTests/PythonDataObjectsTest.TestOwnedReferences (1013 of 2034) PASS: lldb-shell :: SymbolFile/DWARF/debug_loclists-dwo.s (1014 of 2034) UNSUPPORTED: lldb-api :: android/platform/TestDefaultCacheLineSize.py (1015 of 2034) PASS: lldb-api :: functionalities/unwind/zeroth_frame/TestZerothFrame.py (1016 of 2034) PASS: lldb-unit :: Utility/./UtilityTests/ArchSpecTest.MergeFrom (1017 of 2034) PASS: lldb-api :: lang/objc/objc-super/TestObjCSuper.py (1018 of 2034) PASS: lldb-unit :: Utility/./UtilityTests/FileSpecTest.Yaml (1019 of 2034) PASS: lldb-api :: macosx/DBGSourcePathRemapping/TestDSYMSourcePathRemapping.py (1020 of 2034) PASS: lldb-unit :: Process/gdb-remote/./ProcessGdbRemoteTests/GDBRemoteClientBaseTest.SendContinueAndInterrupt2PacketBug (1021 of 2034) PASS: lldb-unit :: Utility/./UtilityTests/StringExtractorTest.DecodeHexU8_Exact (1022 of 2034) PASS: lldb-unit :: Core/./LLDBCoreTests/CommunicationTest.SynchronizeWhileClosing (1023 of 2034) UNSUPPORTED: lldb-shell :: Register/arm-gp-read.test (1024 of 2034) PASS: lldb-unit :: Host/./HostTests/SocketTest.DomainGetConnectURI (1025 of 2034) PASS: lldb-api :: commands/expression/call-function/TestCallBuiltinFunction.py (1026 of 2034) PASS: lldb-unit :: Utility/./UtilityTests/ArchSpecTest.YAML (1027 of 2034) PASS: lldb-unit :: Host/./HostTests/ProcessLaunchInfoTest.Constructor (1028 of 2034) PASS: lldb-api :: lang/cpp/wchar_t/TestCxxWCharT.py (1029 of 2034) UNSUPPORTED: lldb-shell :: ObjectFile/ELF/minidebuginfo-no-lzma.yaml (1030 of 2034) PASS: lldb-api :: functionalities/tail_call_frames/ambiguous_tail_call_seq2/TestAmbiguousTailCallSeq2.py (1031 of 2034) PASS: lldb-api :: functionalities/wrong_commands/TestWrongCommands.py (1032 of 2034) UNSUPPORTED: lldb-shell :: Register/aarch64-fp-read.test (1033 of 2034) PASS: lldb-unit :: ScriptInterpreter/Python/./ScriptInterpreterPythonTests/PythonDataObjectsTest.TestPythonIntegerToStructuredInteger (1034 of 2034) PASS: lldb-api :: tools/lldb-vscode/launch/TestVSCode_launch.py (1035 of 2034) PASS: lldb-unit :: Utility/./UtilityTests/BinaryStreamTest.PutSLEB128FiveBytes (1036 of 2034) PASS: lldb-unit :: Utility/./UtilityTests/StreamTeeTest.Constructor1Stream (1037 of 2034) UNSUPPORTED: lldb-shell :: Breakpoint/ppc64-localentry.test (1038 of 2034) PASS: lldb-api :: lang/cpp/bool/TestCPPBool.py (1039 of 2034) PASS: lldb-unit :: Platform/./LLDBPlatformTests/PlatformDarwinTest.FindComponentInPath (1040 of 2034) PASS: lldb-api :: types/TestCharTypeExpr.py (1041 of 2034) PASS: lldb-shell :: Minidump/Windows/find-module.test (1042 of 2034) PASS: lldb-api :: functionalities/data-formatter/data-formatter-objc/TestDataFormatterObjCNSBundle.py (1043 of 2034) UNSUPPORTED: lldb-shell :: ScriptInterpreter/Lua/breakpoint_callback.test (1044 of 2034) PASS: lldb-shell :: ObjectFile/ELF/section-addresses.yaml (1045 of 2034) PASS: lldb-unit :: Utility/./UtilityTests/StreamTest.PutHex8 (1046 of 2034) PASS: lldb-unit :: Language/Highlighting/./HighlighterTests/HighlighterTest.ClangScalarLiterals (1047 of 2034) PASS: lldb-unit :: UnwindAssembly/x86/./UnwindAssemblyx86Tests/Testx86AssemblyInspectionEngine.TestPushESI (1048 of 2034) UNSUPPORTED: lldb-api :: commands/expression/macros/TestMacros.py (1049 of 2034) PASS: lldb-unit :: Expression/./ExpressionTests/CppModuleConfigurationTest.IgnoreLibStdCpp (1050 of 2034) PASS: lldb-unit :: UnwindAssembly/x86/./UnwindAssemblyx86Tests/Testx86AssemblyInspectionEngine.TestCALLNextInsn (1051 of 2034) PASS: lldb-unit :: Utility/./UtilityTests/StringListTest.SplitIntoLinesSingleTrailingCR (1052 of 2034) PASS: lldb-api :: functionalities/data-formatter/setvaluefromcstring/TestSetValueFromCString.py (1053 of 2034) PASS: lldb-unit :: Utility/./UtilityTests/RangeDataVector.FindEntryThatContains_Overlap (1054 of 2034) PASS: lldb-api :: api/multithreaded/TestMultithreaded.py (1055 of 2034) PASS: lldb-shell :: Reproducer/TestPythonImport.test (1056 of 2034) PASS: lldb-api :: functionalities/thread/exit_during_step/TestExitDuringStep.py (1057 of 2034) PASS: lldb-unit :: Utility/./UtilityTests/UriParserTest.BadPort (1058 of 2034) PASS: lldb-unit :: tools/lldb-server/tests/./LLDBServerTests/StandardStartupTest.TestStopReplyContainsThreadPcs (1059 of 2034) PASS: lldb-api :: python_api/hello_world/TestHelloWorld.py (1060 of 2034) UNSUPPORTED: lldb-shell :: Register/x86-64-gp-write.test (1061 of 2034) PASS: lldb-api :: functionalities/rerun/TestRerun.py (1062 of 2034) PASS: lldb-unit :: Process/minidump/./LLDBMinidumpTests/RegisterContextMinidump.ConvertMinidumpContext_x86_64 (1063 of 2034) PASS: lldb-api :: python_api/watchpoint/TestWatchpointIgnoreCount.py (1064 of 2034) PASS: lldb-api :: lang/cpp/nsimport/TestCppNsImport.py (1065 of 2034) PASS: lldb-unit :: Utility/./UtilityTests/StreamTest.PutPtr (1066 of 2034) PASS: lldb-unit :: Utility/./UtilityTests/StringExtractorTest.GetHexBytes_FullString (1067 of 2034) UNSUPPORTED: lldb-shell :: Register/x86-gp-read.test (1068 of 2034) PASS: lldb-api :: commands/disassemble/basic/TestDisassembleBreakpoint.py (1069 of 2034) PASS: lldb-unit :: Utility/./UtilityTests/NameMatchesTest.StartsWith (1070 of 2034) PASS: lldb-unit :: Symbol/./SymbolTests/DWARFCallFrameInfoTest.Basic_eh (1071 of 2034) PASS: lldb-unit :: Utility/./UtilityTests/StringExtractorTest.DecodeHexU8_InvalidHex2 (1072 of 2034) PASS: lldb-unit :: Utility/./UtilityTests/BinaryStreamTest.PutSLEB128TwoBytes (1073 of 2034) PASS: lldb-unit :: Utility/./UtilityTests/StreamTeeTest.GetStreamAtIndexOutOfBounds (1074 of 2034) PASS: lldb-unit :: Expression/./ExpressionTests/DiagnosticManagerTest.AppendMessageNoDiag (1075 of 2034) PASS: lldb-api :: commands/platform/basic/TestPlatformPython.py (1076 of 2034) PASS: lldb-api :: commands/frame/diagnose/virtual-method-call/TestDiagnoseDereferenceVirtualMethodCall.py (1077 of 2034) UNSUPPORTED: lldb-api :: functionalities/darwin_log/filter/exact_match/activity-chain/TestDarwinLogFilterMatchActivityChain.py (1078 of 2034) PASS: lldb-shell :: SymbolFile/DWARF/dwp-separate-debug-file.cpp (1079 of 2034) PASS: lldb-unit :: Symbol/./SymbolTests/PostfixExpression.ToDWARF (1080 of 2034) PASS: lldb-unit :: Symbol/./SymbolTests/TestClangASTImporter.ImportInvalidType (1081 of 2034) PASS: lldb-unit :: Target/./TargetTests/PathMappingListTest.RemapRoot (1082 of 2034) UNSUPPORTED: lldb-shell :: SymbolFile/PDB/class-layout.test (1083 of 2034) PASS: lldb-api :: functionalities/thread/concurrent_events/TestConcurrentDelayedCrashWithBreakpointWatchpoint.py (1084 of 2034) PASS: lldb-api :: commands/expression/import-std-module/no-std-module/TestMissingStdModule.py (1085 of 2034) PASS: lldb-shell :: Commands/command-target-modules-dump-sections.yaml (1086 of 2034) PASS: lldb-unit :: Utility/./UtilityTests/CompletionRequest.TryCompleteCurrentArgMode (1087 of 2034) PASS: lldb-api :: lang/objc/rdar-10967107/TestRdar10967107.py (1088 of 2034) UNSUPPORTED: lldb-api :: functionalities/ubsan/user-expression/TestUbsanUserExpression.py (1089 of 2034) PASS: lldb-api :: functionalities/breakpoint/breakpoint_ignore_count/TestBreakpointIgnoreCount.py (1090 of 2034) UNSUPPORTED: lldb-shell :: BuildScript/toolchain-msvc.test (1091 of 2034) PASS: lldb-unit :: DataFormatter/./LLDBFormatterTests/StringPrinterTests.CxxUTF8 (1092 of 2034) PASS: lldb-api :: functionalities/data-formatter/type_summary_list_script/TestTypeSummaryListScript.py (1093 of 2034) PASS: lldb-shell :: ObjectFile/PECOFF/invalid-export-table.yaml (1094 of 2034) PASS: lldb-shell :: SymbolFile/DWARF/dwarf5_locations.s (1095 of 2034) PASS: lldb-unit :: Utility/./UtilityTests/EnvironmentTest.EnvpConversion (1096 of 2034) PASS: lldb-api :: functionalities/breakpoint/objc/TestObjCBreakpoints.py (1097 of 2034) PASS: lldb-api :: commands/watchpoints/watchpoint_size/TestWatchpointSizes.py (1098 of 2034) PASS: lldb-unit :: Utility/./UtilityTests/StructuredDataTest.ParseJSONFromFile (1099 of 2034) PASS: lldb-unit :: Expression/./ExpressionTests/DWARFExpression.DW_OP_stack_value (1100 of 2034) PASS: lldb-shell :: Register/x86-64-gp-read.test (1101 of 2034) PASS: lldb-api :: functionalities/archives/TestBSDArchives.py (1102 of 2034) PASS: lldb-api :: python_api/exprpath_synthetic/TestExprPathSynthetic.py (1103 of 2034) UNSUPPORTED: lldb-shell :: Register/x86-64-ymm16-read.test (1104 of 2034) PASS: lldb-shell :: ObjectFile/wasm/embedded-debug-sections.yaml (1105 of 2034) PASS: lldb-unit :: Utility/./UtilityTests/SerializationRountripTest.SerializeDeserializeCString (1106 of 2034) PASS: lldb-shell :: SymbolFile/DWARF/debug_ranges.s (1107 of 2034) UNSUPPORTED: lldb-api :: commands/expression/call-restarts/TestCallThatRestarts.py (1108 of 2034) PASS: lldb-api :: tools/lldb-server/TestGdbRemoteExitCode.py (1109 of 2034) PASS: lldb-unit :: Utility/./UtilityTests/Flags.AllClear (1110 of 2034) PASS: lldb-unit :: Process/minidump/./LLDBMinidumpTests/MinidumpParserTest.InvalidMinidump (1111 of 2034) PASS: lldb-api :: functionalities/signal/TestSendSignal.py (1112 of 2034) PASS: lldb-unit :: Signals/./SignalsTests/UnixSignalsTest.VersionChange (1113 of 2034) PASS: lldb-unit :: Process/minidump/./LLDBMinidumpTests/MinidumpParserTest.MinidumpModuleOrder (1114 of 2034) PASS: lldb-api :: macosx/dyld-trie-symbols/TestDyldTrieSymbols.py (1115 of 2034) PASS: lldb-shell :: Settings/TestDisableColor.test (1116 of 2034) UNSUPPORTED: lldb-api :: functionalities/data-formatter/data-formatter-stl/libstdcpp/vbool/TestDataFormatterStdVBool.py (1117 of 2034) PASS: lldb-unit :: Core/./LLDBCoreTests/SourceFileCache.FindSourceFileNotFound (1118 of 2034) PASS: lldb-api :: lang/cpp/const_this/TestConstThis.py (1119 of 2034) UNSUPPORTED: lldb-shell :: SymbolFile/PDB/function-nested-block.test (1120 of 2034) PASS: lldb-unit :: Process/minidump/./LLDBMinidumpTests/MinidumpParserTest.GetThreadContext_x86_64 (1121 of 2034) PASS: lldb-shell :: SymbolFile/NativePDB/break-by-function.cpp (1122 of 2034) PASS: lldb-unit :: Host/./HostTests/SocketTest.TCPListen0GetPort (1123 of 2034) PASS: lldb-unit :: Process/minidump/./LLDBMinidumpTests/RegisterContextMinidump.ConvertMinidumpContext_x86_32 (1124 of 2034) PASS: lldb-api :: python_api/process/TestProcessAPI.py (1125 of 2034) PASS: lldb-unit :: Utility/./UtilityTests/ReproducerTest.SetReplay (1126 of 2034) PASS: lldb-api :: commands/watchpoints/watchpoint_disable/TestWatchpointDisable.py (1127 of 2034) PASS: lldb-api :: functionalities/tail_call_frames/disambiguate_paths_to_common_sink/TestDisambiguatePathsToCommonSink.py (1128 of 2034) UNSUPPORTED: lldb-shell :: SymbolFile/PDB/variables-locations.test (1129 of 2034) PASS: lldb-unit :: Utility/./UtilityTests/RegularExpression.Empty (1130 of 2034) UNSUPPORTED: lldb-api :: tools/lldb-server/thread-name/TestGdbRemoteThreadName.py (1131 of 2034) PASS: lldb-unit :: Process/gdb-remote/./ProcessGdbRemoteTests/GDBRemoteCommunicationServerTest.SendErrorResponse_ErrorList (1132 of 2034) UNSUPPORTED: lldb-api :: arm/breakpoint-it/TestBreakpointIt.py (1133 of 2034) PASS: lldb-api :: lang/cpp/std-function-step-into-callable/TestStdFunctionStepIntoCallable.py (1134 of 2034) PASS: lldb-shell :: Reproducer/TestDump.test (1135 of 2034) PASS: lldb-api :: lang/cpp/namespace/TestNamespaceLookup.py (1136 of 2034) PASS: lldb-api :: lang/cpp/rvalue-references/TestRvalueReferences.py (1137 of 2034) PASS: lldb-unit :: Utility/./UtilityTests/ConstStringTest.NullAndEmptyStates (1138 of 2034) PASS: lldb-unit :: Utility/./UtilityTests/CompletionRequest.TestCompletionOwnership (1139 of 2034) PASS: lldb-api :: functionalities/thread/concurrent_events/TestConcurrentSignalWatch.py (1140 of 2034) PASS: lldb-api :: functionalities/data-formatter/compactvectors/TestCompactVectors.py (1141 of 2034) PASS: lldb-api :: macosx/universal/TestUniversal.py (1142 of 2034) PASS: lldb-shell :: Register/x86-64-read.test (1143 of 2034) PASS: lldb-api :: functionalities/thread/step_out/TestThreadStepOut.py (1144 of 2034) PASS: lldb-unit :: Utility/./UtilityTests/StringLexerTest.PutBack (1145 of 2034) PASS: lldb-api :: functionalities/data-formatter/summary-string-onfail/Test-rdar-9974002.py (1146 of 2034) PASS: lldb-unit :: ScriptInterpreter/Python/./ScriptInterpreterPythonTests/PythonDataObjectsTest.TestPythonDictionaryManipulation (1147 of 2034) PASS: lldb-unit :: Symbol/./SymbolTests/LineEntryTest.GetSameLineContiguousAddressRangeOneInline (1148 of 2034) XFAIL: lldb-shell :: Register/x86-mm-xmm-write.test (1149 of 2034) UNSUPPORTED: lldb-shell :: Expr/TestIRMemoryMapWindows.test (1150 of 2034) PASS: lldb-unit :: Utility/./UtilityTests/AnsiTerminal.Basic (1151 of 2034) PASS: lldb-shell :: SymbolFile/DWARF/DW_AT_low_pc-addrx.s (1152 of 2034) PASS: lldb-api :: python_api/lldbutil/TestSwigVersion.py (1153 of 2034) UNSUPPORTED: lldb-api :: tools/lldb-server/TestGdbRemoteAuxvSupport.py (1154 of 2034) PASS: lldb-unit :: Symbol/./SymbolTests/TestTypeSystemClang.TestGetEnumIntegerTypeBasicTypes (1155 of 2034) PASS: lldb-unit :: ScriptInterpreter/Python/./ScriptInterpreterPythonTests/PythonDataObjectsTest.TestPythonCallableInvoke (1156 of 2034) PASS: lldb-unit :: Utility/./UtilityTests/RangeTest.ContainsRangeStartingFromZero (1157 of 2034) PASS: lldb-unit :: Process/gdb-remote/./ProcessGdbRemoteTests/GDBRemoteCommunicationClientTest.SyncThreadState (1158 of 2034) PASS: lldb-api :: commands/expression/import-std-module/vector-of-vectors/TestVectorOfVectorsFromStdModule.py (1159 of 2034) PASS: lldb-shell :: SymbolFile/NativePDB/source-list.cpp (1160 of 2034) PASS: lldb-api :: lang/c/blocks/TestBlocks.py (1161 of 2034) PASS: lldb-unit :: Language/Highlighting/./HighlighterTests/HighlighterTest.ClangTrailingBackslashBeforeNewline (1162 of 2034) PASS: lldb-api :: functionalities/gdb_remote_client/TestRestartBug.py (1163 of 2034) PASS: lldb-unit :: Language/Highlighting/./HighlighterTests/HighlighterTest.ClangSquareBrackets (1164 of 2034) PASS: lldb-shell :: SymbolFile/NativePDB/global-classes.cpp (1165 of 2034) PASS: lldb-unit :: Utility/./UtilityTests/StringListTest.JoinThree (1166 of 2034) PASS: lldb-api :: tools/lldb-server/TestGdbRemoteProcessInfo.py (1167 of 2034) PASS: lldb-unit :: Utility/./UtilityTests/StringExtractorTest.DecodeHexU8_Underflow (1168 of 2034) PASS: lldb-api :: python_api/frame/get-variables/TestGetVariables.py (1169 of 2034) PASS: lldb-api :: python_api/function_symbol/TestDisasmAPI.py (1170 of 2034) PASS: lldb-api :: functionalities/plugins/command_plugin/TestPluginCommands.py (1171 of 2034) PASS: lldb-api :: functionalities/dead-strip/TestDeadStrip.py (1172 of 2034) PASS: lldb-api :: lang/objc/objc-struct-argument/TestObjCStructArgument.py (1173 of 2034) PASS: lldb-api :: commands/apropos/basic/TestApropos.py (1174 of 2034) PASS: lldb-unit :: Utility/./UtilityTests/StringExtractorTest.GetHexU8_Underflow (1175 of 2034) UNSUPPORTED: lldb-shell :: Register/arm-fp-read.test (1176 of 2034) UNSUPPORTED: lldb-api :: functionalities/thread/multi_break/TestMultipleBreakpoints.py (1177 of 2034) PASS: lldb-unit :: Utility/./UtilityTests/StringLexerTest.NextIfList (1178 of 2034) PASS: lldb-shell :: SymbolFile/DWARF/debug-types-missing-signature.test (1179 of 2034) PASS: lldb-api :: functionalities/thread/concurrent_events/TestConcurrentTwoWatchpointThreads.py (1180 of 2034) PASS: lldb-unit :: Utility/./UtilityTests/BinaryStreamTest.PutSLEB128Zero (1181 of 2034) PASS: lldb-unit :: Utility/./UtilityTests/RangeDataVector.FindEntryThatContains (1182 of 2034) PASS: lldb-api :: functionalities/lazy-loading/TestLazyLoading.py (1183 of 2034) PASS: lldb-api :: commands/expression/import-std-module/stack/TestStackFromStdModule.py (1184 of 2034) PASS: lldb-unit :: Utility/./UtilityTests/UUIDTest.RelationalOperators (1185 of 2034) UNSUPPORTED: lldb-api :: commands/expression/completion-crash-invalid-iterator/TestInvalidIteratorCompletionCrash.py (1186 of 2034) UNSUPPORTED: lldb-api :: commands/watchpoints/multi_watchpoint_slots/TestWatchpointMultipleSlots.py (1187 of 2034) PASS: lldb-api :: python_api/lldbutil/iter/TestRegistersIterator.py (1188 of 2034) PASS: lldb-unit :: Utility/./UtilityTests/SerializationRountripTest.SerializeDeserializeCStringArray (1189 of 2034) PASS: lldb-api :: functionalities/breakpoint/breakpoint_names/TestBreakpointNames.py (1190 of 2034) PASS: lldb-api :: types/TestShortType.py (1191 of 2034) PASS: lldb-unit :: ScriptInterpreter/Python/./ScriptInterpreterPythonTests/PythonDataObjectsTest.TestPythonCallableCheck (1192 of 2034) PASS: lldb-api :: python_api/process/io/TestProcessIO.py (1193 of 2034) PASS: lldb-api :: functionalities/breakpoint/breakpoint_command/TestRegexpBreakCommand.py (1194 of 2034) PASS: lldb-unit :: Process/gdb-remote/./ProcessGdbRemoteTests/GDBRemoteClientBaseTest.SendContinueAndWait (1195 of 2034) PASS: lldb-unit :: ScriptInterpreter/Python/./ScriptInterpreterPythonTests/PythonDataObjectsTest.TestPythonDictionaryToStructuredDictionary (1196 of 2034) PASS: lldb-unit :: SymbolFile/NativePDB/./SymbolFileNativePDBTests/PDBFPOProgramToDWARFExpressionTests.UnresolvedRegisterReference (1197 of 2034) PASS: lldb-api :: api/listeners/TestListener.py (1198 of 2034) PASS: lldb-api :: lang/objc/real-definition/TestRealDefinition.py (1199 of 2034) PASS: lldb-api :: functionalities/breakpoint/breakpoint_command/TestBreakpointCommandsFromPython.py (1200 of 2034) PASS: lldb-unit :: Utility/./UtilityTests/DeserializerTest.HasData (1201 of 2034) PASS: lldb-unit :: UnwindAssembly/x86/./UnwindAssemblyx86Tests/Testx86AssemblyInspectionEngine.Test64bitFramelessSmallStackFrame (1202 of 2034) PASS: lldb-unit :: Utility/./UtilityTests/RangeTest.NotEqualInvalid (1203 of 2034) PASS: lldb-shell :: ObjectFile/ELF/aarch64-relocations.yaml (1204 of 2034) PASS: lldb-api :: functionalities/tail_call_frames/inlining_and_tail_calls/TestInliningAndTailCalls.py (1205 of 2034) PASS: lldb-shell :: Process/TestEnvironment.test (1206 of 2034) PASS: lldb-unit :: Utility/./UtilityTests/UriParserTest.MinimalPath (1207 of 2034) PASS: lldb-unit :: Utility/./UtilityTests/EnvironmentTest.EnvpConstruction (1208 of 2034) PASS: lldb-unit :: ScriptInterpreter/Python/./ScriptInterpreterPythonTests/PythonDataObjectsTest.TestPythonByteArray (1209 of 2034) PASS: lldb-unit :: Utility/./UtilityTests/PassiveReplayTest.InstrumentedBarRef (1210 of 2034) PASS: lldb-shell :: Process/UnsupportedLanguage.test (1211 of 2034) PASS: lldb-unit :: Utility/./UtilityTests/EventTest.DumpEventDataBytes (1212 of 2034) PASS: lldb-api :: functionalities/breakpoint/breakpoint_conditions/TestBreakpointConditions.py (1213 of 2034) PASS: lldb-unit :: ScriptInterpreter/Python/./ScriptInterpreterPythonTests/PythonDataObjectsTest.TestPythonInteger (1214 of 2034) PASS: lldb-unit :: Symbol/./SymbolTests/TestTypeSystemClang.TestGetTypeClassDeclType (1215 of 2034) PASS: lldb-api :: lang/cpp/type_lookup/TestCppTypeLookup.py (1216 of 2034) PASS: lldb-unit :: UnwindAssembly/x86/./UnwindAssemblyx86Tests/Testx86AssemblyInspectionEngine.Test64bitFramelessBigStackFrame (1217 of 2034) UNSUPPORTED: lldb-shell :: Watchpoint/netbsd-nouserdbregs.test (1218 of 2034) PASS: lldb-api :: python_api/value/linked_list/TestValueAPILinkedList.py (1219 of 2034) PASS: lldb-api :: functionalities/data-formatter/data-formatter-stl/libcxx/iterator/TestDataFormatterLibccIterator.py (1220 of 2034) PASS: lldb-shell :: Driver/TestSingleQuote.test (1221 of 2034) PASS: lldb-unit :: Utility/./UtilityTests/ArgsTest.EscapeLLDBCommandArgument (1222 of 2034) UNSUPPORTED: lldb-shell :: SymbolFile/DWARF/debug-types-expressions.test (1223 of 2034) PASS: lldb-shell :: Reproducer/TestDSYM.test (1224 of 2034) PASS: lldb-unit :: UnwindAssembly/x86/./UnwindAssemblyx86Tests/Testx86AssemblyInspectionEngine.TestPopEDI (1225 of 2034) PASS: lldb-unit :: UnwindAssembly/x86/./UnwindAssemblyx86Tests/Testx86AssemblyInspectionEngine.TestPopESI (1226 of 2034) PASS: lldb-api :: commands/expression/context-object/TestContextObject.py (1227 of 2034) PASS: lldb-unit :: Utility/./UtilityTests/ProcessInfoTest.Constructor (1228 of 2034) PASS: lldb-api :: commands/command/history/TestCommandHistory.py (1229 of 2034) PASS: lldb-unit :: Language/Highlighting/./HighlighterTests/HighlighterTest.ClangUnterminatedString (1230 of 2034) UNSUPPORTED: lldb-shell :: SymbolFile/NativePDB/ast-functions-msvc.cpp (1231 of 2034) PASS: lldb-shell :: Minidump/Windows/broken-unwind.test (1232 of 2034) PASS: lldb-api :: lang/cpp/llvm-style/TestLLVMStyle.py (1233 of 2034) PASS: lldb-unit :: Target/./TargetTests/ExecutionContextTest.GetByteOrder (1234 of 2034) PASS: lldb-api :: lang/c/array_types/TestArrayTypes.py (1235 of 2034) PASS: lldb-unit :: Utility/./UtilityTests/CompletionRequest.ShiftArguments (1236 of 2034) PASS: lldb-api :: python_api/name_lookup/TestNameLookup.py (1237 of 2034) PASS: lldb-api :: functionalities/tail_call_frames/thread_step_out_or_return/TestSteppingOutWithArtificialFrames.py (1238 of 2034) PASS: lldb-unit :: Host/./HostTests/NativeProcessProtocolTest.SetBreakpointFailRead (1239 of 2034) PASS: lldb-shell :: ObjectFile/Breakpad/sections.test (1240 of 2034) PASS: lldb-api :: lang/cpp/static_methods/TestCPPStaticMethods.py (1241 of 2034) PASS: lldb-shell :: Expr/TestIRMemoryMap.test (1242 of 2034) PASS: lldb-api :: driver/batch_mode/TestBatchMode.py (1243 of 2034) UNSUPPORTED: lldb-api :: macosx/macabi/TestMacABImacOSFramework.py (1244 of 2034) PASS: lldb-api :: tools/lldb-server/TestGdbRemoteSingleStep.py (1245 of 2034) UNSUPPORTED: lldb-api :: commands/register/register/intel_xtended_registers/mpx_bound_violation/TestBoundViolation.py (1246 of 2034) PASS: lldb-shell :: Reproducer/Modules/TestModuleCXX.test (1247 of 2034) PASS: lldb-shell :: Quit/TestQuitExitCodeImplicit0.test (1248 of 2034) PASS: lldb-shell :: SymbolFile/NativePDB/bitfields.cpp (1249 of 2034) PASS: lldb-api :: functionalities/data-formatter/data-formatter-stl/libcxx/tuple/TestDataFormatterLibcxxTuple.py (1250 of 2034) PASS: lldb-shell :: BuildScript/compiler-full-path.test (1251 of 2034) PASS: lldb-api :: commands/frame/diagnose/inheritance/TestDiagnoseInheritance.py (1252 of 2034) PASS: lldb-unit :: Utility/./UtilityTests/StreamTeeTest.Flush (1253 of 2034) PASS: lldb-shell :: Minidump/dump-all.test (1254 of 2034) PASS: lldb-api :: functionalities/thread/create_after_attach/TestCreateAfterAttach.py (1255 of 2034) PASS: lldb-unit :: Expression/./ExpressionTests/DiagnosticManagerTest.FixedExpression (1256 of 2034) PASS: lldb-unit :: Utility/./UtilityTests/FileSpecTest.RemoveLastPathComponent (1257 of 2034) PASS: lldb-unit :: ScriptInterpreter/Python/./ScriptInterpreterPythonTests/PythonDataObjectsTest.TestPythonDictionaryValueEquality (1258 of 2034) PASS: lldb-api :: functionalities/data-formatter/ptr_ref_typedef/TestPtrRef2Typedef.py (1259 of 2034) PASS: lldb-api :: functionalities/data-formatter/data-formatter-objc/TestDataFormatterObjCNSData.py (1260 of 2034) PASS: lldb-unit :: Utility/./UtilityTests/RangeTest.ContainsAddrInvalid (1261 of 2034) PASS: lldb-shell :: Driver/TestCore.test (1262 of 2034) PASS: lldb-api :: tools/lldb-server/TestAppleSimulatorOSType.py (1263 of 2034) PASS: lldb-unit :: Utility/./UtilityTests/StringExtractorTest.GetHexU8_InvalidHex (1264 of 2034) PASS: lldb-api :: macosx/order/TestOrderFile.py (1265 of 2034) PASS: lldb-shell :: ObjectFile/wasm/basic.yaml (1266 of 2034) PASS: lldb-api :: functionalities/postmortem/mach-core/TestMachCore.py (1267 of 2034) PASS: lldb-shell :: SymbolFile/DWARF/debug_loc-aslr.s (1268 of 2034) PASS: lldb-api :: sample_test/TestSampleInlineTest.py (1269 of 2034) PASS: lldb-api :: commands/expression/persistent_ptr_update/TestPersistentPtrUpdate.py (1270 of 2034) PASS: lldb-api :: python_api/watchpoint/TestSetWatchpoint.py (1271 of 2034) PASS: lldb-shell :: SymbolFile/DWARF/dir-separator-no-comp-dir.s (1272 of 2034) FAIL: lldb-shell :: SymbolFile/DWARF/DW_TAG_variable-DW_AT_const_value.s (1273 of 2034) ******************** TEST 'lldb-shell :: SymbolFile/DWARF/DW_TAG_variable-DW_AT_const_value.s' FAILED ******************** Script: -- : 'RUN: at line 5'; /Users/buildslave/jenkins/workspace/lldb-cmake-sanitized/lldb-build/bin/llvm-mc -triple x86_64-unknown-linux-gnu /Users/buildslave/jenkins/workspace/lldb-cmake-sanitized/llvm-project/lldb/test/Shell/SymbolFile/DWARF/DW_TAG_variable-DW_AT_const_value.s -filetype=obj > /Users/buildslave/jenkins/workspace/lldb-cmake-sanitized/lldb-build/tools/lldb/test/SymbolFile/DWARF/Output/DW_TAG_variable-DW_AT_const_value.s.tmp.o : 'RUN: at line 6'; /Users/buildslave/jenkins/workspace/lldb-cmake-sanitized/lldb-build/bin/lldb --no-lldbinit -S /Users/buildslave/jenkins/workspace/lldb-cmake-sanitized/lldb-build/tools/lldb/test/Shell/lit-lldb-init /Users/buildslave/jenkins/workspace/lldb-cmake-sanitized/lldb-build/tools/lldb/test/SymbolFile/DWARF/Output/DW_TAG_variable-DW_AT_const_value.s.tmp.o -o "p/x magic64" -o exit | /Users/buildslave/jenkins/workspace/lldb-cmake-sanitized/lldb-build/bin/FileCheck /Users/buildslave/jenkins/workspace/lldb-cmake-sanitized/llvm-project/lldb/test/Shell/SymbolFile/DWARF/DW_TAG_variable-DW_AT_const_value.s -- Exit Code: 1

Hide Details

Command Output (stderr): -- /Users/buildslave/jenkins/workspace/lldb-cmake-sanitized/llvm-project/lldb/source/Utility/DataExtractor.cpp:934:17: runtime error: negation of -9223372036854775808 cannot be represented in type 'int64_t' (aka 'long long'); cast to an unsigned type to negate this value to itself SUMMARY: UndefinedBehaviorSanitizer: undefined-behavior /Users/buildslave/jenkins/workspace/lldb-cmake-sanitized/llvm-project/lldb/source/Utility/DataExtractor.cpp:934:17 in PLEASE submit a bug report to https://bugs.llvm.org/ and include the crash backtrace. Stack dump: 0. Program arguments: /Users/buildslave/jenkins/workspace/lldb-cmake-sanitized/lldb-build/bin/lldb --no-lldbinit -S /Users/buildslave/jenkins/workspace/lldb-cmake-sanitized/lldb-build/tools/lldb/test/Shell/lit-lldb-init /Users/buildslave/jenkins/workspace/lldb-cmake-sanitized/lldb-build/tools/lldb/test/SymbolFile/DWARF/Output/DW_TAG_variable-DW_AT_const_value.s.tmp.o -o p/x magic64 -o exit /Users/buildslave/jenkins/workspace/lldb-cmake-sanitized/llvm-project/lldb/test/Shell/SymbolFile/DWARF/DW_TAG_variable-DW_AT_const_value.s:8:10: error: CHECK: expected string not found in input # CHECK: (const long) $0 = 0xed9a924c00011151 ^ <stdin>:1:1: note: scanning from here (lldb) command source -s 0 '/Users/buildslave/jenkins/workspace/lldb-cmake-sanitized/lldb-build/tools/lldb/test/Shell/lit-lldb-init' ^ <stdin>:11:1: note: possible intended match here (lldb) p/x magic64 ^

Hide Details

--

Hide Details

******************** PASS: lldb-api :: functionalities/thread/exit_during_break/TestExitDuringBreak.py (1274 of 2034) PASS: lldb-api :: functionalities/breakpoint/scripted_bkpt/TestScriptedResolver.py (1275 of 2034) PASS: lldb-unit :: SymbolFile/DWARF/./SymbolFileDWARFTests/SymbolFileDWARFTests.TestAbilitiesForDWARF (1276 of 2034) PASS: lldb-api :: functionalities/thread/concurrent_events/TestConcurrentDelayWatchBreak.py (1277 of 2034) PASS: lldb-unit :: Utility/./UtilityTests/GeneratorTest.Get (1278 of 2034) PASS: lldb-api :: tools/lldb-server/TestGdbRemoteThreadsInStopReply.py (1279 of 2034) PASS: lldb-unit :: Utility/./UtilityTests/StreamTest.PutCString (1280 of 2034) PASS: lldb-api :: terminal/TestSTTYBeforeAndAfter.py (1281 of 2034) PASS: lldb-api :: functionalities/breakpoint/move_nearest/TestMoveNearest.py (1282 of 2034) PASS: lldb-unit :: Symbol/./SymbolTests/DWARFCallFrameInfoTest.Basic_dwarf3 (1283 of 2034) XFAIL: lldb-shell :: Unwind/prefer-debug-over-eh-frame.test (1284 of 2034) PASS: lldb-unit :: Utility/./UtilityTests/UriParserTest.BracketedHostnameWithPortIPv4 (1285 of 2034) PASS: lldb-unit :: Utility/./UtilityTests/ProcessInstanceInfo.DumpTable_invalidUID (1286 of 2034) PASS: lldb-api :: lang/c/set_values/TestSetValues.py (1287 of 2034) PASS: lldb-unit :: Process/gdb-remote/./ProcessGdbRemoteTests/GDBRemoteClientBaseTest.SendPacketAndReceiveResponseWithOutputSupport (1288 of 2034) PASS: lldb-api :: api/command-return-object/TestSBCommandReturnObject.py (1289 of 2034) PASS: lldb-unit :: Process/minidump/./LLDBMinidumpTests/MinidumpParserTest.GetMemoryRegionInfoLinuxMaps (1290 of 2034) PASS: lldb-shell :: Heap/heap-cstr.test (1291 of 2034) PASS: lldb-api :: python_api/file_handle/TestFileHandle.py (1292 of 2034) PASS: lldb-shell :: SymbolFile/DWARF/parallel-indexing-stress.s (1293 of 2034) PASS: lldb-unit :: Expression/./ExpressionTests/CppModuleConfigurationTest.Sysroot (1294 of 2034) UNSUPPORTED: lldb-shell :: SymbolFile/PDB/vbases.test (1295 of 2034) PASS: lldb-unit :: Utility/./UtilityTests/StringExtractorTest.GetHexU8_Extra (1296 of 2034) PASS: lldb-api :: functionalities/signal/handle-abrt/TestHandleAbort.py (1297 of 2034) PASS: lldb-unit :: Host/./HostTests/SocketTest.DomainListenConnectAccept (1298 of 2034) PASS: lldb-shell :: Settings/TestEchoCommands.test (1299 of 2034) PASS: lldb-api :: python_api/section/TestSectionAPI.py (1300 of 2034) PASS: lldb-api :: functionalities/data-formatter/data-formatter-stl/libcxx/variant/TestDataFormatterLibcxxVariant.py (1301 of 2034) PASS: lldb-api :: lang/objc/objc-static-method/TestObjCStaticMethod.py (1302 of 2034) PASS: lldb-unit :: Symbol/./SymbolTests/TestClangASTImporter.CanImportInvalidType (1303 of 2034) PASS: lldb-unit :: ScriptInterpreter/Python/./ScriptInterpreterPythonTests/PythonDataObjectsTest.TestDictionaryResolutionWithDot (1304 of 2034) PASS: lldb-api :: commands/expression/persistent_types/TestPersistentTypes.py (1305 of 2034) PASS: lldb-unit :: ObjectFile/Breakpad/./ObjectFileBreakpadTests/InfoRecord.parse (1306 of 2034) PASS: lldb-unit :: Host/./HostTests/SocketTest.TCPGetAddress (1307 of 2034) PASS: lldb-api :: commands/command/source/TestCommandSource.py (1308 of 2034) PASS: lldb-unit :: Host/./HostTests/MainLoopTest.DetectsEOF (1309 of 2034) UNSUPPORTED: lldb-api :: functionalities/data-formatter/data-formatter-stl/libstdcpp/vector/TestDataFormatterStdVector.py (1310 of 2034) PASS: lldb-api :: commands/expression/entry-bp/TestExprEntryBP.py (1311 of 2034) PASS: lldb-api :: functionalities/data-formatter/array_typedef/TestArrayTypedef.py (1312 of 2034) PASS: lldb-unit :: ScriptInterpreter/Python/./ScriptInterpreterPythonTests/PythonDataObjectsTest.TestPythonString (1313 of 2034) PASS: lldb-api :: functionalities/recursion/TestValueObjectRecursion.py (1314 of 2034) PASS: lldb-api :: functionalities/data-formatter/data-formatter-skip-summary/TestDataFormatterSkipSummary.py (1315 of 2034) UNSUPPORTED: lldb-api :: functionalities/data-formatter/data-formatter-stl/libstdcpp/list/TestDataFormatterStdList.py (1316 of 2034) PASS: lldb-api :: lang/objc/objc-static-method-stripped/TestObjCStaticMethodStripped.py (1317 of 2034) PASS: lldb-shell :: Driver/TestNoUseColor.test (1318 of 2034) PASS: lldb-api :: commands/breakpoint/set/func-regex/TestBreakpointRegexError.py (1319 of 2034) PASS: lldb-api :: functionalities/data-formatter/data-formatter-stl/libcxx/forward_list/TestDataFormatterLibcxxForwardList.py (1320 of 2034) UNSUPPORTED: lldb-shell :: Register/x86-zmm-write.test (1321 of 2034) UNSUPPORTED: lldb-api :: functionalities/tsan/multiple/TestTsanMultiple.py (1322 of 2034) PASS: lldb-shell :: ObjectFile/ELF/many-sections.s (1323 of 2034) PASS: lldb-shell :: SymbolFile/DWARF/debug-names-compressed.cpp (1324 of 2034) PASS: lldb-unit :: Symbol/./SymbolTests/TestClangASTImporter.CopyDeclTagDecl (1325 of 2034) PASS: lldb-unit :: Utility/./UtilityTests/UriParserTest.SchemeHostSeparator (1326 of 2034) PASS: lldb-unit :: Utility/./UtilityTests/ScalarTest.GetValue (1327 of 2034) PASS: lldb-unit :: Utility/./UtilityTests/StringListTest.SplitIntoLines (1328 of 2034) PASS: lldb-unit :: Utility/./UtilityTests/ProcessInstanceInfoList.Yaml (1329 of 2034) UNSUPPORTED: lldb-api :: commands/target/auto-install-main-executable/TestAutoInstallMainExecutable.py (1330 of 2034) PASS: lldb-unit :: Host/./HostTests/SocketTest.TCPGetConnectURI (1331 of 2034) PASS: lldb-unit :: Utility/./UtilityTests/FileSpecTest.CopyByAppendingPathComponent (1332 of 2034) PASS: lldb-api :: lang/cpp/dynamic-value/TestDynamicValue.py (1333 of 2034) PASS: lldb-unit :: Utility/./UtilityTests/RangeTest.LessThan (1334 of 2034) PASS: lldb-unit :: UnwindAssembly/x86/./UnwindAssemblyx86Tests/Testx86AssemblyInspectionEngine.TestPopRBP (1335 of 2034) PASS: lldb-shell :: Commands/command-disassemble-process.yaml (1336 of 2034) PASS: lldb-api :: python_api/value_var_update/TestValueVarUpdate.py (1337 of 2034) PASS: lldb-unit :: Utility/./UtilityTests/BinaryStreamTest.PutULEB128FiveBytes (1338 of 2034) PASS: lldb-unit :: Utility/./UtilityTests/StringListTest.GetMaxStringLengthEqualSize (1339 of 2034) PASS: lldb-api :: functionalities/data-formatter/nssetsynth/TestNSSetSynthetic.py (1340 of 2034) PASS: lldb-unit :: Utility/./UtilityTests/StreamTeeTest.GetStreamAtIndexOutOfBoundsEmpty (1341 of 2034) PASS: lldb-api :: commands/watchpoints/watchpoint_commands/condition/TestWatchpointConditionCmd.py (1342 of 2034) PASS: lldb-api :: lang/cpp/offsetof/TestOffsetofCpp.py (1343 of 2034) PASS: lldb-api :: lang/c/unions/TestUnionMembers.py (1344 of 2034) PASS: lldb-api :: lang/objc/objc-builtin-types/TestObjCBuiltinTypes.py (1345 of 2034) PASS: lldb-api :: macosx/safe-to-func-call/TestSafeFuncCalls.py (1346 of 2034) PASS: lldb-api :: macosx/find-dsym/deep-bundle/TestDeepBundle.py (1347 of 2034) PASS: lldb-api :: functionalities/data-formatter/data-formatter-stl/libcxx/unique_ptr/TestDataFormatterLibcxxUniquePtr.py (1348 of 2034) PASS: lldb-unit :: Utility/./UtilityTests/FileSpecTest.GetPath (1349 of 2034) PASS: lldb-api :: commands/command/delete/TestCommandDelete.py (1350 of 2034) PASS: lldb-unit :: Target/./TargetTests/ExecutionContextTest.GetByteOrderProcess (1351 of 2034) PASS: lldb-api :: functionalities/non-overlapping-index-variable-i/TestIndexVariable.py (1352 of 2034) PASS: lldb-unit :: SymbolFile/DWARF/./SymbolFileDWARFTests/SymbolFileDWARFTests.TestAbbrevMissingTerminator (1353 of 2034) PASS: lldb-api :: lang/objc/objc-ivar-offsets/TestObjCIvarOffsets.py (1354 of 2034) PASS: lldb-unit :: UnwindAssembly/x86/./UnwindAssemblyx86Tests/Testx86AssemblyInspectionEngine.TestPopRBPWithREX (1355 of 2034) PASS: lldb-api :: functionalities/data-formatter/poarray/TestPrintObjectArray.py (1356 of 2034) PASS: lldb-unit :: ScriptInterpreter/Python/./ScriptInterpreterPythonTests/PythonDataObjectsTest.TestInstanceNameResolutionNoDot (1357 of 2034) PASS: lldb-unit :: ScriptInterpreter/Python/./ScriptInterpreterPythonTests/PythonDataObjectsTest.TestPythonBoolean (1358 of 2034) PASS: lldb-api :: commands/expression/import-std-module/shared_ptr/TestSharedPtrFromStdModule.py (1359 of 2034) XFAIL: lldb-shell :: SymbolFile/DWARF/find-type-in-function.cpp (1360 of 2034) PASS: lldb-unit :: ScriptInterpreter/Python/./ScriptInterpreterPythonTests/PythonDataObjectsTest.TestPythonListValueEquality (1361 of 2034) PASS: lldb-api :: commands/expression/unicode-in-variable/TestUnicodeInVariable.py (1362 of 2034) PASS: lldb-unit :: Host/./HostTests/SocketTest.UDPGetConnectURI (1363 of 2034) PASS: lldb-shell :: ObjectFile/ELF/PT_TLS-overlap-PT_LOAD.yaml (1364 of 2034) PASS: lldb-unit :: UnwindAssembly/x86/./UnwindAssemblyx86Tests/Testx86AssemblyInspectionEngine.TestPushExtended (1365 of 2034) PASS: lldb-unit :: Utility/./UtilityTests/LogChannelTest.Enable (1366 of 2034) PASS: lldb-shell :: SymbolFile/DWARF/dwarf5-atomic.s (1367 of 2034) PASS: lldb-unit :: Language/Highlighting/./HighlighterTests/HighlighterTest.ClangCursorPosEndOfLine (1368 of 2034) PASS: lldb-unit :: ScriptInterpreter/Python/./ScriptInterpreterPythonTests/PythonDataObjectsTest.TestGlobalNameResolutionNoDot (1369 of 2034) PASS: lldb-unit :: Core/./LLDBCoreTests/RichManglingContextTest.IPDRealloc (1370 of 2034) PASS: lldb-unit :: Utility/./UtilityTests/LogChannelTest.Disable (1371 of 2034) PASS: lldb-unit :: Utility/./UtilityTests/RangeTest.ContainsAddr (1372 of 2034) PASS: lldb-unit :: UnwindAssembly/x86/./UnwindAssemblyx86Tests/Testx86AssemblyInspectionEngine.TestPopR13 (1373 of 2034) PASS: lldb-unit :: Utility/./UtilityTests/XcodeSDKTest.GetCanonicalNameAndConstruct (1374 of 2034) PASS: lldb-shell :: Reproducer/TestDriverOptions.test (1375 of 2034) PASS: lldb-api :: commands/expression/anonymous-struct/TestCallUserAnonTypedef.py (1376 of 2034) PASS: lldb-unit :: Utility/./UtilityTests/UriParserTest.Minimal (1377 of 2034) PASS: lldb-api :: commands/apropos/with-process/TestAproposWithProcess.py (1378 of 2034) PASS: lldb-shell :: Settings/TestSettingsSet.test (1379 of 2034) PASS: lldb-shell :: ObjectFile/ELF/PT_LOAD-empty.yaml (1380 of 2034) PASS: lldb-shell :: SymbolFile/DWARF/find-variable-file.cpp (1381 of 2034) PASS: lldb-unit :: Interpreter/./InterpreterTests/OptionArgParserTest.toChar (1382 of 2034) PASS: lldb-shell :: SymbolFile/DWARF/find-inline-method.s (1383 of 2034) PASS: lldb-api :: sanity/TestSettingSkipping.py (1384 of 2034) PASS: lldb-shell :: SymbolFile/DWARF/debug_ranges-missing-section.s (1385 of 2034) PASS: lldb-api :: functionalities/mtc/simple/TestMTCSimple.py (1386 of 2034) PASS: lldb-unit :: Language/Highlighting/./HighlighterTests/HighlighterTest.ClangCursorPosBeforeOtherToken (1387 of 2034) PASS: lldb-unit :: Utility/./UtilityTests/SubsystemRAIITest.NormalSubsystem (1388 of 2034) PASS: lldb-api :: functionalities/data-formatter/hexcaps/TestDataFormatterHexCaps.py (1389 of 2034) PASS: lldb-unit :: SymbolFile/NativePDB/./SymbolFileNativePDBTests/PDBFPOProgramToDWARFExpressionTests.InvalidOpUnary (1390 of 2034) PASS: lldb-shell :: SymbolFile/DWARF/debug_loc.s (1391 of 2034) PASS: lldb-unit :: ObjectFile/ELF/./ObjectFileELFTests/ObjectFileELFTest.GetSymtab_NoSymEntryPointArmThumbAddressClass (1392 of 2034) PASS: lldb-api :: functionalities/data-formatter/data-formatter-proper-plurals/TestFormattersOneIsSingular.py (1393 of 2034) PASS: lldb-api :: python_api/sbplatform/TestSBPlatform.py (1394 of 2034) UNSUPPORTED: lldb-shell :: ScriptInterpreter/Lua/watchpoint_callback.test (1395 of 2034) PASS: lldb-unit :: Utility/./UtilityTests/StringExtractorTest.GetHexBytesAvail_OddPair (1396 of 2034) PASS: lldb-api :: functionalities/thread/concurrent_events/TestConcurrentSignalBreak.py (1397 of 2034) PASS: lldb-api :: macosx/queues/TestQueues.py (1398 of 2034) UNSUPPORTED: lldb-shell :: SymbolFile/PDB/udt-layout.test (1399 of 2034) PASS: lldb-unit :: UnwindAssembly/x86/./UnwindAssemblyx86Tests/Testx86AssemblyInspectionEngine.TestStackRealign8BitDisp_i386 (1400 of 2034) PASS: lldb-api :: functionalities/data-formatter/data-formatter-synthtype/TestDataFormatterSynthType.py (1401 of 2034) PASS: lldb-unit :: Utility/./UtilityTests/FileSpecTest.EqualDotsWindows (1402 of 2034) PASS: lldb-unit :: Utility/./UtilityTests/StreamTest.PutHex16ByteOrderLittle (1403 of 2034) PASS: lldb-unit :: Utility/./UtilityTests/StatusTest.ErrorConversion (1404 of 2034) PASS: lldb-api :: functionalities/type_lookup/TestTypeLookup.py (1405 of 2034) PASS: lldb-api :: functionalities/data-formatter/data-formatter-stl/libcxx/map/TestDataFormatterLibccMap.py (1406 of 2034) PASS: lldb-unit :: UnwindAssembly/x86/./UnwindAssemblyx86Tests/Testx86AssemblyInspectionEngine.TestSubRSP (1407 of 2034) PASS: lldb-unit :: Expression/./ExpressionTests/CppModuleConfigurationTest.LibCppV2 (1408 of 2034) PASS: lldb-unit :: Utility/./UtilityTests/FileSpecTest.AppendPathComponent (1409 of 2034) PASS: lldb-unit :: Expression/./ExpressionTests/ClangExpressionDeclMapTest.TestPersistentDeclLookup (1410 of 2034) PASS: lldb-unit :: Utility/./UtilityTests/StreamTest.ShiftOperatorStrings (1411 of 2034) PASS: lldb-api :: tools/lldb-server/TestGdbRemote_vCont.py (1412 of 2034) PASS: lldb-shell :: ObjectFile/ELF/netbsd-exec-8.99.30-amd64.yaml (1413 of 2034) PASS: lldb-api :: functionalities/thread/concurrent_events/TestConcurrentCrashWithSignal.py (1414 of 2034) PASS: lldb-shell :: Reproducer/TestReuseDirectory.test (1415 of 2034) PASS: lldb-unit :: Utility/./UtilityTests/ArchSpecTest.TestParseMachCPUDashSubtypeTripleExtra (1416 of 2034) PASS: lldb-api :: functionalities/data-formatter/data-formatter-globals/TestDataFormatterGlobals.py (1417 of 2034) UNSUPPORTED: lldb-shell :: Register/x86-64-zmm-write.test (1418 of 2034) PASS: lldb-shell :: SymbolFile/NativePDB/ast-types.cpp (1419 of 2034) PASS: lldb-api :: functionalities/step-avoids-no-debug/TestStepNoDebug.py (1420 of 2034) PASS: lldb-api :: commands/expression/import_builtin_fileid/TestImportBuiltinFileID.py (1421 of 2034) PASS: lldb-unit :: Utility/./UtilityTests/ConstStringTest.FromMidOfBufferStringRef (1422 of 2034) PASS: lldb-unit :: Process/gdb-remote/./ProcessGdbRemoteTests/GDBRemoteClientBaseTest.InterruptNoResponse (1423 of 2034) PASS: lldb-api :: functionalities/thread/concurrent_events/TestConcurrentCrashWithWatchpoint.py (1424 of 2034) PASS: lldb-api :: functionalities/thread/concurrent_events/TestConcurrentWatchBreakDelay.py (1425 of 2034) PASS: lldb-api :: functionalities/inline-stepping/TestInlineStepping.py (1426 of 2034) PASS: lldb-api :: lang/c/stepping/TestThreadStepping.py (1427 of 2034) PASS: lldb-unit :: Expression/./ExpressionTests/ClangExpressionDeclMapTest.TestUnknownIdentifierLookup (1428 of 2034) UNSUPPORTED: lldb-shell :: ExecControl/StopHook/stop-hook-threads.test (1429 of 2034) PASS: lldb-unit :: Host/./HostTests/NativeProcessProtocolTest.SetBreakpointFailWrite (1430 of 2034) PASS: lldb-api :: tools/lldb-vscode/console/TestVSCode_console.py (1431 of 2034) PASS: lldb-api :: python_api/watchpoint/watchlocation/TestTargetWatchAddress.py (1432 of 2034) PASS: lldb-unit :: Utility/./UtilityTests/RangeTest.SlideZero (1433 of 2034) PASS: lldb-unit :: Utility/./UtilityTests/BinaryStreamTest.PutULEB128OneByte (1434 of 2034) PASS: lldb-unit :: ScriptInterpreter/Python/./ScriptInterpreterPythonTests/PythonDataObjectsTest.TestPythonListManipulation (1435 of 2034) PASS: lldb-unit :: Core/./LLDBCoreTests/MangledTest.EmptyForInvalidName (1436 of 2034) PASS: lldb-unit :: SymbolFile/DWARF/./SymbolFileDWARFTests/SymbolFileDWARFTests.ParseArangesNonzeroSegmentSize (1437 of 2034) PASS: lldb-unit :: Utility/./UtilityTests/StringLexerTest.AdvanceIf (1438 of 2034) PASS: lldb-unit :: Utility/./UtilityTests/StringListTest.AppendStringCString (1439 of 2034) PASS: lldb-unit :: Utility/./UtilityTests/StringExtractorTest.GetNameColonValueNoColon (1440 of 2034) PASS: lldb-unit :: Utility/./UtilityTests/StringListTest.AppendStringStdString (1441 of 2034) PASS: lldb-unit :: Utility/./UtilityTests/StringListTest.CopyListSingle (1442 of 2034) UNSUPPORTED: lldb-api :: benchmarks/turnaround/TestCompileRunToBreakpointTurnaround.py (1443 of 2034) PASS: lldb-api :: functionalities/data-formatter/ostypeformatting/TestFormattersOsType.py (1444 of 2034) PASS: lldb-api :: lang/c/modules/TestCModules.py (1445 of 2034) UNSUPPORTED: lldb-api :: functionalities/darwin_log/filter/exact_match/subsystem/TestDarwinLogFilterMatchSubsystem.py (1446 of 2034) PASS: lldb-unit :: UnwindAssembly/x86/./UnwindAssemblyx86Tests/Testx86AssemblyInspectionEngine.TestReturnDetect (1447 of 2034) PASS: lldb-unit :: Utility/./UtilityTests/TimeoutTest.Construction (1448 of 2034) PASS: lldb-unit :: Utility/./UtilityTests/ArgsTest.StringListConstructor (1449 of 2034) PASS: lldb-api :: commands/log/basic/TestLogging.py (1450 of 2034) PASS: lldb-api :: python_api/process/read-mem-cstring/TestReadMemCString.py (1451 of 2034) UNSUPPORTED: lldb-api :: functionalities/data-formatter/data-formatter-stl/libstdcpp/map/TestDataFormatterStdMap.py (1452 of 2034) PASS: lldb-shell :: SymbolFile/DWARF/find-method-local-struct.cpp (1453 of 2034) PASS: lldb-shell :: SymbolFile/DWARF/dwarf5-partial-index.cpp (1454 of 2034) UNSUPPORTED: lldb-api :: tools/lldb-server/platform-process-connect/TestPlatformProcessConnect.py (1455 of 2034) PASS: lldb-api :: lang/c/shared_lib_stripped_symbols/TestSharedLibStrippedSymbols.py (1456 of 2034) PASS: lldb-api :: commands/expression/namespace_local_var_same_name_obj_c/TestNamespaceLocalVarSameNameObjC.py (1457 of 2034) PASS: lldb-unit :: Language/Highlighting/./HighlighterTests/HighlighterTest.FallbackHighlighter (1458 of 2034) PASS: lldb-unit :: UnwindAssembly/x86/./UnwindAssemblyx86Tests/Testx86AssemblyInspectionEngine.TestPopR15 (1459 of 2034) PASS: lldb-unit :: Utility/./UtilityTests/RegularExpression.Valid (1460 of 2034) PASS: lldb-api :: functionalities/memory/read/TestMemoryRead.py (1461 of 2034) PASS: lldb-unit :: Symbol/./SymbolTests/SymbolsTest.LocateExecutableSymbolFileForUnknownExecutableAndMissingSymbolFile (1462 of 2034) PASS: lldb-api :: functionalities/gdb_remote_client/TestNoWatchpointSupportInfo.py (1463 of 2034) PASS: lldb-unit :: Utility/./UtilityTests/StreamTest.PutSLEB128 (1464 of 2034) PASS: lldb-unit :: Target/./TargetTests/ModuleCacheTest.GetAndPutUuidExists (1465 of 2034) PASS: lldb-unit :: SymbolFile/DWARF/./SymbolFileDWARFTests/XcodeSDKModuleTests.TestModuleGetXcodeSDK (1466 of 2034) PASS: lldb-shell :: SymbolFile/DWARF/dir-separator-posix.s (1467 of 2034) PASS: lldb-unit :: Host/./HostTests/NativeProcessProtocolTest.SetBreakpoint (1468 of 2034) PASS: lldb-api :: functionalities/data-formatter/cstring-utf8-summary/TestCstringUnicode.py (1469 of 2034) PASS: lldb-shell :: SymbolFile/Breakpad/symtab.test (1470 of 2034) PASS: lldb-unit :: Utility/./UtilityTests/ArgsTest.GetQuotedCommandString (1471 of 2034) PASS: lldb-unit :: Process/gdb-remote/./ProcessGdbRemoteTests/GDBRemoteClientBaseTest.SendContinueAndInterrupt (1472 of 2034) PASS: lldb-unit :: Symbol/./SymbolTests/TestTypeSystemClang.TestNotDeletingUserCopyCstrDueToMoveCStr (1473 of 2034) PASS: lldb-unit :: Utility/./UtilityTests/BinaryStreamTest.PutSLEB128NineBytes (1474 of 2034) PASS: lldb-unit :: Utility/./UtilityTests/StringListTest.LongestCommonPrefix (1475 of 2034) PASS: lldb-api :: functionalities/data-formatter/data-formatter-synthval/TestDataFormatterSynthVal.py (1476 of 2034) PASS: lldb-api :: functionalities/postmortem/minidump/TestMiniDump.py (1477 of 2034) PASS: lldb-shell :: ObjectFile/ELF/PT_LOAD-overlap-PT_INTERP.yaml (1478 of 2034) PASS: lldb-unit :: Process/gdb-remote/./ProcessGdbRemoteTests/GDBRemoteCommunicationServerTest.SendErrorResponse_Status (1479 of 2034) PASS: lldb-unit :: Language/Highlighting/./HighlighterTests/HighlighterTest.ClangCursorPos (1480 of 2034) PASS: lldb-shell :: ObjectFile/ELF/gnu-debuglink.yaml (1481 of 2034) PASS: lldb-api :: lang/cpp/function_refs/TestFunctionRefs.py (1482 of 2034) PASS: lldb-unit :: Signals/./SignalsTests/UnixSignalsTest.Iteration (1483 of 2034) PASS: lldb-unit :: Host/./HostTests/NativeProcessProtocolTest.ReadMemoryWithoutTrap (1484 of 2034) PASS: lldb-shell :: Breakpoint/debug_addrx.test (1485 of 2034) PASS: lldb-api :: commands/expression/expr-in-syscall/TestExpressionInSyscall.py (1486 of 2034) PASS: lldb-unit :: Expression/./ExpressionTests/CppModuleConfigurationTest.AmbiguousLibCpp (1487 of 2034) PASS: lldb-unit :: Utility/./UtilityTests/StringListTest.PopBack (1488 of 2034) PASS: lldb-unit :: Utility/./UtilityTests/StringListTest.DefaultConstructor (1489 of 2034) PASS: lldb-api :: lang/cpp/inlines/TestInlines.py (1490 of 2034) PASS: lldb-unit :: Utility/./UtilityTests/StringExtractorTest.GetHexBytesAvail_FullString (1491 of 2034) PASS: lldb-api :: lang/objc/foundation/TestObjectDescriptionAPI.py (1492 of 2034) PASS: lldb-shell :: SymbolFile/DWARF/find-basic-type.cpp (1493 of 2034) PASS: lldb-unit :: Utility/./UtilityTests/StreamTest.AddressEmptyPrefix (1494 of 2034) PASS: lldb-unit :: Breakpoint/./LLDBBreakpointTests/BreakpointIDTest.StringIsBreakpointName (1495 of 2034) PASS: lldb-api :: lang/cpp/covariant-return-types/TestCovariantReturnTypes.py (1496 of 2034) PASS: lldb-api :: tools/lldb-server/TestGdbRemoteKill.py (1497 of 2034) PASS: lldb-api :: functionalities/breakpoint/debugbreak/TestDebugBreak.py (1498 of 2034) PASS: lldb-unit :: debugserver/./debugserverTests/RNBSocket.LoopBackListenIPv4 (1499 of 2034) PASS: lldb-unit :: UnwindAssembly/x86/./UnwindAssemblyx86Tests/Testx86AssemblyInspectionEngine.Test32bitFramelessSmallStackFrame (1500 of 2034) PASS: lldb-unit :: Utility/./UtilityTests/StringListTest.GetMaxStringLengthEmpty (1501 of 2034) PASS: lldb-api :: python_api/thread/TestThreadAPI.py (1502 of 2034) UNSUPPORTED: lldb-api :: terminal/TestEditline.py (1503 of 2034) PASS: lldb-unit :: Process/minidump/./LLDBMinidumpTests/RegisterContextMinidump.CheckRegisterContextMinidump_ARM (1504 of 2034) UNSUPPORTED: lldb-shell :: Process/Windows/exception_access_violation.cpp (1505 of 2034) PASS: lldb-unit :: Utility/./UtilityTests/RangeTest.SetRangeBase (1506 of 2034) PASS: lldb-api :: commands/expression/options/TestExprOptions.py (1507 of 2034) PASS: lldb-unit :: Host/./HostTests/NativeProcessProtocolTest.ReadCStringFromMemory_CrossPageBoundary (1508 of 2034) PASS: lldb-unit :: Utility/./UtilityTests/StringExtractorTest.GetHexU8_InvalidHex_NoEof (1509 of 2034) PASS: lldb-unit :: Expression/./ExpressionTests/CppModuleConfigurationTest.MissingUsrInclude (1510 of 2034) PASS: lldb-unit :: Utility/./UtilityTests/ScalarTest.Promotion (1511 of 2034) PASS: lldb-api :: commands/expression/radar_9531204/TestPrintfAfterUp.py (1512 of 2034) PASS: lldb-unit :: Core/./LLDBCoreTests/RichManglingContextTest.SwitchProvider (1513 of 2034) PASS: lldb-unit :: SymbolFile/DWARF/./SymbolFileDWARFTests/SymbolFileDWARFTests.TestAbbrevOutOfOrder (1514 of 2034) UNSUPPORTED: lldb-api :: functionalities/tsan/cpp_global_location/TestTsanCPPGlobalLocation.py (1515 of 2034) UNSUPPORTED: lldb-shell :: ObjectFile/PECOFF/disassemble-thumb.yaml (1516 of 2034) PASS: lldb-api :: functionalities/breakpoint/inlined_breakpoints/TestInlinedBreakpoints.py (1517 of 2034) PASS: lldb-unit :: Utility/./UtilityTests/VMRange.SetEndAddress (1518 of 2034) PASS: lldb-unit :: API/./APITests/SBCommandInterpreterTest.SingleWordCommand (1519 of 2034) PASS: lldb-api :: functionalities/data-formatter/data-formatter-ptr-to-array/TestPtrToArrayFormatting.py (1520 of 2034) PASS: lldb-unit :: Core/./LLDBCoreTests/RichManglingContextTest.FromCxxMethodName (1521 of 2034) PASS: lldb-api :: commands/command/script/import/rdar-12586188/TestRdar12586188.py (1522 of 2034) PASS: lldb-api :: lang/cpp/symbols/TestSymbols.py (1523 of 2034) PASS: lldb-unit :: Utility/./UtilityTests/StringListTest.JoinNonSpace (1524 of 2034) PASS: lldb-unit :: SymbolFile/NativePDB/./SymbolFileNativePDBTests/PDBFPOProgramToDWARFExpressionTests.MultipleDependentAssignments (1525 of 2034) PASS: lldb-unit :: Utility/./UtilityTests/StatusTest.ErrorConstructor (1526 of 2034) PASS: lldb-unit :: Utility/./UtilityTests/RangeTest.EqualInvalid (1527 of 2034) PASS: lldb-unit :: Language/CPlusPlus/./LanguageCPlusPlusTests/CPlusPlusLanguage.CPlusPlusNameParser (1528 of 2034) PASS: lldb-api :: lang/c/find_struct_type/TestFindStructTypes.py (1529 of 2034) PASS: lldb-unit :: Core/./LLDBCoreTests/RichManglingContextTest.Basic (1530 of 2034) PASS: lldb-api :: python_api/frame/TestFrames.py (1531 of 2034) PASS: lldb-unit :: Host/./HostTests/FileSystemTest.EnumerateDirectory (1532 of 2034) PASS: lldb-api :: lang/cpp/namespace/TestNamespace.py (1533 of 2034) UNSUPPORTED: lldb-shell :: Unwind/eh-frame-small-fde.test (1534 of 2034) PASS: lldb-shell :: Commands/command-source.test (1535 of 2034) PASS: lldb-api :: types/TestDoubleTypes.py (1536 of 2034) PASS: lldb-shell :: SymbolFile/DWARF/debug_ranges_and_rnglists.test (1537 of 2034) PASS: lldb-shell :: Quit/TestQuitExitCodeHexA.test (1538 of 2034) PASS: lldb-unit :: Process/gdb-remote/./ProcessGdbRemoteTests/GDBRemoteCommunicationServerTest.SendErrorResponse_StringError (1539 of 2034) PASS: lldb-api :: types/TestShortTypeExpr.py (1540 of 2034) PASS: lldb-unit :: UnwindAssembly/x86/./UnwindAssemblyx86Tests/Testx86AssemblyInspectionEngine.TestPushR12 (1541 of 2034) PASS: lldb-unit :: Process/gdb-remote/./ProcessGdbRemoteTests/GDBRemoteClientBaseTest.SendContinueAndAsyncPacket (1542 of 2034) PASS: lldb-api :: functionalities/gdb_remote_client/TestGDBRemoteLoad.py (1543 of 2034) PASS: lldb-unit :: UnwindAssembly/x86/./UnwindAssemblyx86Tests/Testx86AssemblyInspectionEngine.TestAddESP (1544 of 2034) PASS: lldb-shell :: SymbolFile/Breakpad/line-table-discontinuous-file-ids.test (1545 of 2034) PASS: lldb-unit :: Utility/./UtilityTests/StringListTest.GetMaxStringLengthMixed (1546 of 2034) PASS: lldb-api :: lang/cpp/limit-debug-info/TestWithLimitDebugInfo.py (1547 of 2034) PASS: lldb-api :: functionalities/process_group/TestChangeProcessGroup.py (1548 of 2034) PASS: lldb-unit :: Symbol/./SymbolTests/TestTypeSystemClang.TestGetBasicTypeFromName (1549 of 2034) PASS: lldb-shell :: Reproducer/Functionalities/TestExpressionEvaluation.test (1550 of 2034) PASS: lldb-unit :: Utility/./UtilityTests/UriParserTest.PortOverflow (1551 of 2034) PASS: lldb-unit :: Utility/./UtilityTests/UriParserTest.MinimalPortPath (1552 of 2034) PASS: lldb-unit :: SymbolFile/DWARF/./SymbolFileDWARFTests/SymbolFileDWARFTests.TestAbbrevValidAttrNullForm (1553 of 2034) UNSUPPORTED: lldb-shell :: ScriptInterpreter/Lua/bindings.test (1554 of 2034) PASS: lldb-unit :: Utility/./UtilityTests/ListenerTest.GetEventImmediate (1555 of 2034) PASS: lldb-unit :: Target/./TargetTests/ExecutionContextTest.GetByteOrderTarget (1556 of 2034) PASS: lldb-unit :: UnwindAssembly/x86/./UnwindAssemblyx86Tests/Testx86AssemblyInspectionEngine.Test32BitOnlyInstruction (1557 of 2034) PASS: lldb-api :: lang/cpp/unicode-literals/TestUnicodeLiterals.py (1558 of 2034) PASS: lldb-api :: commands/expression/import-std-module/basic/TestImportStdModule.py (1559 of 2034) PASS: lldb-unit :: Utility/./UtilityTests/StringListTest.SplitIntoLinesEmpty (1560 of 2034) PASS: lldb-unit :: Utility/./UtilityTests/RegularExpression.CopyAssignment (1561 of 2034) PASS: lldb-api :: source-manager/TestSourceManager.py (1562 of 2034) PASS: lldb-unit :: Process/minidump/./LLDBMinidumpTests/MinidumpParserTest.GetThreadContext_x86_32_wow64 (1563 of 2034) PASS: lldb-api :: macosx/save_crashlog/TestSaveCrashlog.py (1564 of 2034) PASS: lldb-unit :: ScriptInterpreter/Python/./ScriptInterpreterPythonTests/PythonDataObjectsTest.TestPythonIntegerToStr (1565 of 2034) PASS: lldb-unit :: Utility/./UtilityTests/StringListTest.InsertStringAtIndexStdString (1566 of 2034) PASS: lldb-shell :: ObjectFile/ELF/minidebuginfo-corrupt-xz.yaml (1567 of 2034) PASS: lldb-api :: commands/expression/weak_symbols/TestWeakSymbols.py (1568 of 2034) PASS: lldb-unit :: Utility/./UtilityTests/ArchSpecTest.MergeFromMachOUnknown (1569 of 2034) UNSUPPORTED: lldb-shell :: SymbolFile/PDB/function-level-linking.test (1570 of 2034) PASS: lldb-unit :: Utility/./UtilityTests/BinaryStreamTest.PutULEB128NineBytes (1571 of 2034) PASS: lldb-unit :: Symbol/./SymbolTests/TestTypeSystemClang.TestFunctionTemplateConstruction (1572 of 2034) PASS: lldb-unit :: Utility/./UtilityTests/VMRange.ContainsRange (1573 of 2034) PASS: lldb-unit :: Utility/./UtilityTests/UserIDResolver.GetGroupName (1574 of 2034) PASS: lldb-unit :: Utility/./UtilityTests/DataExtractorTest.PeekData (1575 of 2034) PASS: lldb-shell :: ObjectFile/Breakpad/uuid-matching-mac.test (1576 of 2034) PASS: lldb-unit :: Utility/./UtilityTests/SharedCluster.ClusterManager (1577 of 2034) PASS: lldb-api :: lang/objcxx/hide-runtime-values/TestObjCXXHideRuntimeValues.py (1578 of 2034) PASS: lldb-api :: python_api/value/TestValueAPI.py (1579 of 2034) PASS: lldb-shell :: SymbolFile/DWARF/dwarf5-index-is-used.cpp (1580 of 2034) PASS: lldb-unit :: Language/Highlighting/./HighlighterTests/HighlighterTest.ClangCommas (1581 of 2034) PASS: lldb-unit :: Utility/./UtilityTests/StreamTest.ChangingByteOrder (1582 of 2034) UNSUPPORTED: lldb-api :: functionalities/data-formatter/data-formatter-stl/libstdcpp/string/TestDataFormatterStdString.py (1583 of 2034) PASS: lldb-shell :: SymbolFile/DWARF/DW_OP_piece-struct.s (1584 of 2034) PASS: lldb-unit :: Utility/./UtilityTests/DataExtractorTest.GetMaxU64_unchecked (1585 of 2034) UNSUPPORTED: lldb-shell :: ScriptInterpreter/Lua/convenience_variables.test (1586 of 2034) PASS: lldb-api :: lang/objc/objc++/TestObjCXX.py (1587 of 2034) PASS: lldb-unit :: Utility/./UtilityTests/ArgsTest.TestInsertArg (1588 of 2034) PASS: lldb-api :: commands/watchpoints/watchpoint_on_vectors/TestValueOfVectorVariable.py (1589 of 2034) PASS: lldb-api :: lang/cpp/class_types/TestClassTypesDisassembly.py (1590 of 2034) PASS: lldb-unit :: Utility/./UtilityTests/BinaryStreamTest.PutULEB128SixBytes (1591 of 2034) PASS: lldb-api :: commands/watchpoints/watchpoint_commands/command/TestWatchpointCommandLLDB.py (1592 of 2034) PASS: lldb-api :: functionalities/gdb_remote_client/TestNoGPacketSupported.py (1593 of 2034) PASS: lldb-unit :: Utility/./UtilityTests/DataExtractorTest.GetCStr (1594 of 2034) PASS: lldb-unit :: Utility/./UtilityTests/LogTest.Register (1595 of 2034) PASS: lldb-unit :: Utility/./UtilityTests/RegularExpression.Invalid (1596 of 2034) UNSUPPORTED: lldb-api :: functionalities/asan/TestReportData.py (1597 of 2034) PASS: lldb-api :: functionalities/load_unload/TestLoadUnload.py (1598 of 2034) PASS: lldb-unit :: Utility/./UtilityTests/DataExtractorTest.GetULEB128_bit63 (1599 of 2034) PASS: lldb-api :: functionalities/data-formatter/var-in-aggregate-misuse/TestVarInAggregateMisuse.py (1600 of 2034) PASS: lldb-shell :: ObjectFile/ELF/section-types.yaml (1601 of 2034) PASS: lldb-api :: commands/settings/use_source_cache/TestUseSourceCache.py (1602 of 2034) PASS: lldb-unit :: Utility/./UtilityTests/ArgsTest.GetArgumentArrayRef (1603 of 2034) PASS: lldb-unit :: Utility/./UtilityTests/StringListTest.LongestCommonPrefixSingleElement (1604 of 2034) PASS: lldb-shell :: Settings/TestDisassemblyFormat.test (1605 of 2034) PASS: lldb-unit :: Utility/./UtilityTests/SerializationRountripTest.SerializeDeserializeObjectPointer (1606 of 2034) PASS: lldb-shell :: Driver/TestCommands.test (1607 of 2034) PASS: lldb-api :: functionalities/postmortem/wow64_minidump/TestWow64MiniDump.py (1608 of 2034) PASS: lldb-unit :: debugserver/./debugserverTests/RNBSocket.AnyListen (1609 of 2034) PASS: lldb-unit :: Utility/./UtilityTests/StringLexerTest.GetUnlexed (1610 of 2034) UNSUPPORTED: lldb-api :: tools/lldb-server/signal-filtering/TestGdbRemote_QPassSignals.py (1611 of 2034) PASS: lldb-unit :: Utility/./UtilityTests/TimerTest.CategoryTimes (1612 of 2034) PASS: lldb-api :: functionalities/data-formatter/data-formatter-advanced/TestDataFormatterAdv.py (1613 of 2034) PASS: lldb-unit :: Utility/./UtilityTests/AnsiTerminal.AtStart (1614 of 2034) PASS: lldb-shell :: Driver/TestPositionalArgs.test (1615 of 2034) PASS: lldb-unit :: Utility/./UtilityTests/LogTest.Unregister (1616 of 2034) PASS: lldb-api :: lang/objc/foundation/TestObjCMethodsNSArray.py (1617 of 2034) PASS: lldb-unit :: Host/./HostTests/FileActionTest.Open (1618 of 2034) PASS: lldb-shell :: ObjectFile/PECOFF/uuid.yaml (1619 of 2034) PASS: lldb-unit :: Symbol/./SymbolTests/TestTypeSystemClang.TestIsClangType (1620 of 2034) PASS: lldb-api :: functionalities/data-formatter/data-formatter-stl/libcxx/bitset/TestDataFormatterLibcxxBitset.py (1621 of 2034) PASS: lldb-unit :: Utility/./UtilityTests/RecordReplayTest.InstrumentedFooSameThis (1622 of 2034) PASS: lldb-shell :: SymbolFile/DWARF/dwp.s (1623 of 2034) PASS: lldb-api :: functionalities/target-new-solib-notifications/TestModuleLoadedNotifys.py (1624 of 2034) PASS: lldb-unit :: Host/./HostTests/MainLoopTest.TerminatesImmediately (1625 of 2034) PASS: lldb-api :: commands/platform/process/list/TestProcessList.py (1626 of 2034) UNSUPPORTED: lldb-api :: benchmarks/startup/TestStartupDelays.py (1627 of 2034) PASS: lldb-unit :: UnwindAssembly/x86/./UnwindAssemblyx86Tests/Testx86AssemblyInspectionEngine.TestDisassemblyMidFunctionEpilogues (1628 of 2034) PASS: lldb-unit :: Utility/./UtilityTests/Flags.IsClear (1629 of 2034) PASS: lldb-unit :: Utility/./UtilityTests/BroadcasterTest.EventTypeHasListeners (1630 of 2034) PASS: lldb-api :: python_api/debugger/TestDebuggerAPI.py (1631 of 2034) PASS: lldb-api :: commands/expression/completion-crash-incomplete-record/TestCompletionCrashIncompleteRecord.py (1632 of 2034) PASS: lldb-unit :: Expression/./ExpressionTests/DiagnosticManagerTest.AppendMessageSubsequentDiags (1633 of 2034) PASS: lldb-api :: functionalities/testid/TestTestId.py (1634 of 2034) PASS: lldb-unit :: Language/CPlusPlus/./LanguageCPlusPlusTests/CPlusPlusLanguage.ExtractContextAndIdentifier (1635 of 2034) PASS: lldb-api :: functionalities/postmortem/minidump-new/TestMiniDumpNew.py (1636 of 2034) PASS: lldb-unit :: Utility/./UtilityTests/VMRange.Reset (1637 of 2034) PASS: lldb-unit :: UnwindAssembly/x86/./UnwindAssemblyx86Tests/Testx86AssemblyInspectionEngine.TestPushEBX (1638 of 2034) PASS: lldb-api :: functionalities/inferior-crashing/recursive-inferior/TestRecursiveInferior.py (1639 of 2034) PASS: lldb-unit :: Utility/./UtilityTests/StringExtractorTest.GetU64BigEndian (1640 of 2034) PASS: lldb-unit :: Utility/./UtilityTests/StreamTeeTest.SetStreamAtIndexOutOfBounds (1641 of 2034) PASS: lldb-unit :: SymbolFile/NativePDB/./SymbolFileNativePDBTests/PDBFPOProgramToDWARFExpressionTests.DependencyChain (1642 of 2034) PASS: lldb-shell :: Host/TestCustomShell.test (1643 of 2034) PASS: lldb-unit :: Utility/./UtilityTests/StringListTest.Assignment (1644 of 2034) PASS: lldb-unit :: Process/minidump/./LLDBMinidumpTests/MinidumpParserTest.FindMemoryRangeWithFullMemoryMinidump (1645 of 2034) PASS: lldb-unit :: Utility/./UtilityTests/ScalarTest.Division (1646 of 2034) UNSUPPORTED: lldb-api :: benchmarks/expression/TestRepeatedExprs.py (1647 of 2034) PASS: lldb-shell :: Reproducer/TestGDBRemoteRepro.test (1648 of 2034) PASS: lldb-shell :: ObjectFile/Breakpad/discontiguous-sections.test (1649 of 2034) PASS: lldb-shell :: SymbolFile/Breakpad/line-table-mixed-path-styles.test (1650 of 2034) PASS: lldb-shell :: Minidump/breakpad-symbols.test (1651 of 2034) PASS: lldb-api :: commands/expression/completion-in-lambda-and-unnamed-class/TestCompletionInLambdaAndUnnamedClass.py (1652 of 2034) PASS: lldb-shell :: SymbolFile/NativePDB/s_constant.cpp (1653 of 2034) PASS: lldb-unit :: Host/./HostTests/MainLoopTest.ReadObject (1654 of 2034) PASS: lldb-shell :: ObjectFile/ELF/minidebuginfo-find-symbols.yaml (1655 of 2034) PASS: lldb-unit :: ScriptInterpreter/Python/./ScriptInterpreterPythonTests/PythonDataObjectsTest.TestModuleNameResolutionNoDot (1656 of 2034) PASS: lldb-api :: functionalities/data-formatter/data-formatter-objc/TestDataFormatterObjCExpr.py (1657 of 2034) PASS: lldb-api :: lang/objc/ivar-IMP/TestObjCiVarIMP.py (1658 of 2034) PASS: lldb-api :: functionalities/type_completion/TestTypeCompletion.py (1659 of 2034) PASS: lldb-unit :: Utility/./UtilityTests/LogChannelEnabledTest.LogThread (1660 of 2034) PASS: lldb-unit :: Symbol/./SymbolTests/TestTypeSystemClang.TestConvertAccessTypeToAccessSpecifier (1661 of 2034) PASS: lldb-unit :: Utility/./UtilityTests/ArgsTest.ReplaceArgumentAtIndexOutOfRange (1662 of 2034) UNSUPPORTED: lldb-shell :: Register/x86-gp-write.test (1663 of 2034) PASS: lldb-shell :: Minidump/fb-dump.test (1664 of 2034) PASS: lldb-api :: lang/cpp/diamond/TestDiamond.py (1665 of 2034) PASS: lldb-api :: functionalities/data-formatter/synthcapping/TestSyntheticCapping.py (1666 of 2034) PASS: lldb-unit :: Host/./HostTests/MainLoopTest.UnmonitoredSignal (1667 of 2034) PASS: lldb-unit :: Host/./HostTests/FileSystemTest.Readable (1668 of 2034) PASS: lldb-unit :: ObjectFile/PECOFF/./ObjectFilePECOFFTests/PECallFrameInfoTest.Basic_eh (1669 of 2034) PASS: lldb-shell :: Reproducer/TestFileRepro.test (1670 of 2034) PASS: lldb-shell :: SymbolFile/DWARF/find-variable-dwo.cpp (1671 of 2034) UNSUPPORTED: lldb-shell :: SymbolFile/DWARF/split-dwarf-expression-eval-bug.cpp (1672 of 2034) PASS: lldb-unit :: Utility/./UtilityTests/StringLexerTest.NextIf (1673 of 2034) UNSUPPORTED: lldb-shell :: Register/x86-64-ymm16-write.test (1674 of 2034) PASS: lldb-api :: commands/expression/radar_9673664/TestExprHelpExamples.py (1675 of 2034) UNSUPPORTED: lldb-shell :: SymbolFile/PDB/ast-restore.test (1676 of 2034) PASS: lldb-api :: commands/settings/quoting/TestQuoting.py (1677 of 2034) PASS: lldb-unit :: Utility/./UtilityTests/ScalarTest.RightShiftOperator (1678 of 2034) PASS: lldb-api :: lang/cpp/modules-import/TestCXXModulesImport.py (1679 of 2034) PASS: lldb-api :: functionalities/data-formatter/data-formatter-caching/TestDataFormatterCaching.py (1680 of 2034) PASS: lldb-api :: commands/expression/test/TestExprs.py (1681 of 2034) PASS: lldb-api :: macosx/find-dsym/bundle-with-dot-in-filename/TestBundleWithDotInFilename.py (1682 of 2034) UNSUPPORTED: lldb-api :: linux/sepdebugsymlink/TestTargetSymbolsSepDebugSymlink.py (1683 of 2034) PASS: lldb-api :: functionalities/source-map/TestTargetSourceMap.py (1684 of 2034) PASS: lldb-api :: lang/cpp/extern_c/TestExternCSymbols.py (1685 of 2034) PASS: lldb-api :: lang/mixed/TestMixedLanguages.py (1686 of 2034) PASS: lldb-api :: commands/expression/unwind_expression/TestUnwindExpression.py (1687 of 2034) PASS: lldb-api :: python_api/default-constructor/TestDefaultConstructorForAPIObjects.py (1688 of 2034) PASS: lldb-unit :: Utility/./UtilityTests/RangeTest.Union (1689 of 2034) PASS: lldb-unit :: Host/./HostTests/FileSystemTest.OpenErrno (1690 of 2034) PASS: lldb-unit :: Utility/./UtilityTests/Flags.Reset (1691 of 2034) PASS: lldb-shell :: Commands/command-disassemble.s (1692 of 2034) PASS: lldb-unit :: Process/gdb-remote/./ProcessGdbRemoteTests/GDBRemoteClientBaseTest.SendContinueDelegateStructuredDataReceipt (1693 of 2034) PASS: lldb-unit :: Language/Highlighting/./HighlighterTests/HighlighterTest.HighlighterSelectionPath (1694 of 2034) PASS: lldb-shell :: SymbolFile/NativePDB/globals-fundamental.cpp (1695 of 2034) PASS: lldb-unit :: Utility/./UtilityTests/VASprintfTest.EncodingError (1696 of 2034) PASS: lldb-api :: types/TestFloatTypesExpr.py (1697 of 2034) PASS: lldb-api :: commands/expression/regression-access-function-template-in-record/TestRegressionAccessFunctionTemplateInRecord.py (1698 of 2034) PASS: lldb-shell :: Breakpoint/debug_rnglist_offset_pair.test (1699 of 2034) UNSUPPORTED: lldb-api :: functionalities/darwin_log/filter/exact_match/message/TestDarwinLogFilterMatchMessage.py (1700 of 2034) PASS: lldb-api :: commands/expression/ignore-artificial-constructors/TestIgnoreArtificialConstructors.py (1701 of 2034) PASS: lldb-api :: commands/expression/ir-interpreter/TestIRInterpreter.py (1702 of 2034) PASS: lldb-unit :: Utility/./UtilityTests/ArgsTest.TestSingleArgWithQuotedSpace (1703 of 2034) PASS: lldb-api :: python_api/module_section/TestModuleAndSection.py (1704 of 2034) PASS: lldb-api :: functionalities/breakpoint/breakpoint_ids/TestBreakpointIDs.py (1705 of 2034) PASS: lldb-shell :: ObjectFile/ELF/compressed-sections.yaml (1706 of 2034) PASS: lldb-api :: lang/objc/foundation/TestObjCMethodsNSError.py (1707 of 2034) PASS: lldb-unit :: Process/minidump/./LLDBMinidumpTests/MinidumpParserTest.GetMemory (1708 of 2034) PASS: lldb-api :: functionalities/postmortem/netbsd-core/TestNetBSDCore.py (1709 of 2034) PASS: lldb-api :: functionalities/thread/num_threads/TestNumThreads.py (1710 of 2034) PASS: lldb-shell :: SymbolFile/DWARF/dwarf5-debug_line.s (1711 of 2034) PASS: lldb-api :: lang/cpp/chained-calls/TestCppChainedCalls.py (1712 of 2034) PASS: lldb-unit :: Utility/./UtilityTests/StringExtractorTest.DecodeHexU8_Underflow2 (1713 of 2034) PASS: lldb-shell :: ExecControl/StopHook/stop-hook.test (1714 of 2034) PASS: lldb-shell :: SymbolFile/DWARF/gnu-style-compression.cpp (1715 of 2034) PASS: lldb-shell :: SymbolFile/DWARF/find-basic-function.cpp (1716 of 2034) PASS: lldb-unit :: Utility/./UtilityTests/StreamTest.PutBytesAsRawHex8ToLittleEndian (1717 of 2034) PASS: lldb-shell :: Driver/TestRepl.test (1718 of 2034) PASS: lldb-shell :: Breakpoint/jitbp_elf.test (1719 of 2034) PASS: lldb-api :: commands/frame/diagnose/dereference-argument/TestDiagnoseDereferenceArgument.py (1720 of 2034) PASS: lldb-unit :: Utility/./UtilityTests/UserIDResolver.GetUserName (1721 of 2034) PASS: lldb-api :: functionalities/reproducers/attach/TestReproducerAttach.py (1722 of 2034) PASS: lldb-api :: lang/c/function_types/TestFunctionTypes.py (1723 of 2034) PASS: lldb-api :: python_api/breakpoint/TestBreakpointAPI.py (1724 of 2034) PASS: lldb-shell :: SymbolFile/NativePDB/function-types-classes.cpp (1725 of 2034) PASS: lldb-unit :: Utility/./UtilityTests/StringListTest.GetMaxStringLengthIncreasingSize (1726 of 2034) PASS: lldb-api :: functionalities/thread/concurrent_events/TestConcurrentManyBreakpoints.py (1727 of 2034) PASS: lldb-unit :: ObjectFile/Breakpad/./ObjectFileBreakpadTests/StackWinRecord.parse (1728 of 2034) PASS: lldb-api :: lang/objc/modules-cache/TestClangModulesCache.py (1729 of 2034) UNSUPPORTED: lldb-api :: benchmarks/expression/TestExpressionCmd.py (1730 of 2034) PASS: lldb-unit :: Utility/./UtilityTests/FileSpecTest.Match (1731 of 2034) PASS: lldb-unit :: UnwindAssembly/x86/./UnwindAssemblyx86Tests/Testx86AssemblyInspectionEngine.TestLEAVE (1732 of 2034) PASS: lldb-api :: functionalities/object-file/TestImageListMultiArchitecture.py (1733 of 2034) PASS: lldb-unit :: Utility/./UtilityTests/ConstStringTest.UpdateMangledCounterpart (1734 of 2034) PASS: lldb-unit :: Interpreter/./InterpreterTests/OptionArgParserTest.toBoolean (1735 of 2034) PASS: lldb-shell :: SymbolFile/DWARF/debug_rnglists.s (1736 of 2034) PASS: lldb-unit :: Process/gdb-remote/./ProcessGdbRemoteTests/GDBRemoteCommunicationClientTest.SendStartTracePacket (1737 of 2034) PASS: lldb-shell :: SymbolFile/symbol-binding.test (1738 of 2034) PASS: lldb-unit :: Utility/./UtilityTests/StringListTest.InsertStringAtIndexMove (1739 of 2034) PASS: lldb-unit :: Utility/./UtilityTests/VMRange.Comparison (1740 of 2034) PASS: lldb-api :: commands/expression/formatters/TestFormatters.py (1741 of 2034) PASS: lldb-unit :: Utility/./UtilityTests/ScalarTest.SetValueFromCString (1742 of 2034) PASS: lldb-unit :: Utility/./UtilityTests/ConstStringTest.CompareStringRef (1743 of 2034) PASS: lldb-unit :: Utility/./UtilityTests/NameMatchesTest.Ignore (1744 of 2034) PASS: lldb-api :: commands/help/TestHelp.py (1745 of 2034) PASS: lldb-unit :: Utility/./UtilityTests/RegisterValueTest.GetSet8 (1746 of 2034) PASS: lldb-api :: functionalities/thread/concurrent_events/TestConcurrentTwoBreakpointsOneDelaySignal.py (1747 of 2034) PASS: lldb-unit :: Utility/./UtilityTests/StringListTest.GetMaxStringLengthDecreasingSize (1748 of 2034) PASS: lldb-api :: tools/lldb-server/commandline/TestStubReverseConnect.py (1749 of 2034) PASS: lldb-api :: functionalities/stats_api/TestStatisticsAPI.py (1750 of 2034) PASS: lldb-unit :: Expression/./ExpressionTests/DiagnosticManagerTest.AppendMessageAttachToLastDiag (1751 of 2034) PASS: lldb-unit :: Utility/./UtilityTests/ConstStringTest.CompareConstString (1752 of 2034) PASS: lldb-api :: commands/expression/call-function/TestCallStdStringFunction.py (1753 of 2034) PASS: lldb-api :: python_api/lldbutil/frame/TestFrameUtils.py (1754 of 2034) PASS: lldb-unit :: Utility/./UtilityTests/RangeTest.LessThanInvalid (1755 of 2034) UNSUPPORTED: lldb-api :: iohandler/resize/TestIOHandlerResize.py (1756 of 2034) UNSUPPORTED: lldb-api :: functionalities/darwin_log/format/TestDarwinLogMessageFormat.py (1757 of 2034) PASS: lldb-unit :: UnwindAssembly/x86/./UnwindAssemblyx86Tests/Testx86AssemblyInspectionEngine.TestPopR14 (1758 of 2034) UNSUPPORTED: lldb-shell :: SymbolFile/NativePDB/local-variables.cpp (1759 of 2034) UNSUPPORTED: lldb-shell :: SymbolFile/PDB/variables.test (1760 of 2034) PASS: lldb-api :: python_api/sbtype_typeclass/TestSBTypeTypeClass.py (1761 of 2034) PASS: lldb-api :: lang/objc/direct-dispatch-step/TestObjCDirectDispatchStepping.py (1762 of 2034) PASS: lldb-api :: functionalities/data-formatter/data-formatter-objc/TestDataFormatterObjNSException.py (1763 of 2034) PASS: lldb-shell :: ScriptInterpreter/Python/crashlog.test (1764 of 2034) UNSUPPORTED: lldb-api :: lang/cpp/function-template-parameter-pack/TestFunctionTemplateParameterPack.py (1765 of 2034) PASS: lldb-unit :: Utility/./UtilityTests/UriParserTest.Empty (1766 of 2034) PASS: lldb-api :: types/TestFloatTypes.py (1767 of 2034) PASS: lldb-shell :: Breakpoint/single-file-split-dwarf.test (1768 of 2034) PASS: lldb-unit :: Utility/./UtilityTests/BinaryStreamTest.PutSLEB128EightBytes (1769 of 2034) UNSUPPORTED: lldb-shell :: Register/x86-64-xmm16-read.test (1770 of 2034) PASS: lldb-api :: commands/expression/char/TestExprsChar.py (1771 of 2034) PASS: lldb-unit :: Expression/./ExpressionTests/DWARFExpression.DW_OP_convert (1772 of 2034) UNSUPPORTED: lldb-api :: commands/register/register/intel_xtended_registers/TestMPXRegisters.py (1773 of 2034) PASS: lldb-unit :: Utility/./UtilityTests/NameMatchesTest.EndsWith (1774 of 2034) PASS: lldb-shell :: ObjectFile/ELF/short-build-id.yaml (1775 of 2034) PASS: lldb-unit :: Utility/./UtilityTests/UriParserTest.BracketedHostnameWithPortIPv6 (1776 of 2034) PASS: lldb-api :: python_api/type/TestTypeList.py (1777 of 2034) PASS: lldb-unit :: Process/gdb-remote/./ProcessGdbRemoteTests/GDBRemoteCommunicationClientTest.GetModulesInfo_UUID20 (1778 of 2034) PASS: lldb-unit :: Utility/./UtilityTests/RecordReplayTest.InstrumentedBarPtr (1779 of 2034) PASS: lldb-api :: functionalities/gdb_remote_client/TestStopPCs.py (1780 of 2034) PASS: lldb-unit :: Utility/./UtilityTests/XcodeSDKTest.MergeTest (1781 of 2034) PASS: lldb-api :: lang/objc/objc-property/TestObjCProperty.py (1782 of 2034) PASS: lldb-api :: functionalities/thread/state_after_expression/TestStateAfterExpression.py (1783 of 2034) PASS: lldb-unit :: Symbol/./SymbolTests/TestTypeSystemClang.TestOwningModule (1784 of 2034) PASS: lldb-unit :: Symbol/./SymbolTests/TestTypeSystemClang.TemplateArguments (1785 of 2034) PASS: lldb-unit :: Symbol/./SymbolTests/TestClangASTImporter.MetadataPropagationIndirectImport (1786 of 2034) UNSUPPORTED: lldb-api :: functionalities/tsan/basic/TestTsanBasic.py (1787 of 2034) PASS: lldb-shell :: Minidump/memory-region.yaml (1788 of 2034) PASS: lldb-unit :: Utility/./UtilityTests/UriParserTest.SchemeHostSeparator4 (1789 of 2034) PASS: lldb-unit :: Utility/./UtilityTests/StringExtractorTest.GetHexU8_Underflow2_NoEof (1790 of 2034) PASS: lldb-api :: python_api/sbvalue_persist/TestSBValuePersist.py (1791 of 2034) PASS: lldb-unit :: Utility/./UtilityTests/FileSpecTest.IsRelative (1792 of 2034) PASS: lldb-unit :: Utility/./UtilityTests/OptionsWithRawTest.QuotedSuffix (1793 of 2034) UNSUPPORTED: lldb-api :: python_api/disassemble-raw-data/TestDisassemble_VST1_64.py (1794 of 2034) PASS: lldb-api :: functionalities/data-formatter/data-formatter-objc/TestDataFormatterObjCNSDate.py (1795 of 2034) PASS: lldb-api :: functionalities/memory-region/TestMemoryRegion.py (1796 of 2034) PASS: lldb-unit :: Utility/./UtilityTests/StringListTest.JoinMultiCharSeparator (1797 of 2034) PASS: lldb-unit :: Host/./HostTests/SocketAddressTest.GetAddressInfo (1798 of 2034) PASS: lldb-api :: functionalities/thread/concurrent_events/TestConcurrentDelayedCrashWithBreakpointSignal.py (1799 of 2034) UNSUPPORTED: lldb-api :: benchmarks/stepping/TestSteppingSpeed.py (1800 of 2034) PASS: lldb-shell :: SymbolFile/NativePDB/globals-bss.cpp (1801 of 2034) PASS: lldb-shell :: SymbolFile/DWARF/deterministic-build.cpp (1802 of 2034) PASS: lldb-unit :: Host/./HostTests/SocketTest.TCPListen0ConnectAccept (1803 of 2034) PASS: lldb-api :: commands/process/launch/TestProcessLaunch.py (1804 of 2034) PASS: lldb-api :: functionalities/inferior-crashing/TestInferiorCrashingStep.py (1805 of 2034) PASS: lldb-shell :: SymbolFile/NativePDB/disassembly.cpp (1806 of 2034) PASS: lldb-api :: functionalities/abbreviation/TestAbbreviations.py (1807 of 2034) UNSUPPORTED: lldb-shell :: ScriptInterpreter/Lua/lua.test (1808 of 2034) PASS: lldb-api :: lang/c/stepping/TestStepAndBreakpoints.py (1809 of 2034) UNSUPPORTED: lldb-shell :: SymbolFile/PDB/compilands.test (1810 of 2034) PASS: lldb-api :: commands/expression/save_jit_objects/TestSaveJITObjects.py (1811 of 2034) PASS: lldb-unit :: Utility/./UtilityTests/StringExtractorTest.GetHexU8_Underflow_NoEof (1812 of 2034) PASS: lldb-shell :: SymbolFile/Breakpad/stack-cfi-parsing.test (1813 of 2034) PASS: lldb-shell :: SymbolFile/DWARF/apple-index-is-used.cpp (1814 of 2034) PASS: lldb-api :: lang/c/global_variables/TestGlobalVariables.py (1815 of 2034) PASS: lldb-api :: lang/cpp/global_operators/TestCppGlobalOperators.py (1816 of 2034) PASS: lldb-shell :: Reproducer/Functionalities/TestImageList.test (1817 of 2034) PASS: lldb-shell :: Reproducer/TestProcessList.test (1818 of 2034) PASS: lldb-api :: commands/expression/deleting-implicit-copy-constructor/TestDeletingImplicitCopyConstructor.py (1819 of 2034) PASS: lldb-unit :: Process/gdb-remote/./ProcessGdbRemoteTests/GDBRemoteCommunicationServerTest.SendErrorResponse_ErrorNumber (1820 of 2034) PASS: lldb-shell :: SymbolFile/DWARF/debug-types-basic.test (1821 of 2034) PASS: lldb-unit :: Utility/./UtilityTests/RangeTest.ContainsEndInclusive (1822 of 2034) PASS: lldb-shell :: SymbolFile/Breakpad/line-table-edgecases.test (1823 of 2034) PASS: lldb-shell :: Breakpoint/split-dwarf-5-addrbase.test (1824 of 2034) PASS: lldb-api :: commands/expression/persistent_variables/TestPersistentVariables.py (1825 of 2034) UNSUPPORTED: lldb-shell :: Reproducer/TestLuaImport.test (1826 of 2034) PASS: lldb-shell :: ObjectFile/ELF/build-id-case.yaml (1827 of 2034) PASS: lldb-unit :: Symbol/./SymbolTests/TestTypeSystemClang.TestGetTypeClassNested (1828 of 2034) UNSUPPORTED: lldb-api :: arm/breakpoint-thumb-codesection/TestBreakpointThumbCodesection.py (1829 of 2034) PASS: lldb-unit :: Utility/./UtilityTests/ScalarTest.GetBytes (1830 of 2034) PASS: lldb-unit :: Utility/./UtilityTests/StringListTest.ForRange (1831 of 2034) PASS: lldb-unit :: Utility/./UtilityTests/OptionsWithRawTest.ArgsButNoDelimiter (1832 of 2034) PASS: lldb-unit :: Utility/./UtilityTests/Flags.AllSet (1833 of 2034) PASS: lldb-shell :: Settings/TestLineMarkerColor.test (1834 of 2034) PASS: lldb-unit :: Utility/./UtilityTests/IndexToObjectTest.ObjectForIndex (1835 of 2034) PASS: lldb-shell :: Reproducer/TestCrash.test (1836 of 2034) PASS: lldb-api :: tools/lldb-server/commandline/TestStubSetSID.py (1837 of 2034) PASS: lldb-unit :: Expression/./ExpressionTests/CppModuleConfigurationTest.UnrelatedLibrary (1838 of 2034) PASS: lldb-unit :: Utility/./UtilityTests/FileSpecTest.EqualDotsPosixRoot (1839 of 2034) PASS: lldb-unit :: Utility/./UtilityTests/StringListTest.JoinEmpty (1840 of 2034) PASS: lldb-unit :: Utility/./UtilityTests/StreamTest.AddressPrefixAndSuffix (1841 of 2034) UNSUPPORTED: lldb-shell :: Unwind/unwind-plan-dwarf-dump.test (1842 of 2034) UNSUPPORTED: lldb-api :: benchmarks/libcxxmap/TestBenchmarkLibcxxMap.py (1843 of 2034) PASS: lldb-unit :: Utility/./UtilityTests/StreamTest.AddressRangeEmptyRange (1844 of 2034) PASS: lldb-unit :: Process/minidump/./LLDBMinidumpTests/MinidumpParserTest.FindMemoryRange (1845 of 2034) PASS: lldb-unit :: Utility/./UtilityTests/StringListTest.CopyList (1846 of 2034) PASS: lldb-api :: python_api/sbstructureddata/TestStructuredDataAPI.py (1847 of 2034) PASS: lldb-unit :: Utility/./UtilityTests/StringExtractorTest.DecodeHexU8_Extra (1848 of 2034) PASS: lldb-shell :: SymbolFile/DWARF/split-dwarf-multiple-cu.ll (1849 of 2034) PASS: lldb-unit :: Expression/./ExpressionTests/CppModuleConfigurationTest.AmbiguousCLib (1850 of 2034) PASS: lldb-api :: commands/expression/inline-namespace/TestInlineNamespace.py (1851 of 2034) PASS: lldb-api :: functionalities/gdb_remote_client/TestWriteMemory.py (1852 of 2034) PASS: lldb-api :: functionalities/breakpoint/auto_continue/TestBreakpointAutoContinue.py (1853 of 2034) PASS: lldb-unit :: Utility/./UtilityTests/FileSpecTest.FormatFileSpec (1854 of 2034) PASS: lldb-api :: tools/lldb-vscode/breakpoint/TestVSCode_setFunctionBreakpoints.py (1855 of 2034) PASS: lldb-shell :: ObjectFile/wasm/unified-debug-sections.yaml (1856 of 2034) PASS: lldb-api :: macosx/nslog/TestDarwinNSLogOutput.py (1857 of 2034) PASS: lldb-api :: lang/objc/objc-ivar-protocols/TestIvarProtocols.py (1858 of 2034) PASS: lldb-shell :: Breakpoint/dummy-target.test (1859 of 2034) PASS: lldb-api :: python_api/sbdata/TestSBData.py (1860 of 2034) PASS: lldb-unit :: Utility/./UtilityTests/CompletionRequest.TryCompleteCurrentArgGood (1861 of 2034) PASS: lldb-unit :: ScriptInterpreter/Python/./ScriptInterpreterPythonTests/PythonDataObjectsTest.TestExceptions (1862 of 2034) UNSUPPORTED: lldb-api :: lang/objc/ptr_refs/TestPtrRefsObjC.py (1863 of 2034) UNSUPPORTED: lldb-shell :: SymbolFile/dissassemble-entry-point.s (1864 of 2034) PASS: lldb-api :: commands/expression/namespace_local_var_same_name_cpp_and_c/TestNamespaceLocalVarSameNameCppAndC.py (1865 of 2034) PASS: lldb-api :: functionalities/breakpoint/address_breakpoints/TestBadAddressBreakpoints.py (1866 of 2034) PASS: lldb-unit :: Host/./HostTests/Host.WaitStatusFormat (1867 of 2034) PASS: lldb-api :: tools/lldb-vscode/breakpoint/TestVSCode_setExceptionBreakpoints.py (1868 of 2034) PASS: lldb-api :: functionalities/target_var/TestTargetVar.py (1869 of 2034) PASS: lldb-unit :: Process/minidump/./LLDBMinidumpTests/MinidumpParserTest.GetFilteredModuleList (1870 of 2034) PASS: lldb-unit :: Language/Highlighting/./HighlighterTests/HighlighterTest.Colons (1871 of 2034) PASS: lldb-unit :: Process/gdb-remote/./ProcessGdbRemoteTests/GDBRemoteCommunicationClientTest.WriteRegisterNoSuffix (1872 of 2034) PASS: lldb-unit :: SymbolFile/DWARF/./SymbolFileDWARFTests/SymbolFileDWARFTests.TestAbbrevOrder1Start5 (1873 of 2034) PASS: lldb-unit :: Symbol/./SymbolTests/LineEntryTest.GetSameLineContiguousAddressRangeNestedInline (1874 of 2034) UNSUPPORTED: lldb-api :: functionalities/tsan/thread_leak/TestTsanThreadLeak.py (1875 of 2034) PASS: lldb-unit :: Utility/./UtilityTests/StringExtractorTest.GetHexBytes_OddPair (1876 of 2034) PASS: lldb-unit :: Expression/./ExpressionTests/DiagnosticManagerTest.GetStringMultiline (1877 of 2034) PASS: lldb-unit :: Language/Highlighting/./HighlighterTests/HighlighterTest.ClangCursorPosInOtherToken (1878 of 2034) PASS: lldb-api :: tools/lldb-vscode/variables/TestVSCode_variables.py (1879 of 2034) UNSUPPORTED: lldb-api :: functionalities/signal/handle-segv/TestHandleSegv.py (1880 of 2034) PASS: lldb-api :: functionalities/data-formatter/synthupdate/TestSyntheticFilterRecompute.py (1881 of 2034) PASS: lldb-shell :: Driver/TestProcessAttach.test (1882 of 2034) UNSUPPORTED: lldb-api :: commands/gui/basic/TestGuiBasic.py (1883 of 2034) UNSUPPORTED: lldb-shell :: ScriptInterpreter/Lua/persistent_state.test (1884 of 2034) PASS: lldb-api :: commands/expression/import-std-module/deque-basic/TestDequeFromStdModule.py (1885 of 2034) PASS: lldb-api :: commands/target/stop-hooks/TestStopHooks.py (1886 of 2034) PASS: lldb-api :: functionalities/thread/concurrent_events/TestConcurrentNWatchNBreak.py (1887 of 2034) PASS: lldb-unit :: Utility/./UtilityTests/RangeTest.DoesAdjoinOrIntersect (1888 of 2034) PASS: lldb-unit :: Utility/./UtilityTests/ArgsTest.BareSingleQuote (1889 of 2034) UNSUPPORTED: lldb-api :: functionalities/process_save_core/TestProcessSaveCore.py (1890 of 2034) PASS: lldb-unit :: Utility/./UtilityTests/SerializationRountripTest.SerializeDeserializePod (1891 of 2034) PASS: lldb-unit :: Utility/./UtilityTests/StreamTest.AddressPrefix (1892 of 2034) PASS: lldb-unit :: UnwindAssembly/x86/./UnwindAssemblyx86Tests/Testx86AssemblyInspectionEngine.TestPushEDX (1893 of 2034) PASS: lldb-shell :: Commands/command-thread-select.test (1894 of 2034) PASS: lldb-unit :: Utility/./UtilityTests/ScalarTest.CastOperations (1895 of 2034) PASS: lldb-unit :: UnwindAssembly/x86/./UnwindAssemblyx86Tests/Testx86AssemblyInspectionEngine.TestSpArithx86_64Augmented (1896 of 2034) PASS: lldb-shell :: ObjectFile/ELF/section-types-edgecases.yaml (1897 of 2034) PASS: lldb-api :: functionalities/thread/concurrent_events/TestConcurrentBreakpointsDelayedBreakpointOneWatchpoint.py (1898 of 2034) PASS: lldb-api :: functionalities/tail_call_frames/sbapi_support/TestTailCallFrameSBAPI.py (1899 of 2034) PASS: lldb-api :: functionalities/load_using_paths/TestLoadUsingPaths.py (1900 of 2034) PASS: lldb-shell :: Breakpoint/debug_rnglist_rlestartend.test (1901 of 2034) PASS: lldb-api :: functionalities/signal/raise/TestRaise.py (1902 of 2034) PASS: lldb-shell :: SymbolFile/DWARF/DW_OP_piece-smaller-than-struct.s (1903 of 2034) PASS: lldb-api :: commands/source/info/TestSourceInfo.py (1904 of 2034) PASS: lldb-unit :: Utility/./UtilityTests/DataExtractorTest.GetCStrAtNullOffset (1905 of 2034) PASS: lldb-unit :: Utility/./UtilityTests/StringExtractorTest.GetHexU8_Exact_NoEof (1906 of 2034) PASS: lldb-unit :: Utility/./UtilityTests/StringExtractorTest.GetHexBytes_Partial (1907 of 2034) PASS: lldb-api :: commands/expression/persistent_types/TestNestedPersistentTypes.py (1908 of 2034) PASS: lldb-unit :: Utility/./UtilityTests/ArgsTest.TestTrailingBackslash (1909 of 2034) PASS: lldb-shell :: ObjectFile/PECOFF/basic-info-arm64.yaml (1910 of 2034) PASS: lldb-api :: functionalities/thread/concurrent_events/TestConcurrentWatchpointDelayWatchpointOneBreakpoint.py (1911 of 2034) UNSUPPORTED: lldb-shell :: Register/x86-zmm-read.test (1912 of 2034) PASS: lldb-unit :: ScriptInterpreter/Python/./ScriptInterpreterPythonTests/PythonDataObjectsTest.TestObjectAttributes (1913 of 2034) PASS: lldb-unit :: Utility/./UtilityTests/AnsiTerminal.Incomplete (1914 of 2034) UNSUPPORTED: lldb-api :: functionalities/ptr_refs/TestPtrRefs.py (1915 of 2034) UNSUPPORTED: lldb-api :: api/multiple-debuggers/TestMultipleDebuggers.py (1916 of 2034) PASS: lldb-unit :: Utility/./UtilityTests/StringLexerTest.Next (1917 of 2034) PASS: lldb-unit :: ObjectFile/Breakpad/./ObjectFileBreakpadTests/StackCFIRecord.parse (1918 of 2034) PASS: lldb-unit :: Utility/./UtilityTests/StreamTest.PutRawBytesToMixedEndian (1919 of 2034) UNSUPPORTED: lldb-api :: functionalities/darwin_log/filter/regex/activity/TestDarwinLogFilterRegexActivity.py (1920 of 2034) PASS: lldb-api :: functionalities/pre_run_dylibs/TestPreRunDylibs.py (1921 of 2034) PASS: lldb-api :: lang/objc/exceptions/TestObjCExceptions.py (1922 of 2034) PASS: lldb-shell :: ObjectFile/PECOFF/basic-info.yaml (1923 of 2034) PASS: lldb-api :: functionalities/tail_call_frames/thread_step_out_message/TestArtificialFrameStepOutMessage.py (1924 of 2034) PASS: lldb-shell :: ObjectFile/ELF/duplicate-section.yaml (1925 of 2034) PASS: lldb-api :: tools/lldb-server/TestGdbRemoteAttach.py (1926 of 2034) PASS: lldb-api :: lang/cpp/dynamic-value-same-basename/TestDynamicValueSameBase.py (1927 of 2034) PASS: lldb-api :: functionalities/postmortem/elf-core/gcore/TestGCore.py (1928 of 2034) PASS: lldb-unit :: Target/./TargetTests/PathMappingListTest.AbsoluteTests (1929 of 2034) PASS: lldb-shell :: ObjectFile/PECOFF/symbol.yaml (1930 of 2034) PASS: lldb-api :: lang/cpp/virtual-functions/TestCppVirtualFunctions.py (1931 of 2034) PASS: lldb-api :: functionalities/thread/concurrent_events/TestConcurrentDelaySignalWatch.py (1932 of 2034) PASS: lldb-api :: functionalities/data-formatter/data-formatter-objc/TestDataFormatterObjCKVO.py (1933 of 2034) PASS: lldb-api :: commands/expression/vector_of_enums/TestVectorOfEnums.py (1934 of 2034) PASS: lldb-api :: commands/expression/result_numbering/TestResultNumbering.py (1935 of 2034) PASS: lldb-unit :: Utility/./UtilityTests/RangeTest.Clear (1936 of 2034) PASS: lldb-api :: lang/cpp/incomplete-types/TestCppIncompleteTypes.py (1937 of 2034) PASS: lldb-api :: lang/objc/objc-new-syntax/TestObjCNewSyntaxLiteral.py (1938 of 2034) PASS: lldb-unit :: Utility/./UtilityTests/ArchSpecTest.TripleComponentsWereSpecified (1939 of 2034) PASS: lldb-api :: functionalities/optimized_code/TestNoASanExceptionAfterEvalOP_piece.py (1940 of 2034) PASS: lldb-api :: commands/frame/diagnose/bad-reference/TestBadReference.py (1941 of 2034) PASS: lldb-api :: functionalities/thread/backtrace_all/TestBacktraceAll.py (1942 of 2034) PASS: lldb-shell :: BuildScript/modes.test (1943 of 2034) PASS: lldb-shell :: Quit/TestQuitExitCodeHex0.test (1944 of 2034) PASS: lldb-api :: functionalities/avoids-fd-leak/TestFdLeak.py (1945 of 2034) PASS: lldb-shell :: ObjectFile/ELF/PT_LOAD-overlap-PT_TLS.yaml (1946 of 2034) PASS: lldb-unit :: ObjectFile/ELF/./ObjectFileELFTests/ObjectFileELFTest.GetSymtab_NoSymEntryPointArmAddressClass (1947 of 2034) PASS: lldb-unit :: Utility/./UtilityTests/FileSpecTest.OperatorBool (1948 of 2034) PASS: lldb-api :: functionalities/breakpoint/step_over_breakpoint/TestStepOverBreakpoint.py (1949 of 2034) PASS: lldb-api :: functionalities/breakpoint/breakpoint_options/TestBreakpointOptions.py (1950 of 2034) PASS: lldb-unit :: Host/./HostTests/FileSystemTest.Resolve (1951 of 2034) PASS: lldb-unit :: Editline/./EditlineTests/EditlineTestFixture.EditlineReceivesMultiLineText (1952 of 2034) PASS: lldb-api :: functionalities/gdb_remote_client/TestTargetXMLArch.py (1953 of 2034) PASS: lldb-api :: commands/add-dsym/uuid/TestAddDsymCommand.py (1954 of 2034) PASS: lldb-unit :: Utility/./UtilityTests/UriParserTest.LongPath (1955 of 2034) XFAIL: lldb-shell :: Register/x86-mm-xmm-read.test (1956 of 2034) PASS: lldb-api :: commands/expression/context-object-objc/TestContextObjectObjc.py (1957 of 2034) PASS: lldb-unit :: Utility/./UtilityTests/ArgsTest.TestQuotedTrailingBackslash (1958 of 2034) PASS: lldb-api :: python_api/formatters/TestFormattersSBAPI.py (1959 of 2034) PASS: lldb-shell :: Breakpoint/debug_rnglistx_rlex.test (1960 of 2034) PASS: lldb-api :: functionalities/data-formatter/data-formatter-objc/TestDataFormatterObjCPlain.py (1961 of 2034) PASS: lldb-api :: functionalities/gdb_remote_client/TestArmRegisterDefinition.py (1962 of 2034) PASS: lldb-unit :: Utility/./UtilityTests/StreamTest.PutNHex8 (1963 of 2034) PASS: lldb-shell :: ObjectFile/ELF/PT_LOAD.yaml (1964 of 2034) PASS: lldb-api :: commands/expression/dollar-in-variable/TestDollarInVariable.py (1965 of 2034) PASS: lldb-unit :: UnwindAssembly/x86/./UnwindAssemblyx86Tests/Testx86AssemblyInspectionEngine.TestPushImm (1966 of 2034) PASS: lldb-unit :: Utility/./UtilityTests/UUIDTest.Validity (1967 of 2034) PASS: lldb-api :: lang/cpp/auto/TestCPPAuto.py (1968 of 2034) PASS: lldb-api :: commands/expression/class_template_specialization_empty_pack/TestClassTemplateSpecializationParametersHandling.py (1969 of 2034) PASS: lldb-api :: lang/objc/modules-update/TestClangModulesUpdate.py (1970 of 2034) PASS: lldb-shell :: SymbolFile/DWARF/debug_loc_and_loclists.s (1971 of 2034) PASS: lldb-unit :: Host/./HostTests/FileSystemTest.EmptyTest (1972 of 2034) PASS: lldb-unit :: DataFormatter/./LLDBFormatterTests/StringPrinterTests.CxxASCII (1973 of 2034) PASS: lldb-unit :: Utility/./UtilityTests/UriParserTest.TypicalPortPathIPv4 (1974 of 2034) PASS: lldb-unit :: Utility/./UtilityTests/OptionsWithRawTest.WhitespaceSuffix (1975 of 2034) PASS: lldb-unit :: Expression/./ExpressionTests/DiagnosticManagerTest.GetStringPreserveOrder (1976 of 2034) PASS: lldb-api :: commands/expression/import-std-module/sysroot/TestStdModuleSysroot.py (1977 of 2034) UNSUPPORTED: lldb-shell :: SymbolFile/NativePDB/stack_unwinding01.cpp (1978 of 2034) PASS: lldb-api :: commands/expression/scoped_enums/TestScopedEnumType.py (1979 of 2034) PASS: lldb-unit :: Utility/./UtilityTests/XcodeSDKTest.GetSDKTypeForTriple (1980 of 2034) UNSUPPORTED: lldb-api :: iohandler/unicode/TestUnicode.py (1981 of 2034) PASS: lldb-shell :: SymbolFile/DWARF/debug-types-address-ranges.s (1982 of 2034) PASS: lldb-unit :: Utility/./UtilityTests/StringExtractorTest.GetHexU8_Exact (1983 of 2034) PASS: lldb-unit :: Utility/./UtilityTests/NameMatchesTest.Contains (1984 of 2034) PASS: lldb-api :: commands/expression/import_base_class_when_class_has_derived_member/TestImportBaseClassWhenClassHasDerivedMember.py (1985 of 2034) UNSUPPORTED: lldb-api :: lang/objc/objc-dynamic-value/TestObjCDynamicValue.py (1986 of 2034) PASS: lldb-unit :: Utility/./UtilityTests/OptionsWithRawTest.SingleWhitespaceInput (1987 of 2034) PASS: lldb-api :: python_api/sbenvironment/TestSBEnvironment.py (1988 of 2034) PASS: lldb-unit :: Process/gdb-remote/./ProcessGdbRemoteTests/GDBRemoteCommunicationClientTest.TestPacketSpeedJSON (1989 of 2034) PASS: lldb-unit :: Process/gdb-remote/./ProcessGdbRemoteTests/GDBRemoteCommunicationClientTest.WriteRegister (1990 of 2034) PASS: lldb-unit :: Utility/./UtilityTests/RangeTest.ContainsRange (1991 of 2034) PASS: lldb-unit :: Utility/./UtilityTests/AnsiTerminal.WhiteSpace (1992 of 2034) PASS: lldb-unit :: Target/./TargetTests/ModuleCacheTest.GetAndPut (1993 of 2034) UNSUPPORTED: lldb-shell :: SymbolFile/PDB/func-symbols.test (1994 of 2034) PASS: lldb-unit :: Expression/./ExpressionTests/DiagnosticManagerTest.GetStringBasic (1995 of 2034) PASS: lldb-unit :: Host/./HostTests/ConnectionFileDescriptorTest.TCPGetURIv4 (1996 of 2034) PASS: lldb-shell :: ObjectFile/ELF/netbsd-core-amd64.test (1997 of 2034) PASS: lldb-api :: lang/cpp/overloaded-functions/TestOverloadedFunctions.py (1998 of 2034) PASS: lldb-shell :: SymbolFile/DWARF/debug-types-dwo-cross-reference.cpp (1999 of 2034) PASS: lldb-unit :: Utility/./UtilityTests/Predicate.WaitForValueNotEqualTo (2000 of 2034) PASS: lldb-unit :: Utility/./UtilityTests/RangeDataVector.FindEntryIndexesThatContain_Overlap (2001 of 2034) PASS: lldb-unit :: Utility/./UtilityTests/StreamTest.PutHex16ByteOrderBig (2002 of 2034) UNSUPPORTED: lldb-shell :: Minidump/Windows/arm-fp-unwind.test (2003 of 2034) PASS: lldb-api :: lang/objc/foundation/TestObjCMethods2.py (2004 of 2034) PASS: lldb-api :: lang/cpp/trivial_abi/TestTrivialABI.py (2005 of 2034) PASS: lldb-api :: python_api/lldbutil/process/TestPrintStackTraces.py (2006 of 2034) PASS: lldb-unit :: UnwindAssembly/x86/./UnwindAssemblyx86Tests/Testx86AssemblyInspectionEngine.TestPushRBX (2007 of 2034) PASS: lldb-unit :: Process/minidump/./LLDBMinidumpTests/MinidumpParserTest.GetLinuxProcStatus_no_stream (2008 of 2034) PASS: lldb-api :: functionalities/process_crash_info/TestProcessCrashInfo.py (2009 of 2034) PASS: lldb-api :: functionalities/postmortem/minidump-new/TestMiniDumpUUID.py (2010 of 2034) PASS: lldb-api :: functionalities/thread/concurrent_events/TestConcurrentDelaySignalBreak.py (2011 of 2034) PASS: lldb-api :: functionalities/data-formatter/data-formatter-named-summaries/TestDataFormatterNamedSummaries.py (2012 of 2034) PASS: lldb-unit :: Utility/./UtilityTests/StringListTest.Clear (2013 of 2034) PASS: lldb-api :: lang/c/conflicting-symbol/TestConflictingSymbol.py (2014 of 2034) PASS: lldb-unit :: Target/./TargetTests/StackFrameRecognizerTest.NullModuleRegex (2015 of 2034) PASS: lldb-shell :: ObjectFile/PECOFF/dep-modules.yaml (2016 of 2034) PASS: lldb-api :: tools/lldb-server/TestGdbRemote_qThreadStopInfo.py (2017 of 2034) PASS: lldb-unit :: Utility/./UtilityTests/StringListTest.InsertStringAtIndexStart (2018 of 2034) PASS: lldb-unit :: Utility/./UtilityTests/AnsiTerminal.Empty (2019 of 2034) PASS: lldb-unit :: Utility/./UtilityTests/StreamTest.AddressSuffix (2020 of 2034) PASS: lldb-shell :: SymbolFile/Breakpad/unwind-via-stack-win.test (2021 of 2034) PASS: lldb-unit :: UnwindAssembly/x86/./UnwindAssemblyx86Tests/Testx86AssemblyInspectionEngine.TestAddRSP (2022 of 2034) PASS: lldb-api :: commands/process/attach/attach_denied/TestAttachDenied.py (2023 of 2034) PASS: lldb-unit :: Host/./HostTests/ConnectionFileDescriptorTest.TCPGetURIv6 (2024 of 2034) PASS: lldb-unit :: Core/./LLDBCoreTests/UniqueCStringMap.NoDefaultConstructor (2025 of 2034) PASS: lldb-unit :: Utility/./UtilityTests/CompletionRequest.FakeLastArg (2026 of 2034) PASS: lldb-unit :: Interpreter/./InterpreterTests/CompletionTest.FileCompletionAbsolute (2027 of 2034) PASS: lldb-unit :: Utility/./UtilityTests/StringExtractorTest.GetU32LittleEndian (2028 of 2034) UNSUPPORTED: lldb-shell :: ScriptInterpreter/Lua/command_script_import.test (2029 of 2034) PASS: lldb-unit :: SymbolFile/NativePDB/./SymbolFileNativePDBTests/PDBFPOProgramToDWARFExpressionTests.UnresolvedCyclicRegisterAssignmentReference (2030 of 2034) PASS: lldb-shell :: SymbolFile/DWARF/debug_rnglists-dwo.s (2031 of 2034) PASS: lldb-api :: lang/objc/foundation/TestSymbolTable.py (2032 of 2034) PASS: lldb-api :: functionalities/data-formatter/data-formatter-stl/libcxx/string/TestDataFormatterLibcxxString.py (2033 of 2034) PASS: lldb-api :: commands/expression/two-files/TestObjCTypeQueryFromOtherCompileUnit.py (2034 of 2034) Slowest Tests: -------------------------------------------------------------------------- 351.54s: lldb-api :: tools/lldb-server/TestLldbGdbServer.py 267.96s: lldb-api :: lang/cpp/enum_types/TestCPP11EnumTypes.py 254.13s: lldb-api :: api/multithreaded/TestMultithreaded.py 245.43s: lldb-api :: tools/lldb-server/TestGdbRemoteThreadsInStopReply.py 220.05s: lldb-api :: lang/objc/hidden-ivars/TestHiddenIvars.py 217.49s: lldb-api :: lang/objc/foundation/TestObjCMethods.py 157.67s: lldb-api :: lang/objc/objc-new-syntax/TestObjCNewSyntaxLiteral.py 155.47s: lldb-api :: lang/objc/exceptions/TestObjCExceptions.py 152.25s: lldb-api :: lang/cpp/namespace/TestNamespaceLookup.py 136.17s: lldb-api :: lang/objc/real-definition/TestRealDefinition.py 124.25s: lldb-api :: types/TestLongTypesExpr.py 122.03s: lldb-api :: types/TestIntegerTypeExpr.py 118.75s: lldb-api :: tools/lldb-server/TestGdbRemote_qThreadStopInfo.py 118.27s: lldb-api :: lang/objc/objc-new-syntax/TestObjCNewSyntaxDictionary.py 118.17s: lldb-api :: lang/objc/objc-new-syntax/TestObjCNewSyntaxArray.py 114.76s: lldb-api :: lang/objc/foundation/TestObjCMethodsNSError.py 114.06s: lldb-api :: lang/objc/foundation/TestObjCMethodsString.py 102.89s: lldb-api :: python_api/lldbutil/iter/TestLLDBIterator.py 101.93s: lldb-api :: lang/objc/forward-decl/TestForwardDecl.py 101.28s: lldb-api :: lang/objcxx/class-name-clash/TestNameClash.py

Hide Details

Tests Times: -------------------------------------------------------------------------- [ Range ] :: [ Percentage ] :: [ Count ] -------------------------------------------------------------------------- [340s,360s) :: [ ] :: [ 1/2034] [320s,340s) :: [ ] :: [ 0/2034] [300s,320s) :: [ ] :: [ 0/2034] [280s,300s) :: [ ] :: [ 0/2034] [260s,280s) :: [ ] :: [ 2/2034] [240s,260s) :: [ ] :: [ 1/2034] [220s,240s) :: [ ] :: [ 2/2034] [200s,220s) :: [ ] :: [ 0/2034] [180s,200s) :: [ ] :: [ 0/2034] [160s,180s) :: [ ] :: [ 1/2034] [140s,160s) :: [ ] :: [ 2/2034] [120s,140s) :: [ ] :: [ 6/2034] [100s,120s) :: [ ] :: [ 5/2034] [ 80s,100s) :: [ ] :: [ 4/2034] [ 60s, 80s) :: [ ] :: [ 24/2034] [ 40s, 60s) :: [* ] :: [ 87/2034] [ 20s, 40s) :: [** ] :: [ 117/2034] [ 0s, 20s) :: [*********************************** ] :: [1782/2034] -------------------------------------------------------------------------- ******************** Failing Tests (2): lldb-unit :: Utility/./UtilityTests/DataExtractorTest.GetSLEB128_bit63 lldb-shell :: SymbolFile/DWARF/DW_TAG_variable-DW_AT_const_value.s

Hide Details

Hide Details

Testing Time: 4376.67s Unsupported Tests : 171 Expected Passes : 1855 Expected Failures : 6 Unexpected Failures: 2 FAILED: tools/lldb/test/CMakeFiles/check-lldb-lit cd /Users/buildslave/jenkins/workspace/lldb-cmake-sanitized/lldb-build/tools/lldb/test && /usr/local/Frameworks/Python.framework/Versions/3.7/bin/python3.7 /Users/buildslave/jenkins/workspace/lldb-cmake-sanitized/lldb-build/./bin/llvm-lit -v --time-tests --shuffle --xunit-xml-output=/Users/buildslave/jenkins/workspace/lldb-cmake-sanitized/test/results.xml -v -j 4 --timeout 1200 /Users/buildslave/jenkins/workspace/lldb-cmake-sanitized/lldb-build/tools/lldb/test ninja: build stopped: subcommand failed. Command failed: Command '['/usr/bin/env', 'TERM=vt100', '/usr/local/bin/ninja', '-v', 'check-lldb']' returned non-zero exit status 1. Command: ['/usr/bin/env', 'TERM=vt100', '/usr/local/bin/ninja', '-v', 'check-lldb'] [Pipeline] } [Pipeline] // timeout [Pipeline] } [Pipeline] // stage [Pipeline] stage [Pipeline] { (Declarative: Post Actions) [Pipeline] scanForIssues [Clang (LLVM based)] Sleeping for 5 seconds due to JENKINS-32191... [Clang (LLVM based)] Parsing console log (workspace: '/Users/buildslave/jenkins/workspace/lldb-cmake-sanitized') [Clang (LLVM based)] Successfully parsed console log [Clang (LLVM based)] -> found 5 issues (skipped 1 duplicate) [Clang (LLVM based)] Post processing issues on 'green-dragon-23' with source code encoding 'UTF-8' [Clang (LLVM based)] Creating SCM blamer to obtain author and commit information for affected files [Clang (LLVM based)] Creating SCM miner to obtain statistics for affected repository files [Clang (LLVM based)] Resolving file names for all issues in source directory '/Users/buildslave/jenkins/workspace/lldb-cmake-sanitized' [Clang (LLVM based)] -> resolved paths in source directory (4 found, 0 not found) [Clang (LLVM based)] Resolving module names from module definitions (build.xml, pom.xml, or Manifest.mf files) [Clang (LLVM based)] -> resolved module names for 5 issues [Clang (LLVM based)] Resolving package names (or namespaces) by parsing the affected files [Clang (LLVM based)] -> resolved package names of 4 affected files [Clang (LLVM based)] No filter has been set, publishing all 5 issues [Clang (LLVM based)] Creating fingerprints for all affected code blocks to track issues over different builds [Clang (LLVM based)] -> created fingerprints for 5 issues (skipped 0 issues) [Clang (LLVM based)] Copying affected files to Jenkins' build folder '/Users/Shared/Jenkins/Home/jobs/lldb-cmake-sanitized/builds/1512/files-with-issues' [Clang (LLVM based)] -> 4 copied, 0 not in workspace, 0 not-found, 0 with I/O error [Pipeline] junit Recording test results [Pipeline] } [Pipeline] // stage [Pipeline] } [Pipeline] // withEnv [Pipeline] } [Pipeline] // node [Pipeline] End of Pipeline ERROR: script returned exit code 1 Finished: FAILURE