FailedConsole Output

Started by upstream project "lldb-cmake" build number 2645
originally caused by:
 Started by an SCM change
Obtained zorg/jenkins/jobs/jobs/lldb-cmake-sanitized from git https://github.com/llvm/llvm-zorg.git
Running in Durability level: MAX_SURVIVABILITY
[Pipeline] Start of Pipeline
[Pipeline] node
Still waiting to schedule task
Waiting for next available executor on ‘green-dragon-23’
Running on green-dragon-23 in /Users/buildslave/jenkins/workspace/lldb-cmake-sanitized
[Pipeline] {
[Pipeline] stage
[Pipeline] { (Declarative: Checkout SCM)
[Pipeline] checkout
No credentials specified
Fetching changes from the remote Git repository
Checking out Revision 67388f46dff7b59886cc95257211b1d1710feb8c (refs/remotes/origin/master)
Commit message: "LLVMBuilfFactory should always have is_legacy_mode attribute."
 > git rev-parse --is-inside-work-tree # timeout=10
 > git config remote.origin.url https://github.com/llvm/llvm-zorg.git # timeout=10
Fetching upstream changes from https://github.com/llvm/llvm-zorg.git
 > git --version # timeout=10
 > git fetch --tags --progress -- https://github.com/llvm/llvm-zorg.git +refs/heads/*:refs/remotes/origin/*
 > git rev-parse refs/remotes/origin/master^{commit} # timeout=10
 > git rev-parse refs/remotes/origin/origin/master^{commit} # timeout=10
 > git config core.sparsecheckout # timeout=10
 > git checkout -f 67388f46dff7b59886cc95257211b1d1710feb8c
 > git rev-list --no-walk 1844cbfc99c299130773de2c564ef88b04b33e44 # timeout=10
[Pipeline] }
[Pipeline] // stage
[Pipeline] withEnv
[Pipeline] {
[Pipeline] stage
[Pipeline] { (Checkout)
[Pipeline] dir
Running in /Users/buildslave/jenkins/workspace/lldb-cmake-sanitized/llvm-project
[Pipeline] {
[Pipeline] checkout
No credentials specified
Fetching changes from the remote Git repository
Checking out Revision 4d1ecadda59ce82e5fa6e28dd15bf794eee88363 (refs/remotes/origin/master)
Commit message: "[ASan] Refine diagnoses messages"
 > git rev-parse --is-inside-work-tree # timeout=10
 > git config remote.origin.url http://labmaster3.local/git/llvm-project.git # timeout=10
Fetching upstream changes from http://labmaster3.local/git/llvm-project.git
 > git --version # timeout=10
 > git fetch --tags --progress -- http://labmaster3.local/git/llvm-project.git +refs/heads/*:refs/remotes/origin/*
 > git rev-parse refs/remotes/origin/master^{commit} # timeout=10
 > git rev-parse refs/remotes/origin/origin/master^{commit} # timeout=10
 > git config core.sparsecheckout # timeout=10
 > git checkout -f 4d1ecadda59ce82e5fa6e28dd15bf794eee88363
 > git rev-list --no-walk 4d1ecadda59ce82e5fa6e28dd15bf794eee88363 # timeout=10
[Pipeline] }
[Pipeline] // dir
[Pipeline] dir
Running in /Users/buildslave/jenkins/workspace/lldb-cmake-sanitized/llvm-zorg
[Pipeline] {
[Pipeline] checkout
No credentials specified
Fetching changes from the remote Git repository
Checking out Revision bdb8efb160db242c1897a532e4a3e42fc0d968ea (refs/remotes/origin/master)
Commit message: "Refactored ClangLTOBuilder to support github."
 > git rev-parse --is-inside-work-tree # timeout=10
 > git config remote.origin.url http://labmaster3.local/git/llvm-zorg.git # timeout=10
Fetching upstream changes from http://labmaster3.local/git/llvm-zorg.git
 > git --version # timeout=10
 > git fetch --tags --progress -- http://labmaster3.local/git/llvm-zorg.git +refs/heads/*:refs/remotes/origin/*
 > git rev-parse refs/remotes/origin/master^{commit} # timeout=10
 > git rev-parse refs/remotes/origin/origin/master^{commit} # timeout=10
 > git config core.sparsecheckout # timeout=10
 > git checkout -f bdb8efb160db242c1897a532e4a3e42fc0d968ea
 > git rev-list --no-walk bdb8efb160db242c1897a532e4a3e42fc0d968ea # timeout=10
[Pipeline] }
[Pipeline] // dir
[Pipeline] }
[Pipeline] // stage
[Pipeline] stage
[Pipeline] { (Fetch Host Compiler)
[Pipeline] timeout
Timeout set to expire in 10 min
[Pipeline] {
[Pipeline] sh
+ python llvm-zorg/zorg/jenkins/monorepo_build.py fetch
Fetching Compiler

Hide Details

@@@ Fetching Compiler @@@ GETting http://labmaster2.local/artifacts//clang-stage1-RA/latest to /Users/buildslave/jenkins/workspace/lldb-cmake-sanitized/host-compiler.tar.gz ... done. Decompressing... cd /Users/buildslave/jenkins/workspace/lldb-cmake-sanitized/host-compiler/ 'tar' 'zxf' '../host-compiler.tar.gz' Completed at: 2019-10-15T22:32:08 @@@@@@
[Pipeline] } [Pipeline] // timeout [Pipeline] } [Pipeline] // stage [Pipeline] stage [Pipeline] { (Build) [Pipeline] timeout Timeout set to expire in 1 hr 30 min [Pipeline] { [Pipeline] sh + set -u + rm -rf build.properties + cd llvm-project + git tag -a -m 'First Commit' first_commit 97724f18c79c7cc81ced24239eb5e883bf1398ef fatal: tag 'first_commit' already exists + true ++ git describe --match first_commit + git_desc=first_commit-329700-g4d1ecadda59 ++ echo first_commit-329700-g4d1ecadda59 ++ cut -f 2 -d - + export GIT_DISTANCE=329700 + GIT_DISTANCE=329700 ++ echo first_commit-329700-g4d1ecadda59 ++ cut -f 3 -d - + sha=g4d1ecadda59 + export GIT_SHA=4d1ecadda59 + GIT_SHA=4d1ecadda59 + cd - /Users/buildslave/jenkins/workspace/lldb-cmake-sanitized + export PATH=/usr/local/bin:/usr/local/sbin:/usr/bin:/bin:/usr/sbin:/sbin:/usr/bin:/usr/local/bin + PATH=/usr/local/bin:/usr/local/sbin:/usr/bin:/bin:/usr/sbin:/sbin:/usr/bin:/usr/local/bin + python llvm-zorg/zorg/jenkins/monorepo_build.py lldb-cmake-sanitized build --assertions '--projects=clang;libcxx;libcxxabi;lld;lldb' --cmake-type=Release
Clean

Hide Details

@@@ Clean @@@ Completed at: 2019-10-15T22:32:16 @@@@@@
Cmake

Hide Details

@@@ Cmake @@@ cd /Users/buildslave/jenkins/workspace/lldb-cmake-sanitized/lldb-build '/usr/local/bin/cmake' '-G' 'Ninja' '/Users/buildslave/jenkins/workspace/lldb-cmake-sanitized/llvm-project/llvm' '-DCMAKE_BUILD_TYPE=Release' '-DCMAKE_EXPORT_COMPILE_COMMANDS=ON' '-DCMAKE_INSTALL_PREFIX=/Users/buildslave/jenkins/workspace/lldb-cmake-sanitized/lldb-install' '-DCMAKE_MAKE_PROGRAM=/usr/local/bin/ninja' '-DLLDB_TEST_USER_ARGS=--arch;x86_64;--build-dir;/Users/buildslave/jenkins/workspace/lldb-cmake-sanitized/lldb-build/lldb-test-build.noindex;-s=/Users/buildslave/jenkins/workspace/lldb-cmake-sanitized/test/logs;-t;--env;TERM=vt100' '-DLLVM_ENABLE_ASSERTIONS:BOOL=TRUE' '-DLLVM_ENABLE_MODULES=On' '-DLLVM_ENABLE_PROJECTS=clang;libcxx;libcxxabi;lld;lldb' '-DLLVM_LIT_ARGS=-v --time-tests --shuffle --xunit-xml-output=/Users/buildslave/jenkins/workspace/lldb-cmake-sanitized/test/results.xml -v --timeout 1200' '-DLLVM_VERSION_PATCH=99' '-DLLVM_TARGETS_TO_BUILD=X86' '-DLLVM_USE_SANITIZER=Address;Undefined' '-DLLDB_TEST_C_COMPILER=/Users/buildslave/jenkins/workspace/lldb-cmake-sanitized/host-compiler/bin/clang' '-DLLDB_TEST_CXX_COMPILER=/Users/buildslave/jenkins/workspace/lldb-cmake-sanitized/host-compiler/bin/clang++' '-DCMAKE_C_COMPILER=/Users/buildslave/jenkins/workspace/lldb-cmake-sanitized/host-compiler/bin/clang' '-DCMAKE_CXX_COMPILER=/Users/buildslave/jenkins/workspace/lldb-cmake-sanitized/host-compiler/bin/clang++' -- clang project is enabled -- clang-tools-extra project is disabled -- compiler-rt project is disabled -- debuginfo-tests project is disabled -- libc project is disabled -- libclc project is disabled -- libcxx project is enabled -- libcxxabi project is enabled -- libunwind project is disabled -- lld project is enabled -- lldb project is enabled -- llgo project is disabled -- openmp project is disabled -- parallel-libs project is disabled -- polly project is disabled -- pstl project is disabled -- Could NOT find Z3: Found unsuitable version "0.0.0", but required is at least "4.7.1" (found Z3_LIBRARIES-NOTFOUND) -- Found libtool - /Applications/Xcode.app/Contents/Developer/Toolchains/XcodeDefault.xctoolchain/usr/bin/libtool -- Native target architecture is X86 -- Threads enabled. -- Doxygen disabled. -- Go bindings disabled. -- Ninja version: 1.8.2 -- Found ld64 - /Applications/Xcode.app/Contents/Developer/Toolchains/XcodeDefault.xctoolchain/usr/bin/ld -- Could NOT find OCaml (missing: OCAMLFIND OCAML_VERSION OCAML_STDLIB_PATH) -- Could NOT find OCaml (missing: OCAMLFIND OCAML_VERSION OCAML_STDLIB_PATH) -- OCaml bindings disabled. -- LLVM host triple: x86_64-apple-darwin18.0.0 -- LLVM default target triple: x86_64-apple-darwin18.0.0 -- Building with -fPIC -- Constructing LLVMBuild project information -- Linker detection: ld64 -- Targeting X86 -- Found compiler-rt directory: /Users/buildslave/jenkins/workspace/lldb-cmake-sanitized/host-compiler/lib/clang/10.0.0/lib/darwin -- Manually linking compiler-rt library: /Users/buildslave/jenkins/workspace/lldb-cmake-sanitized/host-compiler/lib/clang/10.0.0/lib/darwin/libclang_rt.asan_osx_dynamic.dylib -- Could not find ParallelSTL, libc++abi will not attempt to use it but the build may fail if the libc++ in use needs it to be available. -- Linker detection: ld64 CMake Warning at /Users/buildslave/jenkins/workspace/lldb-cmake-sanitized/llvm-project/libcxx/CMakeLists.txt:709 (message): Unsupported value of LLVM_USE_SANITIZER: Address;Undefined Call Stack (most recent call first): /Users/buildslave/jenkins/workspace/lldb-cmake-sanitized/llvm-project/libcxx/CMakeLists.txt:723 (get_sanitizer_flags)

Hide Details

Hide Details

-- Found compiler-rt directory: /Users/buildslave/jenkins/workspace/lldb-cmake-sanitized/host-compiler/lib/clang/10.0.0/lib/darwin -- Manually linking compiler-rt library: /Users/buildslave/jenkins/workspace/lldb-cmake-sanitized/host-compiler/lib/clang/10.0.0/lib/darwin/libclang_rt.asan_osx_dynamic.dylib -- Linker detection: ld64 -- Linker detection: ld64 -- Clang version: 10.0.99 -- LLD version: 10.0.99 -- LLDB version: 10.0.99svn -- Symbols (liblldb): exporting all symbols from the lldb namespace -- Could NOT find Doxygen (missing: DOXYGEN_EXECUTABLE) -- Could NOT find epydoc -- LLDB Tests use just-built debugserver: /Users/buildslave/jenkins/workspace/lldb-cmake-sanitized/lldb-build/./bin/debugserver -- LLVM FileCheck Found: /usr/local/bin/FileCheck -- Version: 0.0.0 -- Performing Test HAVE_THREAD_SAFETY_ATTRIBUTES -- failed to compile -- Performing Test HAVE_GNU_POSIX_REGEX -- failed to compile -- Performing Test HAVE_POSIX_REGEX -- success -- Performing Test HAVE_STEADY_CLOCK -- success -- Configuring done -- Generating done -- Build files have been written to: /Users/buildslave/jenkins/workspace/lldb-cmake-sanitized/lldb-build Completed at: 2019-10-15T22:32:29 @@@@@@
Build

Hide Details

@@@ Build @@@ cd /Users/buildslave/jenkins/workspace/lldb-cmake-sanitized/lldb-build '/usr/local/bin/ninja' '-v' [1/2] cd /Users/buildslave/jenkins/workspace/lldb-cmake-sanitized/lldb-build/tools/lldb && /usr/bin/python /Users/buildslave/jenkins/workspace/lldb-cmake-sanitized/llvm-project/lldb/scripts/finishSwigWrapperClasses.py --srcRoot=/Users/buildslave/jenkins/workspace/lldb-cmake-sanitized/llvm-project/lldb --targetDir=/Users/buildslave/jenkins/workspace/lldb-cmake-sanitized/lldb-build/./lib --cfgBldDir=/Users/buildslave/jenkins/workspace/lldb-cmake-sanitized/lldb-build/tools/lldb/scripts --prefix=/Users/buildslave/jenkins/workspace/lldb-cmake-sanitized/lldb-build --cmakeBuildConfiguration=. --lldbLibDir=lib --lldbPythonPath=/Users/buildslave/jenkins/workspace/lldb-cmake-sanitized/lldb-build/./lib/python2.7/site-packages/lldb -m [2/2] cd /Users/buildslave/jenkins/workspace/lldb-cmake-sanitized/lldb-build/lib/python2.7/site-packages/lldb && /usr/local/Cellar/cmake/3.12.3/bin/cmake -E create_symlink ../../../liblldb.dylib _lldb.so && cd /Users/buildslave/jenkins/workspace/lldb-cmake-sanitized/lldb-build/lib/python2.7/site-packages/lldb && /usr/local/Cellar/cmake/3.12.3/bin/cmake -E create_symlink ../../../../bin/lldb-argdumper lldb-argdumper Completed at: 2019-10-15T22:32:30 @@@@@@
[Pipeline] } [Pipeline] // timeout [Pipeline] } [Pipeline] // stage [Pipeline] stage [Pipeline] { (Test) [Pipeline] timeout Timeout set to expire in 2 hr 0 min [Pipeline] { [Pipeline] sh + set -u + export PATH=/usr/local/bin:/usr/local/sbin:/usr/bin:/bin:/usr/sbin:/sbin:/usr/bin:/usr/local/bin + PATH=/usr/local/bin:/usr/local/sbin:/usr/bin:/bin:/usr/sbin:/sbin:/usr/bin:/usr/local/bin + rm -rf test/results.xml ++ sysctl hw.physicalcpu ++ awk '{print $2}' + export MAX_PARALLEL_TESTS=8 + MAX_PARALLEL_TESTS=8 + python llvm-zorg/zorg/jenkins/monorepo_build.py lldb-cmake-sanitized test
Clean

Hide Details

@@@ Clean @@@ Completed at: 2019-10-15T22:32:33 @@@@@@
Run Tests

Hide Details

@@@ Run Tests @@@ cd /Users/buildslave/jenkins/workspace/lldb-cmake-sanitized/lldb-build '/usr/bin/env' 'TERM=vt100' '/usr/local/bin/ninja' '-v' 'check-lldb' [1/3] cd /Users/buildslave/jenkins/workspace/lldb-cmake-sanitized/lldb-build/tools/lldb && /usr/bin/python /Users/buildslave/jenkins/workspace/lldb-cmake-sanitized/llvm-project/lldb/scripts/finishSwigWrapperClasses.py --srcRoot=/Users/buildslave/jenkins/workspace/lldb-cmake-sanitized/llvm-project/lldb --targetDir=/Users/buildslave/jenkins/workspace/lldb-cmake-sanitized/lldb-build/./lib --cfgBldDir=/Users/buildslave/jenkins/workspace/lldb-cmake-sanitized/lldb-build/tools/lldb/scripts --prefix=/Users/buildslave/jenkins/workspace/lldb-cmake-sanitized/lldb-build --cmakeBuildConfiguration=. --lldbLibDir=lib --lldbPythonPath=/Users/buildslave/jenkins/workspace/lldb-cmake-sanitized/lldb-build/./lib/python2.7/site-packages/lldb -m [2/3] cd /Users/buildslave/jenkins/workspace/lldb-cmake-sanitized/lldb-build/lib/python2.7/site-packages/lldb && /usr/local/Cellar/cmake/3.12.3/bin/cmake -E create_symlink ../../../liblldb.dylib _lldb.so && cd /Users/buildslave/jenkins/workspace/lldb-cmake-sanitized/lldb-build/lib/python2.7/site-packages/lldb && /usr/local/Cellar/cmake/3.12.3/bin/cmake -E create_symlink ../../../../bin/lldb-argdumper lldb-argdumper [2/3] cd /Users/buildslave/jenkins/workspace/lldb-cmake-sanitized/lldb-build/tools/lldb/test && /usr/bin/python /Users/buildslave/jenkins/workspace/lldb-cmake-sanitized/lldb-build/./bin/llvm-lit -v --time-tests --shuffle --xunit-xml-output=/Users/buildslave/jenkins/workspace/lldb-cmake-sanitized/test/results.xml -v --timeout 1200 /Users/buildslave/jenkins/workspace/lldb-cmake-sanitized/lldb-build/tools/lldb/test llvm-lit: /Users/buildslave/jenkins/workspace/lldb-cmake-sanitized/llvm-project/lldb/test/Shell/helper/toolchain.py:97: note: using SDKROOT: '/Applications/Xcode.app/Contents/Developer/Platforms/MacOSX.platform/Developer/SDKs/MacOSX.sdk' llvm-lit: /Users/buildslave/jenkins/workspace/lldb-cmake-sanitized/llvm-project/llvm/utils/lit/lit/llvm/config.py:340: note: using clang: /Users/buildslave/jenkins/workspace/lldb-cmake-sanitized/lldb-build/bin/clang llvm-lit: /Users/buildslave/jenkins/workspace/lldb-cmake-sanitized/llvm-project/llvm/utils/lit/lit/llvm/config.py:340: note: using ld.lld: /Users/buildslave/jenkins/workspace/lldb-cmake-sanitized/lldb-build/bin/ld.lld llvm-lit: /Users/buildslave/jenkins/workspace/lldb-cmake-sanitized/llvm-project/llvm/utils/lit/lit/llvm/config.py:340: note: using lld-link: /Users/buildslave/jenkins/workspace/lldb-cmake-sanitized/lldb-build/bin/lld-link llvm-lit: /Users/buildslave/jenkins/workspace/lldb-cmake-sanitized/llvm-project/llvm/utils/lit/lit/llvm/config.py:340: note: using ld64.lld: /Users/buildslave/jenkins/workspace/lldb-cmake-sanitized/lldb-build/bin/ld64.lld llvm-lit: /Users/buildslave/jenkins/workspace/lldb-cmake-sanitized/llvm-project/llvm/utils/lit/lit/llvm/config.py:340: note: using wasm-ld: /Users/buildslave/jenkins/workspace/lldb-cmake-sanitized/lldb-build/bin/wasm-ld llvm-lit: /Users/buildslave/jenkins/workspace/lldb-cmake-sanitized/llvm-project/llvm/utils/lit/lit/main.py:103: note: The test suite configuration requested an individual test timeout of 600 seconds but a timeout of 1200 seconds was requested on the command line. Forcing timeout to be 1200 seconds Deleting module cache at /Users/buildslave/jenkins/workspace/lldb-cmake-sanitized/lldb-build/tools/lldb/lldb-test-build.noindex/module-cache-clang/lldb-api. Deleting module cache at /Users/buildslave/jenkins/workspace/lldb-cmake-sanitized/lldb-build/tools/lldb/lldb-test-build.noindex/module-cache-lldb/lldb-api. -- Testing: 1781 tests, 16 workers -- UNSUPPORTED: lldb-shell :: SymbolFile/PDB/class-layout.test (1 of 1781) PASS: lldb-unit :: Utility/./UtilityTests/StringListTest.JoinThree (2 of 1781) PASS: lldb-unit :: Utility/./UtilityTests/StringLexerTest.GetUnlexed (3 of 1781) PASS: lldb-unit :: Utility/./UtilityTests/ScalarTest.GetBytes (4 of 1781) PASS: lldb-unit :: Utility/./UtilityTests/RegisterValueTest.GetSet8 (5 of 1781) PASS: lldb-unit :: Process/minidump/./LLDBMinidumpTests/RegisterContextMinidump.CheckRegisterContextMinidump_ARM (6 of 1781) PASS: lldb-unit :: UnwindAssembly/x86/./UnwindAssemblyx86Tests/Testx86AssemblyInspectionEngine.TestCALLNextInsn (7 of 1781) PASS: lldb-unit :: Utility/./UtilityTests/RegularExpression.Match (8 of 1781) PASS: lldb-unit :: Utility/./UtilityTests/StreamTest.PutBytesAsRawHex8ToMixedEndian (9 of 1781) PASS: lldb-shell :: Breakpoint/split-dwarf-5-addrbase.test (10 of 1781) PASS: lldb-shell :: SymbolFile/NativePDB/ast-types.cpp (11 of 1781) UNSUPPORTED: lldb-api :: functionalities/darwin_log/format/TestDarwinLogMessageFormat.py (12 of 1781) PASS: lldb-unit :: Utility/./UtilityTests/AnsiTerminal.AtStart (13 of 1781) UNSUPPORTED: lldb-api :: benchmarks/libcxxlist/TestBenchmarkLibcxxList.py (14 of 1781) PASS: lldb-unit :: Utility/./UtilityTests/ArgsTest.ReplaceArgumentAtIndexLonger (15 of 1781) PASS: lldb-shell :: SymbolFile/NativePDB/ast-functions.cpp (16 of 1781) PASS: lldb-api :: functionalities/abbreviation/TestCommonShortSpellings.py (17 of 1781) PASS: lldb-shell :: Commands/CommandScriptImmediateOutput/CommandScriptImmediateOutputFile.test (18 of 1781) PASS: lldb-api :: functionalities/multidebugger_commands/TestMultipleDebuggersCommands.py (19 of 1781) PASS: lldb-shell :: BuildScript/toolchain-clang.test (20 of 1781) PASS: lldb-shell :: Minidump/Windows/find-module.test (21 of 1781) PASS: lldb-api :: tools/lldb-server/TestGdbRemoteSingleStep.py (22 of 1781) PASS: lldb-unit :: SymbolFile/NativePDB/./SymbolFileNativePDBTests/PDBFPOProgramToDWARFExpressionTests.UnsupportedRASearch (23 of 1781) PASS: lldb-unit :: Language/Highlighting/./HighlighterTests/HighlighterTest.Keywords (24 of 1781) PASS: lldb-unit :: Process/gdb-remote/./ProcessGdbRemoteTests/GDBRemoteClientBaseTest.SendPacketAndReceiveResponseWithOutputSupport (25 of 1781) UNSUPPORTED: lldb-api :: functionalities/darwin_log/filter/exact_match/activity-chain/TestDarwinLogFilterMatchActivityChain.py (26 of 1781) PASS: lldb-unit :: Expression/./ExpressionTests/DiagnosticManagerTest.PutString (27 of 1781) PASS: lldb-unit :: Host/./HostTests/FileActionTest.Open (28 of 1781) PASS: lldb-api :: lang/cpp/type_lookup/TestCppTypeLookup.py (29 of 1781) PASS: lldb-api :: functionalities/data-formatter/type_summary_list_script/TestTypeSummaryListScript.py (30 of 1781) PASS: lldb-api :: functionalities/inferior-changed/TestInferiorChanged.py (31 of 1781) PASS: lldb-unit :: Utility/./UtilityTests/StreamTest.PutHex64ByteOrderLittle (32 of 1781) PASS: lldb-api :: functionalities/gdb_remote_client/TestGDBRemoteLoad.py (33 of 1781) PASS: lldb-api :: functionalities/thread/num_threads/TestNumThreads.py (34 of 1781) PASS: lldb-api :: commands/expression/rdar42038760/TestScalarURem.py (35 of 1781) PASS: lldb-unit :: Utility/./UtilityTests/StringExtractorTest.InitMisc (36 of 1781) PASS: lldb-api :: functionalities/data-formatter/data-formatter-synthval/TestDataFormatterSynthVal.py (37 of 1781) PASS: lldb-unit :: Utility/./UtilityTests/BinaryStreamTest.PutULEB128NineBytes (38 of 1781) PASS: lldb-api :: commands/process/launch/TestProcessLaunch.py (39 of 1781) PASS: lldb-api :: macosx/function-starts/TestFunctionStarts.py (40 of 1781) PASS: lldb-unit :: Core/./LLDBCoreTests/RichManglingContextTest.IPDRealloc (41 of 1781) PASS: lldb-unit :: Utility/./UtilityTests/StreamTeeTest.CopyConstructor (42 of 1781) PASS: lldb-unit :: Symbol/./SymbolTests/PostfixExpression.ParseOneExpression (43 of 1781) PASS: lldb-api :: functionalities/tail_call_frames/thread_step_out_or_return/TestSteppingOutWithArtificialFrames.py (44 of 1781) PASS: lldb-api :: functionalities/postmortem/minidump-new/TestMiniDumpNew.py (45 of 1781) UNSUPPORTED: lldb-api :: linux/add-symbols/TestTargetSymbolsAddCommand.py (46 of 1781) PASS: lldb-api :: linux/builtin_trap/TestBuiltinTrap.py (47 of 1781) UNSUPPORTED: lldb-shell :: ObjectFile/ELF/minidebuginfo-no-lzma.yaml (48 of 1781) PASS: lldb-unit :: UnwindAssembly/x86/./UnwindAssemblyx86Tests/Testx86AssemblyInspectionEngine.Test64bitFramelessBigStackFrame (49 of 1781) PASS: lldb-api :: functionalities/data-formatter/data-formatter-stl/libcxx/bitset/TestDataFormatterLibcxxBitset.py (50 of 1781) PASS: lldb-api :: functionalities/tsan/thread_leak/TestTsanThreadLeak.py (51 of 1781) PASS: lldb-shell :: SymbolFile/DWARF/debug_ranges.s (52 of 1781) UNSUPPORTED: lldb-shell :: BuildScript/toolchain-msvc.test (53 of 1781) PASS: lldb-unit :: Utility/./UtilityTests/AnsiTerminal.Twice (54 of 1781) PASS: lldb-shell :: SymbolFile/Breakpad/unwind-via-raSearch.test (55 of 1781) PASS: lldb-unit :: Utility/./UtilityTests/UriParserTest.LongPath (56 of 1781) PASS: lldb-api :: macosx/version_zero/TestGetVersionZeroVersion.py (57 of 1781) PASS: lldb-api :: lang/c/offsetof/TestOffsetof.py (58 of 1781) PASS: lldb-unit :: Utility/./UtilityTests/OptionsWithRawTest.TerminatedQuote (59 of 1781) PASS: lldb-api :: functionalities/data-formatter/data-formatter-objc/TestDataFormatterObjCCF.py (60 of 1781) PASS: lldb-api :: functionalities/data-formatter/varscript_formatting/TestDataFormatterVarScriptFormatting.py (61 of 1781) PASS: lldb-api :: commands/reproducer/invalid-args/TestInvalidArgsReproducer.py (62 of 1781) PASS: lldb-shell :: ObjectFile/PECOFF/uuid.yaml (63 of 1781) PASS: lldb-unit :: Language/Highlighting/./HighlighterTests/HighlighterTest.HighlighterSelectionPath (64 of 1781) PASS: lldb-unit :: Utility/./UtilityTests/LogTest.Unregister (65 of 1781) PASS: lldb-api :: functionalities/modern-type-lookup/basic/TestBasicModernTypeLookup.py (66 of 1781) PASS: lldb-unit :: Utility/./UtilityTests/FileSpecTest.FileAndDirectoryComponents (67 of 1781) PASS: lldb-unit :: ScriptInterpreter/Python/./ScriptInterpreterPythonTests/PythonDataObjectsTest.TestGlobalNameResolutionNoDot (68 of 1781) UNSUPPORTED: lldb-shell :: SymbolFile/PDB/ast-restore.test (69 of 1781) PASS: lldb-api :: source-manager/TestSourceManager.py (70 of 1781) PASS: lldb-unit :: ObjectFile/PECOFF/./ObjectFilePECOFFTests/PECallFrameInfoTest.Chained_eh (71 of 1781) PASS: lldb-unit :: Process/minidump/./LLDBMinidumpTests/RegisterContextMinidump.ConvertMinidumpContext_x86_32 (72 of 1781) PASS: lldb-shell :: ObjectFile/ELF/gnu-debuglink.yaml (73 of 1781) PASS: lldb-api :: lang/cpp/llvm-style/TestLLVMStyle.py (74 of 1781) PASS: lldb-unit :: Utility/./UtilityTests/StreamTeeTest.AppendStream (75 of 1781) PASS: lldb-api :: commands/expression/cast_int_to_anonymous_enum/TestCastIntToAnonymousEnum.py (76 of 1781) PASS: lldb-unit :: Process/gdb-remote/./ProcessGdbRemoteTests/GDBRemoteClientBaseTest.SendContinueAndInterrupt (77 of 1781) PASS: lldb-unit :: Platform/./LLDBPlatformTests/PlatformDarwinTest.TestParseVersionBuildDir (78 of 1781) UNSUPPORTED: lldb-api :: functionalities/data-formatter/data-formatter-stl/libstdcpp/vector/TestDataFormatterStdVector.py (79 of 1781) PASS: lldb-unit :: Utility/./UtilityTests/BinaryStreamTest.PutULEB128One (80 of 1781) PASS: lldb-api :: functionalities/non-overlapping-index-variable-i/TestIndexVariable.py (81 of 1781) PASS: lldb-api :: macosx/safe-to-func-call/TestSafeFuncCalls.py (82 of 1781) PASS: lldb-api :: functionalities/breakpoint/breakpoint_by_line_and_column/TestBreakpointByLineAndColumn.py (83 of 1781) PASS: lldb-unit :: Utility/./UtilityTests/UserIDResolver.GetUserName (84 of 1781) PASS: lldb-unit :: Process/minidump/./LLDBMinidumpTests/MinidumpParserTest.GetPid (85 of 1781) PASS: lldb-api :: commands/expression/pr35310/TestExprsBug35310.py (86 of 1781) PASS: lldb-unit :: ScriptInterpreter/Python/./ScriptInterpreterPythonTests/PythonDataObjectsTest.TestPythonListToStructuredList (87 of 1781) PASS: lldb-unit :: Utility/./UtilityTests/DataExtractorTest.GetCStrAtEnd (88 of 1781) PASS: lldb-api :: lang/c/local_variables/TestLocalVariables.py (89 of 1781) PASS: lldb-api :: lang/c/find_struct_type/TestFindStructTypes.py (90 of 1781) PASS: lldb-unit :: ScriptInterpreter/Python/./ScriptInterpreterPythonTests/PythonExceptionStateTest.TestManualRestoreSemantics (91 of 1781) PASS: lldb-api :: commands/frame/recognizer/TestFrameRecognizer.py (92 of 1781) PASS: lldb-unit :: UnwindAssembly/x86/./UnwindAssemblyx86Tests/Testx86AssemblyInspectionEngine.TestSimplex86_64Augmented (93 of 1781) PASS: lldb-unit :: Utility/./UtilityTests/RangeTest.DoesAdjoinOrIntersect (94 of 1781) PASS: lldb-api :: commands/expression/function_template_specialization_temp_args/TestFunctionTemplateSpecializationTempArgs.py (95 of 1781) PASS: lldb-api :: python_api/process/TestProcessAPI.py (96 of 1781) PASS: lldb-unit :: ScriptInterpreter/Python/./ScriptInterpreterPythonTests/PythonDataObjectsTest.TestPythonDictionaryManipulation (97 of 1781) PASS: lldb-unit :: Utility/./UtilityTests/RangeDataVector.FindEntryThatContains (98 of 1781) PASS: lldb-shell :: Reproducer/TestGDBRemoteRepro.test (99 of 1781) PASS: lldb-api :: commands/expression/import-std-module/forward_list-basic/TestBasicForwardList.py (100 of 1781) PASS: lldb-unit :: ObjectFile/Breakpad/./ObjectFileBreakpadTests/LineRecord.parse (101 of 1781) PASS: lldb-api :: commands/expression/import-std-module/list-basic/TestBasicList.py (102 of 1781) PASS: lldb-unit :: SymbolFile/NativePDB/./SymbolFileNativePDBTests/PDBFPOProgramToDWARFExpressionTests.MultipleDependentAssignments (103 of 1781) UNSUPPORTED: lldb-api :: commands/expression/completion-crash-incomplete-record/TestCompletionCrashIncompleteRecord.py (104 of 1781) PASS: lldb-unit :: Utility/./UtilityTests/ArgsTest.GetQuotedCommandString (105 of 1781) PASS: lldb-api :: functionalities/data-formatter/data-formatter-smart-array/TestDataFormatterSmartArray.py (106 of 1781) PASS: lldb-api :: commands/expression/import-std-module/vector-of-vectors/TestVectorOfVectors.py (107 of 1781) UNSUPPORTED: lldb-api :: tools/lldb-server/platform-process-connect/TestPlatformProcessConnect.py (108 of 1781) PASS: lldb-unit :: Host/./HostTests/NativeProcessProtocolTest.SetBreakpoint (109 of 1781) PASS: lldb-api :: functionalities/thread/concurrent_events/TestConcurrentCrashWithSignal.py (110 of 1781) PASS: lldb-unit :: Utility/./UtilityTests/CompletionRequest.Constructor (111 of 1781) PASS: lldb-api :: functionalities/thread/concurrent_events/TestConcurrentManyBreakpoints.py (112 of 1781) PASS: lldb-api :: functionalities/signal/handle-abrt/TestHandleAbort.py (113 of 1781) PASS: lldb-unit :: Language/Highlighting/./HighlighterTests/HighlighterTest.ClangCommas (114 of 1781) PASS: lldb-api :: lang/objc/objc-class-method/TestObjCClassMethod.py (115 of 1781) PASS: lldb-api :: api/listeners/TestListener.py (116 of 1781) PASS: lldb-unit :: Utility/./UtilityTests/VMRange.CollectionContains (117 of 1781) PASS: lldb-unit :: UnwindAssembly/x86/./UnwindAssemblyx86Tests/Testx86AssemblyInspectionEngine.TestDisassemblyJunkBytes (118 of 1781) PASS: lldb-shell :: ObjectFile/MachO/subsections.yaml (119 of 1781) PASS: lldb-unit :: Utility/./UtilityTests/RangeTest.DoesIntersect (120 of 1781) PASS: lldb-unit :: Utility/./UtilityTests/StreamTest.PutHex16ByteOrderLittle (121 of 1781) PASS: lldb-unit :: Core/./LLDBCoreTests/MangledTest.NameIndexes_FindFunctionSymbols (122 of 1781) PASS: lldb-api :: lang/objc/objc-super/TestObjCSuper.py (123 of 1781) PASS: lldb-unit :: UnwindAssembly/x86/./UnwindAssemblyx86Tests/Testx86AssemblyInspectionEngine.TestPopESI (124 of 1781) PASS: lldb-unit :: ScriptInterpreter/Python/./ScriptInterpreterPythonTests/PythonDataObjectsTest.TestPythonBytes (125 of 1781) PASS: lldb-api :: functionalities/thread/concurrent_events/TestConcurrentTwoBreakpointsOneWatchpoint.py (126 of 1781) PASS: lldb-api :: python_api/signals/TestSignalsAPI.py (127 of 1781) PASS: lldb-unit :: Language/Highlighting/./HighlighterTests/HighlighterTest.ClangCursorPos (128 of 1781) PASS: lldb-unit :: Utility/./UtilityTests/UriParserTest.SchemeHostSeparator3 (129 of 1781) PASS: lldb-shell :: Reproducer/Modules/TestModuleCXX.test (130 of 1781) UNSUPPORTED: lldb-shell :: SymbolFile/DWARF/debug-types-expressions.test (131 of 1781) UNSUPPORTED: lldb-api :: commands/watchpoints/multi_watchpoint_slots/TestWatchpointMultipleSlots.py (132 of 1781) PASS: lldb-api :: lang/objc/print-obj/TestPrintObj.py (133 of 1781) PASS: lldb-api :: lang/objc/foundation/TestObjectDescriptionAPI.py (134 of 1781) UNSUPPORTED: lldb-shell :: Register/x86-64-zmm-write.test (135 of 1781) PASS: lldb-unit :: Utility/./UtilityTests/UserIDResolver.GetGroupName (136 of 1781) PASS: lldb-api :: lang/objcxx/hide-runtime-values/TestObjCXXHideRuntimeValues.py (137 of 1781) PASS: lldb-unit :: Utility/./UtilityTests/StringExtractorTest.GetHexBytesAvail_OddPair (138 of 1781) PASS: lldb-api :: functionalities/thread/concurrent_events/TestConcurrentDelayedCrashWithBreakpointWatchpoint.py (139 of 1781) PASS: lldb-api :: commands/expression/xvalue/TestXValuePrinting.py (140 of 1781) PASS: lldb-shell :: SymbolFile/Breakpad/unwind-via-stack-win.test (141 of 1781) PASS: lldb-api :: commands/expression/calculator_mode/TestCalculatorMode.py (142 of 1781) PASS: lldb-unit :: Host/./HostTests/SocketTest.DomainGetConnectURI (143 of 1781) PASS: lldb-unit :: Utility/./UtilityTests/ArgsTest.TestSingleArg (144 of 1781) UNSUPPORTED: lldb-api :: functionalities/thread/multi_break/TestMultipleBreakpoints.py (145 of 1781) PASS: lldb-api :: types/TestDoubleTypes.py (146 of 1781) PASS: lldb-api :: lang/objc/objc-property/TestObjCProperty.py (147 of 1781) PASS: lldb-api :: functionalities/gdb_remote_client/TestRestartBug.py (148 of 1781) UNSUPPORTED: lldb-api :: tools/lldb-server/TestGdbRemoteModuleInfo.py (149 of 1781) PASS: lldb-api :: functionalities/data-formatter/data-formatter-stl/libcxx/initializerlist/TestInitializerList.py (150 of 1781) PASS: lldb-unit :: Utility/./UtilityTests/DataExtractorTest.GetCStr (151 of 1781) PASS: lldb-unit :: Process/gdb-remote/./ProcessGdbRemoteTests/GDBRemoteCommunicationServerTest.SendErrorResponse_ErrorNumber (152 of 1781) PASS: lldb-unit :: Process/minidump/./LLDBMinidumpTests/MinidumpParserTest.GetMemoryRegionInfo (153 of 1781) PASS: lldb-api :: lang/objc/global_ptrs/TestGlobalObjects.py (154 of 1781) PASS: lldb-api :: commands/expression/ir-interpreter/TestIRInterpreter.py (155 of 1781) PASS: lldb-unit :: ScriptInterpreter/Python/./ScriptInterpreterPythonTests/PythonDataObjectsTest.TestPythonBoolean (156 of 1781) PASS: lldb-api :: commands/expression/save_jit_objects/TestSaveJITObjects.py (157 of 1781) PASS: lldb-api :: python_api/symbol-context/TestSymbolContext.py (158 of 1781) PASS: lldb-api :: functionalities/jitloader_gdb/TestJITLoaderGDB.py (159 of 1781) PASS: lldb-shell :: Host/TestCustomShell.test (160 of 1781) PASS: lldb-shell :: Reproducer/TestDriverOptions.test (161 of 1781) PASS: lldb-unit :: Utility/./UtilityTests/RecordReplayTest.InstrumentedBar (162 of 1781) PASS: lldb-shell :: Reproducer/TestDump.test (163 of 1781) PASS: lldb-api :: commands/expression/dont_allow_jit/TestAllowJIT.py (164 of 1781) PASS: lldb-api :: lang/cpp/scope/TestCppScope.py (165 of 1781) PASS: lldb-api :: lang/objc/variadic_methods/TestVariadicMethods.py (166 of 1781) PASS: lldb-shell :: BuildScript/script-args.test (167 of 1781) PASS: lldb-api :: functionalities/data-formatter/summary-string-onfail/Test-rdar-9974002.py (168 of 1781) UNSUPPORTED: lldb-api :: functionalities/data-formatter/data-formatter-stl/libstdcpp/tuple/TestDataFormatterStdTuple.py (169 of 1781) PASS: lldb-shell :: Breakpoint/split-dwarf5-debug-stroffsets.test (170 of 1781) PASS: lldb-unit :: Utility/./UtilityTests/BinaryStreamTest.PutSLEB128NineBytes (171 of 1781) PASS: lldb-unit :: Utility/./UtilityTests/LogTest.LLDB_LOG_nullptr (172 of 1781) PASS: lldb-api :: lang/cpp/breakpoint-commands/TestCPPBreakpointCommands.py (173 of 1781) PASS: lldb-api :: lang/cpp/auto/TestCPPAuto.py (174 of 1781) PASS: lldb-api :: commands/platform/basic/TestPlatformCommand.py (175 of 1781) PASS: lldb-shell :: Settings/TestFrameFormatNoColor.test (176 of 1781) PASS: lldb-api :: commands/frame/diagnose/dereference-this/TestDiagnoseDereferenceThis.py (177 of 1781) PASS: lldb-api :: commands/expression/import-std-module/unique_ptr/TestUniquePtr.py (178 of 1781) PASS: lldb-api :: functionalities/process_group/TestChangeProcessGroup.py (179 of 1781) PASS: lldb-api :: functionalities/target-new-solib-notifications/TestModuleLoadedNotifys.py (180 of 1781) PASS: lldb-api :: lang/c/shared_lib/TestSharedLib.py (181 of 1781) PASS: lldb-shell :: Breakpoint/implicit_const_form_support.test (182 of 1781) PASS: lldb-unit :: Utility/./UtilityTests/RangeTest.LessThanInvalid (183 of 1781) PASS: lldb-unit :: Utility/./UtilityTests/RangeTest.NotEqual (184 of 1781) PASS: lldb-api :: functionalities/thread/create_after_attach/TestCreateAfterAttach.py (185 of 1781) PASS: lldb-api :: commands/expression/import-std-module/conflicts/TestStdModuleWithConflicts.py (186 of 1781) PASS: lldb-unit :: Utility/./UtilityTests/FileSpecTest.EqualDotsPosix (187 of 1781) PASS: lldb-unit :: Utility/./UtilityTests/BinaryStreamTest.PutSLEB128Zero (188 of 1781) PASS: lldb-unit :: Utility/./UtilityTests/StringExtractorTest.GetHexBytes_Underflow (189 of 1781) PASS: lldb-api :: tools/lldb-server/register-reading/TestGdbRemoteGPacket.py (190 of 1781) PASS: lldb-api :: commands/expression/persistent_types/TestPersistentTypes.py (191 of 1781) PASS: lldb-api :: functionalities/thread/concurrent_events/TestConcurrentSignalWatchBreak.py (192 of 1781) PASS: lldb-unit :: Utility/./UtilityTests/GeneratorTest.Get (193 of 1781) PASS: lldb-api :: lang/cpp/dynamic-value-same-basename/TestDynamicValueSameBase.py (194 of 1781) PASS: lldb-api :: functionalities/data-formatter/data-formatter-stl/libcxx/forward_list/TestDataFormatterLibcxxForwardList.py (195 of 1781) PASS: lldb-unit :: Expression/./ExpressionTests/CppModuleConfigurationTest.LibCppV2 (196 of 1781) PASS: lldb-api :: functionalities/inline-stepping/TestInlineStepping.py (197 of 1781) PASS: lldb-api :: functionalities/data-formatter/data-formatter-stl/libcxx/atomic/TestLibCxxAtomic.py (198 of 1781) PASS: lldb-api :: functionalities/breakpoint/move_nearest/TestMoveNearest.py (199 of 1781) PASS: lldb-api :: functionalities/archives/TestBSDArchives.py (200 of 1781) PASS: lldb-api :: lang/objc/real-definition/TestRealDefinition.py (201 of 1781) PASS: lldb-unit :: UnwindAssembly/x86/./UnwindAssemblyx86Tests/Testx86AssemblyInspectionEngine.TestSpillRegToStackViaMOVx86_64 (202 of 1781) PASS: lldb-unit :: UnwindAssembly/x86/./UnwindAssemblyx86Tests/Testx86AssemblyInspectionEngine.TestPushEDX (203 of 1781) PASS: lldb-unit :: Expression/./ExpressionTests/DiagnosticManagerTest.GetStringNoDiags (204 of 1781) UNSUPPORTED: lldb-api :: tools/lldb-vscode/breakpoint/TestVSCode_setExceptionBreakpoints.py (205 of 1781) PASS: lldb-api :: functionalities/thread/jump/TestThreadJump.py (206 of 1781) PASS: lldb-unit :: Utility/./UtilityTests/ArchSpecTest.MergeFrom (207 of 1781) PASS: lldb-unit :: Utility/./UtilityTests/StreamTest.ShiftOperatorStrings (208 of 1781) PASS: lldb-api :: functionalities/gdb_remote_client/TestNoWatchpointSupportInfo.py (209 of 1781) PASS: lldb-unit :: Utility/./UtilityTests/RangeTest.ContainsAddrInvalid (210 of 1781) PASS: lldb-unit :: UnwindAssembly/x86/./UnwindAssemblyx86Tests/Testx86AssemblyInspectionEngine.TestSubESP (211 of 1781) XFAIL: lldb-shell :: Register/x86-64-ymm-write.test (212 of 1781) PASS: lldb-unit :: Utility/./UtilityTests/StreamTest.ShiftOperatorPtr (213 of 1781) PASS: lldb-unit :: Process/gdb-remote/./ProcessGdbRemoteTests/GDBRemoteCommunicationClientTest.WriteRegister (214 of 1781) PASS: lldb-api :: functionalities/data-formatter/data-formatter-stl/libcxx/tuple/TestDataFormatterLibcxxTuple.py (215 of 1781) PASS: lldb-unit :: Utility/./UtilityTests/Flags.IsClear (216 of 1781) PASS: lldb-unit :: Utility/./UtilityTests/StringExtractorTest.InitEmpty (217 of 1781) PASS: lldb-api :: functionalities/data-formatter/data-formatter-stl/libcxx/multimap/TestDataFormatterLibccMultiMap.py (218 of 1781) PASS: lldb-api :: lang/cpp/namespace/TestNamespace.py (219 of 1781) PASS: lldb-unit :: Utility/./UtilityTests/DataExtractorTest.GetMaxS64 (220 of 1781) PASS: lldb-unit :: Utility/./UtilityTests/CompletionRequest.DuplicateFiltering (221 of 1781) PASS: lldb-unit :: Utility/./UtilityTests/BinaryStreamTest.PutSLEB128ThreeBytes (222 of 1781) PASS: lldb-api :: functionalities/thread/concurrent_events/TestConcurrentTwoWatchpointsOneSignal.py (223 of 1781) PASS: lldb-api :: lang/cpp/const_this/TestConstThis.py (224 of 1781) PASS: lldb-api :: python_api/frame/get-variables/TestGetVariables.py (225 of 1781) PASS: lldb-api :: commands/target/basic/TestTargetCommand.py (226 of 1781) PASS: lldb-api :: python_api/lldbutil/process/TestPrintStackTraces.py (227 of 1781) PASS: lldb-api :: lang/objc/conflicting-definition/TestConflictingDefinition.py (228 of 1781) PASS: lldb-unit :: Host/./HostTests/File.GetWaitableHandleFileno (229 of 1781) PASS: lldb-unit :: Utility/./UtilityTests/AnsiTerminal.Basic (230 of 1781) PASS: lldb-shell :: SymbolFile/NativePDB/nested-types.cpp (231 of 1781) PASS: lldb-unit :: debugserver/./debugserverTests/RNBSocket.LoopBackConnectIPv6 (232 of 1781) PASS: lldb-shell :: ObjectFile/PECOFF/basic-info-arm.yaml (233 of 1781) UNSUPPORTED: lldb-api :: api/multiple-debuggers/TestMultipleDebuggers.py (234 of 1781) PASS: lldb-unit :: Utility/./UtilityTests/ArchSpecTest.TestSetTriple (235 of 1781) PASS: lldb-unit :: Utility/./UtilityTests/NameMatchesTest.StartsWith (236 of 1781) PASS: lldb-unit :: Utility/./UtilityTests/StreamTest.PutBytesAsRawHex8ToBigEndian (237 of 1781) UNSUPPORTED: lldb-api :: commands/expression/call-restarts/TestCallThatRestarts.py (238 of 1781) PASS: lldb-api :: functionalities/data-formatter/data-formatter-objc/TestDataFormatterObjCExpr.py (239 of 1781) PASS: lldb-api :: lang/objc/modules/TestObjCModules.py (240 of 1781) PASS: lldb-unit :: Language/CPlusPlus/./LanguageCPlusPlusTests/CPlusPlusLanguage.ExtractContextAndIdentifier (241 of 1781) UNSUPPORTED: lldb-shell :: Breakpoint/case-insensitive.test (242 of 1781) PASS: lldb-unit :: Utility/./UtilityTests/ScalarTest.Equality (243 of 1781) PASS: lldb-unit :: Language/Highlighting/./HighlighterTests/HighlighterTest.HighlighterSelectionType (244 of 1781) PASS: lldb-api :: commands/expression/import-std-module/vector-basic/TestBasicVector.py (245 of 1781) PASS: lldb-api :: tools/lldb-server/TestGdbRemoteHostInfo.py (246 of 1781) PASS: lldb-shell :: Minidump/Windows/Sigsegv/sigsegv.test (247 of 1781) UNSUPPORTED: lldb-api :: benchmarks/startup/TestStartupDelays.py (248 of 1781) PASS: lldb-unit :: Utility/./UtilityTests/VASprintfTest.NoBufferResize (249 of 1781) PASS: lldb-shell :: SymbolFile/DWARF/dwarf5-index-is-used.cpp (250 of 1781) PASS: lldb-shell :: ObjectFile/ELF/PT_LOAD-empty.yaml (251 of 1781) PASS: lldb-unit :: Utility/./UtilityTests/VMRange.Ordering (252 of 1781) PASS: lldb-api :: python_api/sbvalue_const_addrof/TestSBValueConstAddrOf.py (253 of 1781) PASS: lldb-shell :: ObjectFile/ELF/compressed-sections.yaml (254 of 1781) PASS: lldb-shell :: Reproducer/Functionalities/TestDataFormatter.test (255 of 1781) PASS: lldb-api :: python_api/sbvalue_persist/TestSBValuePersist.py (256 of 1781) PASS: lldb-unit :: Utility/./UtilityTests/AnsiTerminal.Incomplete (257 of 1781) UNSUPPORTED: lldb-api :: lang/cpp/printf/TestPrintf.py (258 of 1781) PASS: lldb-api :: commands/help/TestHelp.py (259 of 1781) PASS: lldb-unit :: Host/./HostTests/FileSystemTest.OpenErrno (260 of 1781) PASS: lldb-unit :: Utility/./UtilityTests/StringExtractorTest.GetHexU8_Underflow2 (261 of 1781) PASS: lldb-unit :: Utility/./UtilityTests/UriParserTest.Empty (262 of 1781) PASS: lldb-unit :: Utility/./UtilityTests/StringExtractorTest.GetHexU8_Exact (263 of 1781) PASS: lldb-unit :: Target/./TargetTests/ModuleCacheTest.GetAndPutUuidExists (264 of 1781) PASS: lldb-api :: commands/expression/import-std-module/list-dbg-info-content/TestDbgInfoContentList.py (265 of 1781) PASS: lldb-shell :: Quit/TestQuitExitCode-30.test (266 of 1781) PASS: lldb-unit :: Expression/./ExpressionTests/CppModuleConfigurationTest.LinuxLocalLibCpp (267 of 1781) PASS: lldb-unit :: Utility/./UtilityTests/SerializationRountripTest.SerializeDeserializePodReferences (268 of 1781) PASS: lldb-unit :: Utility/./UtilityTests/NameMatchesTest.EndsWith (269 of 1781) PASS: lldb-api :: functionalities/inferior-crashing/recursive-inferior/TestRecursiveInferior.py (270 of 1781) PASS: lldb-api :: functionalities/tail_call_frames/unambiguous_sequence/TestUnambiguousTailCalls.py (271 of 1781) PASS: lldb-shell :: Breakpoint/debug_addrx.test (272 of 1781) PASS: lldb-unit :: SymbolFile/NativePDB/./SymbolFileNativePDBTests/PDBFPOProgramToDWARFExpressionTests.DependencyChain (273 of 1781) PASS: lldb-unit :: Host/./HostTests/NativeProcessProtocolTest.ReadCStringFromMemory_MaxSize (274 of 1781) PASS: lldb-unit :: Language/Highlighting/./HighlighterTests/HighlighterTest.ClangCursorPosInOtherToken (275 of 1781) UNSUPPORTED: lldb-api :: android/platform/TestDefaultCacheLineSize.py (276 of 1781) PASS: lldb-api :: functionalities/data-formatter/setvaluefromcstring/TestSetValueFromCString.py (277 of 1781) PASS: lldb-api :: macosx/queues/TestQueues.py (278 of 1781) PASS: lldb-unit :: Utility/./UtilityTests/StringExtractorTest.DecodeHexU8_Underflow2 (279 of 1781) PASS: lldb-api :: lang/objc/foundation/TestObjCMethods2.py (280 of 1781) PASS: lldb-api :: functionalities/breakpoint/debugbreak/TestDebugBreak.py (281 of 1781) PASS: lldb-api :: functionalities/thread/concurrent_events/TestConcurrentTwoBreakpointThreads.py (282 of 1781) PASS: lldb-api :: lang/cpp/class_types/TestClassTypesDisassembly.py (283 of 1781) PASS: lldb-unit :: Language/Highlighting/./HighlighterTests/HighlighterTest.ClangCursorPosEndOfLine (284 of 1781) PASS: lldb-unit :: UnwindAssembly/x86/./UnwindAssemblyx86Tests/Testx86AssemblyInspectionEngine.TestPopR12 (285 of 1781) UNSUPPORTED: lldb-api :: functionalities/unwind/standard/TestStandardUnwind.py (286 of 1781) PASS: lldb-unit :: Utility/./UtilityTests/BinaryStreamTest.PutULEB128ThreeBytes (287 of 1781) PASS: lldb-unit :: Utility/./UtilityTests/StringListTest.LongestCommonPrefixNoPrefix (288 of 1781) PASS: lldb-shell :: Reproducer/TestRelativePath.test (289 of 1781) PASS: lldb-api :: functionalities/gdb_remote_client/TestTargetXMLArch.py (290 of 1781) PASS: lldb-shell :: Heap/heap-cstr.test (291 of 1781) PASS: lldb-api :: functionalities/signal/raise/TestRaise.py (292 of 1781) PASS: lldb-api :: python_api/hello_world/TestHelloWorld.py (293 of 1781) PASS: lldb-api :: macosx/nslog/TestDarwinNSLogOutput.py (294 of 1781) PASS: lldb-api :: python_api/lldbutil/iter/TestLLDBIterator.py (295 of 1781) PASS: lldb-unit :: ScriptInterpreter/Python/./ScriptInterpreterPythonTests/PythonDataObjectsTest.TestResetting (296 of 1781) PASS: lldb-api :: python_api/target/TestTargetAPI.py (297 of 1781) PASS: lldb-api :: functionalities/conditional_break/TestConditionalBreak.py (298 of 1781) PASS: lldb-api :: functionalities/tail_call_frames/ambiguous_tail_call_seq2/TestAmbiguousTailCallSeq2.py (299 of 1781) PASS: lldb-api :: lang/cpp/nested-class-other-compilation-unit/TestNestedClassWithParentInAnotherCU.py (300 of 1781) PASS: lldb-api :: commands/statistics/basic/TestStats.py (301 of 1781) PASS: lldb-api :: commands/expression/import-std-module/weak_ptr/TestWeakPtr.py (302 of 1781) PASS: lldb-unit :: Utility/./UtilityTests/CompletionRequest.TryCompleteCurrentArgGood (303 of 1781) PASS: lldb-unit :: Core/./LLDBCoreTests/MangledTest.ResultForValidName (304 of 1781) PASS: lldb-api :: functionalities/gdb_remote_client/TestNestedRegDefinitions.py (305 of 1781) PASS: lldb-unit :: Utility/./UtilityTests/ArgsTest.DoubleQuotedItem (306 of 1781) PASS: lldb-unit :: Utility/./UtilityTests/StringListTest.GetMaxStringLengthEqualSize (307 of 1781) PASS: lldb-unit :: Process/gdb-remote/./ProcessGdbRemoteTests/GDBRemoteCommunicationServerTest.SendErrorResponse_StringError (308 of 1781) PASS: lldb-unit :: ObjectFile/Breakpad/./ObjectFileBreakpadTests/StackCFIRecord.parse (309 of 1781) PASS: lldb-unit :: Utility/./UtilityTests/EnvironmentTest.EnvpConversion (310 of 1781) PASS: lldb-api :: functionalities/breakpoint/serialize/TestBreakpointSerialization.py (311 of 1781) PASS: lldb-api :: functionalities/type_completion/TestTypeCompletion.py (312 of 1781) PASS: lldb-api :: tools/lldb-server/TestGdbRemoteRegisterState.py (313 of 1781) PASS: lldb-shell :: Unwind/eh-frame-dwarf-unwind.test (314 of 1781) PASS: lldb-shell :: SymbolFile/DWARF/debug-types-line-tables.s (315 of 1781) PASS: lldb-unit :: Symbol/./SymbolTests/Type.GetTypeScopeAndBasename (316 of 1781) PASS: lldb-unit :: Utility/./UtilityTests/TimerTest.CategoryTimesNested (317 of 1781) PASS: lldb-api :: functionalities/data-formatter/data-formatter-stl/libcxx/vbool/TestDataFormatterLibcxxVBool.py (318 of 1781) PASS: lldb-unit :: Utility/./UtilityTests/StringExtractorTest.GetU32LittleEndian (319 of 1781) PASS: lldb-unit :: Utility/./UtilityTests/StringListTest.LongestCommonPrefixSingleElement (320 of 1781) PASS: lldb-api :: commands/expression/issue_11588/Test11588.py (321 of 1781) PASS: lldb-api :: functionalities/data-formatter/data-formatter-synth/TestDataFormatterSynth.py (322 of 1781) PASS: lldb-unit :: Core/./LLDBCoreTests/RichManglingContextTest.FromCxxMethodName (323 of 1781) PASS: lldb-shell :: SymbolFile/DWARF/debug-line-basic.s (324 of 1781) PASS: lldb-api :: functionalities/data-formatter/data-formatter-ptr-to-array/TestPtrToArrayFormatting.py (325 of 1781) PASS: lldb-unit :: ScriptInterpreter/Python/./ScriptInterpreterPythonTests/PythonDataObjectsTest.TestPythonTupleInitializerList (326 of 1781) PASS: lldb-unit :: Utility/./UtilityTests/StringListTest.Join (327 of 1781) PASS: lldb-api :: functionalities/data-formatter/data-formatter-stl/libcxx/vector/TestDataFormatterLibcxxVector.py (328 of 1781) PASS: lldb-api :: macosx/order/TestOrderFile.py (329 of 1781) PASS: lldb-shell :: Driver/LocalLLDBInit.test (330 of 1781) PASS: lldb-unit :: Utility/./UtilityTests/ArchSpecTest.OperatorBool (331 of 1781) PASS: lldb-api :: functionalities/thread/concurrent_events/TestConcurrentTwoBreakpointsOneSignal.py (332 of 1781) UNSUPPORTED: lldb-api :: functionalities/darwin_log/source/debug/TestDarwinLogSourceDebug.py (333 of 1781) PASS: lldb-unit :: Process/minidump/./LLDBMinidumpTests/MinidumpParserTest.GetThreadContext_x86_64 (334 of 1781) PASS: lldb-api :: commands/expression/context-object/TestContextObject.py (335 of 1781) PASS: lldb-unit :: Utility/./UtilityTests/UUIDTest.Validity (336 of 1781) PASS: lldb-unit :: Host/./HostTests/FileSystemTest.MakeAbsolute (337 of 1781) PASS: lldb-api :: commands/expression/anonymous-struct/TestCallUserAnonTypedef.py (338 of 1781) UNSUPPORTED: lldb-api :: benchmarks/stepping/TestSteppingSpeed.py (339 of 1781) PASS: lldb-api :: commands/expression/scoped_enums/TestScopedEnumType.py (340 of 1781) PASS: lldb-unit :: UnwindAssembly/x86/./UnwindAssemblyx86Tests/Testx86AssemblyInspectionEngine.TestAddESP (341 of 1781) PASS: lldb-api :: lang/cpp/namespace_conflicts/TestNamespaceConflicts.py (342 of 1781) PASS: lldb-unit :: Host/./HostTests/Host.WaitStatusFormat (343 of 1781) PASS: lldb-api :: python_api/sbtype_typeclass/TestSBTypeTypeClass.py (344 of 1781) PASS: lldb-api :: commands/target/create-deps/TestTargetCreateDeps.py (345 of 1781) PASS: lldb-api :: lang/cpp/bool/TestCPPBool.py (346 of 1781) PASS: lldb-unit :: Utility/./UtilityTests/OptionsWithRawTest.ArgsButNoDelimiter (347 of 1781) PASS: lldb-unit :: Utility/./UtilityTests/StringExtractorTest.GetHexU8_Underflow (348 of 1781) PASS: lldb-shell :: ObjectFile/MachO/lc_build_version.yaml (349 of 1781) PASS: lldb-unit :: Process/minidump/./LLDBMinidumpTests/MinidumpParserTest.GetMemoryRegionInfoLinuxMaps (350 of 1781) PASS: lldb-shell :: Breakpoint/case-sensitive.test (351 of 1781) PASS: lldb-unit :: Utility/./UtilityTests/StringLexerTest.Next (352 of 1781) PASS: lldb-unit :: Expression/./ExpressionTests/DiagnosticManagerTest.FixedExpression (353 of 1781) PASS: lldb-api :: macosx/universal/TestUniversal.py (354 of 1781) UNSUPPORTED: lldb-api :: functionalities/darwin_log/source/info/TestDarwinLogSourceInfo.py (355 of 1781) PASS: lldb-unit :: Utility/./UtilityTests/ArgsTest.TestAppendArg (356 of 1781) PASS: lldb-shell :: SymbolFile/Breakpad/line-table-mixed-path-styles.test (357 of 1781) PASS: lldb-shell :: ObjectFile/Breakpad/sections.test (358 of 1781) PASS: lldb-unit :: ScriptInterpreter/Python/./ScriptInterpreterPythonTests/PythonDataObjectsTest.TestPythonIntegerToStructuredInteger (359 of 1781) PASS: lldb-api :: functionalities/ubsan/basic/TestUbsanBasic.py (360 of 1781) PASS: lldb-unit :: Utility/./UtilityTests/ConstStringTest.CompareStringRef (361 of 1781) PASS: lldb-shell :: ObjectFile/ELF/section-addresses.yaml (362 of 1781) PASS: lldb-api :: commands/expression/radar_9531204/TestPrintfAfterUp.py (363 of 1781) PASS: lldb-unit :: Utility/./UtilityTests/StringListTest.AppendListCStringArrayEmpty (364 of 1781) PASS: lldb-shell :: Register/x86-64-ymm-read.test (365 of 1781) PASS: lldb-unit :: Symbol/./SymbolTests/TestClangASTContext.TestRemoveFastQualifiers (366 of 1781) PASS: lldb-shell :: SymbolFile/DWARF/split-dwarf-multiple-cu.ll (367 of 1781) PASS: lldb-shell :: Minidump/dump-all.test (368 of 1781) PASS: lldb-unit :: ScriptInterpreter/Python/./ScriptInterpreterPythonTests/PythonExceptionStateTest.TestDiscardSemantics (369 of 1781) PASS: lldb-unit :: UnwindAssembly/x86/./UnwindAssemblyx86Tests/Testx86AssemblyInspectionEngine.TestPopR15 (370 of 1781) PASS: lldb-api :: lang/objc/foundation/TestConstStrings.py (371 of 1781) UNSUPPORTED: lldb-api :: functionalities/darwin_log/filter/regex/category/TestDarwinLogFilterRegexCategory.py (372 of 1781) PASS: lldb-unit :: Utility/./UtilityTests/OptionsWithRawTest.SingleWhitespaceInput (373 of 1781) PASS: lldb-unit :: Utility/./UtilityTests/UriParserTest.MinimalPort (374 of 1781) PASS: lldb-unit :: Utility/./UtilityTests/RegularExpression.Valid (375 of 1781) PASS: lldb-unit :: Utility/./UtilityTests/RecordReplayTest.InstrumentedFoo (376 of 1781) PASS: lldb-shell :: SymbolFile/DWARF/split-dwarf-inlining.cpp (377 of 1781) PASS: lldb-api :: lang/objc/modules-auto-import/TestModulesAutoImport.py (378 of 1781) PASS: lldb-unit :: UnwindAssembly/x86/./UnwindAssemblyx86Tests/Testx86AssemblyInspectionEngine.TestPushR15 (379 of 1781) PASS: lldb-unit :: Utility/./UtilityTests/FileSpecTest.GetNormalizedPath (380 of 1781) PASS: lldb-unit :: Utility/./UtilityTests/StreamTest.QuotedCString (381 of 1781) PASS: lldb-api :: functionalities/data-formatter/pyobjsynthprovider/TestPyObjSynthProvider.py (382 of 1781) UNSUPPORTED: lldb-shell :: Register/x86-zmm-read.test (383 of 1781) PASS: lldb-shell :: Commands/command-regex-unalias.test (384 of 1781) PASS: lldb-api :: tools/lldb-server/TestAppleSimulatorOSType.py (385 of 1781) PASS: lldb-api :: commands/frame/diagnose/local-variable/TestLocalVariable.py (386 of 1781) PASS: lldb-unit :: Utility/./UtilityTests/StatusTest.ErrorConstructor (387 of 1781) PASS: lldb-api :: functionalities/tail_call_frames/inlining_and_tail_calls/TestInliningAndTailCalls.py (388 of 1781) PASS: lldb-api :: commands/expression/two-files/TestObjCTypeQueryFromOtherCompileUnit.py (389 of 1781) PASS: lldb-unit :: Utility/./UtilityTests/UriParserTest.SchemeHostSeparator2 (390 of 1781) UNSUPPORTED: lldb-shell :: SymbolFile/PDB/function-level-linking.test (391 of 1781) PASS: lldb-unit :: Utility/./UtilityTests/ScalarTest.Comparison (392 of 1781) PASS: lldb-shell :: ObjectFile/PECOFF/sections-names.yaml (393 of 1781) PASS: lldb-unit :: debugserver/./debugserverTests/RNBSocket.LoopBackListenIPv6 (394 of 1781) PASS: lldb-api :: functionalities/breakpoint/breakpoint_locations/TestBreakpointLocations.py (395 of 1781) PASS: lldb-api :: lang/cpp/diamond/TestDiamond.py (396 of 1781) PASS: lldb-unit :: Utility/./UtilityTests/StringExtractorTest.GetHexU8_Extra_NoEof (397 of 1781) PASS: lldb-unit :: Utility/./UtilityTests/CompletionRequest.TryCompleteCurrentArgMode (398 of 1781) PASS: lldb-api :: commands/watchpoints/watchpoint_commands/command/TestWatchpointCommandLLDB.py (399 of 1781) PASS: lldb-unit :: Language/Highlighting/./HighlighterTests/HighlighterTest.ClangSquareBrackets (400 of 1781) PASS: lldb-api :: lang/objc/objc-builtin-types/TestObjCBuiltinTypes.py (401 of 1781) PASS: lldb-shell :: Breakpoint/single-file-split-dwarf.test (402 of 1781) PASS: lldb-unit :: Expression/./ExpressionTests/DiagnosticManagerTest.PutStringSeverities (403 of 1781) PASS: lldb-api :: functionalities/memory/read/TestMemoryRead.py (404 of 1781) PASS: lldb-api :: functionalities/breakpoint/address_breakpoints/TestAddressBreakpoints.py (405 of 1781) PASS: lldb-shell :: SymbolFile/DWARF/compilercontext.ll (406 of 1781) PASS: lldb-shell :: Driver/TestNoUseColor.test (407 of 1781) PASS: lldb-unit :: ScriptInterpreter/Python/./ScriptInterpreterPythonTests/PythonDataObjectsTest.TestExtractingUInt64ThroughStructuredData (408 of 1781) PASS: lldb-api :: functionalities/data-formatter/boolreference/TestFormattersBoolRefPtr.py (409 of 1781) PASS: lldb-unit :: Host/./HostTests/ConnectionFileDescriptorTest.TCPGetURIv6 (410 of 1781) PASS: lldb-api :: commands/quit/TestQuit.py (411 of 1781) PASS: lldb-unit :: Process/gdb-remote/./ProcessGdbRemoteTests/GDBRemoteCommunicationClientTest.GetMemoryRegionInfo (412 of 1781) PASS: lldb-api :: functionalities/backticks/TestBackticksWithoutATarget.py (413 of 1781) PASS: lldb-unit :: Host/./HostTests/FileSystemTest.Resolve (414 of 1781) PASS: lldb-api :: lang/objc/orderedset/TestOrderedSet.py (415 of 1781) PASS: lldb-api :: python_api/class_members/TestSBTypeClassMembers.py (416 of 1781) PASS: lldb-api :: lang/objc/objc-struct-argument/TestObjCStructArgument.py (417 of 1781) PASS: lldb-unit :: Utility/./UtilityTests/AnsiTerminal.Empty (418 of 1781) PASS: lldb-api :: functionalities/signal/TestSendSignal.py (419 of 1781) PASS: lldb-unit :: Utility/./UtilityTests/StringListTest.LongestCommonPrefixEmpty (420 of 1781) PASS: lldb-unit :: Utility/./UtilityTests/RangeTest.ContainsEndInclusive (421 of 1781) PASS: lldb-shell :: Minidump/breakpad-symbols.test (422 of 1781) PASS: lldb-api :: commands/expression/invalid-args/TestInvalidArgsExpression.py (423 of 1781) PASS: lldb-unit :: Host/./HostTests/SocketTest.DecodeHostAndPort (424 of 1781) PASS: lldb-api :: functionalities/data-formatter/data-formatter-named-summaries/TestDataFormatterNamedSummaries.py (425 of 1781) PASS: lldb-api :: functionalities/thread/backtrace_all/TestBacktraceAll.py (426 of 1781) PASS: lldb-unit :: Utility/./UtilityTests/Flags.GetBitSize (427 of 1781) FAIL: lldb-api :: tools/lldb-server/TestGdbRemoteKill.py (428 of 1781) ******************** TEST 'lldb-api :: tools/lldb-server/TestGdbRemoteKill.py' FAILED ******************** lldb version 10.0.99 (http://labmaster3.local/git/llvm-project.git revision 078bec6c48dd9d17ab9720897d2bb7ccbb886763) clang revision 4d1ecadda59ce82e5fa6e28dd15bf794eee88363 llvm revision 4d1ecadda59ce82e5fa6e28dd15bf794eee88363 LLDB library dir: /Users/buildslave/jenkins/workspace/lldb-cmake-sanitized/lldb-build/bin LLDB import library dir: /Users/buildslave/jenkins/workspace/lldb-cmake-sanitized/lldb-build/bin libstdcxx tests will not be run because: Don't know how to build with libstdcxx on macosx Skipping following debug info categories: ['dwo']

Hide Details

Session logs for test failures/errors/unexpected successes will go into directory '/Users/buildslave/jenkins/workspace/lldb-cmake-sanitized/test/logs' Command invoked: /Users/buildslave/jenkins/workspace/lldb-cmake-sanitized/llvm-project/lldb/test/API/dotest.py --arch=x86_64 -s /Users/buildslave/jenkins/workspace/lldb-cmake-sanitized/lldb-build/lldb-test-traces -S nm -u CXXFLAGS -u CFLAGS --executable /Users/buildslave/jenkins/workspace/lldb-cmake-sanitized/lldb-build/./bin/lldb --dsymutil /Users/buildslave/jenkins/workspace/lldb-cmake-sanitized/lldb-build/./bin/dsymutil --filecheck /Users/buildslave/jenkins/workspace/lldb-cmake-sanitized/lldb-build/./bin/FileCheck -C /Users/buildslave/jenkins/workspace/lldb-cmake-sanitized/host-compiler/bin/clang --codesign-identity lldb_codesign --server /Users/buildslave/jenkins/workspace/lldb-cmake-sanitized/lldb-build/./bin/debugserver --arch x86_64 --build-dir /Users/buildslave/jenkins/workspace/lldb-cmake-sanitized/lldb-build/lldb-test-build.noindex -s=/Users/buildslave/jenkins/workspace/lldb-cmake-sanitized/test/logs -t --env TERM=vt100 --env LLVM_LIBS_DIR=/Users/buildslave/jenkins/workspace/lldb-cmake-sanitized/lldb-build/./lib --build-dir /Users/buildslave/jenkins/workspace/lldb-cmake-sanitized/lldb-build/tools/lldb/lldb-test-build.noindex --lldb-module-cache-dir /Users/buildslave/jenkins/workspace/lldb-cmake-sanitized/lldb-build/tools/lldb/lldb-test-build.noindex/module-cache-lldb/lldb-api --clang-module-cache-dir /Users/buildslave/jenkins/workspace/lldb-cmake-sanitized/lldb-build/tools/lldb/lldb-test-build.noindex/module-cache-clang/lldb-api /Users/buildslave/jenkins/workspace/lldb-cmake-sanitized/llvm-project/lldb/packages/Python/lldbsuite/test/tools/lldb-server -p TestGdbRemoteKill.py Change dir to: /Users/buildslave/jenkins/workspace/lldb-cmake-sanitized/llvm-project/lldb/packages/Python/lldbsuite/test/tools/lldb-server runCmd: settings set symbols.enable-external-lookup false output:

Hide Details

runCmd: settings set plugin.process.gdb-remote.packet-timeout 60 output:

Hide Details

runCmd: settings set symbols.clang-modules-cache-path "/Users/buildslave/jenkins/workspace/lldb-cmake-sanitized/lldb-build/tools/lldb/lldb-test-build.noindex/module-cache-lldb/lldb-api" output:

Hide Details

runCmd: settings set use-color false output:

Hide Details

Adding tearDown hook: def shutdown_named_pipe(): # Close the pipe. try: named_pipe.close() except: print("failed to close named pipe") None

Hide Details

# Delete the pipe. try: os.remove(named_pipe_path) except: print("failed to delete named pipe: {}".format(named_pipe_path)) None

Hide Details

# Delete the temp directory. try: os.rmdir(temp_dir) except: print( "failed to delete temp dir: {}, directory contents: '{}'".format( temp_dir, os.listdir(temp_dir))) None

Hide Details

Hide Details

Adding tearDown hook: def shutdown_process_for_attach(): try: inferior.terminate() except: logger.warning( "failed to terminate inferior process for attach: {}; ignoring".format( sys.exc_info()[0]))

Hide Details

Hide Details

Adding tearDown hook: def cleanupSubprocesses(self): # Ensure any subprocesses are cleaned up for p in self.subprocesses: p.terminate() del p del self.subprocesses[:] # Ensure any forked processes are cleaned up for pid in self.forkedProcessPids: if os.path.exists("/proc/" + str(pid)): os.kill(pid, signal.SIGTERM)

Hide Details

Hide Details

FAIL: LLDB (/Users/buildslave/jenkins/workspace/lldb-cmake-sanitized/host-compiler/bin/clang-10-x86_64) :: test_attach_commandline_kill_after_initial_stop_debugserver (TestGdbRemoteKill.TestGdbRemoteKill) Executing tearDown hook: def cleanupSubprocesses(self): # Ensure any subprocesses are cleaned up for p in self.subprocesses: p.terminate() del p del self.subprocesses[:] # Ensure any forked processes are cleaned up for pid in self.forkedProcessPids: if os.path.exists("/proc/" + str(pid)): os.kill(pid, signal.SIGTERM)

Hide Details

Hide Details

Executing tearDown hook: def shutdown_process_for_attach(): try: inferior.terminate() except: logger.warning( "failed to terminate inferior process for attach: {}; ignoring".format( sys.exc_info()[0]))

Hide Details

Hide Details

Executing tearDown hook: def shutdown_named_pipe(): # Close the pipe. try: named_pipe.close() except: print("failed to close named pipe") None

Hide Details

# Delete the pipe. try: os.remove(named_pipe_path) except: print("failed to delete named pipe: {}".format(named_pipe_path)) None

Hide Details

# Delete the temp directory. try: os.rmdir(temp_dir) except: print( "failed to delete temp dir: {}, directory contents: '{}'".format( temp_dir, os.listdir(temp_dir))) None

Hide Details

Hide Details

runCmd: settings set symbols.enable-external-lookup false output:

Hide Details

runCmd: settings set plugin.process.gdb-remote.packet-timeout 60 output:

Hide Details

runCmd: settings set symbols.clang-modules-cache-path "/Users/buildslave/jenkins/workspace/lldb-cmake-sanitized/lldb-build/tools/lldb/lldb-test-build.noindex/module-cache-lldb/lldb-api" output:

Hide Details

runCmd: settings set use-color false output:

Hide Details

UNSUPPORTED: LLDB (/Users/buildslave/jenkins/workspace/lldb-cmake-sanitized/host-compiler/bin/clang-10-x86_64) :: test_attach_commandline_kill_after_initial_stop_llgs (TestGdbRemoteKill.TestGdbRemoteKill) (llgs tests) Restore dir to: /Users/buildslave/jenkins/workspace/lldb-cmake-sanitized/lldb-build/tools/lldb/test ====================================================================== FAIL: test_attach_commandline_kill_after_initial_stop_debugserver (TestGdbRemoteKill.TestGdbRemoteKill) ---------------------------------------------------------------------- Traceback (most recent call last): File "/Users/buildslave/jenkins/workspace/lldb-cmake-sanitized/llvm-project/lldb/packages/Python/lldbsuite/test/decorators.py", line 141, in wrapper func(*args, **kwargs) File "/Users/buildslave/jenkins/workspace/lldb-cmake-sanitized/llvm-project/lldb/packages/Python/lldbsuite/test/tools/lldb-server/TestGdbRemoteKill.py", line 53, in test_attach_commandline_kill_after_initial_stop_debugserver self.attach_commandline_kill_after_initial_stop() File "/Users/buildslave/jenkins/workspace/lldb-cmake-sanitized/llvm-project/lldb/packages/Python/lldbsuite/test/tools/lldb-server/TestGdbRemoteKill.py", line 18, in attach_commandline_kill_after_initial_stop procs = self.prep_debug_monitor_and_inferior() File "/Users/buildslave/jenkins/workspace/lldb-cmake-sanitized/llvm-project/lldb/packages/Python/lldbsuite/test/tools/lldb-server/gdbremote_testcase.py", line 583, in prep_debug_monitor_and_inferior server = self.connect_to_debug_monitor(attach_pid=attach_pid) File "/Users/buildslave/jenkins/workspace/lldb-cmake-sanitized/llvm-project/lldb/packages/Python/lldbsuite/test/tools/lldb-server/gdbremote_testcase.py", line 417, in connect_to_debug_monitor server = self.launch_debug_monitor(attach_pid=attach_pid) File "/Users/buildslave/jenkins/workspace/lldb-cmake-sanitized/llvm-project/lldb/packages/Python/lldbsuite/test/tools/lldb-server/gdbremote_testcase.py", line 410, in launch_debug_monitor self.port = self.get_stub_port_from_named_socket(self._READ_TIMEOUT) File "/Users/buildslave/jenkins/workspace/lldb-cmake-sanitized/llvm-project/lldb/packages/Python/lldbsuite/test/tools/lldb-server/gdbremote_testcase.py", line 216, in get_stub_port_from_named_socket "write side of pipe has not written anything - stub isn't writing to pipe.") AssertionError: 0 == 0 : write side of pipe has not written anything - stub isn't writing to pipe. Config=x86_64-/Users/buildslave/jenkins/workspace/lldb-cmake-sanitized/host-compiler/bin/clang-10 ---------------------------------------------------------------------- Ran 2 tests in 11.534s

Hide Details

RESULT: FAILED (0 passes, 1 failures, 0 errors, 1 skipped, 0 expected failures, 0 unexpected successes)

Hide Details

******************** PASS: lldb-unit :: Utility/./UtilityTests/ArgsTest.TestArgv (429 of 1781) XFAIL: lldb-shell :: Register/x86-mm-xmm-write.test (430 of 1781) PASS: lldb-api :: commands/command/delete/TestCommandDelete.py (431 of 1781) PASS: lldb-api :: lang/c/anonymous/TestAnonymous.py (432 of 1781) PASS: lldb-shell :: SymbolFile/Breakpad/line-table-missing-file.test (433 of 1781) PASS: lldb-unit :: Host/./HostTests/FileSystemTest.Readable (434 of 1781) PASS: lldb-shell :: Quit/TestQuitExitCodeTooManyArgs.test (435 of 1781) PASS: lldb-api :: lang/objc/objc-baseclass-sbtype/TestObjCBaseClassSBType.py (436 of 1781) PASS: lldb-unit :: Utility/./UtilityTests/RecordReplayTest.InstrumentedBarPtr (437 of 1781) PASS: lldb-unit :: Utility/./UtilityTests/ReproducerTest.SetCapture (438 of 1781) PASS: lldb-unit :: Utility/./UtilityTests/StreamTeeTest.Assignment (439 of 1781) PASS: lldb-api :: macosx/find-dsym/bundle-with-dot-in-filename/TestBundleWithDotInFilename.py (440 of 1781) PASS: lldb-api :: lang/objc/modules-incomplete/TestIncompleteModules.py (441 of 1781) PASS: lldb-api :: functionalities/value_md5_crash/TestValueMD5Crash.py (442 of 1781) UNSUPPORTED: lldb-shell :: SymbolFile/PDB/function-nested-block.test (443 of 1781) PASS: lldb-api :: python_api/lldbutil/iter/TestRegistersIterator.py (444 of 1781) PASS: lldb-shell :: Quit/TestQuitExitCodeHexA.test (445 of 1781) PASS: lldb-api :: functionalities/tsan/thread_numbers/TestTsanThreadNumbers.py (446 of 1781) PASS: lldb-api :: commands/frame/diagnose/array/TestArray.py (447 of 1781) PASS: lldb-api :: functionalities/data-formatter/dump_dynamic/TestDumpDynamic.py (448 of 1781) PASS: lldb-unit :: ObjectFile/Breakpad/./ObjectFileBreakpadTests/Record.classify (449 of 1781) PASS: lldb-unit :: Process/gdb-remote/./ProcessGdbRemoteTests/GDBRemoteClientBaseTest.SendContinueAndAsyncSignal (450 of 1781) PASS: lldb-unit :: Utility/./UtilityTests/DataExtractorTest.GetMaxU64 (451 of 1781) PASS: lldb-shell :: ObjectFile/ELF/PT_LOAD.yaml (452 of 1781) PASS: lldb-api :: functionalities/breakpoint/scripted_bkpt/TestScriptedResolver.py (453 of 1781) PASS: lldb-unit :: Utility/./UtilityTests/RangeTest.SizeTypes (454 of 1781) UNSUPPORTED: lldb-shell :: SymbolFile/NativePDB/typedefs.cpp (455 of 1781) PASS: lldb-unit :: Process/gdb-remote/./ProcessGdbRemoteTests/GDBRemoteCommunicationServerTest.SendErrorResponse_UnimplementedError (456 of 1781) PASS: lldb-unit :: UnwindAssembly/x86/./UnwindAssemblyx86Tests/Testx86AssemblyInspectionEngine.TestSimple32bitFrameFunction (457 of 1781) PASS: lldb-unit :: Host/./HostTests/FileSystemTest.EnumerateDirectory (458 of 1781) PASS: lldb-api :: lang/cpp/call-function/TestCallCPPFunction.py (459 of 1781) PASS: lldb-api :: functionalities/data-formatter/data-formatter-stl/libcxx/variant/TestDataFormatterLibcxxVariant.py (460 of 1781) PASS: lldb-api :: python_api/value/empty_class/TestValueAPIEmptyClass.py (461 of 1781) PASS: lldb-api :: commands/watchpoints/watchpoint_on_vectors/TestValueOfVectorVariable.py (462 of 1781) PASS: lldb-shell :: Breakpoint/debug_rnglistx_rlex.test (463 of 1781) PASS: lldb-shell :: Commands/CommandScriptImmediateOutput/CommandScriptImmediateOutputConsole.test (464 of 1781) PASS: lldb-api :: functionalities/inferior-crashing/TestInferiorCrashingStep.py (465 of 1781) PASS: lldb-unit :: Process/gdb-remote/./ProcessGdbRemoteTests/GDBRemoteCommunicationClientTest.SendGetDataPacket (466 of 1781) PASS: lldb-api :: lang/c/global_variables/TestGlobalVariables.py (467 of 1781) PASS: lldb-unit :: ScriptInterpreter/Python/./ScriptInterpreterPythonTests/PythonDataObjectsTest.TestBorrowedReferences (468 of 1781) PASS: lldb-unit :: Utility/./UtilityTests/BinaryStreamTest.PutSLEB128TwoBytes (469 of 1781) PASS: lldb-api :: functionalities/thread/concurrent_events/TestConcurrentWatchBreakDelay.py (470 of 1781) PASS: lldb-api :: functionalities/data-formatter/synthupdate/TestSyntheticFilterRecompute.py (471 of 1781) PASS: lldb-unit :: Utility/./UtilityTests/StringListTest.Clear (472 of 1781) PASS: lldb-unit :: Utility/./UtilityTests/VMRange.Clear (473 of 1781) PASS: lldb-unit :: UnwindAssembly/x86/./UnwindAssemblyx86Tests/Testx86AssemblyInspectionEngine.Test32bitFramelessSmallStackFrame (474 of 1781) PASS: lldb-api :: tools/lldb-server/TestGdbRemoteThreadsInStopReply.py (475 of 1781) PASS: lldb-api :: lang/cpp/class-template-parameter-pack/TestClassTemplateParameterPack.py (476 of 1781) UNSUPPORTED: lldb-api :: functionalities/thread/create_during_step/TestCreateDuringStep.py (477 of 1781) PASS: lldb-api :: lang/c/array_types/TestArrayTypes.py (478 of 1781) PASS: lldb-api :: functionalities/tsan/cpp_global_location/TestTsanCPPGlobalLocation.py (479 of 1781) PASS: lldb-unit :: Utility/./UtilityTests/StreamTest.PutSLEB128 (480 of 1781) PASS: lldb-shell :: ObjectFile/ELF/section-types-edgecases.yaml (481 of 1781) PASS: lldb-api :: commands/frame/var-scope/TestFrameVariableScope.py (482 of 1781) PASS: lldb-api :: functionalities/tail_call_frames/disambiguate_call_site/TestDisambiguateCallSite.py (483 of 1781) PASS: lldb-unit :: ObjectFile/ELF/./ObjectFileELFTests/ObjectFileELFTest.SectionsResolveConsistently (484 of 1781) PASS: lldb-api :: functionalities/asan/TestMemoryHistory.py (485 of 1781) PASS: lldb-shell :: ObjectFile/ELF/section-permissions.yaml (486 of 1781) PASS: lldb-api :: lang/c/function_types/TestFunctionTypes.py (487 of 1781) PASS: lldb-unit :: Process/gdb-remote/./ProcessGdbRemoteTests/GDBRemoteClientBaseTest.SendContinueAndLateInterrupt (488 of 1781) PASS: lldb-shell :: ExecControl/StopHook/stop-hook.test (489 of 1781) PASS: lldb-api :: lang/cpp/virtual/TestVirtual.py (490 of 1781) PASS: lldb-unit :: Host/./HostTests/SocketTest.UDPConnect (491 of 1781) PASS: lldb-api :: lang/cpp/gmodules/TestWithModuleDebugging.py (492 of 1781) PASS: lldb-shell :: SymbolFile/DWARF/gnu-style-compression.cpp (493 of 1781) UNSUPPORTED: lldb-shell :: Unwind/eh-frame-small-fde.test (494 of 1781) PASS: lldb-unit :: Interpreter/./InterpreterTests/OptionArgParserTest.toBoolean (495 of 1781) PASS: lldb-api :: lang/c/enum_types/TestEnumTypes.py (496 of 1781) PASS: lldb-unit :: Signals/./SignalsTests/UnixSignalsTest.GetFilteredSignals (497 of 1781) PASS: lldb-unit :: Utility/./UtilityTests/ArgsTest.TestTrailingBackslash (498 of 1781) PASS: lldb-api :: lang/c/unicode/TestUnicodeSymbols.py (499 of 1781) PASS: lldb-api :: commands/watchpoints/watchpoint_set_command/TestWatchLocationWithWatchSet.py (500 of 1781) PASS: lldb-unit :: Utility/./UtilityTests/TimerTest.CategoryTimes (501 of 1781) PASS: lldb-unit :: UnwindAssembly/x86/./UnwindAssemblyx86Tests/Testx86AssemblyInspectionEngine.Test32bitFramelessBigStackFrame (502 of 1781) PASS: lldb-unit :: UnwindAssembly/x86/./UnwindAssemblyx86Tests/Testx86AssemblyInspectionEngine.TestPushEBX (503 of 1781) PASS: lldb-api :: commands/platform/basic/TestPlatformPython.py (504 of 1781) PASS: lldb-api :: lang/cpp/accelerator-table/TestCPPAccelerator.py (505 of 1781) UNSUPPORTED: lldb-api :: python_api/disassemble-raw-data/TestDisassemble_VST1_64.py (506 of 1781) PASS: lldb-shell :: SymbolFile/DWARF/dwarf5-partial-index.cpp (507 of 1781) PASS: lldb-api :: lang/c/struct_types/TestStructTypes.py (508 of 1781) PASS: lldb-unit :: Utility/./UtilityTests/ConstStringTest.UpdateMangledCounterpart (509 of 1781) PASS: lldb-unit :: Utility/./UtilityTests/BinaryStreamTest.PutULEB128EightBytes (510 of 1781) PASS: lldb-unit :: Utility/./UtilityTests/StreamTest.PutCStringWithStringRef (511 of 1781) PASS: lldb-api :: sanity/TestModuleCacheSanity.py (512 of 1781) PASS: lldb-shell :: Expr/TestIRMemoryMap.test (513 of 1781) PASS: lldb-api :: commands/expression/po_verbosity/TestPoVerbosity.py (514 of 1781) PASS: lldb-api :: commands/expression/import-std-module/deque-dbg-info-content/TestDbgInfoContentDeque.py (515 of 1781) PASS: lldb-api :: python_api/watchpoint/TestWatchpointIgnoreCount.py (516 of 1781) PASS: lldb-api :: functionalities/postmortem/mach-core/TestMachCore.py (517 of 1781) PASS: lldb-unit :: Utility/./UtilityTests/OptionsWithRawTest.MultiWordSuffix (518 of 1781) PASS: lldb-api :: functionalities/thread/step_until/TestStepUntil.py (519 of 1781) FAIL: lldb-api :: iohandler/completion/TestIOHandlerCompletion.py (520 of 1781) ******************** TEST 'lldb-api :: iohandler/completion/TestIOHandlerCompletion.py' FAILED ******************** lldb version 10.0.99 (http://labmaster3.local/git/llvm-project.git revision 078bec6c48dd9d17ab9720897d2bb7ccbb886763) clang revision 4d1ecadda59ce82e5fa6e28dd15bf794eee88363 llvm revision 4d1ecadda59ce82e5fa6e28dd15bf794eee88363 LLDB library dir: /Users/buildslave/jenkins/workspace/lldb-cmake-sanitized/lldb-build/bin LLDB import library dir: /Users/buildslave/jenkins/workspace/lldb-cmake-sanitized/lldb-build/bin libstdcxx tests will not be run because: Don't know how to build with libstdcxx on macosx Skipping following debug info categories: ['dwo'] (lldb) settings set symbols.enable-external-lookup false (lldb) settings set plugin.process.gdb-remote.packet-timeout 60 (lldb) settings set symbols.clang-modules-cache-path "/Users/buildslave/jenkins/workspace/lldb-cmake-sanitized/lldb-build/tools/lldb/lldb-test-build.noindex/module-cache-lldb/lldb-api" (lldb) settings set use-color false (lldb) a Available completions: _regexp-attach -- Attach to process by ID or name. _regexp-break -- Set a breakpoint using one of several shorthand formats. _regexp-bt -- Show the current thread's call stack. Any numeric argument displays at most that many frames. The argument 'all' displays all threads. Use 'settings set frame-format' to customize the printing of individual frames and 'settings set thread-format' to customize the thread header. _regexp-display -- Evaluate an expression at every stop (see 'help target stop-hook'.) _regexp-down -- Select a newer stack frame. Defaults to moving one frame, a numeric argument can specify an arbitrary number. _regexp-env -- Shorthand for viewing and setting environment variables. _regexp-jump -- Set the program counter to a new address. _regexp-list -- List relevant source code using one of several shorthand formats. _regexp-tbreak -- Set a one-shot breakpoint using one of several shorthand formats. _regexp-undisplay -- Stop displaying expression at every stop (specified by stop-hook index.) _regexp-up -- Select an older stack frame. Defaults to moving one frame, a numeric argument can specify an arbitrary number. apropos -- List debugger commands related to a word or subject. breakpoint -- Commands for operating on breakpoints (see 'help b' for shorthand.) command -- Commands for managing custom LLDB commands. disassemble -- Disassemble specified instructions in the current target. Defaults to the current function for the current thread and stack frame. expression -- Evaluate an expression on the current thread. Displays any returned value with LLDB's default formatting. frame -- Commands for selecting and examing the current thread's stack frames. gdb-remote -- Connect to a process via remote GDB server. If no host is specifed, localhost is assumed. gui -- Switch into the curses based GUI mode. help -- Show a list of all debugger commands, or give details about a specific command. kdp-remote -- Connect to a process via remote KDP server. If no UDP port is specified, port 41139 is assumed. language -- Commands specific to a source language. log -- Commands controlling LLDB internal logging. memory -- Commands for operating on memory in the current target process. platform -- Commands to manage and create platforms. plugin -- Commands for managing LLDB plugins. process -- Commands for interacting with processes on the current platform. quit -- Quit the LLDB debugger. register -- Commands to access registers for the current thread and stack frame. reproducer -- Commands for manipulate the reproducer functionality. script -- Invoke the script interpreter with provided code and display any results. Start the interactive interpreter if no code is supplied. settings regi -- Commands for managing LLDB settings. source -- Commands for examining source code described by debug information for the current target process. statistics -- Print statistics about a debugging session target -- Commands for operating on debugger targets. thread -- Commands for operating on one or more threads in the current process. type -- Commands for operating on the type system. version -- Show the LLDB debugger version. watchpoint -- Commands for operating on watchpoints. add-dsym -- Add a debug symbol file to one of the target's current modules by specifying a path to a debug symbols file, or using the options to specify a module to download symbols for. More (Y/n/a): attach -- Attach to process by ID or name. b -- Set a breakpoint using one of several shorthand formats. bt -- Show the current thread's call stack. Any numeric argument displays at most that many frames. The argument 'all' displays all threads. Use 'settings set frame-format' to customize the printing of individual frames and 'settings set thread-format' to customize the thread header. c -- Continue execution of all threads in the current process. call -- Evaluate an expression on the current thread. Displays any returned value with LLDB's default formatting. continue -- Continue execution of all threads in the current process. detach -- Detach from the current target process. di -- Disassemble specified instructions in the current target. Defaults to the current function for the current thread and stack frame. dis -- Disassemble specified instructions in the current target. Defaults to the current function for the current thread and stack frame. display -- Evaluate an expression at every stop (see 'help target stop-hook'.) down -- Select a newer stack frame. Defaults to moving one frame, a numeric argument can specify an arbitrary number. env -- Shorthand for viewing and setting environment variables. exit -- Quit the LLDB debugger. f -- Select the current stack frame by index from within the current thread (see 'thread backtrace'.) file -- Create a target using the argument as the main executable. finish -- Finish executing the current stack frame and stop after returning. Defaults to current thread unless specified. image -- Commands for accessing information for one or more target modules. j -- Set the program counter to a new address. jump -- Set the program counter to a new address. kill -- Terminate the current target process. l -- List relevant source code using one of several shorthand formats. list -- List relevant source code using one of several shorthand formats. n -- Source level single step, stepping over calls. Defaults to current thread unless specified. next -- Source level single step, stepping over calls. Defaults to current thread unless specified. nexti -- Instruction level single step, stepping over calls. Defaults to current thread unless specified. ni -- Instruction level single step, stepping over calls. Defaults to current thread unless specified. p -- Evaluate an expression on the current thread. Displays any returned value with LLDB's default formatting. parray -- Evaluate an expression on the current thread. Displays any returned value with LLDB's default formatting. po -- Evaluate an expression on the current thread. Displays any returned value with formatting controlled by the type's author. poarray -- Evaluate an expression on the current thread. Displays any returned value with LLDB's default formatting. print -- Evaluate an expression on the current thread. Displays any returned value with LLDB's default formatting. q -- Quit the LLDB debugger. r -- Launch the executable in the debugger. rbreak -- Sets a breakpoint or set of breakpoints in the executable. re -- Commands to access registers for the current thread and stack frame. run -- Launch the executable in the debugger. s -- Source level single step, stepping into calls. Defaults to current thread unless specified. si -- Instruction level single step, stepping into calls. Defaults to current thread unless specified. sif -- Step through the current block, stopping if you step directly into a function whose name matches the TargetFunctionName. step -- Source level single step, stepping into calls. Defaults to current thread unless specified. More (Y/n/a): stepi -- Instruction level single step, stepping into calls. Defaults to current thread unless specified. t -- Change the currently selected thread. tbreak -- Set a one-shot breakpoint using one of several shorthand formats. undisplay -- Stop displaying expression at every stop (specified by stop-hook index.) up -- Select an older stack frame. Defaults to moving one frame, a numeric argument can specify an arbitrary number. v -- Show variables for the current stack frame. Defaults to all arguments and local variables in scope. Names of argument, local, file static and file global variables can be specified. Children of aggregate variables can be specified such as 'var->child.x'. The -> and [] operators in 'frame variable' do not invoke operator overloads if they exist, but directly access the specified element. If you want to trigger operator overloads use the expression command to print the variable instead. It is worth noting that except for overloaded operators, when printing local variables 'expr local_var' and 'frame var local_var' produce the same results. However, 'frame variable' is more efficient, since it uses debug information and memory reads directly, rather than parsing and evaluating an expression, which may even involve JITing and running code in the target program. var -- Show variables for the current stack frame. Defaults to all arguments and local variables in scope. Names of argument, local, file static and file global variables can be specified. Children of aggregate variables can be specified such as 'var->child.x'. The -> and [] operators in 'frame variable' do not invoke operator overloads if they exist, but directly access the specified element. If you want to trigger operator overloads use the expression command to print the variable instead. It is worth noting that except for overloaded operators, when printing local variables 'expr local_var' and 'frame var local_var' produce the same results. However, 'frame variable' is more efficient, since it uses debug information and memory reads directly, rather than parsing and evaluating an expression, which may even involve JITing and running code in the target program. vo -- Show variables for the current stack frame. Defaults to all arguments and local variables in scope. Names of argument, local, file static and file global variables can be specified. Children of aggregate variables can be specified such as 'var->child.x'. The -> and [] operators in 'frame variable' do not invoke operator overloads if they exist, but directly access the specified element. If you want to trigger operator overloads use the expression command to print the variable instead. It is worth noting that except for overloaded operators, when printing local variables 'expr local_var' and 'frame var local_var' produce the same results. However, 'frame variable' is more efficient, since it uses debug information and memory reads directly, rather than parsing and evaluating an expression, which may even involve JITing and running code in the target program. x -- Read from the memory of the current target process. (lldb)  (lldb) regi (lldb) register

Hide Details

Commands to access registers for the current thread and stack frame.

Hide Details

Syntax: register [read|write] ...

Hide Details

The following subcommands are supported:

Hide Details

read -- Dump the contents of one or more register values from the current frame. If no register is specified, dumps them all. write -- Modify a single register value.

Hide Details

For more help on any particular subcommand, type 'help <command> <subcommand>'. (lldb) file /Users/buildslave/jenkins/workspace/lldb-cmake-sanitized/llvm-project/lldb/packages/Python/lldbsuite/test/iohandler/completion file /Users/buildslave/jenkins/workspace/lldb-cmake-sanitized/llvm-project/lldb/packages/Python/lldbsuite/test/iohandler/completion (lldb) file /Users/buildslave/jenkins/workspace/lldb-cmake-sanitized/llvm-project/lldb/packages/Python/lldbsuite/test/iohandler/completion/TestIOHandler TestIOHandler (lldb) file /Users/buildslave/jenkins/workspace/lldb-cmake-sanitized/llvm-project/lldb/packages/Python/lldbsuite/test/iohandler/completion/TestIOHandlerCompletion.py

Hide Details

error: '/Users/buildslave/jenkins/workspace/lldb-cmake-sanitized/llvm-project/lldb/packages/Python/lldbsuite/test/iohandler/completion/TestIOHandlerCompletion.py' doesn't contain any 'host' platform architectures: x86_64, i386 (lldb) Available completions: _regexp-attach -- Attach to process by ID or name. _regexp-break -- Set a breakpoint using one of several shorthand formats. _regexp-bt -- Show the current thread's call stack. Any numeric argument displays at most that many frames. The argument 'all' displays all threads. Use 'settings set frame-format' to customize the printing of individual frames and 'settings set thread-format' to customize the thread header. _regexp-display -- Evaluate an expression at every stop (see 'help target stop-hook'.) _regexp-down -- Select a newer stack frame. Defaults to moving one frame, a numeric argument can specify an arbitrary number. _regexp-env -- Shorthand for viewing and setting environment variables. _regexp-jump -- Set the program counter to a new address. _regexp-list -- List relevant source code using one of several shorthand formats. _regexp-tbreak -- Set a one-shot breakpoint using one of several shorthand formats. _regexp-undisplay -- Stop displaying expression at every stop (specified by stop-hook index.) _regexp-up -- Select an older stack frame. Defaults to moving one frame, a numeric argument can specify an arbitrary number. apropos -- List debugger commands related to a word or subject. breakpoint -- Commands for operating on breakpoints (see 'help b' for shorthand.) command -- Commands for managing custom LLDB commands. disassemble -- Disassemble specified instructions in the current target. Defaults to the current function for the current thread and stack frame. expression -- Evaluate an expression on the current thread. Displays any returned value with LLDB's default formatting. frame -- Commands for selecting and examing the current thread's stack frames. gdb-remote -- Connect to a process via remote GDB server. If no host is specifed, localhost is assumed. gui -- Switch into the curses based GUI mode. help -- Show a list of all debugger commands, or give details about a specific command. kdp-remote -- Connect to a process via remote KDP server. If no UDP port is specified, port 41139 is assumed. language -- Commands specific to a source language. log -- Commands controlling LLDB internal logging. memory -- Commands for operating on memory in the current target process. platform -- Commands to manage and create platforms. plugin -- Commands for managing LLDB plugins. process -- Commands for interacting with processes on the current platform. quit -- Quit the LLDB debugger. register -- Commands to access registers for the current thread and stack frame. reproducer -- Commands for manipulate the reproducer functionality. script -- Invoke the script interpreter with provided code and display any results. Start the interactive interpreter if no code is supplied. settings -- Commands for managing LLDB settings. source -- Commands for examining source code described by debug information for the current target process. statistics -- Print statistics about a debugging session target -- Commands for operating on debugger targets. thread -- Commands for operating on one or more threads in the current process. type -- Commands for operating on the type system. version -- Show the LLDB debugger version. watchpoint -- Commands for operating on watchpoints. add-dsym -- Add a debug symbol file to one of the target's current modules by specifying a path to a debug symbols file, or using the options to specify a module to download symbols for. More (Y/n/a): n (lldb)  egoinvalid K(lldb) settings set interpreter.prompt-on-quit false

Hide Details

Session logs for test failures/errors/unexpected successes will go into directory '/Users/buildslave/jenkins/workspace/lldb-cmake-sanitized/test/logs' Command invoked: /Users/buildslave/jenkins/workspace/lldb-cmake-sanitized/llvm-project/lldb/test/API/dotest.py --arch=x86_64 -s /Users/buildslave/jenkins/workspace/lldb-cmake-sanitized/lldb-build/lldb-test-traces -S nm -u CXXFLAGS -u CFLAGS --executable /Users/buildslave/jenkins/workspace/lldb-cmake-sanitized/lldb-build/./bin/lldb --dsymutil /Users/buildslave/jenkins/workspace/lldb-cmake-sanitized/lldb-build/./bin/dsymutil --filecheck /Users/buildslave/jenkins/workspace/lldb-cmake-sanitized/lldb-build/./bin/FileCheck -C /Users/buildslave/jenkins/workspace/lldb-cmake-sanitized/host-compiler/bin/clang --codesign-identity lldb_codesign --server /Users/buildslave/jenkins/workspace/lldb-cmake-sanitized/lldb-build/./bin/debugserver --arch x86_64 --build-dir /Users/buildslave/jenkins/workspace/lldb-cmake-sanitized/lldb-build/lldb-test-build.noindex -s=/Users/buildslave/jenkins/workspace/lldb-cmake-sanitized/test/logs -t --env TERM=vt100 --env LLVM_LIBS_DIR=/Users/buildslave/jenkins/workspace/lldb-cmake-sanitized/lldb-build/./lib --build-dir /Users/buildslave/jenkins/workspace/lldb-cmake-sanitized/lldb-build/tools/lldb/lldb-test-build.noindex --lldb-module-cache-dir /Users/buildslave/jenkins/workspace/lldb-cmake-sanitized/lldb-build/tools/lldb/lldb-test-build.noindex/module-cache-lldb/lldb-api --clang-module-cache-dir /Users/buildslave/jenkins/workspace/lldb-cmake-sanitized/lldb-build/tools/lldb/lldb-test-build.noindex/module-cache-clang/lldb-api /Users/buildslave/jenkins/workspace/lldb-cmake-sanitized/llvm-project/lldb/packages/Python/lldbsuite/test/iohandler/completion -p TestIOHandlerCompletion.py Change dir to: /Users/buildslave/jenkins/workspace/lldb-cmake-sanitized/llvm-project/lldb/packages/Python/lldbsuite/test/iohandler/completion runCmd: settings set symbols.enable-external-lookup false output:

Hide Details

runCmd: settings set plugin.process.gdb-remote.packet-timeout 60 output:

Hide Details

runCmd: settings set symbols.clang-modules-cache-path "/Users/buildslave/jenkins/workspace/lldb-cmake-sanitized/lldb-build/tools/lldb/lldb-test-build.noindex/module-cache-lldb/lldb-api" output:

Hide Details

runCmd: settings set use-color false output:

Hide Details

FAIL: LLDB (/Users/buildslave/jenkins/workspace/lldb-cmake-sanitized/host-compiler/bin/clang-10-x86_64) :: test_completion (TestIOHandlerCompletion.IOHandlerCompletionTest) tearing down the child process....

Hide Details

CLEANUP ERROR: LLDB (/Users/buildslave/jenkins/workspace/lldb-cmake-sanitized/host-compiler/bin/clang-10-x86_64) :: test_completion (TestIOHandlerCompletion.IOHandlerCompletionTest) Restore dir to: /Users/buildslave/jenkins/workspace/lldb-cmake-sanitized/lldb-build/tools/lldb/test ====================================================================== ERROR: test_completion (TestIOHandlerCompletion.IOHandlerCompletionTest) ---------------------------------------------------------------------- Traceback (most recent call last): File "/Users/buildslave/jenkins/workspace/lldb-cmake-sanitized/llvm-project/lldb/packages/Python/lldbsuite/test/iohandler/completion/TestIOHandlerCompletion.py", line 52, in test_completion self.quit() File "/Users/buildslave/jenkins/workspace/lldb-cmake-sanitized/llvm-project/lldb/packages/Python/lldbsuite/test/lldbpexpect.py", line 61, in quit self.child.close(force=not gracefully) File "/Users/buildslave/jenkins/workspace/lldb-cmake-sanitized/llvm-project/lldb/third_party/Python/module/pexpect-4.6/pexpect/pty_spawn.py", line 327, in close self.ptyproc.close(force=force) File "/System/Library/Frameworks/Python.framework/Versions/2.7/lib/python2.7/contextlib.py", line 35, in __exit__ self.gen.throw(type, value, traceback) File "/Users/buildslave/jenkins/workspace/lldb-cmake-sanitized/llvm-project/lldb/third_party/Python/module/pexpect-4.6/pexpect/pty_spawn.py", line 25, in _wrap_ptyprocess_err raise ExceptionPexpect(*e.args) ExceptionPexpect: Could not terminate the child. Config=x86_64-/Users/buildslave/jenkins/workspace/lldb-cmake-sanitized/host-compiler/bin/clang-10 ---------------------------------------------------------------------- Ran 1 test in 2.176s

Hide Details

RESULT: FAILED (0 passes, 0 failures, 1 errors, 0 skipped, 0 expected failures, 0 unexpected successes)

Hide Details

******************** PASS: lldb-shell :: ObjectFile/MachO/lc_build_version_notools.yaml (521 of 1781) PASS: lldb-unit :: Process/minidump/./LLDBMinidumpTests/MinidumpParserTest.GetPidWow64 (522 of 1781) PASS: lldb-unit :: Utility/./UtilityTests/ArgsTest.TestQuotedTrailingBackslash (523 of 1781) PASS: lldb-unit :: Process/gdb-remote/./ProcessGdbRemoteTests/GDBRemoteClientBaseTest.SendContinueAndWait (524 of 1781) PASS: lldb-unit :: Process/minidump/./LLDBMinidumpTests/MinidumpParserTest.GetFilteredModuleList (525 of 1781) PASS: lldb-api :: lang/objc/objc-stepping/TestObjCStepping.py (526 of 1781) PASS: lldb-api :: functionalities/data-formatter/data-formatter-stl/libstdcpp/unique_ptr/invalid/TestDataFormatterInvalidStdUniquePtr.py (527 of 1781) PASS: lldb-unit :: Expression/./ExpressionTests/CppModuleConfigurationTest.AmbiguousLibCpp (528 of 1781) PASS: lldb-unit :: Target/./TargetTests/ExecutionContextTest.GetByteOrder (529 of 1781) PASS: lldb-shell :: Quit/TestQuitExitCode30.test (530 of 1781) UNSUPPORTED: lldb-api :: tools/lldb-server/TestGdbRemoteAuxvSupport.py (531 of 1781) PASS: lldb-unit :: Utility/./UtilityTests/StreamTest.PutRawBytesToLittleEndian (532 of 1781) UNSUPPORTED: lldb-shell :: Register/aarch64-gp-read.test (533 of 1781) PASS: lldb-unit :: Utility/./UtilityTests/StreamTest.PutHex32ByteOrderLittle (534 of 1781) UNSUPPORTED: lldb-api :: benchmarks/continue/TestBenchmarkContinue.py (535 of 1781) PASS: lldb-api :: python_api/module_section/TestModuleAndSection.py (536 of 1781) PASS: lldb-api :: functionalities/asan/TestReportData.py (537 of 1781) PASS: lldb-shell :: ObjectFile/ELF/PT_TLS-overlap-PT_LOAD.yaml (538 of 1781) PASS: lldb-shell :: SymbolFile/DWARF/find-variable-dwo.cpp (539 of 1781) PASS: lldb-unit :: Utility/./UtilityTests/LogChannelTest.Disable (540 of 1781) PASS: lldb-unit :: Utility/./UtilityTests/RegularExpression.Invalid (541 of 1781) PASS: lldb-shell :: SymbolFile/DWARF/dir-separator-no-comp-dir-relative-name.s (542 of 1781) PASS: lldb-api :: commands/expression/formatters/TestFormatters.py (543 of 1781) PASS: lldb-unit :: Process/gdb-remote/./ProcessGdbRemoteTests/GDBRemoteCommunicationClientTest.GetModulesInfoInvalidResponse (544 of 1781) PASS: lldb-unit :: UnwindAssembly/x86/./UnwindAssemblyx86Tests/Testx86AssemblyInspectionEngine.TestPushEBP (545 of 1781) PASS: lldb-unit :: Host/./HostTests/FileSystemTest.FileAndDirectoryComponents (546 of 1781) PASS: lldb-unit :: Utility/./UtilityTests/RangeTest.ContainsRangeStartingFromZero (547 of 1781) PASS: lldb-unit :: Language/Highlighting/./HighlighterTests/HighlighterTest.Colons (548 of 1781) PASS: lldb-unit :: Utility/./UtilityTests/FileSpecTest.GuessPathStyle (549 of 1781) PASS: lldb-api :: functionalities/data-formatter/data-formatter-objc/TestDataFormatterObjCNSData.py (550 of 1781) PASS: lldb-api :: functionalities/data-formatter/data-formatter-stl/libcxx/set/TestDataFormatterLibcxxSet.py (551 of 1781) PASS: lldb-api :: commands/apropos/basic/TestApropos.py (552 of 1781) PASS: lldb-unit :: Process/gdb-remote/./ProcessGdbRemoteTests/GDBRemoteCommunicationClientTest.SendStartTracePacket (553 of 1781) PASS: lldb-api :: lang/objc/foundation/TestObjCMethodsNSArray.py (554 of 1781) PASS: lldb-unit :: Target/./TargetTests/ExecutionContextTest.GetByteOrderProcess (555 of 1781) PASS: lldb-unit :: Utility/./UtilityTests/StringExtractorTest.GetNameColonValueNoColon (556 of 1781) PASS: lldb-api :: functionalities/show_location/TestShowLocationDwarf5.py (557 of 1781) UNSUPPORTED: lldb-api :: functionalities/thread/break_after_join/TestBreakAfterJoin.py (558 of 1781) PASS: lldb-unit :: Utility/./UtilityTests/UriParserTest.BracketedHostname (559 of 1781) PASS: lldb-api :: functionalities/avoids-fd-leak/TestFdLeak.py (560 of 1781) PASS: lldb-unit :: Target/./TargetTests/ExecutionContextTest.GetByteOrderTarget (561 of 1781) PASS: lldb-api :: python_api/watchpoint/TestSetWatchpoint.py (562 of 1781) PASS: lldb-unit :: SymbolFile/NativePDB/./SymbolFileNativePDBTests/PDBFPOProgramToDWARFExpressionTests.UnresolvedRegisterAssignmentReference (563 of 1781) PASS: lldb-unit :: UnwindAssembly/x86/./UnwindAssemblyx86Tests/Testx86AssemblyInspectionEngine.TestSubRSP (564 of 1781) PASS: lldb-unit :: Utility/./UtilityTests/BinaryStreamTest.PutULEB128Zero (565 of 1781) UNSUPPORTED: lldb-api :: tools/lldb-vscode/attach/TestVSCode_attach.py (566 of 1781) PASS: lldb-unit :: SymbolFile/NativePDB/./SymbolFileNativePDBTests/PDBFPOProgramToDWARFExpressionTests.UnresolvedRegisterReference (567 of 1781) PASS: lldb-api :: python_api/thread/TestThreadAPI.py (568 of 1781) UNSUPPORTED: lldb-shell :: SymbolFile/PDB/func-symbols.test (569 of 1781) PASS: lldb-api :: functionalities/postmortem/elf-core/thread_crash/TestLinuxCoreThreads.py (570 of 1781) PASS: lldb-unit :: Utility/./UtilityTests/StreamTest.PutHex16ByteOrderBig (571 of 1781) PASS: lldb-unit :: Utility/./UtilityTests/BinaryStreamTest.PutULEB128FourBytes (572 of 1781) PASS: lldb-unit :: UnwindAssembly/x86/./UnwindAssemblyx86Tests/Testx86AssemblyInspectionEngine.TestMovRSPtoRBP (573 of 1781) PASS: lldb-shell :: ObjectFile/MachO/symtab.yaml (574 of 1781) UNSUPPORTED: lldb-api :: functionalities/data-formatter/data-formatter-stl/libstdcpp/iterator/TestDataFormatterStdIterator.py (575 of 1781) PASS: lldb-unit :: Utility/./UtilityTests/DataExtractorTest.GetCStrAtNullOffset (576 of 1781) PASS: lldb-api :: commands/expression/inline-namespace/TestInlineNamespace.py (577 of 1781) PASS: lldb-api :: functionalities/plugins/command_plugin/TestPluginCommands.py (578 of 1781) PASS: lldb-api :: lang/cpp/offsetof/TestOffsetofCpp.py (579 of 1781) PASS: lldb-shell :: SymbolFile/NativePDB/break-by-function.cpp (580 of 1781) PASS: lldb-unit :: Utility/./UtilityTests/Flags.AnySet (581 of 1781) UNSUPPORTED: lldb-shell :: Register/x86-64-gp-write.test (582 of 1781) PASS: lldb-api :: lang/cpp/thread_local/TestThreadLocal.py (583 of 1781) PASS: lldb-unit :: ScriptInterpreter/Python/./ScriptInterpreterPythonTests/PythonDataObjectsTest.TestTypeNameResolutionNoDot (584 of 1781) PASS: lldb-shell :: ObjectFile/Breakpad/sections-trailing-func.test (585 of 1781) PASS: lldb-unit :: Utility/./UtilityTests/TimeoutTest.Construction (586 of 1781) PASS: lldb-api :: functionalities/gdb_remote_client/TestArmRegisterDefinition.py (587 of 1781) PASS: lldb-unit :: Utility/./UtilityTests/StringListTest.PopBack (588 of 1781) PASS: lldb-api :: functionalities/inferior-crashing/recursive-inferior/TestRecursiveInferiorStep.py (589 of 1781) PASS: lldb-unit :: Utility/./UtilityTests/StreamTest.PutBytesAsRawHex8ToLittleEndian (590 of 1781) PASS: lldb-unit :: Utility/./UtilityTests/StreamTest.ShiftOperatorInts (591 of 1781) PASS: lldb-unit :: SymbolFile/NativePDB/./SymbolFileNativePDBTests/PDBFPOProgramToDWARFExpressionTests.InvalidOpBinary (592 of 1781) PASS: lldb-api :: lang/objc/objc-new-syntax/TestObjCNewSyntaxLiteral.py (593 of 1781) PASS: lldb-api :: tools/lldb-server/inferior-crash/TestGdbRemoteSegFault.py (594 of 1781) PASS: lldb-unit :: Utility/./UtilityTests/FileSpecTest.FormatFileSpec (595 of 1781) PASS: lldb-unit :: Utility/./UtilityTests/OptionsWithRawTest.SingleWordSuffix (596 of 1781) PASS: lldb-unit :: Utility/./UtilityTests/ArgsTest.TestUnknownEscape (597 of 1781) PASS: lldb-api :: functionalities/thread/concurrent_events/TestConcurrentTwoWatchpointsOneBreakpoint.py (598 of 1781) PASS: lldb-unit :: ScriptInterpreter/Python/./ScriptInterpreterPythonTests/PythonDataObjectsTest.TestPythonIntegerToStr (599 of 1781) PASS: lldb-api :: lang/cpp/modules-import/TestCXXModulesImport.py (600 of 1781) PASS: lldb-unit :: Utility/./UtilityTests/StreamTest.PutPtr (601 of 1781) PASS: lldb-shell :: Settings/TestDisableColor.test (602 of 1781) PASS: lldb-unit :: Symbol/./SymbolTests/DWARFCallFrameInfoTest.Basic_eh (603 of 1781) PASS: lldb-unit :: tools/lldb-server/tests/./LLDBServerTests/TestBase.LaunchModePreservesEnvironment (604 of 1781) PASS: lldb-unit :: Utility/./UtilityTests/VASprintfTest.EncodingError (605 of 1781) PASS: lldb-api :: api/multithreaded/TestMultithreaded.py (606 of 1781) PASS: lldb-unit :: Utility/./UtilityTests/StringListTest.ShiftCString (607 of 1781) PASS: lldb-unit :: Host/./HostTests/TaskPoolTest.TaskMap (608 of 1781) UNSUPPORTED: lldb-api :: functionalities/data-formatter/data-formatter-stl/libstdcpp/smart_ptr/TestDataFormatterStdSmartPtr.py (609 of 1781) PASS: lldb-api :: functionalities/data-formatter/compactvectors/TestCompactVectors.py (610 of 1781) PASS: lldb-api :: commands/expression/call-function/TestCallUserDefinedFunction.py (611 of 1781) UNSUPPORTED: lldb-api :: linux/mix-dwo-and-regular-objects/TestMixedDwarfBinary.py (612 of 1781) PASS: lldb-unit :: Utility/./UtilityTests/StringExtractorTest.GetHexBytes_Partial (613 of 1781) PASS: lldb-unit :: UnwindAssembly/x86/./UnwindAssemblyx86Tests/Testx86AssemblyInspectionEngine.TestPopEBX (614 of 1781) PASS: lldb-api :: lang/cpp/char8_t/TestCxxChar8_t.py (615 of 1781) PASS: lldb-unit :: UnwindAssembly/x86/./UnwindAssemblyx86Tests/Testx86AssemblyInspectionEngine.TestLEAVE (616 of 1781) PASS: lldb-unit :: Utility/./UtilityTests/StatusTest.ErrorConversion (617 of 1781) UNSUPPORTED: lldb-shell :: Register/aarch64-fp-read.test (618 of 1781) PASS: lldb-unit :: Utility/./UtilityTests/Predicate.WaitForValueEqualTo (619 of 1781) UNSUPPORTED: lldb-api :: macosx/macabi/TestMacABImacOSFramework.py (620 of 1781) PASS: lldb-api :: functionalities/postmortem/elf-core/gcore/TestGCore.py (621 of 1781) PASS: lldb-unit :: Host/./HostTests/File.GetStreamFromDescriptor (622 of 1781) PASS: lldb-unit :: Process/minidump/./LLDBMinidumpTests/MinidumpParserTest.FindMemoryRange (623 of 1781) PASS: lldb-api :: lang/cpp/trivial_abi/TestTrivialABI.py (624 of 1781) PASS: lldb-unit :: Utility/./UtilityTests/StringListTest.InsertStringAtIndexMove (625 of 1781) PASS: lldb-api :: functionalities/gdb_remote_client/TestWriteMemory.py (626 of 1781) PASS: lldb-shell :: Reproducer/TestSynchronous.test (627 of 1781) PASS: lldb-unit :: ScriptInterpreter/Python/./ScriptInterpreterPythonTests/PythonDataObjectsTest.TestPythonDictionaryValueEquality (628 of 1781) PASS: lldb-api :: commands/expression/import-std-module/forward_list-dbg-info-content/TestDbgInfoContentForwardList.py (629 of 1781) PASS: lldb-api :: python_api/section/TestSectionAPI.py (630 of 1781) PASS: lldb-unit :: Utility/./UtilityTests/RangeTest.Copy (631 of 1781) PASS: lldb-api :: functionalities/data-formatter/data-formatter-objc/TestDataFormatterObjNSException.py (632 of 1781) PASS: lldb-unit :: ScriptInterpreter/Python/./ScriptInterpreterPythonTests/PythonDataObjectsTest.TestPythonListManipulation (633 of 1781) PASS: lldb-api :: functionalities/thread/concurrent_events/TestConcurrentNWatchNBreak.py (634 of 1781) PASS: lldb-api :: lang/c/set_values/TestSetValues.py (635 of 1781) UNSUPPORTED: lldb-shell :: SymbolFile/PDB/type-quals.test (636 of 1781) PASS: lldb-unit :: Utility/./UtilityTests/ScalarTest.APIntConstructor (637 of 1781) PASS: lldb-api :: functionalities/tsan/multiple/TestTsanMultiple.py (638 of 1781) UNSUPPORTED: lldb-api :: benchmarks/frame_variable/TestFrameVariableResponse.py (639 of 1781) UNSUPPORTED: lldb-shell :: Process/Windows/exception_access_violation.cpp (640 of 1781) PASS: lldb-api :: python_api/frame/inlines/TestInlinedFrame.py (641 of 1781) PASS: lldb-unit :: Utility/./UtilityTests/StringListTest.SplitIntoLinesSingleTrailingCR (642 of 1781) PASS: lldb-unit :: Utility/./UtilityTests/SerializationRountripTest.SerializeDeserializeCString (643 of 1781) UNSUPPORTED: lldb-shell :: Register/x86-64-xmm16-write.test (644 of 1781) PASS: lldb-api :: functionalities/postmortem/wow64_minidump/TestWow64MiniDump.py (645 of 1781) PASS: lldb-api :: functionalities/data-formatter/data-formatter-objc/nsindexpath/TestDataFormatterNSIndexPath.py (646 of 1781) UNSUPPORTED: lldb-api :: functionalities/breakpoint/breakpoint_in_delayslot/TestAvoidBreakpointInDelaySlot.py (647 of 1781) PASS: lldb-api :: commands/watchpoints/watchpoint_commands/condition/TestWatchpointConditionCmd.py (648 of 1781) PASS: lldb-shell :: SymbolFile/NativePDB/globals-bss.cpp (649 of 1781) PASS: lldb-unit :: Process/minidump/./LLDBMinidumpTests/MinidumpParserTest.GetMemoryRegionInfoFromMemory64List (650 of 1781) UNSUPPORTED: lldb-shell :: SymbolFile/PDB/udt-layout.test (651 of 1781) PASS: lldb-api :: lang/cpp/nsimport/TestCppNsImport.py (652 of 1781) PASS: lldb-unit :: Utility/./UtilityTests/ArchSpecTest.MergeFromMachOUnknown (653 of 1781) PASS: lldb-api :: functionalities/data-formatter/data-formatter-stl/libcxx/iterator/TestDataFormatterLibccIterator.py (654 of 1781) PASS: lldb-api :: commands/add-dsym/uuid/TestAddDsymCommand.py (655 of 1781) PASS: lldb-unit :: Utility/./UtilityTests/LogChannelEnabledTest.LLDB_LOG_ERROR (656 of 1781) PASS: lldb-api :: functionalities/abbreviation/TestAbbreviations.py (657 of 1781) PASS: lldb-shell :: SymbolFile/DWARF/debug-types-dwo-cross-reference.cpp (658 of 1781) PASS: lldb-unit :: Symbol/./SymbolTests/DWARFCallFrameInfoTest.Basic_dwarf3 (659 of 1781) PASS: lldb-shell :: SymbolFile/NativePDB/source-list.cpp (660 of 1781) PASS: lldb-api :: functionalities/thread/concurrent_events/TestConcurrentBreakpointsDelayedBreakpointOneWatchpoint.py (661 of 1781) PASS: lldb-api :: lang/c/conflicting-symbol/TestConflictingSymbol.py (662 of 1781) PASS: lldb-api :: commands/process/attach-resume/TestAttachResume.py (663 of 1781) PASS: lldb-shell :: ObjectFile/ELF/netbsd-core-amd64.test (664 of 1781) PASS: lldb-unit :: Utility/./UtilityTests/StatusTest.Formatv (665 of 1781) PASS: lldb-unit :: UnwindAssembly/x86/./UnwindAssemblyx86Tests/Testx86AssemblyInspectionEngine.TestPushR12 (666 of 1781) PASS: lldb-api :: lang/cpp/rvalue-references/TestRvalueReferences.py (667 of 1781) PASS: lldb-unit :: Signals/./SignalsTests/UnixSignalsTest.VersionChange (668 of 1781) PASS: lldb-api :: functionalities/breakpoint/step_over_breakpoint/TestStepOverBreakpoint.py (669 of 1781) PASS: lldb-api :: tools/lldb-server/commandline/TestStubReverseConnect.py (670 of 1781) UNSUPPORTED: lldb-api :: functionalities/data-formatter/data-formatter-stl/libstdcpp/unique_ptr/TestDataFormatterStdUniquePtr.py (671 of 1781) PASS: lldb-unit :: Utility/./UtilityTests/VMRange.ContainsAddr (672 of 1781) PASS: lldb-unit :: Utility/./UtilityTests/TildeExpressionResolver.ResolveFullPath (673 of 1781) PASS: lldb-unit :: Host/./HostTests/HostInfoTest.GetHostname (674 of 1781) PASS: lldb-shell :: SymbolFile/Breakpad/symtab.test (675 of 1781) PASS: lldb-unit :: SymbolFile/DWARF/./SymbolFileDWARFTests/SymbolFileDWARFTests.TestAbbrevInvalidNULLTag (676 of 1781) PASS: lldb-shell :: SymbolFile/DWARF/debug_ranges-missing-section.s (677 of 1781) PASS: lldb-unit :: Utility/./UtilityTests/ArgsTest.ReplaceArgumentAtIndexFarOutOfRange (678 of 1781) PASS: lldb-unit :: Utility/./UtilityTests/OptionsWithRawTest.UnterminatedQuote (679 of 1781) PASS: lldb-api :: functionalities/data-formatter/data-formatter-globals/TestDataFormatterGlobals.py (680 of 1781) PASS: lldb-unit :: Symbol/./SymbolTests/PostfixExpression.ToDWARF (681 of 1781) UNSUPPORTED: lldb-api :: functionalities/process_save_core/TestProcessSaveCore.py (682 of 1781) PASS: lldb-unit :: ScriptInterpreter/Python/./ScriptInterpreterPythonTests/PythonExceptionStateTest.TestResetSemantics (683 of 1781) PASS: lldb-shell :: SymbolFile/NativePDB/function-types-calling-conv.cpp (684 of 1781) PASS: lldb-unit :: Core/./LLDBCoreTests/RichManglingContextTest.SwitchProvider (685 of 1781) PASS: lldb-unit :: Utility/./UtilityTests/StringLexerTest.NextIf (686 of 1781) UNSUPPORTED: lldb-api :: benchmarks/turnaround/TestCompileRunToBreakpointTurnaround.py (687 of 1781) PASS: lldb-unit :: Symbol/./SymbolTests/LineEntryTest.GetSameLineContiguousAddressRangeNoInlines (688 of 1781) PASS: lldb-unit :: Expression/./ExpressionTests/CppModuleConfigurationTest.Sysroot (689 of 1781) PASS: lldb-shell :: Watchpoint/SetErrorCases.test (690 of 1781) UNSUPPORTED: lldb-api :: functionalities/longjmp/TestLongjmp.py (691 of 1781) UNSUPPORTED: lldb-api :: functionalities/darwin_log/filter/exact_match/category/TestDarwinLogFilterMatchCategory.py (692 of 1781) PASS: lldb-unit :: Utility/./UtilityTests/UUIDTest.RelationalOperators (693 of 1781) PASS: lldb-api :: commands/frame/select/TestFrameSelect.py (694 of 1781) PASS: lldb-api :: functionalities/thread/concurrent_events/TestConcurrentDelaySignalBreak.py (695 of 1781) PASS: lldb-unit :: Utility/./UtilityTests/EnvironmentTest.EnvpConstruction (696 of 1781) PASS: lldb-api :: lang/c/stepping/TestThreadStepping.py (697 of 1781) UNSUPPORTED: lldb-shell :: Expr/TestIRMemoryMapWindows.test (698 of 1781) PASS: lldb-shell :: Settings/TestFrameFormatColor.test (699 of 1781) PASS: lldb-unit :: Target/./TargetTests/PathMappingListTest.RelativeTests (700 of 1781) PASS: lldb-api :: python_api/exprpath_synthetic/TestExprPathSynthetic.py (701 of 1781) PASS: lldb-unit :: Utility/./UtilityTests/RangeTest.ClearWithStarAddress (702 of 1781) PASS: lldb-unit :: Utility/./UtilityTests/CompletionRequest.ShiftArguments (703 of 1781) PASS: lldb-unit :: Utility/./UtilityTests/UriParserTest.BadPort2 (704 of 1781) PASS: lldb-api :: commands/expression/import_builtin_fileid/TestImportBuiltinFileID.py (705 of 1781) PASS: lldb-api :: functionalities/data-formatter/data-formatter-objc/TestDataFormatterObjCNSBundle.py (706 of 1781) PASS: lldb-api :: commands/expression/persist_objc_pointeetype/TestPersistObjCPointeeType.py (707 of 1781) PASS: lldb-unit :: Utility/./UtilityTests/StringListTest.SplitIntoLines (708 of 1781) PASS: lldb-unit :: UnwindAssembly/x86/./UnwindAssemblyx86Tests/Testx86AssemblyInspectionEngine.TestPushESI (709 of 1781) PASS: lldb-unit :: ScriptInterpreter/Python/./ScriptInterpreterPythonTests/PythonDataObjectsTest.TestInstanceNameResolutionNoDot (710 of 1781) PASS: lldb-unit :: UnwindAssembly/x86/./UnwindAssemblyx86Tests/Testx86AssemblyInspectionEngine.TestSpArithx86_64Augmented (711 of 1781) PASS: lldb-unit :: Utility/./UtilityTests/StringListTest.AppendStringMove (712 of 1781) PASS: lldb-shell :: SymbolFile/DWARF/find-function-regex.cpp (713 of 1781) PASS: lldb-shell :: ObjectFile/ELF/minidebuginfo-corrupt-xz.yaml (714 of 1781) PASS: lldb-api :: functionalities/thread/concurrent_events/TestConcurrentSignalNWatchNBreak.py (715 of 1781) PASS: lldb-unit :: Language/Highlighting/./HighlighterTests/HighlighterTest.ClangComments (716 of 1781) PASS: lldb-unit :: Utility/./UtilityTests/OptionsWithRawTest.EmptyArgsOnlySuffix (717 of 1781) PASS: lldb-unit :: Host/./HostTests/NativeProcessProtocolTest.ReadMemoryWithoutTrap (718 of 1781) PASS: lldb-shell :: Register/x86-64-read.test (719 of 1781) PASS: lldb-shell :: SymbolFile/DWARF/apple-index-is-used.cpp (720 of 1781) PASS: lldb-api :: commands/apropos/with-process/TestAproposWithProcess.py (721 of 1781) PASS: lldb-unit :: Expression/./ExpressionTests/DiagnosticManagerTest.PutStringMultiple (722 of 1781) PASS: lldb-unit :: UnwindAssembly/x86/./UnwindAssemblyx86Tests/Testx86AssemblyInspectionEngine.TestPushEDI (723 of 1781) PASS: lldb-unit :: Utility/./UtilityTests/RangeDataVector.FindEntryThatContains_Overlap (724 of 1781) PASS: lldb-unit :: Utility/./UtilityTests/StringExtractorTest.GetHexBytesAvail_Partial (725 of 1781) PASS: lldb-unit :: Utility/./UtilityTests/UriParserTest.BracketedHostnameWithColon (726 of 1781) PASS: lldb-unit :: Utility/./UtilityTests/StringListTest.AppendStringStdString (727 of 1781) PASS: lldb-unit :: Symbol/./SymbolTests/TestClangASTContext.TestRecordHasFields (728 of 1781) PASS: lldb-unit :: Target/./TargetTests/ModuleCacheTest.GetAndPutStrangeHostname (729 of 1781) PASS: lldb-shell :: SymbolFile/DWARF/array-sizes.s (730 of 1781) PASS: lldb-api :: functionalities/thread/exit_during_step/TestExitDuringStep.py (731 of 1781) PASS: lldb-unit :: Expression/./ExpressionTests/DiagnosticManagerTest.AppendMessageNoDiag (732 of 1781) PASS: lldb-unit :: Utility/./UtilityTests/StructuredDataTest.StringDump (733 of 1781) PASS: lldb-unit :: Utility/./UtilityTests/StreamTeeTest.GetStreamAtIndexOutOfBoundsEmpty (734 of 1781) PASS: lldb-unit :: Utility/./UtilityTests/RangeTest.SetRangeBase (735 of 1781) PASS: lldb-unit :: ScriptInterpreter/Python/./ScriptInterpreterPythonTests/PythonDataObjectsTest.TestPythonTupleSize (736 of 1781) PASS: lldb-api :: functionalities/data-formatter/data-formatter-synthtype/TestDataFormatterSynthType.py (737 of 1781) PASS: lldb-api :: macosx/find-app-in-bundle/TestFindAppInBundle.py (738 of 1781) PASS: lldb-shell :: ObjectFile/PECOFF/subsections.yaml (739 of 1781) PASS: lldb-unit :: ScriptInterpreter/Python/./ScriptInterpreterPythonTests/PythonDataObjectsTest.TestPythonTupleToStructuredList (740 of 1781) PASS: lldb-api :: commands/watchpoints/hello_watchpoint/TestMyFirstWatchpoint.py (741 of 1781) PASS: lldb-api :: commands/expression/vector_of_enums/TestVectorOfEnums.py (742 of 1781) PASS: lldb-unit :: Utility/./UtilityTests/ArgsTest.ReplaceArgumentAtIndexShort (743 of 1781) PASS: lldb-shell :: SymbolFile/DWARF/find-method.cpp (744 of 1781) PASS: lldb-api :: functionalities/modern-type-lookup/basic-objc/TestBasicObjcModernTypeLookup.py (745 of 1781) PASS: lldb-unit :: UnwindAssembly/x86/./UnwindAssemblyx86Tests/Testx86AssemblyInspectionEngine.TestPushImm (746 of 1781) PASS: lldb-api :: lang/c/inlines/TestRedefinitionsInInlines.py (747 of 1781) PASS: lldb-unit :: Utility/./UtilityTests/LogTest.Register (748 of 1781) PASS: lldb-api :: macosx/add-dsym/TestAddDsymMidExecutionCommand.py (749 of 1781) PASS: lldb-api :: api/check_public_api_headers/TestPublicAPIHeaders.py (750 of 1781) PASS: lldb-shell :: ObjectFile/MachO/lc_version_min.yaml (751 of 1781) PASS: lldb-shell :: ObjectFile/PECOFF/dep-modules.yaml (752 of 1781) PASS: lldb-shell :: ObjectFile/ELF/netbsd-exec-8.99.30-amd64.yaml (753 of 1781) PASS: lldb-unit :: Host/./HostTests/FileSystemTest.GetPermissions (754 of 1781) PASS: lldb-unit :: Expression/./ExpressionTests/DiagnosticManagerTest.AddDiagnostic (755 of 1781) PASS: lldb-unit :: ScriptInterpreter/Python/./ScriptInterpreterPythonTests/PythonExceptionStateTest.TestExceptionStateChecking (756 of 1781) PASS: lldb-api :: commands/expression/expr-in-syscall/TestExpressionInSyscall.py (757 of 1781) PASS: lldb-unit :: Utility/./UtilityTests/StreamTest.PutHex64ByteOrderBig (758 of 1781) PASS: lldb-api :: functionalities/data-formatter/data-formatter-disabling/TestDataFormatterDisabling.py (759 of 1781) PASS: lldb-unit :: Utility/./UtilityTests/LogChannelEnabledTest.log_options (760 of 1781) PASS: lldb-api :: functionalities/breakpoint/breakpoint_ignore_count/TestBreakpointIgnoreCount.py (761 of 1781) XFAIL: lldb-shell :: Register/x86-64-write.test (762 of 1781) PASS: lldb-api :: commands/version/TestVersion.py (763 of 1781) PASS: lldb-unit :: Expression/./ExpressionTests/DiagnosticManagerTest.GetStringPreserveOrder (764 of 1781) PASS: lldb-unit :: Utility/./UtilityTests/BinaryStreamTest.PutSLEB128MaxValue (765 of 1781) PASS: lldb-unit :: Editline/./EditlineTests/EditlineTestFixture.EditlineReceivesSingleLineText (766 of 1781) PASS: lldb-unit :: Utility/./UtilityTests/ArgsTest.TestSingleQuotedArgWithSpace (767 of 1781) PASS: lldb-unit :: Utility/./UtilityTests/OptionsWithRawTest.QuotedSuffix (768 of 1781) PASS: lldb-api :: lang/cpp/class_types/TestClassTypes.py (769 of 1781) PASS: lldb-unit :: Utility/./UtilityTests/StreamTeeTest.SetStreamAtIndexOutOfBounds (770 of 1781) PASS: lldb-unit :: ObjectFile/ELF/./ObjectFileELFTests/ObjectFileELFTest.GetSymtab_NoSymEntryPointArmAddressClass (771 of 1781) PASS: lldb-api :: functionalities/load_using_paths/TestLoadUsingPaths.py (772 of 1781) PASS: lldb-api :: lang/cpp/global_variables/TestCPPGlobalVariables.py (773 of 1781) PASS: lldb-unit :: Utility/./UtilityTests/ScalarTest.Scalar_512 (774 of 1781) PASS: lldb-api :: commands/command/script/import/TestImport.py (775 of 1781) PASS: lldb-unit :: SymbolFile/NativePDB/./SymbolFileNativePDBTests/PDBFPOProgramToDWARFExpressionTests.MultipleIndependentAssignments (776 of 1781) PASS: lldb-api :: functionalities/step_scripted/TestStepScripted.py (777 of 1781) PASS: lldb-api :: functionalities/data-formatter/hexcaps/TestDataFormatterHexCaps.py (778 of 1781) PASS: lldb-shell :: SymbolFile/Breakpad/unwind-via-stack-cfi.test (779 of 1781) PASS: lldb-unit :: Utility/./UtilityTests/RecordReplayTest.InstrumentedBarRef (780 of 1781) PASS: lldb-api :: functionalities/breakpoint/breakpoint_set_restart/TestBreakpointSetRestart.py (781 of 1781) PASS: lldb-api :: functionalities/thread/concurrent_events/TestConcurrentWatchpointDelayWatchpointOneBreakpoint.py (782 of 1781) PASS: lldb-unit :: SymbolFile/DWARF/./SymbolFileDWARFTests/SymbolFileDWARFTests.TestAbbrevOrder1Start5 (783 of 1781) PASS: lldb-unit :: Utility/./UtilityTests/ScalarTest.RightShiftOperator (784 of 1781) PASS: lldb-shell :: SymbolFile/DWARF/debug-types-address-ranges.s (785 of 1781) UNSUPPORTED: lldb-api :: tools/lldb-server/libraries-svr4/TestGdbRemoteLibrariesSvr4Support.py (786 of 1781) PASS: lldb-api :: lang/cpp/lambdas/TestLambdas.py (787 of 1781) PASS: lldb-api :: functionalities/data-formatter/var-in-aggregate-misuse/TestVarInAggregateMisuse.py (788 of 1781) PASS: lldb-unit :: Symbol/./SymbolTests/TestClangASTContext.TestIsClangType (789 of 1781) PASS: lldb-unit :: Utility/./UtilityTests/UriParserTest.SchemeHostSeparator (790 of 1781) PASS: lldb-unit :: Utility/./UtilityTests/RangeTest.SlideZero (791 of 1781) PASS: lldb-unit :: Symbol/./SymbolTests/TestClangASTContext.TestConvertAccessTypeToAccessSpecifier (792 of 1781) PASS: lldb-api :: commands/expression/import-std-module/shared_ptr/TestSharedPtr.py (793 of 1781) PASS: lldb-unit :: Utility/./UtilityTests/StreamTeeTest.DefaultConstructor (794 of 1781) UNSUPPORTED: lldb-shell :: Register/x86-ymm-write.test (795 of 1781) PASS: lldb-unit :: Utility/./UtilityTests/CompletionRequest.TryCompleteCurrentArgBad (796 of 1781) PASS: lldb-unit :: Utility/./UtilityTests/StreamTest.PutCString (797 of 1781) PASS: lldb-unit :: Signals/./SignalsTests/UnixSignalsTest.GetInfo (798 of 1781) PASS: lldb-api :: python_api/process/read-mem-cstring/TestReadMemCString.py (799 of 1781) PASS: lldb-unit :: Utility/./UtilityTests/StringExtractorTest.GetHexU8_Extra (800 of 1781) PASS: lldb-unit :: Utility/./UtilityTests/RegularExpression.Empty (801 of 1781) PASS: lldb-shell :: SymbolFile/DWARF/deterministic-build.cpp (802 of 1781) PASS: lldb-unit :: UnwindAssembly/x86/./UnwindAssemblyx86Tests/Testx86AssemblyInspectionEngine.TestSimple64bitFrameFunction (803 of 1781) PASS: lldb-unit :: UnwindAssembly/x86/./UnwindAssemblyx86Tests/Testx86AssemblyInspectionEngine.TestSpillRegToStackViaMOVi386 (804 of 1781) PASS: lldb-unit :: Interpreter/./InterpreterTests/CompletionTest.DirCompletionUsername (805 of 1781) PASS: lldb-api :: lang/objcxx/objcxx-ivar-vector/TestIvarVector.py (806 of 1781) PASS: lldb-api :: python_api/formatters/TestFormattersSBAPI.py (807 of 1781) PASS: lldb-shell :: SymbolFile/NativePDB/break-by-line.cpp (808 of 1781) PASS: lldb-unit :: Process/gdb-remote/./ProcessGdbRemoteTests/GDBRemoteCommunicationServerTest.SendErrorResponse_Status (809 of 1781) UNSUPPORTED: lldb-shell :: SymbolFile/PDB/variables-locations.test (810 of 1781) PASS: lldb-api :: lang/cpp/global_operators/TestCppGlobalOperators.py (811 of 1781) PASS: lldb-unit :: Utility/./UtilityTests/StringExtractorTest.DecodeHexU8_Extra (812 of 1781) UNSUPPORTED: lldb-shell :: SymbolFile/PDB/variables.test (813 of 1781) UNSUPPORTED: lldb-api :: functionalities/tty/TestTerminal.py (814 of 1781) PASS: lldb-api :: python_api/type/TestTypeList.py (815 of 1781) PASS: lldb-api :: commands/watchpoints/step_over_watchpoint/TestStepOverWatchpoint.py (816 of 1781) PASS: lldb-unit :: Language/Highlighting/./HighlighterTests/HighlighterTest.DefaultHighlighter (817 of 1781) PASS: lldb-unit :: Language/Highlighting/./HighlighterTests/HighlighterTest.ClangUnterminatedString (818 of 1781) PASS: lldb-api :: commands/expression/import-std-module/queue/TestQueue.py (819 of 1781) PASS: lldb-unit :: Utility/./UtilityTests/ArgsTest.GetArgumentArrayRef (820 of 1781) PASS: lldb-api :: commands/expression/class_template_specialization_empty_pack/TestClassTemplateSpecializationParametersHandling.py (821 of 1781) PASS: lldb-unit :: Utility/./UtilityTests/StreamTest.PutULEB128 (822 of 1781) PASS: lldb-api :: lang/cpp/dynamic-value/TestDynamicValue.py (823 of 1781) PASS: lldb-api :: commands/process/attach/TestProcessAttach.py (824 of 1781) PASS: lldb-unit :: Utility/./UtilityTests/BinaryStreamTest.PutULEB128FiveBytes (825 of 1781) PASS: lldb-unit :: UnwindAssembly/x86/./UnwindAssemblyx86Tests/Testx86AssemblyInspectionEngine.TestPushR14 (826 of 1781) PASS: lldb-unit :: Utility/./UtilityTests/StringListTest.CopyListEmpty (827 of 1781) PASS: lldb-api :: functionalities/load_unload/TestLoadUnload.py (828 of 1781) PASS: lldb-api :: lang/cpp/symbols/TestSymbols.py (829 of 1781) PASS: lldb-api :: functionalities/data-formatter/data-formatter-stl/libcxx/list/loop/TestDataFormatterLibcxxListLoop.py (830 of 1781) PASS: lldb-unit :: UnwindAssembly/x86/./UnwindAssemblyx86Tests/Testx86AssemblyInspectionEngine.TestPopRBPWithREX (831 of 1781) PASS: lldb-api :: lang/cpp/virtual-overload/TestVirtualOverload.py (832 of 1781) PASS: lldb-api :: lang/objc/foundation/TestRuntimeTypes.py (833 of 1781) PASS: lldb-unit :: Utility/./UtilityTests/DeserializerTest.HasData (834 of 1781) PASS: lldb-shell :: SymbolFile/NativePDB/tag-types.cpp (835 of 1781) PASS: lldb-shell :: Expr/TestTypeOfDeclTypeExpr.test (836 of 1781) PASS: lldb-unit :: Expression/./ExpressionTests/CppModuleConfigurationTest.MissingLibCpp (837 of 1781) PASS: lldb-api :: functionalities/thread/concurrent_events/TestConcurrentManyCrash.py (838 of 1781) PASS: lldb-unit :: Host/./HostTests/MainLoopTest.ReadObject (839 of 1781) PASS: lldb-unit :: Symbol/./SymbolTests/SymbolsTest.LocateExecutableSymbolFileForUnknownExecutableAndMissingSymbolFile (840 of 1781) PASS: lldb-unit :: Utility/./UtilityTests/StringListTest.SplitIntoLinesEmpty (841 of 1781) PASS: lldb-unit :: Utility/./UtilityTests/ArchSpecTest.TripleComponentsWereSpecified (842 of 1781) PASS: lldb-unit :: Language/Highlighting/./HighlighterTests/HighlighterTest.ClangOperators (843 of 1781) PASS: lldb-api :: python_api/watchpoint/watchlocation/TestTargetWatchAddress.py (844 of 1781) PASS: lldb-shell :: ObjectFile/ELF/section-overlap.yaml (845 of 1781) PASS: lldb-unit :: Utility/./UtilityTests/ArgsTest.StringListConstructor (846 of 1781) PASS: lldb-unit :: Utility/./UtilityTests/ScalarTest.CastOperations (847 of 1781) UNSUPPORTED: lldb-api :: tools/lldb-server/thread-name/TestGdbRemoteThreadName.py (848 of 1781) PASS: lldb-api :: commands/expression/import-std-module/basic/TestImportStdModule.py (849 of 1781) PASS: lldb-unit :: Utility/./UtilityTests/StreamTest.PutMaxHex64ByteOrderLittle (850 of 1781) PASS: lldb-api :: functionalities/data-formatter/stringprinter/TestStringPrinter.py (851 of 1781) PASS: lldb-unit :: Utility/./UtilityTests/StringListTest.Assignment (852 of 1781) PASS: lldb-shell :: Driver/TestRepl.test (853 of 1781) PASS: lldb-unit :: Utility/./UtilityTests/BroadcasterTest.EventTypeHasListeners (854 of 1781) PASS: lldb-api :: types/TestDoubleTypesExpr.py (855 of 1781) PASS: lldb-api :: functionalities/thread/step_out/TestThreadStepOut.py (856 of 1781) PASS: lldb-api :: functionalities/data-formatter/vector-types/TestVectorTypesFormatting.py (857 of 1781) PASS: lldb-shell :: Quit/TestQuitExitCodeHex0.test (858 of 1781) PASS: lldb-shell :: ObjectFile/ELF/PT_LOAD-overlap.yaml (859 of 1781) UNSUPPORTED: lldb-api :: functionalities/darwin_log/filter/regex/activity-chain/TestDarwinLogFilterRegexActivityChain.py (860 of 1781) PASS: lldb-unit :: Utility/./UtilityTests/ArchSpecTest.TestParseMachCPUDashSubtypeTripleSimple (861 of 1781) UNSUPPORTED: lldb-api :: tools/lldb-vscode/stackTrace/TestVSCode_stackTrace.py (862 of 1781) PASS: lldb-api :: python_api/symbol-context/two-files/TestSymbolContextTwoFiles.py (863 of 1781) PASS: lldb-shell :: ObjectFile/PECOFF/basic-info-arm64.yaml (864 of 1781) PASS: lldb-unit :: Utility/./UtilityTests/LogChannelTest.EnableOptions (865 of 1781) PASS: lldb-api :: terminal/TestSTTYBeforeAndAfter.py (866 of 1781) PASS: lldb-unit :: SymbolFile/DWARF/./SymbolFileDWARFTests/SymbolFileDWARFTests.TestAbbrevMissingTerminator (867 of 1781) PASS: lldb-api :: functionalities/step-avoids-no-debug/TestStepNoDebug.py (868 of 1781) PASS: lldb-unit :: Utility/./UtilityTests/ReproducerTest.SetReplay (869 of 1781) PASS: lldb-unit :: Utility/./UtilityTests/StringExtractorTest.DecodeHexU8_Exact (870 of 1781) PASS: lldb-api :: functionalities/breakpoint/breakpoint_language/TestBreakpointLanguage.py (871 of 1781) PASS: lldb-api :: functionalities/thread/thread_exit/TestThreadExit.py (872 of 1781) PASS: lldb-api :: lang/cpp/overloaded-functions/TestOverloadedFunctions.py (873 of 1781) UNSUPPORTED: lldb-api :: lang/objc/rdar-12408181/TestRdar12408181.py (874 of 1781) PASS: lldb-unit :: Utility/./UtilityTests/StringListTest.GetMaxStringLengthEmpty (875 of 1781) PASS: lldb-unit :: Utility/./UtilityTests/BinaryStreamTest.PutSLEB128SixBytes (876 of 1781) PASS: lldb-unit :: SymbolFile/DWARF/./SymbolFileDWARFTests/SymbolFileDWARFTests.TestAbbrevOrder1Start1 (877 of 1781) PASS: lldb-api :: functionalities/testid/TestTestId.py (878 of 1781) PASS: lldb-api :: functionalities/data-formatter/data-formatter-stl/libcxx/map/TestDataFormatterLibccMap.py (879 of 1781) PASS: lldb-unit :: Interpreter/./InterpreterTests/OptionArgParserTest.toChar (880 of 1781) PASS: lldb-unit :: Utility/./UtilityTests/UriParserTest.BracketedHostnamePort (881 of 1781) PASS: lldb-unit :: Interpreter/./InterpreterTests/CompletionTest.DirCompletionAbsolute (882 of 1781) PASS: lldb-api :: functionalities/tail_call_frames/sbapi_support/TestTailCallFrameSBAPI.py (883 of 1781) PASS: lldb-unit :: Host/./HostTests/SocketTest.DomainListenConnectAccept (884 of 1781) PASS: lldb-unit :: Utility/./UtilityTests/NameMatchesTest.Equals (885 of 1781) PASS: lldb-api :: functionalities/breakpoint/source_regexp/TestSourceRegexBreakpoints.py (886 of 1781) PASS: lldb-api :: commands/command/script/TestCommandScript.py (887 of 1781) PASS: lldb-unit :: UnwindAssembly/x86/./UnwindAssemblyx86Tests/Testx86AssemblyInspectionEngine.TestPopR13 (888 of 1781) PASS: lldb-unit :: Expression/./ExpressionTests/DiagnosticManagerTest.HasFixits (889 of 1781) PASS: lldb-api :: functionalities/data-formatter/data-formatter-stl/libcxx/string/TestDataFormatterLibcxxString.py (890 of 1781) PASS: lldb-api :: commands/expression/namespace_local_var_same_name_obj_c/TestNamespaceLocalVarSameNameObjC.py (891 of 1781) PASS: lldb-api :: functionalities/data-formatter/data-formatter-objc/TestDataFormatterObjCNSContainer.py (892 of 1781) PASS: lldb-api :: lang/cpp/incomplete-types/TestCppIncompleteTypes.py (893 of 1781) PASS: lldb-unit :: Utility/./UtilityTests/StringLexerTest.HasAtLeast (894 of 1781) PASS: lldb-api :: tools/lldb-server/TestGdbRemote_vCont.py (895 of 1781) PASS: lldb-shell :: SymbolFile/DWARF/find-variable-file.cpp (896 of 1781) PASS: lldb-unit :: Expression/./ExpressionTests/DWARFExpression.DW_OP_pick (897 of 1781) PASS: lldb-unit :: Utility/./UtilityTests/NameMatchesTest.RegularExpression (898 of 1781) PASS: lldb-unit :: Utility/./UtilityTests/RangeTest.Union (899 of 1781) UNSUPPORTED: lldb-api :: functionalities/data-formatter/data-formatter-stl/libcxx/function/TestLibCxxFunction.py (900 of 1781) PASS: lldb-api :: lang/cpp/operator-overload/TestOperatorOverload.py (901 of 1781) PASS: lldb-shell :: SymbolFile/DWARF/debug_loc.s (902 of 1781) PASS: lldb-unit :: Utility/./UtilityTests/StringListTest.ForRangeEmpty (903 of 1781) PASS: lldb-api :: functionalities/breakpoint/cpp_exception/TestCPPExceptionBreakpoint.py (904 of 1781) PASS: lldb-unit :: Process/gdb-remote/./ProcessGdbRemoteTests/GDBRemoteClientBaseTest.SendContinueDelegateStructuredDataReceipt (905 of 1781) PASS: lldb-api :: arm/emulation/TestEmulations.py (906 of 1781) UNSUPPORTED: lldb-shell :: Register/x86-64-zmm-read.test (907 of 1781) PASS: lldb-api :: functionalities/return-value/TestReturnValue.py (908 of 1781) PASS: lldb-api :: functionalities/modern-type-lookup/objc-modules/TestObjModulesModernTypeLookup.py (909 of 1781) PASS: lldb-api :: macosx/thread-names/TestInterruptThreadNames.py (910 of 1781) PASS: lldb-unit :: Utility/./UtilityTests/AnsiTerminal.Unknown (911 of 1781) PASS: lldb-shell :: ObjectFile/ELF/basic-info.yaml (912 of 1781) PASS: lldb-unit :: Interpreter/./InterpreterTests/CompletionTest.FileCompletionAbsolute (913 of 1781) PASS: lldb-api :: python_api/sbstructureddata/TestStructuredDataAPI.py (914 of 1781) PASS: lldb-api :: lang/objc/objc++/TestObjCXX.py (915 of 1781) PASS: lldb-shell :: Driver/TestSingleQuote.test (916 of 1781) PASS: lldb-api :: functionalities/gdb_remote_client/TestRecognizeBreakpoint.py (917 of 1781) PASS: lldb-api :: lang/objc/foundation/TestObjCMethodsString.py (918 of 1781) PASS: lldb-unit :: Language/Highlighting/./HighlighterTests/HighlighterTest.ClangEmptyInput (919 of 1781) PASS: lldb-unit :: Utility/./UtilityTests/SerializationRountripTest.SerializeDeserializePod (920 of 1781) PASS: lldb-unit :: Process/minidump/./LLDBMinidumpTests/MinidumpParserTest.GetPidWindows (921 of 1781) XFAIL: lldb-shell :: Register/x86-mm-xmm-read.test (922 of 1781) PASS: lldb-unit :: Utility/./UtilityTests/ScalarTest.SetValueFromCString (923 of 1781) PASS: lldb-api :: functionalities/data-formatter/data-formatter-stl/libcxx/queue/TestDataFormatterLibcxxQueue.py (924 of 1781) PASS: lldb-unit :: ScriptInterpreter/Python/./ScriptInterpreterPythonTests/PythonDataObjectsTest.TestObjectAttributes (925 of 1781) PASS: lldb-shell :: SymbolFile/Breakpad/symtab-macho.test (926 of 1781) PASS: lldb-api :: functionalities/thread/thread_specific_break/TestThreadSpecificBreakpoint.py (927 of 1781) PASS: lldb-shell :: SymbolFile/DWARF/find-method-local-struct.cpp (928 of 1781) PASS: lldb-api :: commands/expression/timeout/TestCallWithTimeout.py (929 of 1781) PASS: lldb-api :: python_api/value_var_update/TestValueVarUpdate.py (930 of 1781) PASS: lldb-unit :: Expression/./ExpressionTests/DiagnosticManagerTest.GetStringBasic (931 of 1781) PASS: lldb-api :: functionalities/inferior-assert/TestInferiorAssert.py (932 of 1781) PASS: lldb-shell :: SymbolFile/NativePDB/function-types-builtins.cpp (933 of 1781) PASS: lldb-unit :: Utility/./UtilityTests/StructuredDataTest.ParseJSONFromFile (934 of 1781) PASS: lldb-api :: functionalities/tail_call_frames/thread_step_out_message/TestArtificialFrameStepOutMessage.py (935 of 1781) PASS: lldb-unit :: ScriptInterpreter/Python/./ScriptInterpreterPythonTests/PythonDataObjectsTest.TestModuleNameResolutionNoDot (936 of 1781) PASS: lldb-unit :: Utility/./UtilityTests/GeneratorTest.GetOrCreate (937 of 1781) PASS: lldb-unit :: Utility/./UtilityTests/NameMatchesTest.Ignore (938 of 1781) PASS: lldb-unit :: UnwindAssembly/x86/./UnwindAssemblyx86Tests/Testx86AssemblyInspectionEngine.TestStackRealign8BitDisp_i386 (939 of 1781) PASS: lldb-api :: functionalities/breakpoint/dummy_target_breakpoints/TestBreakpointsWithNoTargets.py (940 of 1781) UNSUPPORTED: lldb-shell :: SymbolFile/NativePDB/ast-functions-msvc.cpp (941 of 1781) PASS: lldb-api :: functionalities/thread/concurrent_events/TestConcurrentSignalDelayWatch.py (942 of 1781) PASS: lldb-unit :: ObjectFile/PECOFF/./ObjectFilePECOFFTests/PECallFrameInfoTest.Basic_eh (943 of 1781) PASS: lldb-api :: functionalities/gdb_remote_client/TestStopPCs.py (944 of 1781) PASS: lldb-unit :: Utility/./UtilityTests/OptionsWithRawTest.WhitespaceSuffix (945 of 1781) PASS: lldb-unit :: Language/Highlighting/./HighlighterTests/HighlighterTest.ClangCursorPosAfterOtherToken (946 of 1781) PASS: lldb-shell :: Settings/TestSettingsSet.test (947 of 1781) PASS: lldb-unit :: Utility/./UtilityTests/RangeTest.LessThan (948 of 1781) PASS: lldb-api :: functionalities/breakpoint/consecutive_breakpoints/TestConsecutiveBreakpoints.py (949 of 1781) PASS: lldb-api :: lang/c/stepping/TestStepAndBreakpoints.py (950 of 1781) PASS: lldb-unit :: Utility/./UtilityTests/StringExtractorTest.GetNameColonValueSuccess (951 of 1781) PASS: lldb-unit :: Breakpoint/./LLDBBreakpointTests/BreakpointIDTest.StringIsBreakpointName (952 of 1781) PASS: lldb-shell :: SymbolFile/DWARF/debug-types-basic.test (953 of 1781) PASS: lldb-unit :: Utility/./UtilityTests/StringListTest.GetSize (954 of 1781) PASS: lldb-api :: commands/expression/test/TestExprs2.py (955 of 1781) PASS: lldb-unit :: ObjectFile/Breakpad/./ObjectFileBreakpadTests/PublicRecord.parse (956 of 1781) PASS: lldb-unit :: Utility/./UtilityTests/TimerTest.CategoryTimesStats (957 of 1781) PASS: lldb-unit :: Utility/./UtilityTests/StringListTest.InsertStringAtIndexEnd (958 of 1781) PASS: lldb-unit :: Utility/./UtilityTests/StreamTeeTest.SetStreamAtIndexOverwrite (959 of 1781) UNSUPPORTED: lldb-api :: tools/lldb-vscode/variables/TestVSCode_variables.py (960 of 1781) PASS: lldb-unit :: Utility/./UtilityTests/DataExtractorTest.GetMaxU64_unchecked (961 of 1781) PASS: lldb-unit :: UnwindAssembly/x86/./UnwindAssemblyx86Tests/Testx86AssemblyInspectionEngine.TestSimplei386ugmented (962 of 1781) PASS: lldb-api :: commands/disassemble/basic/TestFrameDisassemble.py (963 of 1781) PASS: lldb-api :: commands/expression/call-function/TestCallBuiltinFunction.py (964 of 1781) PASS: lldb-unit :: UnwindAssembly/x86/./UnwindAssemblyx86Tests/Testx86AssemblyInspectionEngine.TestPushRBPWithREX (965 of 1781) UNSUPPORTED: lldb-api :: linux/sepdebugsymlink/TestTargetSymbolsSepDebugSymlink.py (966 of 1781) PASS: lldb-unit :: Utility/./UtilityTests/StringListTest.JoinSingle (967 of 1781) PASS: lldb-unit :: Host/./HostTests/NativeProcessProtocolTest.SetBreakpointFailVerify (968 of 1781) PASS: lldb-unit :: Utility/./UtilityTests/StringExtractorTest.GetU64BigEndian (969 of 1781) PASS: lldb-api :: functionalities/data-formatter/data-formatter-objc/TestDataFormatterObjCNSDate.py (970 of 1781) PASS: lldb-unit :: Core/./LLDBCoreTests/UniqueCStringMap.NoDefaultConstructor (971 of 1781) PASS: lldb-shell :: SymbolFile/DWARF/debug-types-missing-signature.test (972 of 1781) PASS: lldb-api :: lang/objc/self/TestObjCSelf.py (973 of 1781) PASS: lldb-shell :: BuildScript/compiler-full-path.test (974 of 1781) PASS: lldb-unit :: Utility/./UtilityTests/ScalarTest.Division (975 of 1781) PASS: lldb-shell :: Settings/TestModuleCacheSanity.test (976 of 1781) PASS: lldb-unit :: SymbolFile/DWARF/./SymbolFileDWARFTests/SymbolFileDWARFTests.TestAbbrevOutOfOrder (977 of 1781) PASS: lldb-api :: functionalities/thread/concurrent_events/TestConcurrentWatchpointWithDelayWatchpointThreads.py (978 of 1781) PASS: lldb-unit :: Utility/./UtilityTests/OptionsWithRawTest.ArgsButNoLeadingDash (979 of 1781) UNSUPPORTED: lldb-api :: functionalities/breakpoint/hardware_breakpoints/hardware_breakpoint_on_multiple_threads/TestHWBreakMultiThread.py (980 of 1781) UNSUPPORTED: lldb-api :: functionalities/darwin_log/filter/regex/message/TestDarwinLogFilterRegexMessage.py (981 of 1781) PASS: lldb-api :: lang/c/register_variables/TestRegisterVariables.py (982 of 1781) PASS: lldb-unit :: Utility/./UtilityTests/StringExtractorTest.GetHexU8_InvalidHex (983 of 1781) PASS: lldb-unit :: UnwindAssembly/x86/./UnwindAssemblyx86Tests/Testx86AssemblyInspectionEngine.TestPopRBX (984 of 1781) PASS: lldb-unit :: Host/./HostTests/FileSystemTest.Exists (985 of 1781) PASS: lldb-unit :: SymbolFile/NativePDB/./SymbolFileNativePDBTests/PDBFPOProgramToDWARFExpressionTests.UnknownOp (986 of 1781) PASS: lldb-unit :: Utility/./UtilityTests/BinaryStreamTest.PutULEB128SixBytes (987 of 1781) UNSUPPORTED: lldb-api :: functionalities/darwin_log/filter/regex/subsystem/TestDarwinLogFilterRegexSubsystem.py (988 of 1781) PASS: lldb-api :: commands/expression/ir-interpreter-phi-nodes/TestIRInterpreterPHINodes.py (989 of 1781) PASS: lldb-shell :: Commands/command-script-import.test (990 of 1781) PASS: lldb-api :: functionalities/target_var/TestTargetVar.py (991 of 1781) PASS: lldb-api :: functionalities/thread/concurrent_events/TestConcurrentDelayWatchBreak.py (992 of 1781) PASS: lldb-api :: functionalities/data-formatter/data-formatter-cpp/TestDataFormatterCpp.py (993 of 1781) PASS: lldb-unit :: UnwindAssembly/x86/./UnwindAssemblyx86Tests/Testx86AssemblyInspectionEngine.TestPopEBP (994 of 1781) PASS: lldb-unit :: Host/./HostTests/SocketTest.UDPGetConnectURI (995 of 1781) PASS: lldb-unit :: Utility/./UtilityTests/UriParserTest.PortOverflow (996 of 1781) PASS: lldb-unit :: debugserver/./debugserverTests/RNBSocket.LoopBackListenIPv4 (997 of 1781) PASS: lldb-unit :: Utility/./UtilityTests/LogChannelTest.Enable (998 of 1781) PASS: lldb-api :: functionalities/postmortem/netbsd-core/TestNetBSDCore.py (999 of 1781) PASS: lldb-unit :: ScriptInterpreter/Python/./ScriptInterpreterPythonTests/PythonDataObjectsTest.TestPythonString (1000 of 1781) PASS: lldb-unit :: UnwindAssembly/x86/./UnwindAssemblyx86Tests/Testx86AssemblyInspectionEngine.TestReturnDetect (1001 of 1781) PASS: lldb-api :: functionalities/unwind/noreturn/module-end/TestNoReturnModuleEnd.py (1002 of 1781) PASS: lldb-api :: lang/cpp/unsigned_types/TestUnsignedTypes.py (1003 of 1781) PASS: lldb-api :: lang/c/modules/TestCModules.py (1004 of 1781) PASS: lldb-shell :: ObjectFile/PECOFF/basic-info.yaml (1005 of 1781) PASS: lldb-shell :: Commands/command-regex-delete.test (1006 of 1781) PASS: lldb-unit :: Process/gdb-remote/./ProcessGdbRemoteTests/GDBRemoteClientBaseTest.SendContinueDelegateInterface (1007 of 1781) PASS: lldb-api :: functionalities/breakpoint/breakpoint_ids/TestBreakpointIDs.py (1008 of 1781) PASS: lldb-api :: functionalities/data-formatter/data-formatter-enum-format/TestDataFormatterEnumFormat.py (1009 of 1781) UNSUPPORTED: lldb-api :: commands/expression/macros/TestMacros.py (1010 of 1781) PASS: lldb-unit :: ObjectFile/Breakpad/./ObjectFileBreakpadTests/FuncRecord.parse (1011 of 1781) UNSUPPORTED: lldb-shell :: SymbolFile/NativePDB/local-variables.cpp (1012 of 1781) PASS: lldb-api :: python_api/file_handle/TestFileHandle.py (1013 of 1781) PASS: lldb-api :: lang/cpp/extern_c/TestExternCSymbols.py (1014 of 1781) PASS: lldb-unit :: Language/Highlighting/./HighlighterTests/HighlighterTest.ClangCursorOutOfBounds (1015 of 1781) PASS: lldb-api :: lang/objc/objc-ivar-protocols/TestIvarProtocols.py (1016 of 1781) PASS: lldb-unit :: Utility/./UtilityTests/IndexToObjectTest.ObjectForIndex (1017 of 1781) PASS: lldb-unit :: Expression/./ExpressionTests/DWARFExpression.DW_OP_convert (1018 of 1781) PASS: lldb-api :: functionalities/data-formatter/ptr_ref_typedef/TestPtrRef2Typedef.py (1019 of 1781) PASS: lldb-unit :: Utility/./UtilityTests/StringExtractorTest.GetHexBytesAvail_Underflow (1020 of 1781) PASS: lldb-api :: commands/watchpoints/watchpoint_commands/TestWatchpointCommands.py (1021 of 1781) PASS: lldb-unit :: Target/./TargetTests/ModuleCacheTest.GetAndPut (1022 of 1781) PASS: lldb-api :: lang/objc/foundation/TestObjCMethods.py (1023 of 1781) PASS: lldb-unit :: ScriptInterpreter/Python/./ScriptInterpreterPythonTests/PythonExceptionStateTest.TestAcquisitionSemantics (1024 of 1781) PASS: lldb-api :: lang/cpp/namespace/TestNamespaceLookup.py (1025 of 1781) PASS: lldb-api :: lang/objc/objc-new-syntax/TestObjCNewSyntaxDictionary.py (1026 of 1781) PASS: lldb-shell :: ObjectFile/ELF/many-sections.s (1027 of 1781) PASS: lldb-unit :: Symbol/./SymbolTests/PostfixExpression.ParseFPOProgram (1028 of 1781) PASS: lldb-api :: commands/expression/completion/TestExprCompletion.py (1029 of 1781) PASS: lldb-unit :: SymbolFile/NativePDB/./SymbolFileNativePDBTests/PDBFPOProgramToDWARFExpressionTests.SingleAssignmentRegisterRef (1030 of 1781) PASS: lldb-api :: commands/expression/rdar44436068/Test128BitsInteger.py (1031 of 1781) PASS: lldb-unit :: Utility/./UtilityTests/BinaryStreamTest.PutSLEB128SevenBytes (1032 of 1781) PASS: lldb-unit :: Utility/./UtilityTests/ConstStringTest.FromMidOfBufferStringRef (1033 of 1781) PASS: lldb-api :: lang/cpp/namespace_definitions/TestNamespaceDefinitions.py (1034 of 1781) PASS: lldb-unit :: Utility/./UtilityTests/NameMatchesTest.Contains (1035 of 1781) PASS: lldb-unit :: Target/./TargetTests/PathMappingListTest.AbsoluteTests (1036 of 1781) PASS: lldb-api :: functionalities/pre_run_dylibs/TestPreRunDylibs.py (1037 of 1781) PASS: lldb-unit :: Symbol/./SymbolTests/TestClangASTContext.TestBuiltinTypeForEncodingAndBitSize (1038 of 1781) PASS: lldb-shell :: SymbolFile/DWARF/find-basic-function.cpp (1039 of 1781) PASS: lldb-unit :: debugserver/./debugserverTests/RNBSocket.LoopBackConnectIPv4 (1040 of 1781) PASS: lldb-api :: commands/frame/diagnose/bad-reference/TestBadReference.py (1041 of 1781) PASS: lldb-shell :: ObjectFile/PECOFF/export-dllfunc.yaml (1042 of 1781) PASS: lldb-shell :: SymbolFile/DWARF/debug-types-dwarf5.s (1043 of 1781) PASS: lldb-unit :: Process/minidump/./LLDBMinidumpTests/MinidumpParserTest.GetLinuxProcStatus_no_stream (1044 of 1781) PASS: lldb-unit :: Utility/./UtilityTests/Flags.Reset (1045 of 1781) UNSUPPORTED: lldb-api :: lang/objc/bitfield_ivars/TestBitfieldIvars.py (1046 of 1781) PASS: lldb-unit :: Utility/./UtilityTests/UUIDTest.SetFromStringRef (1047 of 1781) PASS: lldb-unit :: ScriptInterpreter/Python/./ScriptInterpreterPythonTests/PythonDataObjectsTest.TestPythonTupleInitializerList2 (1048 of 1781) PASS: lldb-shell :: SymbolFile/DWARF/debug_rnglists.s (1049 of 1781) PASS: lldb-unit :: Utility/./UtilityTests/GeneratorTest.Create (1050 of 1781) PASS: lldb-api :: functionalities/memory/find/TestMemoryFind.py (1051 of 1781) PASS: lldb-api :: functionalities/data-formatter/data-formatter-advanced/TestDataFormatterAdv.py (1052 of 1781) PASS: lldb-api :: macosx/lc-note/kern-ver-str/TestKernVerStrLCNOTE.py (1053 of 1781) PASS: lldb-unit :: Host/./HostTests/SocketTest.TCPGetAddress (1054 of 1781) PASS: lldb-api :: lang/c/local_types/TestUseClosestType.py (1055 of 1781) PASS: lldb-api :: lang/cpp/member-and-local-vars-with-same-name/TestMembersAndLocalsWithSameName.py (1056 of 1781) PASS: lldb-unit :: SymbolFile/NativePDB/./SymbolFileNativePDBTests/PDBFPOProgramToDWARFExpressionTests.InvalidOpUnary (1057 of 1781) PASS: lldb-api :: commands/expression/test/TestExprs.py (1058 of 1781) PASS: lldb-api :: commands/expression/completion-in-lambda-and-unnnamed-class/TestCompletionInLambdaAndUnnamedClass.py (1059 of 1781) PASS: lldb-unit :: Expression/./ExpressionTests/CppModuleConfigurationTest.Xcode (1060 of 1781) PASS: lldb-api :: functionalities/thread/concurrent_events/TestConcurrentSignalWatch.py (1061 of 1781) PASS: lldb-unit :: Utility/./UtilityTests/RangeTest.Clear (1062 of 1781) PASS: lldb-api :: lang/objc/single-entry-dictionary/TestObjCSingleEntryDictionary.py (1063 of 1781) PASS: lldb-api :: functionalities/memory/cache/TestMemoryCache.py (1064 of 1781) PASS: lldb-shell :: SymbolFile/DWARF/childless-compile-unit.s (1065 of 1781) PASS: lldb-unit :: Utility/./UtilityTests/SerializationRountripTest.SerializeDeserializeObjectReference (1066 of 1781) PASS: lldb-unit :: SymbolFile/NativePDB/./SymbolFileNativePDBTests/PDBFPOProgramToDWARFExpressionTests.MissingTargetRegister (1067 of 1781) PASS: lldb-unit :: Utility/./UtilityTests/ArchSpecTest.TestParseMachCPUDashSubtypeTripleExtra (1068 of 1781) PASS: lldb-api :: functionalities/data-formatter/data-formatter-categories/TestDataFormatterCategories.py (1069 of 1781) PASS: lldb-api :: functionalities/memory-region/TestMemoryRegion.py (1070 of 1781) PASS: lldb-unit :: Language/CPlusPlus/./LanguageCPlusPlusTests/CPlusPlusLanguage.CPlusPlusNameParser (1071 of 1781) PASS: lldb-api :: functionalities/data-formatter/nsarraysynth/TestNSArraySynthetic.py (1072 of 1781) UNSUPPORTED: lldb-api :: lang/cpp/function-template-parameter-pack/TestFunctionTemplateParameterPack.py (1073 of 1781) PASS: lldb-unit :: Utility/./UtilityTests/DataExtractorTest.GetBitfield (1074 of 1781) PASS: lldb-unit :: Host/./HostTests/ConnectionFileDescriptorTest.TCPGetURIv4 (1075 of 1781) PASS: lldb-shell :: SymbolFile/DWARF/dir-separator-no-comp-dir.s (1076 of 1781) PASS: lldb-api :: functionalities/data-formatter/data-formatter-stl/libcxx/optional/TestDataFormatterLibcxxOptional.py (1077 of 1781) PASS: lldb-unit :: Utility/./UtilityTests/StringListTest.AppendList (1078 of 1781) PASS: lldb-unit :: Host/./HostTests/MainLoopTest.Signal (1079 of 1781) PASS: lldb-unit :: ScriptInterpreter/Python/./ScriptInterpreterPythonTests/PythonDataObjectsTest.TestPythonDictionaryToStructuredDictionary (1080 of 1781) PASS: lldb-shell :: ObjectFile/ELF/short-build-id.yaml (1081 of 1781) PASS: lldb-api :: lang/objc/objc-static-method-stripped/TestObjCStaticMethodStripped.py (1082 of 1781) PASS: lldb-unit :: Process/minidump/./LLDBMinidumpTests/MinidumpParserTest.GetMemory (1083 of 1781) PASS: lldb-unit :: Utility/./UtilityTests/RangeTest.ContainsRange (1084 of 1781) PASS: lldb-shell :: ObjectFile/ELF/PT_LOAD-overlap-PT_INTERP.yaml (1085 of 1781) PASS: lldb-api :: functionalities/history/TestHistoryRecall.py (1086 of 1781) PASS: lldb-api :: lang/objcxx/cxx-bridged-po/TestObjCXXBridgedPO.py (1087 of 1781) PASS: lldb-shell :: BuildScript/modes.test (1088 of 1781) PASS: lldb-api :: lang/cpp/static_methods/TestCPPStaticMethods.py (1089 of 1781) PASS: lldb-api :: functionalities/postmortem/elf-core/TestLinuxCore.py (1090 of 1781) PASS: lldb-unit :: UnwindAssembly/x86/./UnwindAssemblyx86Tests/Testx86AssemblyInspectionEngine.Testi386IgnoredRegisters (1091 of 1781) PASS: lldb-api :: commands/expression/radar_9673664/TestExprHelpExamples.py (1092 of 1781) PASS: lldb-api :: python_api/default-constructor/TestDefaultConstructorForAPIObjects.py (1093 of 1781) PASS: lldb-unit :: Utility/./UtilityTests/StreamTeeTest.Write (1094 of 1781) PASS: lldb-api :: types/TestRecursiveTypes.py (1095 of 1781) PASS: lldb-api :: lang/objc/objc-optimized/TestObjcOptimized.py (1096 of 1781) PASS: lldb-unit :: Utility/./UtilityTests/StringExtractorTest.GetHexU8_Underflow2_NoEof (1097 of 1781) PASS: lldb-unit :: Utility/./UtilityTests/StringListTest.InsertStringAtIndexOutOfBounds (1098 of 1781) PASS: lldb-unit :: Core/./LLDBCoreTests/RichManglingContextTest.Basic (1099 of 1781) PASS: lldb-api :: api/log/TestAPILog.py (1100 of 1781) PASS: lldb-api :: python_api/interpreter/TestCommandInterpreterAPI.py (1101 of 1781) PASS: lldb-unit :: Utility/./UtilityTests/VMRange.IsValid (1102 of 1781) PASS: lldb-api :: lang/cpp/unique-types/TestUniqueTypes.py (1103 of 1781) PASS: lldb-unit :: Utility/./UtilityTests/StringListTest.JoinNonSpace (1104 of 1781) PASS: lldb-unit :: Host/./HostTests/FileSystemTest.GetByteSize (1105 of 1781) PASS: lldb-api :: lang/objc/objc-static-method/TestObjCStaticMethod.py (1106 of 1781) PASS: lldb-unit :: Utility/./UtilityTests/VMRange.Comparison (1107 of 1781) UNSUPPORTED: lldb-shell :: SymbolFile/PDB/typedefs.test (1108 of 1781) PASS: lldb-unit :: Utility/./UtilityTests/StreamTest.PutChar (1109 of 1781) PASS: lldb-api :: functionalities/data-formatter/data-formatter-script/TestDataFormatterScript.py (1110 of 1781) PASS: lldb-unit :: Utility/./UtilityTests/StringListTest.ForRange (1111 of 1781) PASS: lldb-api :: lang/objc/blocks/TestObjCIvarsInBlocks.py (1112 of 1781) PASS: lldb-unit :: ObjectFile/Breakpad/./ObjectFileBreakpadTests/StackWinRecord.parse (1113 of 1781) PASS: lldb-api :: commands/frame/var/TestFrameVar.py (1114 of 1781) PASS: lldb-api :: types/TestFloatTypesExpr.py (1115 of 1781) PASS: lldb-unit :: Utility/./UtilityTests/RangeTest.Equal (1116 of 1781) PASS: lldb-api :: python_api/function_symbol/TestDisasmAPI.py (1117 of 1781) PASS: lldb-api :: commands/target/create-no-such-arch/TestNoSuchArch.py (1118 of 1781) PASS: lldb-shell :: Unwind/trap_frame_sym_ctx.test (1119 of 1781) UNSUPPORTED: lldb-api :: tools/lldb-vscode/step/TestVSCode_step.py (1120 of 1781) PASS: lldb-unit :: Process/minidump/./LLDBMinidumpTests/MinidumpParserTest.InvalidMinidump (1121 of 1781) PASS: lldb-unit :: SymbolFile/DWARF/./SymbolFileDWARFTests/SymbolFileDWARFTests.TestAbbrevValidAttrNullForm (1122 of 1781) PASS: lldb-api :: lang/cpp/unicode-literals/TestUnicodeLiterals.py (1123 of 1781) PASS: lldb-api :: functionalities/multiword-commands/TestMultiWordCommands.py (1124 of 1781) PASS: lldb-unit :: Utility/./UtilityTests/StateTest.Formatv (1125 of 1781) PASS: lldb-unit :: SymbolFile/DWARF/./SymbolFileDWARFTests/DWARFASTParserClangTests.EnsureAllDIEsInDeclContextHaveBeenParsedParsesOnlyMatchingEntries (1126 of 1781) PASS: lldb-unit :: Utility/./UtilityTests/ConstStringTest.CompareConstString (1127 of 1781) PASS: lldb-api :: functionalities/data-formatter/poarray/TestPrintObjectArray.py (1128 of 1781) PASS: lldb-unit :: Utility/./UtilityTests/BinaryStreamTest.PutSLEB128FiveBytes (1129 of 1781) PASS: lldb-api :: lang/c/tls_globals/TestTlsGlobals.py (1130 of 1781) PASS: lldb-unit :: Utility/./UtilityTests/OptionsWithRawTest.EmptySuffix (1131 of 1781) PASS: lldb-unit :: Utility/./UtilityTests/StringListTest.GetMaxStringLengthIncreasingSize (1132 of 1781) PASS: lldb-api :: python_api/interpreter/TestRunCommandInterpreterAPI.py (1133 of 1781) PASS: lldb-shell :: Process/TestEnvironment.test (1134 of 1781) PASS: lldb-unit :: Process/gdb-remote/./ProcessGdbRemoteTests/GDBRemoteCommunicationClientTest.SendSignalsToIgnore (1135 of 1781) PASS: lldb-unit :: Utility/./UtilityTests/AnsiTerminal.WhiteSpace (1136 of 1781) PASS: lldb-unit :: ScriptInterpreter/Python/./ScriptInterpreterPythonTests/PythonDataObjectsTest.TestPythonStringToStr (1137 of 1781) PASS: lldb-api :: python_api/frame/TestFrames.py (1138 of 1781) UNSUPPORTED: lldb-api :: functionalities/data-formatter/data-formatter-stl/libstdcpp/string/TestDataFormatterStdString.py (1139 of 1781) PASS: lldb-api :: commands/watchpoints/multiple_hits/TestMultipleHits.py (1140 of 1781) PASS: lldb-unit :: Utility/./UtilityTests/RangeTest.Constructor (1141 of 1781) UNSUPPORTED: lldb-shell :: SymbolFile/PDB/compilands.test (1142 of 1781) PASS: lldb-unit :: ObjectFile/Breakpad/./ObjectFileBreakpadTests/InfoRecord.parse (1143 of 1781) PASS: lldb-unit :: Utility/./UtilityTests/StreamTest.ShiftOperatorUInts (1144 of 1781) PASS: lldb-api :: python_api/watchpoint/condition/TestWatchpointConditionAPI.py (1145 of 1781) PASS: lldb-unit :: Utility/./UtilityTests/StreamTest.PutRawBytesToMixedEndian (1146 of 1781) PASS: lldb-unit :: Process/gdb-remote/./ProcessGdbRemoteTests/GDBRemoteCommunicationClientTest.SyncThreadState (1147 of 1781) PASS: lldb-api :: commands/expression/persistent_ptr_update/TestPersistentPtrUpdate.py (1148 of 1781) PASS: lldb-unit :: Utility/./UtilityTests/StringListTest.CopyListSingle (1149 of 1781) PASS: lldb-api :: commands/settings/quoting/TestQuoting.py (1150 of 1781) PASS: lldb-unit :: Utility/./UtilityTests/CompletionRequest.DuplicateFilteringWithComments (1151 of 1781) PASS: lldb-unit :: Utility/./UtilityTests/FileSpecTest.PrependPathComponent (1152 of 1781) PASS: lldb-api :: functionalities/data-formatter/synthcapping/TestSyntheticCapping.py (1153 of 1781) UNSUPPORTED: lldb-shell :: SymbolFile/PDB/calling-conventions.test (1154 of 1781) PASS: lldb-api :: lang/c/vla/TestVLA.py (1155 of 1781) PASS: lldb-unit :: Host/./HostTests/MainLoopTest.UnmonitoredSignal (1156 of 1781) UNSUPPORTED: lldb-api :: python_api/event/TestEvents.py (1157 of 1781) PASS: lldb-api :: commands/expression/import-std-module/shared_ptr-dbg-info-content/TestSharedPtrDbgInfoContent.py (1158 of 1781) PASS: lldb-api :: commands/target/stop-hooks/TestStopHooks.py (1159 of 1781) PASS: lldb-shell :: Breakpoint/debug_rnglist_offset_pair.test (1160 of 1781) PASS: lldb-unit :: Language/Highlighting/./HighlighterTests/HighlighterTest.ClangCursorPosBeforeOtherToken (1161 of 1781) UNSUPPORTED: lldb-api :: functionalities/data-formatter/data-formatter-stl/libstdcpp/map/TestDataFormatterStdMap.py (1162 of 1781) PASS: lldb-unit :: ScriptInterpreter/Python/./ScriptInterpreterPythonTests/PythonExceptionStateTest.TestAutoRestoreChanged (1163 of 1781) PASS: lldb-unit :: UnwindAssembly/x86/./UnwindAssemblyx86Tests/Testx86AssemblyInspectionEngine.TestPopRBP (1164 of 1781) PASS: lldb-unit :: Utility/./UtilityTests/BinaryStreamTest.PutULEB128OneByte (1165 of 1781) UNSUPPORTED: lldb-api :: tools/lldb-server/signal-filtering/TestGdbRemote_QPassSignals.py (1166 of 1781) PASS: lldb-unit :: Utility/./UtilityTests/StreamTest.ChangingByteOrder (1167 of 1781) PASS: lldb-api :: functionalities/data-formatter/data-formatter-skip-summary/TestDataFormatterSkipSummary.py (1168 of 1781) PASS: lldb-api :: functionalities/data-formatter/format-propagation/TestFormatPropagation.py (1169 of 1781) PASS: lldb-unit :: Host/./HostTests/SocketAddressTest.GetAddressInfo (1170 of 1781) PASS: lldb-api :: lang/cpp/wchar_t/TestCxxWCharT.py (1171 of 1781) PASS: lldb-unit :: Expression/./ExpressionTests/CppModuleConfigurationTest.IgnoreLibStdCpp (1172 of 1781) PASS: lldb-unit :: Process/minidump/./LLDBMinidumpTests/MinidumpParserTest.MinidumpModuleOrder (1173 of 1781) PASS: lldb-api :: commands/expression/char/TestExprsChar.py (1174 of 1781) PASS: lldb-unit :: Process/gdb-remote/./ProcessGdbRemoteTests/GDBRemoteCommunicationClientTest.WriteRegisterNoSuffix (1175 of 1781) PASS: lldb-api :: functionalities/breakpoint/inlined_breakpoints/TestInlinedBreakpoints.py (1176 of 1781) PASS: lldb-api :: functionalities/data-formatter/data-formatter-python-synth/TestDataFormatterPythonSynth.py (1177 of 1781) PASS: lldb-api :: commands/expression/unicode-in-variable/TestUnicodeInVariable.py (1178 of 1781) PASS: lldb-unit :: Symbol/./SymbolTests/TestClangASTContext.TestGetBasicTypeFromName (1179 of 1781) PASS: lldb-unit :: Utility/./UtilityTests/StringListTest.InsertStringAtIndexStart (1180 of 1781) PASS: lldb-unit :: Utility/./UtilityTests/Flags.AllSet (1181 of 1781) PASS: lldb-api :: functionalities/source-map/TestTargetSourceMap.py (1182 of 1781) PASS: lldb-api :: functionalities/breakpoint/breakpoint_conditions/TestBreakpointConditions.py (1183 of 1781) PASS: lldb-unit :: Host/./HostTests/ProcessLaunchInfoTest.Constructor (1184 of 1781) PASS: lldb-unit :: Utility/./UtilityTests/StringLexerTest.Peek (1185 of 1781) PASS: lldb-api :: functionalities/thread/exit_during_break/TestExitDuringBreak.py (1186 of 1781) PASS: lldb-shell :: Reproducer/Functionalities/TestStepping.test (1187 of 1781) PASS: lldb-api :: functionalities/tsan/global_location/TestTsanGlobalLocation.py (1188 of 1781) PASS: lldb-unit :: Expression/./ExpressionTests/CppModuleConfigurationTest.AmbiguousCLib (1189 of 1781) PASS: lldb-unit :: Utility/./UtilityTests/StringListTest.RemoveBlankLines (1190 of 1781) PASS: lldb-api :: lang/cpp/stl/TestStdCXXDisassembly.py (1191 of 1781) PASS: lldb-api :: commands/watchpoints/watchpoint_events/TestWatchpointEvents.py (1192 of 1781) PASS: lldb-shell :: Reproducer/Functionalities/TestImageList.test (1193 of 1781) PASS: lldb-shell :: SymbolFile/DWARF/forward-declarations.s (1194 of 1781) PASS: lldb-unit :: Utility/./UtilityTests/StreamTeeTest.GetStreamAtIndexOutOfBounds (1195 of 1781) PASS: lldb-api :: functionalities/data-formatter/frameformat_smallstruct/TestFrameFormatSmallStruct.py (1196 of 1781) PASS: lldb-api :: functionalities/breakpoint/global_constructor/TestBreakpointInGlobalConstructor.py (1197 of 1781) PASS: lldb-unit :: Utility/./UtilityTests/UriParserTest.Minimal (1198 of 1781) PASS: lldb-api :: functionalities/thread/concurrent_events/TestConcurrentManyWatchpoints.py (1199 of 1781) UNSUPPORTED: lldb-api :: functionalities/thread/thread_specific_break_plus_condition/TestThreadSpecificBpPlusCondition.py (1200 of 1781) PASS: lldb-api :: functionalities/thread/crash_during_step/TestCrashDuringStep.py (1201 of 1781) PASS: lldb-api :: python_api/value/change_values/TestChangeValueAPI.py (1202 of 1781) PASS: lldb-api :: functionalities/data-formatter/nsdictionarysynth/TestNSDictionarySynthetic.py (1203 of 1781) PASS: lldb-unit :: Process/gdb-remote/./ProcessGdbRemoteTests/GDBRemoteCommunicationClientTest.SaveRestoreRegistersNoSuffix (1204 of 1781) PASS: lldb-unit :: Utility/./UtilityTests/StreamTest.PutCharNull (1205 of 1781) PASS: lldb-unit :: Utility/./UtilityTests/UriParserTest.SchemeHostSeparator4 (1206 of 1781) PASS: lldb-unit :: Utility/./UtilityTests/ArgsTest.TestInsertArg (1207 of 1781) PASS: lldb-api :: functionalities/ubsan/user-expression/TestUbsanUserExpression.py (1208 of 1781) PASS: lldb-api :: lang/c/strings/TestCStrings.py (1209 of 1781) PASS: lldb-unit :: Utility/./UtilityTests/BroadcasterTest.BroadcastEvent (1210 of 1781) PASS: lldb-unit :: Utility/./UtilityTests/ArgsTest.ReplaceArgumentAtIndexEqual (1211 of 1781) PASS: lldb-unit :: Symbol/./SymbolTests/LineEntryTest.GetSameLineContiguousAddressRangeOneInline (1212 of 1781) PASS: lldb-unit :: Process/gdb-remote/./ProcessGdbRemoteTests/GDBRemoteCommunicationServerTest.SendErrorResponse_ErrorList (1213 of 1781) PASS: lldb-shell :: Settings/TestStopCommandSourceOnError.test (1214 of 1781) PASS: lldb-api :: commands/watchpoints/watchpoint_commands/command/TestWatchpointCommandPython.py (1215 of 1781) UNSUPPORTED: lldb-api :: functionalities/data-formatter/data-formatter-stl/libstdcpp/list/TestDataFormatterStdList.py (1216 of 1781) PASS: lldb-unit :: Utility/./UtilityTests/UUIDTest.StringConverion (1217 of 1781) PASS: lldb-unit :: Utility/./UtilityTests/StreamTest.PutNHex8 (1218 of 1781) PASS: lldb-api :: functionalities/thread/concurrent_events/TestConcurrentBreakpointDelayBreakpointOneSignal.py (1219 of 1781) PASS: lldb-unit :: Host/./HostTests/MainLoopTest.TerminatesImmediately (1220 of 1781) UNSUPPORTED: lldb-api :: functionalities/thread/state/TestThreadStates.py (1221 of 1781) PASS: lldb-unit :: Utility/./UtilityTests/ScalarTest.GetValue (1222 of 1781) PASS: lldb-shell :: Minidump/disassemble-no-module.yaml (1223 of 1781) PASS: lldb-unit :: Utility/./UtilityTests/ConstStringTest.MangledCounterpart (1224 of 1781) PASS: lldb-api :: commands/expression/import-std-module/deque-basic/TestBasicDeque.py (1225 of 1781) PASS: lldb-unit :: Utility/./UtilityTests/RegularExpression.CopyAssignment (1226 of 1781) PASS: lldb-shell :: Settings/TestEchoCommands.test (1227 of 1781) PASS: lldb-unit :: Core/./LLDBCoreTests/StreamCallbackTest.Callback (1228 of 1781) PASS: lldb-shell :: Driver/TestCore.test (1229 of 1781) PASS: lldb-unit :: Editline/./EditlineTests/EditlineTestFixture.EditlineReceivesMultiLineText (1230 of 1781) PASS: lldb-api :: tools/lldb-server/TestGdbRemoteAttach.py (1231 of 1781) PASS: lldb-api :: commands/expression/persistent_types/TestNestedPersistentTypes.py (1232 of 1781) PASS: lldb-api :: commands/expression/import-std-module/vector-bool/TestBoolVector.py (1233 of 1781) PASS: lldb-api :: lang/cpp/limit-debug-info/TestWithLimitDebugInfo.py (1234 of 1781) PASS: lldb-api :: python_api/value/linked_list/TestValueAPILinkedList.py (1235 of 1781) PASS: lldb-api :: functionalities/param_entry_vals/basic_entry_values_x86_64/TestBasicEntryValuesX86_64.py (1236 of 1781) PASS: lldb-shell :: ObjectFile/ELF/build-id-case.yaml (1237 of 1781) PASS: lldb-api :: commands/expression/import-std-module/stack/TestStack.py (1238 of 1781) PASS: lldb-api :: commands/expression/import-std-module/unique_ptr-dbg-info-content/TestUniquePtrDbgInfoContent.py (1239 of 1781) PASS: lldb-api :: lang/c/const_variables/TestConstVariables.py (1240 of 1781) PASS: lldb-api :: functionalities/breakpoint/breakpoint_command/TestBreakpointCommand.py (1241 of 1781) PASS: lldb-api :: functionalities/inferior-crashing/TestInferiorCrashing.py (1242 of 1781) PASS: lldb-shell :: SymbolFile/DWARF/debug-names-compressed.cpp (1243 of 1781) PASS: lldb-unit :: Process/gdb-remote/./ProcessGdbRemoteTests/GDBRemoteClientBaseTest.SendContinueAndInterrupt2PacketBug (1244 of 1781) UNSUPPORTED: lldb-api :: functionalities/thread/concurrent_events/TestConcurrentManySignals.py (1245 of 1781) PASS: lldb-shell :: Quit/TestQuitExitCodeNonInt.test (1246 of 1781) PASS: lldb-shell :: SymbolFile/Breakpad/line-table-edgecases.test (1247 of 1781) PASS: lldb-unit :: Utility/./UtilityTests/UriParserTest.MinimalPortPath (1248 of 1781) PASS: lldb-unit :: ScriptInterpreter/Python/./ScriptInterpreterPythonTests/PythonDataObjectsTest.TestDictionaryResolutionWithDot (1249 of 1781) PASS: lldb-unit :: Process/minidump/./LLDBMinidumpTests/MinidumpParserTest.GetMiscInfo_no_stream (1250 of 1781) PASS: lldb-api :: functionalities/rerun/TestRerun.py (1251 of 1781) PASS: lldb-api :: functionalities/paths/TestPaths.py (1252 of 1781) PASS: lldb-unit :: Symbol/./SymbolTests/SymbolsTest.TerminateLocateExecutableSymbolFileForUnknownExecutableAndUnknownSymbolFile (1253 of 1781) PASS: lldb-api :: commands/log/basic/TestLogging.py (1254 of 1781) PASS: lldb-unit :: Utility/./UtilityTests/FileSpecTest.EqualSeparator (1255 of 1781) PASS: lldb-unit :: Utility/./UtilityTests/ArgsTest.TestOverwriteArgs (1256 of 1781) UNSUPPORTED: lldb-api :: functionalities/darwin_log/basic/TestDarwinLogBasic.py (1257 of 1781) PASS: lldb-shell :: SymbolFile/NativePDB/bitfields.cpp (1258 of 1781) PASS: lldb-unit :: Language/Highlighting/./HighlighterTests/HighlighterTest.ClangPPDirectives (1259 of 1781) PASS: lldb-unit :: Utility/./UtilityTests/ProcessInstanceInfo.DumpTable (1260 of 1781) PASS: lldb-api :: sample_test/TestSampleTest.py (1261 of 1781) PASS: lldb-api :: functionalities/data-formatter/nssetsynth/TestNSSetSynthetic.py (1262 of 1781) PASS: lldb-api :: types/TestFloatTypes.py (1263 of 1781) PASS: lldb-api :: tools/lldb-server/TestGdbRemoteExpeditedRegisters.py (1264 of 1781) PASS: lldb-shell :: Commands/command-backtrace.test (1265 of 1781) FAIL: lldb-api :: tools/lldb-server/TestGdbRemoteProcessInfo.py (1266 of 1781) ******************** TEST 'lldb-api :: tools/lldb-server/TestGdbRemoteProcessInfo.py' FAILED ******************** lldb version 10.0.99 (http://labmaster3.local/git/llvm-project.git revision 078bec6c48dd9d17ab9720897d2bb7ccbb886763) clang revision 4d1ecadda59ce82e5fa6e28dd15bf794eee88363 llvm revision 4d1ecadda59ce82e5fa6e28dd15bf794eee88363 LLDB library dir: /Users/buildslave/jenkins/workspace/lldb-cmake-sanitized/lldb-build/bin LLDB import library dir: /Users/buildslave/jenkins/workspace/lldb-cmake-sanitized/lldb-build/bin libstdcxx tests will not be run because: Don't know how to build with libstdcxx on macosx Skipping following debug info categories: ['dwo']

Hide Details

Session logs for test failures/errors/unexpected successes will go into directory '/Users/buildslave/jenkins/workspace/lldb-cmake-sanitized/test/logs' Command invoked: /Users/buildslave/jenkins/workspace/lldb-cmake-sanitized/llvm-project/lldb/test/API/dotest.py --arch=x86_64 -s /Users/buildslave/jenkins/workspace/lldb-cmake-sanitized/lldb-build/lldb-test-traces -S nm -u CXXFLAGS -u CFLAGS --executable /Users/buildslave/jenkins/workspace/lldb-cmake-sanitized/lldb-build/./bin/lldb --dsymutil /Users/buildslave/jenkins/workspace/lldb-cmake-sanitized/lldb-build/./bin/dsymutil --filecheck /Users/buildslave/jenkins/workspace/lldb-cmake-sanitized/lldb-build/./bin/FileCheck -C /Users/buildslave/jenkins/workspace/lldb-cmake-sanitized/host-compiler/bin/clang --codesign-identity lldb_codesign --server /Users/buildslave/jenkins/workspace/lldb-cmake-sanitized/lldb-build/./bin/debugserver --arch x86_64 --build-dir /Users/buildslave/jenkins/workspace/lldb-cmake-sanitized/lldb-build/lldb-test-build.noindex -s=/Users/buildslave/jenkins/workspace/lldb-cmake-sanitized/test/logs -t --env TERM=vt100 --env LLVM_LIBS_DIR=/Users/buildslave/jenkins/workspace/lldb-cmake-sanitized/lldb-build/./lib --build-dir /Users/buildslave/jenkins/workspace/lldb-cmake-sanitized/lldb-build/tools/lldb/lldb-test-build.noindex --lldb-module-cache-dir /Users/buildslave/jenkins/workspace/lldb-cmake-sanitized/lldb-build/tools/lldb/lldb-test-build.noindex/module-cache-lldb/lldb-api --clang-module-cache-dir /Users/buildslave/jenkins/workspace/lldb-cmake-sanitized/lldb-build/tools/lldb/lldb-test-build.noindex/module-cache-clang/lldb-api /Users/buildslave/jenkins/workspace/lldb-cmake-sanitized/llvm-project/lldb/packages/Python/lldbsuite/test/tools/lldb-server -p TestGdbRemoteProcessInfo.py Change dir to: /Users/buildslave/jenkins/workspace/lldb-cmake-sanitized/llvm-project/lldb/packages/Python/lldbsuite/test/tools/lldb-server runCmd: settings set symbols.enable-external-lookup false output:

Hide Details

runCmd: settings set plugin.process.gdb-remote.packet-timeout 60 output:

Hide Details

runCmd: settings set symbols.clang-modules-cache-path "/Users/buildslave/jenkins/workspace/lldb-cmake-sanitized/lldb-build/tools/lldb/lldb-test-build.noindex/module-cache-lldb/lldb-api" output:

Hide Details

runCmd: settings set use-color false output:

Hide Details

Adding tearDown hook: def shutdown_named_pipe(): # Close the pipe. try: named_pipe.close() except: print("failed to close named pipe") None

Hide Details

# Delete the pipe. try: os.remove(named_pipe_path) except: print("failed to delete named pipe: {}".format(named_pipe_path)) None

Hide Details

# Delete the temp directory. try: os.rmdir(temp_dir) except: print( "failed to delete temp dir: {}, directory contents: '{}'".format( temp_dir, os.listdir(temp_dir))) None

Hide Details

Hide Details

Adding tearDown hook: def shutdown_process_for_attach(): try: inferior.terminate() except: logger.warning( "failed to terminate inferior process for attach: {}; ignoring".format( sys.exc_info()[0]))

Hide Details

Hide Details

Adding tearDown hook: def cleanupSubprocesses(self): # Ensure any subprocesses are cleaned up for p in self.subprocesses: p.terminate() del p del self.subprocesses[:] # Ensure any forked processes are cleaned up for pid in self.forkedProcessPids: if os.path.exists("/proc/" + str(pid)): os.kill(pid, signal.SIGTERM)

Hide Details

Hide Details

Adding tearDown hook: def shutdown_debug_monitor(): try: server.terminate() except: logger.warning( "failed to terminate server for debug monitor: {}; ignoring".format( sys.exc_info()[0]))

Hide Details

Hide Details

Adding tearDown hook: def shutdown_socket(): if sock: try: # send the kill packet so lldb-server shuts down gracefully sock.sendall(GdbRemoteTestCaseBase._GDBREMOTE_KILL_PACKET) except: logger.warning( "failed to send kill packet to debug monitor: {}; ignoring".format( sys.exc_info()[0]))

Hide Details

try: sock.close() except: logger.warning( "failed to close socket to debug monitor: {}; ignoring".format( sys.exc_info()[0]))

Hide Details

Hide Details

Executing tearDown hook: def shutdown_socket(): if sock: try: # send the kill packet so lldb-server shuts down gracefully sock.sendall(GdbRemoteTestCaseBase._GDBREMOTE_KILL_PACKET) except: logger.warning( "failed to send kill packet to debug monitor: {}; ignoring".format( sys.exc_info()[0]))

Hide Details

try: sock.close() except: logger.warning( "failed to close socket to debug monitor: {}; ignoring".format( sys.exc_info()[0]))

Hide Details

Hide Details

Executing tearDown hook: def shutdown_debug_monitor(): try: server.terminate() except: logger.warning( "failed to terminate server for debug monitor: {}; ignoring".format( sys.exc_info()[0]))

Hide Details

Hide Details

Executing tearDown hook: def cleanupSubprocesses(self): # Ensure any subprocesses are cleaned up for p in self.subprocesses: p.terminate() del p del self.subprocesses[:] # Ensure any forked processes are cleaned up for pid in self.forkedProcessPids: if os.path.exists("/proc/" + str(pid)): os.kill(pid, signal.SIGTERM)

Hide Details

Hide Details

Executing tearDown hook: def shutdown_process_for_attach(): try: inferior.terminate() except: logger.warning( "failed to terminate inferior process for attach: {}; ignoring".format( sys.exc_info()[0]))

Hide Details

Hide Details

Executing tearDown hook: def shutdown_named_pipe(): # Close the pipe. try: named_pipe.close() except: print("failed to close named pipe") None

Hide Details

# Delete the pipe. try: os.remove(named_pipe_path) except: print("failed to delete named pipe: {}".format(named_pipe_path)) None

Hide Details

# Delete the temp directory. try: os.rmdir(temp_dir) except: print( "failed to delete temp dir: {}, directory contents: '{}'".format( temp_dir, os.listdir(temp_dir))) None

Hide Details

Hide Details

PASS: LLDB (/Users/buildslave/jenkins/workspace/lldb-cmake-sanitized/host-compiler/bin/clang-10-x86_64) :: test_attach_commandline_qProcessInfo_reports_correct_pid_debugserver (TestGdbRemoteProcessInfo.TestGdbRemoteProcessInfo) runCmd: settings set symbols.enable-external-lookup false output:

Hide Details

runCmd: settings set plugin.process.gdb-remote.packet-timeout 60 output:

Hide Details

runCmd: settings set symbols.clang-modules-cache-path "/Users/buildslave/jenkins/workspace/lldb-cmake-sanitized/lldb-build/tools/lldb/lldb-test-build.noindex/module-cache-lldb/lldb-api" output:

Hide Details

runCmd: settings set use-color false output:

Hide Details

UNSUPPORTED: LLDB (/Users/buildslave/jenkins/workspace/lldb-cmake-sanitized/host-compiler/bin/clang-10-x86_64) :: test_attach_commandline_qProcessInfo_reports_correct_pid_llgs (TestGdbRemoteProcessInfo.TestGdbRemoteProcessInfo) (llgs tests) runCmd: settings set symbols.enable-external-lookup false output:

Hide Details

runCmd: settings set plugin.process.gdb-remote.packet-timeout 60 output:

Hide Details

runCmd: settings set symbols.clang-modules-cache-path "/Users/buildslave/jenkins/workspace/lldb-cmake-sanitized/lldb-build/tools/lldb/lldb-test-build.noindex/module-cache-lldb/lldb-api" output:

Hide Details

runCmd: settings set use-color false output:

Hide Details

Adding tearDown hook: def shutdown_named_pipe(): # Close the pipe. try: named_pipe.close() except: print("failed to close named pipe") None

Hide Details

# Delete the pipe. try: os.remove(named_pipe_path) except: print("failed to delete named pipe: {}".format(named_pipe_path)) None

Hide Details

# Delete the temp directory. try: os.rmdir(temp_dir) except: print( "failed to delete temp dir: {}, directory contents: '{}'".format( temp_dir, os.listdir(temp_dir))) None

Hide Details

Hide Details

Adding tearDown hook: def cleanupSubprocesses(self): # Ensure any subprocesses are cleaned up for p in self.subprocesses: p.terminate() del p del self.subprocesses[:] # Ensure any forked processes are cleaned up for pid in self.forkedProcessPids: if os.path.exists("/proc/" + str(pid)): os.kill(pid, signal.SIGTERM)

Hide Details

Hide Details

Adding tearDown hook: def shutdown_debug_monitor(): try: server.terminate() except: logger.warning( "failed to terminate server for debug monitor: {}; ignoring".format( sys.exc_info()[0]))

Hide Details

Hide Details

Adding tearDown hook: def shutdown_socket(): if sock: try: # send the kill packet so lldb-server shuts down gracefully sock.sendall(GdbRemoteTestCaseBase._GDBREMOTE_KILL_PACKET) except: logger.warning( "failed to send kill packet to debug monitor: {}; ignoring".format( sys.exc_info()[0]))

Hide Details

try: sock.close() except: logger.warning( "failed to close socket to debug monitor: {}; ignoring".format( sys.exc_info()[0]))

Hide Details

Hide Details

Executing tearDown hook: def shutdown_socket(): if sock: try: # send the kill packet so lldb-server shuts down gracefully sock.sendall(GdbRemoteTestCaseBase._GDBREMOTE_KILL_PACKET) except: logger.warning( "failed to send kill packet to debug monitor: {}; ignoring".format( sys.exc_info()[0]))

Hide Details

try: sock.close() except: logger.warning( "failed to close socket to debug monitor: {}; ignoring".format( sys.exc_info()[0]))

Hide Details

Hide Details

Executing tearDown hook: def shutdown_debug_monitor(): try: server.terminate() except: logger.warning( "failed to terminate server for debug monitor: {}; ignoring".format( sys.exc_info()[0]))

Hide Details

Hide Details

Executing tearDown hook: def cleanupSubprocesses(self): # Ensure any subprocesses are cleaned up for p in self.subprocesses: p.terminate() del p del self.subprocesses[:] # Ensure any forked processes are cleaned up for pid in self.forkedProcessPids: if os.path.exists("/proc/" + str(pid)): os.kill(pid, signal.SIGTERM)

Hide Details

Hide Details

Executing tearDown hook: def shutdown_named_pipe(): # Close the pipe. try: named_pipe.close() except: print("failed to close named pipe") None

Hide Details

# Delete the pipe. try: os.remove(named_pipe_path) except: print("failed to delete named pipe: {}".format(named_pipe_path)) None

Hide Details

# Delete the temp directory. try: os.rmdir(temp_dir) except: print( "failed to delete temp dir: {}, directory contents: '{}'".format( temp_dir, os.listdir(temp_dir))) None

Hide Details

Hide Details

PASS: LLDB (/Users/buildslave/jenkins/workspace/lldb-cmake-sanitized/host-compiler/bin/clang-10-x86_64) :: test_qProcessInfo_contains_cputype_cpusubtype_debugserver_darwin (TestGdbRemoteProcessInfo.TestGdbRemoteProcessInfo) runCmd: settings set symbols.enable-external-lookup false output:

Hide Details

runCmd: settings set plugin.process.gdb-remote.packet-timeout 60 output:

Hide Details

runCmd: settings set symbols.clang-modules-cache-path "/Users/buildslave/jenkins/workspace/lldb-cmake-sanitized/lldb-build/tools/lldb/lldb-test-build.noindex/module-cache-lldb/lldb-api" output:

Hide Details

runCmd: settings set use-color false output:

Hide Details

UNSUPPORTED: LLDB (/Users/buildslave/jenkins/workspace/lldb-cmake-sanitized/host-compiler/bin/clang-10-x86_64) :: test_qProcessInfo_contains_cputype_cpusubtype_llgs_darwin (TestGdbRemoteProcessInfo.TestGdbRemoteProcessInfo) (llgs tests) runCmd: settings set symbols.enable-external-lookup false output:

Hide Details

runCmd: settings set plugin.process.gdb-remote.packet-timeout 60 output:

Hide Details

runCmd: settings set symbols.clang-modules-cache-path "/Users/buildslave/jenkins/workspace/lldb-cmake-sanitized/lldb-build/tools/lldb/lldb-test-build.noindex/module-cache-lldb/lldb-api" output:

Hide Details

runCmd: settings set use-color false output:

Hide Details

UNSUPPORTED: LLDB (/Users/buildslave/jenkins/workspace/lldb-cmake-sanitized/host-compiler/bin/clang-10-x86_64) :: test_qProcessInfo_contains_triple_ppid_llgs (TestGdbRemoteProcessInfo.TestGdbRemoteProcessInfo) (llgs tests) UNSUPPORTED: LLDB (/Users/buildslave/jenkins/workspace/lldb-cmake-sanitized/host-compiler/bin/clang-10-x86_64) :: test_qProcessInfo_does_not_contain_cputype_cpusubtype_llgs (TestGdbRemoteProcessInfo.TestGdbRemoteProcessInfo) (skip on macosx, darwin, ios, tvos, watchos, bridgeos) runCmd: settings set symbols.enable-external-lookup false output:

Hide Details

runCmd: settings set plugin.process.gdb-remote.packet-timeout 60 output:

Hide Details

runCmd: settings set symbols.clang-modules-cache-path "/Users/buildslave/jenkins/workspace/lldb-cmake-sanitized/lldb-build/tools/lldb/lldb-test-build.noindex/module-cache-lldb/lldb-api" output:

Hide Details

runCmd: settings set use-color false output:

Hide Details

Adding tearDown hook: def shutdown_named_pipe(): # Close the pipe. try: named_pipe.close() except: print("failed to close named pipe") None

Hide Details

# Delete the pipe. try: os.remove(named_pipe_path) except: print("failed to delete named pipe: {}".format(named_pipe_path)) None

Hide Details

# Delete the temp directory. try: os.rmdir(temp_dir) except: print( "failed to delete temp dir: {}, directory contents: '{}'".format( temp_dir, os.listdir(temp_dir))) None

Hide Details

Hide Details

Adding tearDown hook: def cleanupSubprocesses(self): # Ensure any subprocesses are cleaned up for p in self.subprocesses: p.terminate() del p del self.subprocesses[:] # Ensure any forked processes are cleaned up for pid in self.forkedProcessPids: if os.path.exists("/proc/" + str(pid)): os.kill(pid, signal.SIGTERM)

Hide Details

Hide Details

Adding tearDown hook: def shutdown_debug_monitor(): try: server.terminate() except: logger.warning( "failed to terminate server for debug monitor: {}; ignoring".format( sys.exc_info()[0]))

Hide Details

Hide Details

Adding tearDown hook: def shutdown_socket(): if sock: try: # send the kill packet so lldb-server shuts down gracefully sock.sendall(GdbRemoteTestCaseBase._GDBREMOTE_KILL_PACKET) except: logger.warning( "failed to send kill packet to debug monitor: {}; ignoring".format( sys.exc_info()[0]))

Hide Details

try: sock.close() except: logger.warning( "failed to close socket to debug monitor: {}; ignoring".format( sys.exc_info()[0]))

Hide Details

Hide Details

Executing tearDown hook: def shutdown_socket(): if sock: try: # send the kill packet so lldb-server shuts down gracefully sock.sendall(GdbRemoteTestCaseBase._GDBREMOTE_KILL_PACKET) except: logger.warning( "failed to send kill packet to debug monitor: {}; ignoring".format( sys.exc_info()[0]))

Hide Details

try: sock.close() except: logger.warning( "failed to close socket to debug monitor: {}; ignoring".format( sys.exc_info()[0]))

Hide Details

Hide Details

Executing tearDown hook: def shutdown_debug_monitor(): try: server.terminate() except: logger.warning( "failed to terminate server for debug monitor: {}; ignoring".format( sys.exc_info()[0]))

Hide Details

Hide Details

Executing tearDown hook: def cleanupSubprocesses(self): # Ensure any subprocesses are cleaned up for p in self.subprocesses: p.terminate() del p del self.subprocesses[:] # Ensure any forked processes are cleaned up for pid in self.forkedProcessPids: if os.path.exists("/proc/" + str(pid)): os.kill(pid, signal.SIGTERM)

Hide Details

Hide Details

Executing tearDown hook: def shutdown_named_pipe(): # Close the pipe. try: named_pipe.close() except: print("failed to close named pipe") None

Hide Details

# Delete the pipe. try: os.remove(named_pipe_path) except: print("failed to delete named pipe: {}".format(named_pipe_path)) None

Hide Details

# Delete the temp directory. try: os.rmdir(temp_dir) except: print( "failed to delete temp dir: {}, directory contents: '{}'".format( temp_dir, os.listdir(temp_dir))) None

Hide Details

Hide Details

PASS: LLDB (/Users/buildslave/jenkins/workspace/lldb-cmake-sanitized/host-compiler/bin/clang-10-x86_64) :: test_qProcessInfo_does_not_contain_triple_debugserver_darwin (TestGdbRemoteProcessInfo.TestGdbRemoteProcessInfo) runCmd: settings set symbols.enable-external-lookup false output:

Hide Details

runCmd: settings set plugin.process.gdb-remote.packet-timeout 60 output:

Hide Details

runCmd: settings set symbols.clang-modules-cache-path "/Users/buildslave/jenkins/workspace/lldb-cmake-sanitized/lldb-build/tools/lldb/lldb-test-build.noindex/module-cache-lldb/lldb-api" output:

Hide Details

runCmd: settings set use-color false output:

Hide Details

UNSUPPORTED: LLDB (/Users/buildslave/jenkins/workspace/lldb-cmake-sanitized/host-compiler/bin/clang-10-x86_64) :: test_qProcessInfo_does_not_contain_triple_llgs_darwin (TestGdbRemoteProcessInfo.TestGdbRemoteProcessInfo) (llgs tests) runCmd: settings set symbols.enable-external-lookup false output:

Hide Details

runCmd: settings set plugin.process.gdb-remote.packet-timeout 60 output:

Hide Details

runCmd: settings set symbols.clang-modules-cache-path "/Users/buildslave/jenkins/workspace/lldb-cmake-sanitized/lldb-build/tools/lldb/lldb-test-build.noindex/module-cache-lldb/lldb-api" output:

Hide Details

runCmd: settings set use-color false output:

Hide Details

Adding tearDown hook: def shutdown_named_pipe(): # Close the pipe. try: named_pipe.close() except: print("failed to close named pipe") None

Hide Details

# Delete the pipe. try: os.remove(named_pipe_path) except: print("failed to delete named pipe: {}".format(named_pipe_path)) None

Hide Details

# Delete the temp directory. try: os.rmdir(temp_dir) except: print( "failed to delete temp dir: {}, directory contents: '{}'".format( temp_dir, os.listdir(temp_dir))) None

Hide Details

Hide Details

Adding tearDown hook: def cleanupSubprocesses(self): # Ensure any subprocesses are cleaned up for p in self.subprocesses: p.terminate() del p del self.subprocesses[:] # Ensure any forked processes are cleaned up for pid in self.forkedProcessPids: if os.path.exists("/proc/" + str(pid)): os.kill(pid, signal.SIGTERM)

Hide Details

Hide Details

Adding tearDown hook: def shutdown_debug_monitor(): try: server.terminate() except: logger.warning( "failed to terminate server for debug monitor: {}; ignoring".format( sys.exc_info()[0]))

Hide Details

Hide Details

Adding tearDown hook: def shutdown_socket(): if sock: try: # send the kill packet so lldb-server shuts down gracefully sock.sendall(GdbRemoteTestCaseBase._GDBREMOTE_KILL_PACKET) except: logger.warning( "failed to send kill packet to debug monitor: {}; ignoring".format( sys.exc_info()[0]))

Hide Details

try: sock.close() except: logger.warning( "failed to close socket to debug monitor: {}; ignoring".format( sys.exc_info()[0]))

Hide Details

Hide Details

Executing tearDown hook: def shutdown_socket(): if sock: try: # send the kill packet so lldb-server shuts down gracefully sock.sendall(GdbRemoteTestCaseBase._GDBREMOTE_KILL_PACKET) except: logger.warning( "failed to send kill packet to debug monitor: {}; ignoring".format( sys.exc_info()[0]))

Hide Details

try: sock.close() except: logger.warning( "failed to close socket to debug monitor: {}; ignoring".format( sys.exc_info()[0]))

Hide Details

Hide Details

Executing tearDown hook: def shutdown_debug_monitor(): try: server.terminate() except: logger.warning( "failed to terminate server for debug monitor: {}; ignoring".format( sys.exc_info()[0]))

Hide Details

Hide Details

Executing tearDown hook: def cleanupSubprocesses(self): # Ensure any subprocesses are cleaned up for p in self.subprocesses: p.terminate() del p del self.subprocesses[:] # Ensure any forked processes are cleaned up for pid in self.forkedProcessPids: if os.path.exists("/proc/" + str(pid)): os.kill(pid, signal.SIGTERM)

Hide Details

Hide Details

Executing tearDown hook: def shutdown_named_pipe(): # Close the pipe. try: named_pipe.close() except: print("failed to close named pipe") None

Hide Details

# Delete the pipe. try: os.remove(named_pipe_path) except: print("failed to delete named pipe: {}".format(named_pipe_path)) None

Hide Details

# Delete the temp directory. try: os.rmdir(temp_dir) except: print( "failed to delete temp dir: {}, directory contents: '{}'".format( temp_dir, os.listdir(temp_dir))) None

Hide Details

Hide Details

PASS: LLDB (/Users/buildslave/jenkins/workspace/lldb-cmake-sanitized/host-compiler/bin/clang-10-x86_64) :: test_qProcessInfo_reports_valid_endian_debugserver (TestGdbRemoteProcessInfo.TestGdbRemoteProcessInfo) runCmd: settings set symbols.enable-external-lookup false output:

Hide Details

runCmd: settings set plugin.process.gdb-remote.packet-timeout 60 output:

Hide Details

runCmd: settings set symbols.clang-modules-cache-path "/Users/buildslave/jenkins/workspace/lldb-cmake-sanitized/lldb-build/tools/lldb/lldb-test-build.noindex/module-cache-lldb/lldb-api" output:

Hide Details

runCmd: settings set use-color false output:

Hide Details

UNSUPPORTED: LLDB (/Users/buildslave/jenkins/workspace/lldb-cmake-sanitized/host-compiler/bin/clang-10-x86_64) :: test_qProcessInfo_reports_valid_endian_llgs (TestGdbRemoteProcessInfo.TestGdbRemoteProcessInfo) (llgs tests) runCmd: settings set symbols.enable-external-lookup false output:

Hide Details

runCmd: settings set plugin.process.gdb-remote.packet-timeout 60 output:

Hide Details

runCmd: settings set symbols.clang-modules-cache-path "/Users/buildslave/jenkins/workspace/lldb-cmake-sanitized/lldb-build/tools/lldb/lldb-test-build.noindex/module-cache-lldb/lldb-api" output:

Hide Details

runCmd: settings set use-color false output:

Hide Details

Adding tearDown hook: def shutdown_named_pipe(): # Close the pipe. try: named_pipe.close() except: print("failed to close named pipe") None

Hide Details

# Delete the pipe. try: os.remove(named_pipe_path) except: print("failed to delete named pipe: {}".format(named_pipe_path)) None

Hide Details

# Delete the temp directory. try: os.rmdir(temp_dir) except: print( "failed to delete temp dir: {}, directory contents: '{}'".format( temp_dir, os.listdir(temp_dir))) None

Hide Details

Hide Details

Adding tearDown hook: def cleanupSubprocesses(self): # Ensure any subprocesses are cleaned up for p in self.subprocesses: p.terminate() del p del self.subprocesses[:] # Ensure any forked processes are cleaned up for pid in self.forkedProcessPids: if os.path.exists("/proc/" + str(pid)): os.kill(pid, signal.SIGTERM)

Hide Details

Hide Details

Adding tearDown hook: def shutdown_debug_monitor(): try: server.terminate() except: logger.warning( "failed to terminate server for debug monitor: {}; ignoring".format( sys.exc_info()[0]))

Hide Details

Hide Details

Adding tearDown hook: def shutdown_socket(): if sock: try: # send the kill packet so lldb-server shuts down gracefully sock.sendall(GdbRemoteTestCaseBase._GDBREMOTE_KILL_PACKET) except: logger.warning( "failed to send kill packet to debug monitor: {}; ignoring".format( sys.exc_info()[0]))

Hide Details

try: sock.close() except: logger.warning( "failed to close socket to debug monitor: {}; ignoring".format( sys.exc_info()[0]))

Hide Details

Hide Details

FAIL: LLDB (/Users/buildslave/jenkins/workspace/lldb-cmake-sanitized/host-compiler/bin/clang-10-x86_64) :: test_qProcessInfo_returns_running_process_debugserver (TestGdbRemoteProcessInfo.TestGdbRemoteProcessInfo) Executing tearDown hook: def shutdown_socket(): if sock: try: # send the kill packet so lldb-server shuts down gracefully sock.sendall(GdbRemoteTestCaseBase._GDBREMOTE_KILL_PACKET) except: logger.warning( "failed to send kill packet to debug monitor: {}; ignoring".format( sys.exc_info()[0]))

Hide Details

try: sock.close() except: logger.warning( "failed to close socket to debug monitor: {}; ignoring".format( sys.exc_info()[0]))

Hide Details

Hide Details

Executing tearDown hook: def shutdown_debug_monitor(): try: server.terminate() except: logger.warning( "failed to terminate server for debug monitor: {}; ignoring".format( sys.exc_info()[0]))

Hide Details

Hide Details

Executing tearDown hook: def cleanupSubprocesses(self): # Ensure any subprocesses are cleaned up for p in self.subprocesses: p.terminate() del p del self.subprocesses[:] # Ensure any forked processes are cleaned up for pid in self.forkedProcessPids: if os.path.exists("/proc/" + str(pid)): os.kill(pid, signal.SIGTERM)

Hide Details

Hide Details

Executing tearDown hook: def shutdown_named_pipe(): # Close the pipe. try: named_pipe.close() except: print("failed to close named pipe") None

Hide Details

# Delete the pipe. try: os.remove(named_pipe_path) except: print("failed to delete named pipe: {}".format(named_pipe_path)) None

Hide Details

# Delete the temp directory. try: os.rmdir(temp_dir) except: print( "failed to delete temp dir: {}, directory contents: '{}'".format( temp_dir, os.listdir(temp_dir))) None

Hide Details

Hide Details

runCmd: settings set symbols.enable-external-lookup false output:

Hide Details

runCmd: settings set plugin.process.gdb-remote.packet-timeout 60 output:

Hide Details

runCmd: settings set symbols.clang-modules-cache-path "/Users/buildslave/jenkins/workspace/lldb-cmake-sanitized/lldb-build/tools/lldb/lldb-test-build.noindex/module-cache-lldb/lldb-api" output:

Hide Details

runCmd: settings set use-color false output:

Hide Details

UNSUPPORTED: LLDB (/Users/buildslave/jenkins/workspace/lldb-cmake-sanitized/host-compiler/bin/clang-10-x86_64) :: test_qProcessInfo_returns_running_process_llgs (TestGdbRemoteProcessInfo.TestGdbRemoteProcessInfo) (llgs tests) Restore dir to: /Users/buildslave/jenkins/workspace/lldb-cmake-sanitized/lldb-build/tools/lldb/test ====================================================================== FAIL: test_qProcessInfo_returns_running_process_debugserver (TestGdbRemoteProcessInfo.TestGdbRemoteProcessInfo) ---------------------------------------------------------------------- Traceback (most recent call last): File "/Users/buildslave/jenkins/workspace/lldb-cmake-sanitized/llvm-project/lldb/packages/Python/lldbsuite/test/decorators.py", line 141, in wrapper func(*args, **kwargs) File "/Users/buildslave/jenkins/workspace/lldb-cmake-sanitized/llvm-project/lldb/packages/Python/lldbsuite/test/tools/lldb-server/TestGdbRemoteProcessInfo.py", line 42, in test_qProcessInfo_returns_running_process_debugserver self.qProcessInfo_returns_running_process() File "/Users/buildslave/jenkins/workspace/lldb-cmake-sanitized/llvm-project/lldb/packages/Python/lldbsuite/test/tools/lldb-server/TestGdbRemoteProcessInfo.py", line 35, in qProcessInfo_returns_running_process self.assertTrue(lldbgdbserverutils.process_is_running(pid, True)) AssertionError: False is not True Config=x86_64-/Users/buildslave/jenkins/workspace/lldb-cmake-sanitized/host-compiler/bin/clang-10 ---------------------------------------------------------------------- Ran 12 tests in 20.813s

Hide Details

RESULT: FAILED (4 passes, 1 failures, 0 errors, 7 skipped, 0 expected failures, 0 unexpected successes)

Hide Details

******************** PASS: lldb-unit :: Expression/./ExpressionTests/DiagnosticManagerTest.AppendMessageAttachToLastDiag (1267 of 1781) PASS: lldb-unit :: Utility/./UtilityTests/FileSpecTest.CopyByAppendingPathComponent (1268 of 1781) PASS: lldb-unit :: Utility/./UtilityTests/UriParserTest.TypicalPortPath (1269 of 1781) PASS: lldb-shell :: SymbolFile/DWARF/debug-types-signature-loop.s (1270 of 1781) PASS: lldb-api :: commands/expression/fixits/TestFixIts.py (1271 of 1781) PASS: lldb-api :: functionalities/breakpoint/objc/TestObjCBreakpoints.py (1272 of 1781) PASS: lldb-unit :: Process/minidump/./LLDBMinidumpTests/MinidumpParserTest.GetArchitectureWindows (1273 of 1781) PASS: lldb-api :: functionalities/mtc/simple/TestMTCSimple.py (1274 of 1781) PASS: lldb-unit :: UnwindAssembly/x86/./UnwindAssemblyx86Tests/Testx86AssemblyInspectionEngine.TestPushECX (1275 of 1781) PASS: lldb-unit :: Expression/./ExpressionTests/DiagnosticManagerTest.GetStringMultiline (1276 of 1781) PASS: lldb-unit :: Utility/./UtilityTests/RangeTest.DefaultConstructor (1277 of 1781) PASS: lldb-unit :: Utility/./UtilityTests/RangeTest.NotEqualInvalid (1278 of 1781) PASS: lldb-api :: commands/frame/diagnose/dereference-function-return/TestDiagnoseDereferenceFunctionReturn.py (1279 of 1781) PASS: lldb-api :: python_api/findvalue_duplist/TestSBFrameFindValue.py (1280 of 1781) PASS: lldb-unit :: Host/./HostTests/SocketAddressTest.Set (1281 of 1781) PASS: lldb-api :: macosx/load-kext/TestLoadKext.py (1282 of 1781) PASS: lldb-api :: functionalities/data-formatter/data-formatter-objc/TestDataFormatterObjCKVO.py (1283 of 1781) PASS: lldb-unit :: Host/./HostTests/SocketTest.TCPListen0GetPort (1284 of 1781) PASS: lldb-api :: functionalities/tail_call_frames/disambiguate_tail_call_seq/TestDisambiguateTailCallSeq.py (1285 of 1781) PASS: lldb-unit :: Utility/./UtilityTests/OptionsWithRawTest.EmptyInput (1286 of 1781) PASS: lldb-api :: functionalities/thread/concurrent_events/TestConcurrentBreakpointOneDelayBreakpointThreads.py (1287 of 1781) UNSUPPORTED: lldb-api :: commands/register/register/intel_xtended_registers/mpx_bound_violation/TestBoundViolation.py (1288 of 1781) PASS: lldb-unit :: Utility/./UtilityTests/RangeTest.Slide (1289 of 1781) PASS: lldb-unit :: Expression/./ExpressionTests/CppModuleConfigurationTest.MissingUsrInclude (1290 of 1781) PASS: lldb-unit :: Utility/./UtilityTests/ArgsTest.ReplaceArgumentAtIndexOutOfRange (1291 of 1781) PASS: lldb-unit :: Utility/./UtilityTests/Flags.AnyClear (1292 of 1781) PASS: lldb-api :: functionalities/unwind/sigtramp/TestSigtrampUnwind.py (1293 of 1781) PASS: lldb-shell :: SymbolFile/DWARF/find-basic-namespace.cpp (1294 of 1781) UNSUPPORTED: lldb-api :: benchmarks/libcxxmap/TestBenchmarkLibcxxMap.py (1295 of 1781) PASS: lldb-unit :: SymbolFile/DWARF/./SymbolFileDWARFTests/SymbolFileDWARFTests.TestAbilitiesForDWARF (1296 of 1781) PASS: lldb-api :: functionalities/thread/concurrent_events/TestConcurrentSignalBreak.py (1297 of 1781) PASS: lldb-unit :: UnwindAssembly/x86/./UnwindAssemblyx86Tests/Testx86AssemblyInspectionEngine.Test32BitOnlyInstruction (1298 of 1781) PASS: lldb-shell :: SymbolFile/DWARF/dwarf5_locations.s (1299 of 1781) PASS: lldb-unit :: Utility/./UtilityTests/BinaryStreamTest.PutSLEB128One (1300 of 1781) PASS: lldb-api :: lang/objc/radar-9691614/TestObjCMethodReturningBOOL.py (1301 of 1781) PASS: lldb-unit :: Utility/./UtilityTests/ProcessInstanceInfoMatch.Name (1302 of 1781) PASS: lldb-unit :: Process/minidump/./LLDBMinidumpTests/MinidumpParserTest.GetLinuxProcStatus (1303 of 1781) PASS: lldb-unit :: Expression/./ExpressionTests/DiagnosticManagerTest.AppendMessageSubsequentDiags (1304 of 1781) PASS: lldb-unit :: Utility/./UtilityTests/CompletionRequest.FakeLastArg (1305 of 1781) PASS: lldb-api :: python_api/breakpoint/TestBreakpointAPI.py (1306 of 1781) UNSUPPORTED: lldb-shell :: Register/x86-zmm-write.test (1307 of 1781) PASS: lldb-unit :: Utility/./UtilityTests/LogChannelTest.List (1308 of 1781) PASS: lldb-api :: functionalities/dynamic_value_child_count/TestDynamicValueChildCount.py (1309 of 1781) PASS: lldb-api :: commands/expression/call-function/TestCallStdStringFunction.py (1310 of 1781) PASS: lldb-unit :: Utility/./UtilityTests/StringListTest.JoinEmpty (1311 of 1781) UNSUPPORTED: lldb-api :: lang/objc/objc-dynamic-value/TestObjCDynamicValue.py (1312 of 1781) UNSUPPORTED: lldb-api :: commands/expression/multiline-completion/TestMultilineCompletion.py (1313 of 1781) UNSUPPORTED: lldb-api :: tools/lldb-vscode/breakpoint/TestVSCode_setBreakpoints.py (1314 of 1781) PASS: lldb-unit :: Utility/./UtilityTests/UriParserTest.BadPort (1315 of 1781) PASS: lldb-unit :: Utility/./UtilityTests/TimerTest.CategoryTimes2 (1316 of 1781) PASS: lldb-api :: python_api/lldbutil/frame/TestFrameUtils.py (1317 of 1781) PASS: lldb-api :: commands/command/history/TestCommandHistory.py (1318 of 1781) PASS: lldb-api :: lang/objc/objc-checker/TestObjCCheckers.py (1319 of 1781) PASS: lldb-unit :: Process/minidump/./LLDBMinidumpTests/MinidumpParserTest.MinidumpDuplicateModuleMinAddress (1320 of 1781) PASS: lldb-unit :: UnwindAssembly/x86/./UnwindAssemblyx86Tests/Testx86AssemblyInspectionEngine.TestPushExtended (1321 of 1781) XFAIL: lldb-shell :: Unwind/prefer-debug-over-eh-frame.test (1322 of 1781) PASS: lldb-api :: functionalities/thread/concurrent_events/TestConcurrentCrashWithWatchpoint.py (1323 of 1781) PASS: lldb-shell :: SymbolFile/DWARF/find-inline-method.s (1324 of 1781) PASS: lldb-unit :: UnwindAssembly/x86/./UnwindAssemblyx86Tests/Testx86AssemblyInspectionEngine.TestPushRBX (1325 of 1781) PASS: lldb-shell :: SymbolFile/DWARF/dir-separator-posix.s (1326 of 1781) PASS: lldb-unit :: Utility/./UtilityTests/SerializationRountripTest.SerializeDeserializeObjectPointer (1327 of 1781) UNSUPPORTED: lldb-api :: commands/gui/basic/TestGuiBasic.py (1328 of 1781) PASS: lldb-unit :: Utility/./UtilityTests/FileSpecTest.AppendPathComponent (1329 of 1781) PASS: lldb-shell :: Reproducer/TestReuseDirectory.test (1330 of 1781) PASS: lldb-unit :: Host/./HostTests/SocketTest.TCPListen0ConnectAccept (1331 of 1781) PASS: lldb-unit :: Utility/./UtilityTests/FileSpecTest.EqualDotsPosixRoot (1332 of 1781) PASS: lldb-unit :: Utility/./UtilityTests/OptionsWithRawTest.LeadingSpaceArgs (1333 of 1781) PASS: lldb-api :: python_api/disassemble-raw-data/TestDisassembleRawData.py (1334 of 1781) UNSUPPORTED: lldb-api :: arm/breakpoint-it/TestBreakpointIt.py (1335 of 1781) PASS: lldb-unit :: Utility/./UtilityTests/StreamTest.PutCharWhitespace (1336 of 1781) PASS: lldb-unit :: Utility/./UtilityTests/ConstStringTest.format_provider (1337 of 1781) UNSUPPORTED: lldb-api :: functionalities/darwin_log/filter/exact_match/message/TestDarwinLogFilterMatchMessage.py (1338 of 1781) PASS: lldb-unit :: Host/./HostTests/NativeProcessProtocolTest.ReadCStringFromMemory (1339 of 1781) PASS: lldb-unit :: Utility/./UtilityTests/StringExtractorTest.GetU64LittleEndian (1340 of 1781) PASS: lldb-api :: python_api/debugger/TestDebuggerAPI.py (1341 of 1781) PASS: lldb-unit :: Process/minidump/./LLDBMinidumpTests/MinidumpParserTest.GetArchitecture (1342 of 1781) UNSUPPORTED: lldb-shell :: SymbolFile/PDB/enums-layout.test (1343 of 1781) PASS: lldb-unit :: Utility/./UtilityTests/StringListTest.LongestCommonPrefix (1344 of 1781) PASS: lldb-api :: api/command-return-object/TestSBCommandReturnObject.py (1345 of 1781) PASS: lldb-api :: python_api/objc_type/TestObjCType.py (1346 of 1781) PASS: lldb-api :: functionalities/thread/backtrace_limit/TestBacktraceLimit.py (1347 of 1781) PASS: lldb-shell :: SymbolFile/DWARF/find-basic-variable.cpp (1348 of 1781) PASS: lldb-api :: functionalities/tsan/basic/TestTsanBasic.py (1349 of 1781) PASS: lldb-api :: lang/mixed/TestMixedLanguages.py (1350 of 1781) PASS: lldb-unit :: Host/./HostTests/NativeProcessProtocolTest.ReadCStringFromMemory_CrossPageBoundary (1351 of 1781) PASS: lldb-api :: macosx/find-dsym/deep-bundle/TestDeepBundle.py (1352 of 1781) PASS: lldb-shell :: SymbolFile/DWARF/debug_aranges-empty-section.s (1353 of 1781) PASS: lldb-unit :: SymbolFile/NativePDB/./SymbolFileNativePDBTests/PDBFPOProgramToDWARFExpressionTests.InvalidAssignmentSingle (1354 of 1781) PASS: lldb-unit :: Process/gdb-remote/./ProcessGdbRemoteTests/GDBRemoteCommunicationClientTest.SendGetTraceConfigPacket (1355 of 1781) PASS: lldb-unit :: Host/./HostTests/MainLoopTest.DetectsEOF (1356 of 1781) PASS: lldb-unit :: Host/./HostTests/HostInfoTest.GetAugmentedArchSpec (1357 of 1781) PASS: lldb-unit :: Process/gdb-remote/./ProcessGdbRemoteTests/GDBRemoteCommunicationClientTest.SendStopTracePacket (1358 of 1781) PASS: lldb-shell :: ObjectFile/Breakpad/uuid-matching-mac.test (1359 of 1781) UNSUPPORTED: lldb-api :: linux/thread/create_during_instruction_step/TestCreateDuringInstructionStep.py (1360 of 1781) PASS: lldb-unit :: Utility/./UtilityTests/StringExtractorTest.GetHexBytes_OddPair2 (1361 of 1781) PASS: lldb-api :: lang/cpp/dynamic-value/TestCppValueCast.py (1362 of 1781) PASS: lldb-shell :: Breakpoint/debug_rnglist_basic.test (1363 of 1781) UNSUPPORTED: lldb-shell :: SymbolFile/NativePDB/stack_unwinding01.cpp (1364 of 1781) PASS: lldb-api :: lang/objc/objc-ivar-stripped/TestObjCIvarStripped.py (1365 of 1781) PASS: lldb-unit :: Utility/./UtilityTests/StringExtractorTest.DecodeHexU8_InvalidHex (1366 of 1781) PASS: lldb-unit :: Utility/./UtilityTests/BinaryStreamTest.PutSLEB128OneByte (1367 of 1781) PASS: lldb-unit :: Utility/./UtilityTests/BinaryStreamTest.PutULEB128TwoBytes (1368 of 1781) PASS: lldb-unit :: Utility/./UtilityTests/BinaryStreamTest.PutULEB128MaxValue (1369 of 1781) UNSUPPORTED: lldb-api :: functionalities/signal/handle-segv/TestHandleSegv.py (1370 of 1781) PASS: lldb-unit :: Utility/./UtilityTests/StringExtractorTest.GetHexU8_InvalidHex_NoEof (1371 of 1781) PASS: lldb-unit :: UnwindAssembly/x86/./UnwindAssemblyx86Tests/Testx86AssemblyInspectionEngine.TestStackRealign32BitDisp_x86_64 (1372 of 1781) PASS: lldb-api :: functionalities/breakpoint/breakpoint_command/TestBreakpointCommandsFromPython.py (1373 of 1781) PASS: lldb-unit :: Utility/./UtilityTests/ScalarTest.ExtractBitfield (1374 of 1781) PASS: lldb-shell :: SymbolFile/NativePDB/disassembly.cpp (1375 of 1781) PASS: lldb-unit :: UnwindAssembly/x86/./UnwindAssemblyx86Tests/Testx86AssemblyInspectionEngine.Test64bitFramelessSmallStackFrame (1376 of 1781) UNSUPPORTED: lldb-shell :: ObjectFile/ELF/minidebuginfo-set-and-hit-breakpoint.test (1377 of 1781) PASS: lldb-unit :: Language/Highlighting/./HighlighterTests/HighlighterTest.ClangScalarLiterals (1378 of 1781) PASS: lldb-unit :: Process/gdb-remote/./ProcessGdbRemoteTests/GDBRemoteCommunicationClientTest.SendGetMetaDataPacket (1379 of 1781) UNSUPPORTED: lldb-api :: commands/watchpoints/variable_out_of_scope/TestWatchedVarHitWhenInScope.py (1380 of 1781) PASS: lldb-api :: functionalities/gdb_remote_client/TestThreadSelectionBug.py (1381 of 1781) PASS: lldb-unit :: UnwindAssembly/x86/./UnwindAssemblyx86Tests/Testx86AssemblyInspectionEngine.TestPopEDI (1382 of 1781) PASS: lldb-api :: types/TestIntegerTypesExpr.py (1383 of 1781) PASS: lldb-unit :: Utility/./UtilityTests/StreamTest.ShiftOperatorChars (1384 of 1781) UNSUPPORTED: lldb-shell :: SymbolFile/dissassemble-entry-point.s (1385 of 1781) PASS: lldb-unit :: Host/./HostTests/Host.GetEnvironment (1386 of 1781) PASS: lldb-api :: commands/expression/persistent_variables/TestPersistentVariables.py (1387 of 1781) PASS: lldb-unit :: ObjectFile/Breakpad/./ObjectFileBreakpadTests/ModuleRecord.parse (1388 of 1781) PASS: lldb-unit :: Process/gdb-remote/./ProcessGdbRemoteTests/GDBRemoteCommunicationTest.ReadPacket_checksum (1389 of 1781) PASS: lldb-unit :: Host/./HostTests/SocketTest.TCPGetConnectURI (1390 of 1781) PASS: lldb-api :: lang/objc/forward-decl/TestForwardDecl.py (1391 of 1781) PASS: lldb-unit :: Process/gdb-remote/./ProcessGdbRemoteTests/GDBRemoteCommunicationClientTest.GetModulesInfo (1392 of 1781) PASS: lldb-shell :: SymbolFile/Breakpad/line-table.test (1393 of 1781) PASS: lldb-shell :: SymbolFile/DWARF/debug_ranges_and_rnglists.test (1394 of 1781) PASS: lldb-api :: lang/objc/foundation/TestFoundationDisassembly.py (1395 of 1781) PASS: lldb-unit :: Utility/./UtilityTests/BinaryStreamTest.PutULEB128SevenBytes (1396 of 1781) PASS: lldb-api :: commands/frame/language/TestGuessLanguage.py (1397 of 1781) PASS: lldb-api :: functionalities/dead-strip/TestDeadStrip.py (1398 of 1781) PASS: lldb-shell :: SymbolFile/NativePDB/function-types-classes.cpp (1399 of 1781) PASS: lldb-unit :: Utility/./UtilityTests/ArgsTest.TestQuotedUnknownEscape (1400 of 1781) PASS: lldb-api :: functionalities/thread/concurrent_events/TestConcurrentDelaySignalWatch.py (1401 of 1781) UNSUPPORTED: lldb-api :: commands/expression/completion-crash2/TestCompletionCrash2.py (1402 of 1781) PASS: lldb-api :: python_api/process/io/TestProcessIO.py (1403 of 1781) PASS: lldb-unit :: Process/minidump/./LLDBMinidumpTests/MinidumpParserTest.GetMemoryRegionInfoFromMemoryList (1404 of 1781) PASS: lldb-api :: commands/settings/TestSettings.py (1405 of 1781) PASS: lldb-api :: functionalities/var_path/TestVarPath.py (1406 of 1781) PASS: lldb-api :: lang/objc/modules-inline-functions/TestModulesInlineFunctions.py (1407 of 1781) PASS: lldb-api :: sample_test/TestSampleInlineTest.py (1408 of 1781) PASS: lldb-unit :: UnwindAssembly/x86/./UnwindAssemblyx86Tests/Testx86AssemblyInspectionEngine.TestStackRealignMSVC_i386 (1409 of 1781) PASS: lldb-api :: commands/disassemble/basic/TestDisassembleBreakpoint.py (1410 of 1781) UNSUPPORTED: lldb-api :: functionalities/darwin_log/filter/exact_match/activity/TestDarwinLogFilterMatchActivity.py (1411 of 1781) PASS: lldb-shell :: Settings/TestDisassemblyFormat.test (1412 of 1781) PASS: lldb-shell :: ObjectFile/ELF/PT_LOAD-overlap-PT_TLS.yaml (1413 of 1781) PASS: lldb-api :: functionalities/breakpoint/breakpoint_options/TestBreakpointOptions.py (1414 of 1781) PASS: lldb-unit :: SymbolFile/NativePDB/./SymbolFileNativePDBTests/PDBFPOProgramToDWARFExpressionTests.UnresolvedCyclicRegisterAssignmentReference (1415 of 1781) PASS: lldb-unit :: ScriptInterpreter/Python/./ScriptInterpreterPythonTests/PythonDataObjectsTest.TestPythonCallableInvoke (1416 of 1781) PASS: lldb-api :: functionalities/data-formatter/language_category_updates/TestDataFormatterLanguageCategoryUpdates.py (1417 of 1781) PASS: lldb-shell :: Breakpoint/jitbp_elf.test (1418 of 1781) PASS: lldb-api :: functionalities/postmortem/minidump/TestMiniDump.py (1419 of 1781) PASS: lldb-unit :: Utility/./UtilityTests/StringListTest.CopyList (1420 of 1781) PASS: lldb-api :: functionalities/plugins/python_os_plugin/TestPythonOSPlugin.py (1421 of 1781) PASS: lldb-unit :: Language/Highlighting/./HighlighterTests/HighlighterTest.DefaultHighlighterWithCursor (1422 of 1781) PASS: lldb-unit :: Utility/./UtilityTests/StringListTest.SetSize (1423 of 1781) PASS: lldb-api :: lang/cpp/operators/TestCppOperators.py (1424 of 1781) PASS: lldb-unit :: Expression/./ExpressionTests/CppModuleConfigurationTest.UnrelatedLibrary (1425 of 1781) UNSUPPORTED: lldb-api :: tools/lldb-vscode/launch/TestVSCode_launch.py (1426 of 1781) PASS: lldb-api :: lang/objc/ptr_refs/TestPtrRefsObjC.py (1427 of 1781) PASS: lldb-api :: functionalities/gdb_remote_client/TestGDBRemoteClient.py (1428 of 1781) PASS: lldb-unit :: Language/Highlighting/./HighlighterTests/HighlighterTest.FallbackHighlighter (1429 of 1781) PASS: lldb-shell :: SymbolFile/Breakpad/stack-cfi-parsing.test (1430 of 1781) PASS: lldb-api :: functionalities/thread/concurrent_events/TestConcurrentDelayedCrashWithBreakpointSignal.py (1431 of 1781) PASS: lldb-api :: commands/expression/entry-bp/TestExprEntryBP.py (1432 of 1781) PASS: lldb-api :: commands/expression/unwind_expression/TestUnwindExpression.py (1433 of 1781) PASS: lldb-api :: commands/log/invalid-args/TestInvalidArgsLog.py (1434 of 1781) PASS: lldb-unit :: Utility/./UtilityTests/UriParserTest.MinimalPath (1435 of 1781) PASS: lldb-unit :: Utility/./UtilityTests/StringLexerTest.AdvanceIf (1436 of 1781) PASS: lldb-shell :: Driver/TestTarget.test (1437 of 1781) PASS: lldb-unit :: Utility/./UtilityTests/ArgsTest.BareSingleQuote (1438 of 1781) UNSUPPORTED: lldb-api :: benchmarks/expression/TestExpressionCmd.py (1439 of 1781) PASS: lldb-shell :: SymbolFile/Breakpad/line-table-discontinuous-file-ids.test (1440 of 1781) PASS: lldb-unit :: Utility/./UtilityTests/StreamTest.PutMaxHex64ByteOrderBig (1441 of 1781) PASS: lldb-unit :: Utility/./UtilityTests/RangeTest.EqualInvalid (1442 of 1781) PASS: lldb-api :: commands/process/launch-with-shellexpand/TestLaunchWithShellExpand.py (1443 of 1781) PASS: lldb-unit :: Language/CPlusPlus/./LanguageCPlusPlusTests/CPlusPlusLanguage.MethodNameParsing (1444 of 1781) PASS: lldb-unit :: Utility/./UtilityTests/ProcessInstanceInfo.Dump (1445 of 1781) PASS: lldb-api :: functionalities/completion/TestCompletion.py (1446 of 1781) PASS: lldb-api :: lang/cpp/char1632_t/TestChar1632T.py (1447 of 1781) PASS: lldb-shell :: Driver/TestProcessAttach.test (1448 of 1781) PASS: lldb-unit :: Utility/./UtilityTests/StreamTeeTest.Flush (1449 of 1781) PASS: lldb-unit :: Utility/./UtilityTests/Flags.Clear (1450 of 1781) PASS: lldb-unit :: Process/minidump/./LLDBMinidumpTests/MinidumpParserTest.FindMemoryRangeWithFullMemoryMinidump (1451 of 1781) PASS: lldb-unit :: Utility/./UtilityTests/BinaryStreamTest.PutSLEB128FourBytes (1452 of 1781) PASS: lldb-unit :: Utility/./UtilityTests/AnsiTerminal.KnownPrefix (1453 of 1781) PASS: lldb-api :: lang/objc/modules-cache/TestClangModulesCache.py (1454 of 1781) PASS: lldb-api :: commands/expression/radar_8638051/Test8638051.py (1455 of 1781) PASS: lldb-api :: functionalities/type_lookup/TestTypeLookup.py (1456 of 1781) PASS: lldb-unit :: Utility/./UtilityTests/StringExtractorTest.GetU32BigEndian (1457 of 1781) PASS: lldb-api :: commands/expression/options/TestExprOptions.py (1458 of 1781) PASS: lldb-api :: lang/c/unions/TestUnionMembers.py (1459 of 1781) UNSUPPORTED: lldb-shell :: Register/x86-64-ymm16-write.test (1460 of 1781) PASS: lldb-unit :: Utility/./UtilityTests/StreamTest.PutHex8 (1461 of 1781) PASS: lldb-unit :: Utility/./UtilityTests/StreamTeeTest.Constructor2Streams (1462 of 1781) PASS: lldb-unit :: Utility/./UtilityTests/StringListTest.DefaultConstructor (1463 of 1781) PASS: lldb-unit :: Utility/./UtilityTests/StringExtractorTest.GetHexBytesAvail (1464 of 1781) PASS: lldb-api :: lang/objc/exceptions/TestObjCExceptions.py (1465 of 1781) PASS: lldb-unit :: Process/gdb-remote/./ProcessGdbRemoteTests/GDBRemoteCommunicationClientTest.TestPacketSpeedJSON (1466 of 1781) UNSUPPORTED: lldb-api :: lang/cpp/static_members/TestCPPStaticMembers.py (1467 of 1781) PASS: lldb-api :: commands/command/nested_alias/TestNestedAlias.py (1468 of 1781) PASS: lldb-unit :: Utility/./UtilityTests/StringListTest.InsertStringAtIndexStdString (1469 of 1781) PASS: lldb-api :: functionalities/data-formatter/type_summary_list_arg/TestTypeSummaryListArg.py (1470 of 1781) PASS: lldb-shell :: Driver/TestFile.test (1471 of 1781) PASS: lldb-api :: functionalities/breakpoint/breakpoint_names/TestBreakpointNames.py (1472 of 1781) PASS: lldb-unit :: Language/Highlighting/./HighlighterTests/HighlighterTest.ClangStringLiterals (1473 of 1781) PASS: lldb-unit :: Utility/./UtilityTests/Flags.AllClear (1474 of 1781) PASS: lldb-unit :: Utility/./UtilityTests/TimeoutTest.Format (1475 of 1781) PASS: lldb-unit :: Expression/./ExpressionTests/DiagnosticManagerTest.GetStringMultipleDiags (1476 of 1781) PASS: lldb-unit :: Utility/./UtilityTests/VASprintfTest.BufferResize (1477 of 1781) PASS: lldb-api :: lang/cpp/gmodules-templates/TestGModules.py (1478 of 1781) PASS: lldb-api :: python_api/sbdata/TestSBData.py (1479 of 1781) PASS: lldb-unit :: Host/./HostTests/NativeProcessProtocolTest.SetBreakpointFailRead (1480 of 1781) PASS: lldb-api :: functionalities/stats_api/TestStatisticsAPI.py (1481 of 1781) PASS: lldb-unit :: Expression/./ExpressionTests/ClangHostTest.ComputeClangResourceDirectory (1482 of 1781) PASS: lldb-unit :: Utility/./UtilityTests/LogChannelEnabledTest.LogVerboseThread (1483 of 1781) PASS: lldb-api :: python_api/lldbutil/TestSwigVersion.py (1484 of 1781) PASS: lldb-unit :: Utility/./UtilityTests/StringExtractorTest.DecodeHexU8_Underflow (1485 of 1781) PASS: lldb-unit :: Process/gdb-remote/./ProcessGdbRemoteTests/GDBRemoteClientBaseTest.SendContinueAndAsyncPacket (1486 of 1781) PASS: lldb-unit :: ObjectFile/ELF/./ObjectFileELFTests/ObjectFileELFTest.GetSymtab_NoSymEntryPointArmThumbAddressClass (1487 of 1781) PASS: lldb-api :: functionalities/breakpoint/address_breakpoints/TestBadAddressBreakpoints.py (1488 of 1781) PASS: lldb-api :: functionalities/unwind/noreturn/TestNoreturnUnwind.py (1489 of 1781) UNSUPPORTED: lldb-shell :: BuildScript/toolchain-clang-cl.test (1490 of 1781) PASS: lldb-api :: commands/expression/import-std-module/weak_ptr-dbg-info-content/TestDbgInfoContentWeakPtr.py (1491 of 1781) PASS: lldb-unit :: SymbolFile/DWARF/./SymbolFileDWARFTests/SymbolFileDWARFTests.TestAbbrevNullAttrValidForm (1492 of 1781) PASS: lldb-api :: commands/expression/import-std-module/empty-module/TestEmptyStdModule.py (1493 of 1781) PASS: lldb-unit :: Host/./HostTests/TaskPoolTest.RunTasks (1494 of 1781) PASS: lldb-api :: python_api/function_symbol/TestSymbolAPI.py (1495 of 1781) PASS: lldb-shell :: SymbolFile/NativePDB/ast-methods.cpp (1496 of 1781) PASS: lldb-unit :: Utility/./UtilityTests/StringExtractorTest.GetNameColonValueNoSemicolon (1497 of 1781) PASS: lldb-api :: functionalities/thread/concurrent_events/TestConcurrentCrashWithWatchpointBreakpointSignal.py (1498 of 1781) PASS: lldb-unit :: Process/minidump/./LLDBMinidumpTests/MinidumpParserTest.GetThreadContext_x86_32_wow64 (1499 of 1781) PASS: lldb-api :: lang/objc/hidden-ivars/TestHiddenIvars.py (1500 of 1781) PASS: lldb-unit :: UnwindAssembly/x86/./UnwindAssemblyx86Tests/Testx86AssemblyInspectionEngine.TestPushRBP (1501 of 1781) PASS: lldb-api :: python_api/name_lookup/TestNameLookup.py (1502 of 1781) PASS: lldb-api :: lang/c/forward/TestForwardDeclaration.py (1503 of 1781) PASS: lldb-api :: lang/cpp/template-function/TestTemplateFunctions.py (1504 of 1781) PASS: lldb-unit :: ScriptInterpreter/Python/./ScriptInterpreterPythonTests/PythonDataObjectsTest.TestPythonListValueEquality (1505 of 1781) PASS: lldb-api :: commands/expression/namespace_local_var_same_name_cpp_and_c/TestNamespaceLocalVarSameNameCppAndC.py (1506 of 1781) PASS: lldb-unit :: tools/lldb-server/tests/./LLDBServerTests/TestBase.DebugserverEnv (1507 of 1781) PASS: lldb-unit :: Utility/./UtilityTests/StringListTest.JoinMultiCharSeparator (1508 of 1781) PASS: lldb-unit :: Utility/./UtilityTests/OptionsWithRawTest.WhitespaceInput (1509 of 1781) PASS: lldb-api :: python_api/watchpoint/TestWatchpointIter.py (1510 of 1781) PASS: lldb-shell :: Driver/TestConvenienceVariables.test (1511 of 1781) PASS: lldb-api :: commands/command/script_alias/TestCommandScriptAlias.py (1512 of 1781) PASS: lldb-api :: api/multiple-targets/TestMultipleTargets.py (1513 of 1781) PASS: lldb-api :: commands/gui/invalid-args/TestInvalidArgsGui.py (1514 of 1781) PASS: lldb-unit :: Utility/./UtilityTests/VMRange.ContainsRange (1515 of 1781) PASS: lldb-unit :: Utility/./UtilityTests/LogChannelEnabledTest.LogThread (1516 of 1781) PASS: lldb-api :: functionalities/data-formatter/data-formatter-stl/libcxx/unordered/TestDataFormatterUnordered.py (1517 of 1781) PASS: lldb-shell :: Commands/command-source.test (1518 of 1781) PASS: lldb-shell :: SymbolFile/DWARF/find-basic-type.cpp (1519 of 1781) PASS: lldb-api :: commands/command/source/TestCommandSource.py (1520 of 1781) PASS: lldb-api :: functionalities/data-formatter/data-formatter-stl/libcxx/multiset/TestDataFormatterLibcxxMultiSet.py (1521 of 1781) PASS: lldb-api :: functionalities/tail_call_frames/ambiguous_tail_call_seq1/TestAmbiguousTailCallSeq1.py (1522 of 1781) PASS: lldb-unit :: Expression/./ExpressionTests/CppModuleConfigurationTest.UnknownLibCppFile (1523 of 1781) PASS: lldb-unit :: Utility/./UtilityTests/StringExtractorTest.GetHexU8_Underflow_NoEof (1524 of 1781) PASS: lldb-api :: functionalities/breakpoint/comp_dir_symlink/TestCompDirSymLink.py (1525 of 1781) PASS: lldb-api :: lang/objc/objc-dyn-sbtype/TestObjCDynamicSBType.py (1526 of 1781) PASS: lldb-api :: functionalities/recursion/TestValueObjectRecursion.py (1527 of 1781) PASS: lldb-api :: commands/source/info/TestSourceInfo.py (1528 of 1781) PASS: lldb-api :: python_api/watchpoint/watchlocation/TestSetWatchlocation.py (1529 of 1781) UNSUPPORTED: lldb-shell :: Breakpoint/ppc64-localentry.test (1530 of 1781) PASS: lldb-unit :: Utility/./UtilityTests/RecordReplayTest.InstrumentedFooSameThis (1531 of 1781) PASS: lldb-unit :: Process/minidump/./LLDBMinidumpTests/MinidumpParserTest.GetThreadContext_x86_32 (1532 of 1781) PASS: lldb-unit :: Utility/./UtilityTests/StreamTest.PutHex32ByteOrderBig (1533 of 1781) PASS: lldb-unit :: UnwindAssembly/x86/./UnwindAssemblyx86Tests/Testx86AssemblyInspectionEngine.TestAddRSP (1534 of 1781) PASS: lldb-api :: tools/lldb-server/commandline/TestStubSetSID.py (1535 of 1781) PASS: lldb-api :: commands/expression/context-object-objc/TestContextObjectObjc.py (1536 of 1781) PASS: lldb-unit :: ScriptInterpreter/Python/./ScriptInterpreterPythonTests/PythonDataObjectsTest.TestGlobalNameResolutionWithDot (1537 of 1781) PASS: lldb-unit :: Utility/./UtilityTests/StringExtractorTest.GetHexBytes_FullString (1538 of 1781) PASS: lldb-shell :: SymbolFile/DWARF/find-qualified-variable.cpp (1539 of 1781) PASS: lldb-unit :: Utility/./UtilityTests/StringExtractorTest.GetNameColonValueContainsColon (1540 of 1781) PASS: lldb-unit :: Utility/./UtilityTests/ArgsTest.TestMultipleArgs (1541 of 1781) PASS: lldb-shell :: ObjectFile/ELF/section-types.yaml (1542 of 1781) PASS: lldb-shell :: Expr/TestMultilineExpr.test (1543 of 1781) PASS: lldb-api :: tools/lldb-server/inferior-crash/TestGdbRemoteAbort.py (1544 of 1781) PASS: lldb-api :: lang/cpp/stl/TestSTL.py (1545 of 1781) PASS: lldb-shell :: Settings/TestSettingsWrite.test (1546 of 1781) PASS: lldb-shell :: ObjectFile/ELF/duplicate-section.yaml (1547 of 1781) PASS: lldb-unit :: Utility/./UtilityTests/StringListTest.GetMaxStringLengthMixed (1548 of 1781) PASS: lldb-shell :: SymbolFile/NativePDB/s_constant.cpp (1549 of 1781) PASS: lldb-shell :: ObjectFile/ELF/PT_LOAD-overlap-section.yaml (1550 of 1781) PASS: lldb-api :: functionalities/postmortem/minidump-new/TestMiniDumpUUID.py (1551 of 1781) UNSUPPORTED: lldb-api :: commands/watchpoints/hello_watchlocation/TestWatchLocation.py (1552 of 1781) PASS: lldb-unit :: Utility/./UtilityTests/StringListTest.LongestCommonPrefixDuplicateElement (1553 of 1781) PASS: lldb-unit :: Utility/./UtilityTests/ScalarTest.Promotion (1554 of 1781) PASS: lldb-unit :: Language/CPlusPlus/./LanguageCPlusPlusTests/CPlusPlusLanguage.FindAlternateFunctionManglings (1555 of 1781) PASS: lldb-unit :: Process/minidump/./LLDBMinidumpTests/RegisterContextMinidump.ConvertMinidumpContext_x86_64 (1556 of 1781) PASS: lldb-unit :: Utility/./UtilityTests/Predicate.WaitForValueNotEqualTo (1557 of 1781) PASS: lldb-unit :: UnwindAssembly/x86/./UnwindAssemblyx86Tests/Testx86AssemblyInspectionEngine.TestPushEAX (1558 of 1781) UNSUPPORTED: lldb-shell :: SymbolFile/PDB/pointers.test (1559 of 1781) PASS: lldb-unit :: Symbol/./SymbolTests/TestClangASTContext.TestGetBasicTypeFromEnum (1560 of 1781) PASS: lldb-unit :: ScriptInterpreter/Python/./ScriptInterpreterPythonTests/PythonDataObjectsTest.TestPythonInteger (1561 of 1781) PASS: lldb-unit :: ScriptInterpreter/Python/./ScriptInterpreterPythonTests/PythonDataObjectsTest.TestPythonTupleValues (1562 of 1781) PASS: lldb-unit :: Utility/./UtilityTests/StringListTest.GetMaxStringLengthDecreasingSize (1563 of 1781) PASS: lldb-api :: lang/objc/objc-runtime-ivars/TestRuntimeIvars.py (1564 of 1781) PASS: lldb-api :: functionalities/breakpoint/cpp/TestCPPBreakpointLocations.py (1565 of 1781) PASS: lldb-shell :: Python/crashlog.test (1566 of 1781) PASS: lldb-api :: commands/expression/weak_symbols/TestWeakSymbols.py (1567 of 1781) PASS: lldb-unit :: Utility/./UtilityTests/SerializationRountripTest.SerializeDeserializePodPointers (1568 of 1781) UNSUPPORTED: lldb-api :: lang/c/typedef/Testtypedef.py (1569 of 1781) UNSUPPORTED: lldb-shell :: Unwind/unwind-plan-dwarf-dump.test (1570 of 1781) PASS: lldb-api :: functionalities/fat_archives/TestFatArchives.py (1571 of 1781) PASS: lldb-unit :: Utility/./UtilityTests/FileSpecTest.IsRelative (1572 of 1781) PASS: lldb-unit :: Utility/./UtilityTests/ArgsTest.TestSingleArgWithQuotedSpace (1573 of 1781) PASS: lldb-unit :: Utility/./UtilityTests/FileSpecTest.EqualDotsWindows (1574 of 1781) PASS: lldb-shell :: Driver/TestCommands.test (1575 of 1781) PASS: lldb-unit :: Signals/./SignalsTests/UnixSignalsTest.Iteration (1576 of 1781) PASS: lldb-unit :: Core/./LLDBCoreTests/MangledTest.EmptyForInvalidName (1577 of 1781) PASS: lldb-shell :: Quit/TestQuitExitCodeImplicit0.test (1578 of 1781) PASS: lldb-unit :: Process/gdb-remote/./ProcessGdbRemoteTests/GDBRemoteCommunicationClientTest.GetModulesInfo_UUID20 (1579 of 1781) PASS: lldb-unit :: Utility/./UtilityTests/ProcessInfoTest.Constructor (1580 of 1781) UNSUPPORTED: lldb-shell :: Register/x86-gp-read.test (1581 of 1781) PASS: lldb-api :: commands/command/script/import/rdar-12586188/TestRdar12586188.py (1582 of 1781) PASS: lldb-api :: functionalities/modern-type-lookup/libcxx/TestLibCxxModernTypeLookup.py (1583 of 1781) PASS: lldb-api :: tools/lldb-server/TestGdbRemoteExitCode.py (1584 of 1781) PASS: lldb-unit :: Utility/./UtilityTests/StringExtractorTest.GetHexBytesAvail_FullString (1585 of 1781) UNSUPPORTED: lldb-api :: functionalities/darwin_log/filter/regex/activity/TestDarwinLogFilterRegexActivity.py (1586 of 1781) PASS: lldb-unit :: SymbolFile/NativePDB/./SymbolFileNativePDBTests/PDBFPOProgramToDWARFExpressionTests.InvalidAssignmentMultiple (1587 of 1781) PASS: lldb-api :: commands/frame/diagnose/virtual-method-call/TestDiagnoseDereferenceVirtualMethodCall.py (1588 of 1781) PASS: lldb-api :: macosx/duplicate-archive-members/TestDuplicateMembers.py (1589 of 1781) PASS: lldb-unit :: Language/Highlighting/./HighlighterTests/HighlighterTest.ClangBraces (1590 of 1781) PASS: lldb-api :: lang/objcxx/class-name-clash/TestNameClash.py (1591 of 1781) PASS: lldb-api :: commands/expression/call-function/TestCallStopAndContinue.py (1592 of 1781) PASS: lldb-api :: functionalities/breakpoint/auto_continue/TestBreakpointAutoContinue.py (1593 of 1781) PASS: lldb-shell :: ObjectFile/ELF/base-address.yaml (1594 of 1781) PASS: lldb-api :: functionalities/data-formatter/typedef_array/TestTypedefArray.py (1595 of 1781) PASS: lldb-unit :: Language/Highlighting/./HighlighterTests/HighlighterTest.ClangIdentifiers (1596 of 1781) PASS: lldb-unit :: Utility/./UtilityTests/ListenerTest.GetEventWait (1597 of 1781) PASS: lldb-unit :: Process/minidump/./LLDBMinidumpTests/MinidumpParserTest.GetExceptionStream (1598 of 1781) PASS: lldb-api :: functionalities/ptr_refs/TestPtrRefs.py (1599 of 1781) PASS: lldb-unit :: Symbol/./SymbolTests/Type.CompilerContextPattern (1600 of 1781) PASS: lldb-unit :: Host/./HostTests/TaskPoolTest.AddTask (1601 of 1781) PASS: lldb-shell :: ObjectFile/Breakpad/discontiguous-sections.test (1602 of 1781) PASS: lldb-unit :: Interpreter/./InterpreterTests/OptionArgParserTest.toScriptLanguage (1603 of 1781) PASS: lldb-shell :: SymbolFile/sizeless-symbol.test (1604 of 1781) PASS: lldb-api :: lang/cpp/this/TestCPPThis.py (1605 of 1781) PASS: lldb-unit :: Utility/./UtilityTests/StringListTest.AppendListCStringArray (1606 of 1781) PASS: lldb-unit :: Utility/./UtilityTests/StreamTest.PutRawBytesToBigEndian (1607 of 1781) PASS: lldb-unit :: UnwindAssembly/x86/./UnwindAssemblyx86Tests/Testx86AssemblyInspectionEngine.TestPush0 (1608 of 1781) PASS: lldb-unit :: Utility/./UtilityTests/ProcessInstanceInfo.DumpTable_invalidUID (1609 of 1781) PASS: lldb-api :: lang/objc/objc-foundation-dictionary-empty/TestNSDictionary0.py (1610 of 1781) PASS: lldb-shell :: Register/x86-64-gp-read.test (1611 of 1781) PASS: lldb-api :: functionalities/data-formatter/user-format-vs-summary/TestUserFormatVsSummary.py (1612 of 1781) PASS: lldb-api :: functionalities/thread/concurrent_events/TestConcurrentTwoWatchpointThreads.py (1613 of 1781) PASS: lldb-unit :: ScriptInterpreter/Python/./ScriptInterpreterPythonTests/PythonDataObjectsTest.TestPythonFile (1614 of 1781) PASS: lldb-api :: commands/expression/import-std-module/no-std-module/TestMissingStdModule.py (1615 of 1781) PASS: lldb-api :: commands/expression/call-throws/TestCallThatThrows.py (1616 of 1781) PASS: lldb-shell :: Minidump/fb-dump.test (1617 of 1781) PASS: lldb-unit :: Utility/./UtilityTests/VMRange.SetEndAddress (1618 of 1781) PASS: lldb-api :: lang/objc/foundation/TestSymbolTable.py (1619 of 1781) PASS: lldb-shell :: ObjectFile/Breakpad/breakpad-identification.test (1620 of 1781) PASS: lldb-api :: functionalities/data-formatter/parray/TestPrintArray.py (1621 of 1781) PASS: lldb-api :: lang/objc/foundation/TestObjCMethodsNSError.py (1622 of 1781) PASS: lldb-api :: functionalities/data-formatter/data-formatter-stl/libcxx/list/TestDataFormatterLibcxxList.py (1623 of 1781) PASS: lldb-unit :: tools/lldb-server/tests/./LLDBServerTests/StandardStartupTest.TestStopReplyContainsThreadPcs (1624 of 1781) PASS: lldb-unit :: Utility/./UtilityTests/FileSpecTest.RemoveLastPathComponent (1625 of 1781) PASS: lldb-api :: lang/cpp/inlines/TestInlines.py (1626 of 1781) UNSUPPORTED: lldb-api :: benchmarks/expression/TestRepeatedExprs.py (1627 of 1781) PASS: lldb-unit :: Utility/./UtilityTests/ConstStringTest.NullAndEmptyStates (1628 of 1781) PASS: lldb-unit :: Expression/./ExpressionTests/ClangHostTest.MacOSX (1629 of 1781) PASS: lldb-api :: functionalities/breakpoint/require_hw_breakpoints/TestRequireHWBreakpoints.py (1630 of 1781) PASS: lldb-api :: lang/objc/unicode-string/TestUnicodeString.py (1631 of 1781) PASS: lldb-api :: lang/cpp/class_static/TestStaticVariables.py (1632 of 1781) PASS: lldb-unit :: ScriptInterpreter/Python/./ScriptInterpreterPythonTests/PythonDataObjectsTest.TestPythonCallableCheck (1633 of 1781) PASS: lldb-unit :: Utility/./UtilityTests/StringExtractorTest.GetHexBytes_OddPair (1634 of 1781) PASS: lldb-unit :: Utility/./UtilityTests/StringListTest.AppendStringCString (1635 of 1781) PASS: lldb-unit :: Utility/./UtilityTests/StreamTeeTest.Constructor1Stream (1636 of 1781) PASS: lldb-unit :: Expression/./ExpressionTests/DiagnosticManagerTest.GetStringSeverityLabels (1637 of 1781) PASS: lldb-unit :: Symbol/./SymbolTests/DWARFCallFrameInfoTest.Basic_dwarf4 (1638 of 1781) PASS: lldb-unit :: Utility/./UtilityTests/EventTest.DumpEventDataBytes (1639 of 1781) PASS: lldb-unit :: Utility/./UtilityTests/Flags.Test (1640 of 1781) PASS: lldb-shell :: ObjectFile/ELF/minidebuginfo-find-symbols.yaml (1641 of 1781) PASS: lldb-api :: lang/objc/rdar-10967107/TestRdar10967107.py (1642 of 1781) PASS: lldb-unit :: Symbol/./SymbolTests/LineEntryTest.GetSameLineContiguousAddressRangeNestedInline (1643 of 1781) PASS: lldb-api :: functionalities/data-formatter/data-formatter-objc/TestDataFormatterObjCNSURL.py (1644 of 1781) PASS: lldb-unit :: Utility/./UtilityTests/ArgsTest.AppendArguments (1645 of 1781) PASS: lldb-shell :: ObjectFile/ELF/aarch64-relocations.yaml (1646 of 1781) PASS: lldb-api :: commands/frame/diagnose/inheritance/TestDiagnoseInheritance.py (1647 of 1781) PASS: lldb-unit :: Utility/./UtilityTests/CompletionRequest.TestCompletionOwnership (1648 of 1781) PASS: lldb-api :: python_api/value/TestValueAPI.py (1649 of 1781) PASS: lldb-api :: commands/expression/call-overridden-method/TestCallOverriddenMethod.py (1650 of 1781) UNSUPPORTED: lldb-shell :: ExecControl/StopHook/stop-hook-threads.test (1651 of 1781) PASS: lldb-api :: lang/c/step-target/TestStepTarget.py (1652 of 1781) UNSUPPORTED: lldb-api :: functionalities/darwin_log/filter/exact_match/subsystem/TestDarwinLogFilterMatchSubsystem.py (1653 of 1781) PASS: lldb-unit :: Symbol/./SymbolTests/TestClangASTContext.TemplateArguments (1654 of 1781) PASS: lldb-api :: lang/cpp/chained-calls/TestCppChainedCalls.py (1655 of 1781) UNSUPPORTED: lldb-shell :: Register/x86-gp-write.test (1656 of 1781) PASS: lldb-unit :: Process/gdb-remote/./ProcessGdbRemoteTests/GDBRemoteCommunicationClientTest.ReadRegister (1657 of 1781) PASS: lldb-api :: macosx/indirect_symbol/TestIndirectSymbols.py (1658 of 1781) PASS: lldb-api :: lang/objc/objc-new-syntax/TestObjCNewSyntaxArray.py (1659 of 1781) PASS: lldb-unit :: Utility/./UtilityTests/StringListTest.ShiftStdString (1660 of 1781) PASS: lldb-api :: lang/c/bitfields/TestBitfields.py (1661 of 1781) PASS: lldb-api :: functionalities/breakpoint/breakpoint_command/TestRegexpBreakCommand.py (1662 of 1781) UNSUPPORTED: lldb-api :: functionalities/unwind/ehframe/TestEhFrameUnwind.py (1663 of 1781) PASS: lldb-unit :: Language/Highlighting/./HighlighterTests/HighlighterTest.DefaultHighlighterWithCursorOutOfBounds (1664 of 1781) PASS: lldb-api :: lang/cpp/signed_types/TestSignedTypes.py (1665 of 1781) PASS: lldb-unit :: Utility/./UtilityTests/DataExtractorTest.GetCStrEmpty (1666 of 1781) PASS: lldb-unit :: Utility/./UtilityTests/StreamTest.PutStringAsRawHex8 (1667 of 1781) PASS: lldb-api :: functionalities/data-formatter/data-formatter-objc/nsstring/TestDataFormatterNSString.py (1668 of 1781) PASS: lldb-unit :: Utility/./UtilityTests/LogChannelEnabledTest.LogGetLogThread (1669 of 1781) PASS: lldb-unit :: Process/minidump/./LLDBMinidumpTests/MinidumpParserTest.GetMiscInfoWindows (1670 of 1781) PASS: lldb-shell :: SymbolFile/DWARF/parallel-indexing-stress.s (1671 of 1781) PASS: lldb-unit :: Utility/./UtilityTests/BinaryStreamTest.PutSLEB128EightBytes (1672 of 1781) PASS: lldb-api :: commands/frame/diagnose/complicated-expression/TestComplicatedExpression.py (1673 of 1781) PASS: lldb-unit :: Target/./TargetTests/PathMappingListTest.RemapRoot (1674 of 1781) PASS: lldb-unit :: UnwindAssembly/x86/./UnwindAssemblyx86Tests/Testx86AssemblyInspectionEngine.TestDisassemblyMidFunctionEpilogues (1675 of 1781) PASS: lldb-unit :: Utility/./UtilityTests/RangeTest.ContainsEndInclusiveInvalid (1676 of 1781) PASS: lldb-unit :: Process/gdb-remote/./ProcessGdbRemoteTests/GDBRemoteCommunicationClientTest.GetMemoryRegionInfoInvalidResponse (1677 of 1781) PASS: lldb-unit :: Utility/./UtilityTests/StringLexerTest.PutBack (1678 of 1781) PASS: lldb-api :: functionalities/object-file/TestImageListMultiArchitecture.py (1679 of 1781) PASS: lldb-unit :: Expression/./ExpressionTests/CppModuleConfigurationTest.Linux (1680 of 1781) PASS: lldb-api :: functionalities/data-formatter/refpointer-recursion/TestDataFormatterRefPtrRecursion.py (1681 of 1781) PASS: lldb-unit :: Utility/./UtilityTests/StringExtractorTest.GetHexU8_Exact_NoEof (1682 of 1781) PASS: lldb-api :: lang/objc/ivar-IMP/TestObjCiVarIMP.py (1683 of 1781) PASS: lldb-shell :: Breakpoint/debug_rnglist_rlestartend.test (1684 of 1781) PASS: lldb-api :: lang/cpp/frame-var-anon-unions/TestFrameVariableAnonymousUnions.py (1685 of 1781) PASS: lldb-unit :: ObjectFile/PECOFF/./ObjectFilePECOFFTests/PECallFrameInfoTest.Frame_reg_eh (1686 of 1781) PASS: lldb-unit :: Host/./HostTests/NativeProcessProtocolTest.SetBreakpointFailWrite (1687 of 1781) PASS: lldb-unit :: ObjectFile/ELF/./ObjectFileELFTests/ObjectFileELFTest.GetModuleSpecifications_EarlySectionHeaders (1688 of 1781) PASS: lldb-api :: commands/process/attach/attach_denied/TestAttachDenied.py (1689 of 1781) PASS: lldb-shell :: Quit/TestQuitExitCode0.test (1690 of 1781) PASS: lldb-unit :: Utility/./UtilityTests/StringListTest.ShiftMove (1691 of 1781) PASS: lldb-unit :: Utility/./UtilityTests/StringExtractorTest.DecodeHexU8_InvalidHex2 (1692 of 1781) UNSUPPORTED: lldb-api :: arm/breakpoint-thumb-codesection/TestBreakpointThumbCodesection.py (1693 of 1781) PASS: lldb-api :: functionalities/wrong_commands/TestWrongCommands.py (1694 of 1781) PASS: lldb-api :: functionalities/deleted-executable/TestDeletedExecutable.py (1695 of 1781) PASS: lldb-api :: commands/register/register/register_command/TestRegisters.py (1696 of 1781) PASS: lldb-unit :: Process/minidump/./LLDBMinidumpTests/MinidumpParserTest.GetThreadsAndGetThreadContext (1697 of 1781) PASS: lldb-api :: tools/lldb-server/TestGdbRemote_qThreadStopInfo.py (1698 of 1781) PASS: lldb-api :: commands/expression/no-deadlock/TestExprDoesntBlock.py (1699 of 1781) PASS: lldb-api :: python_api/sblaunchinfo/TestSBLaunchInfo.py (1700 of 1781) UNSUPPORTED: lldb-api :: functionalities/data-formatter/data-formatter-stl/libstdcpp/vbool/TestDataFormatterStdVBool.py (1701 of 1781) PASS: lldb-unit :: Utility/./UtilityTests/DataExtractorTest.PeekData (1702 of 1781) PASS: lldb-api :: functionalities/breakpoint/breakpoint_hit_count/TestBreakpointHitCount.py (1703 of 1781) PASS: lldb-api :: lang/cpp/enum_types/TestCPP11EnumTypes.py (1704 of 1781) PASS: lldb-api :: commands/expression/top-level/TestTopLevelExprs.py (1705 of 1781) XFAIL: lldb-shell :: SymbolFile/DWARF/find-type-in-function.cpp (1706 of 1781) PASS: lldb-unit :: ScriptInterpreter/Python/./ScriptInterpreterPythonTests/PythonDataObjectsTest.TestPythonByteArray (1707 of 1781) PASS: lldb-shell :: Reproducer/TestFileRepro.test (1708 of 1781) PASS: lldb-unit :: SymbolFile/NativePDB/./SymbolFileNativePDBTests/PDBFPOProgramToDWARFExpressionTests.UnresolvedDependentCyclicRegisterAssignmentReference (1709 of 1781) UNSUPPORTED: lldb-shell :: SymbolFile/PDB/expressions.test (1710 of 1781) PASS: lldb-shell :: SymbolFile/NativePDB/global-classes.cpp (1711 of 1781) PASS: lldb-api :: lang/cpp/function_refs/TestFunctionRefs.py (1712 of 1781) PASS: lldb-shell :: SymbolFile/NativePDB/globals-fundamental.cpp (1713 of 1781) PASS: lldb-api :: lang/cpp/exceptions/TestCPPExceptionBreakpoints.py (1714 of 1781) PASS: lldb-unit :: Utility/./UtilityTests/OptionsWithRawTest.EmptySuffixSingleWhitespace (1715 of 1781) PASS: lldb-unit :: Utility/./UtilityTests/StringLexerTest.NextIfList (1716 of 1781) PASS: lldb-unit :: UnwindAssembly/x86/./UnwindAssemblyx86Tests/Testx86AssemblyInspectionEngine.TestPopR14 (1717 of 1781) PASS: lldb-api :: driver/batch_mode/TestBatchMode.py (1718 of 1781) UNSUPPORTED: lldb-shell :: Register/x86-64-xmm16-read.test (1719 of 1781) PASS: lldb-unit :: Utility/./UtilityTests/ListenerTest.GetEventImmediate (1720 of 1781) PASS: lldb-api :: commands/expression/dollar-in-variable/TestDollarInVariable.py (1721 of 1781) PASS: lldb-unit :: Utility/./UtilityTests/ArgsTest.EscapeLLDBCommandArgument (1722 of 1781) PASS: lldb-api :: lang/objc/rdar-11355592/TestRdar11355592.py (1723 of 1781) PASS: lldb-unit :: Symbol/./SymbolTests/TestClangASTContext.TestUnifyAccessSpecifiers (1724 of 1781) PASS: lldb-api :: functionalities/thread/concurrent_events/TestConcurrentSignalDelayBreak.py (1725 of 1781) PASS: lldb-api :: functionalities/data-formatter/data-formatter-proper-plurals/TestFormattersOneIsSingular.py (1726 of 1781) PASS: lldb-unit :: ObjectFile/Breakpad/./ObjectFileBreakpadTests/FileRecord.parse (1727 of 1781) UNSUPPORTED: lldb-api :: commands/expression/completion-crash1/TestCompletionCrash1.py (1728 of 1781) PASS: lldb-api :: lang/cpp/std-function-step-into-callable/TestStdFunctionStepIntoCallable.py (1729 of 1781) PASS: lldb-api :: commands/expression/diagnostics/TestExprDiagnostics.py (1730 of 1781) PASS: lldb-api :: lang/cpp/breakpoint_in_member_func_w_non_primitive_params/TestBreakpointInMemberFuncWNonPrimitiveParams.py (1731 of 1781) PASS: lldb-unit :: Utility/./UtilityTests/AnsiTerminal.AtEnd (1732 of 1781) UNSUPPORTED: lldb-api :: commands/register/register/intel_xtended_registers/TestMPXRegisters.py (1733 of 1781) UNSUPPORTED: lldb-api :: tools/lldb-vscode/breakpoint/TestVSCode_setFunctionBreakpoints.py (1734 of 1781) PASS: lldb-unit :: Utility/./UtilityTests/RangeTest.ContainsAddr (1735 of 1781) PASS: lldb-api :: functionalities/data-formatter/ostypeformatting/TestFormattersOsType.py (1736 of 1781) PASS: lldb-unit :: Process/gdb-remote/./ProcessGdbRemoteTests/GDBRemoteClientBaseTest.InterruptNoResponse (1737 of 1781) PASS: lldb-unit :: ScriptInterpreter/Python/./ScriptInterpreterPythonTests/PythonDataObjectsTest.TestOwnedReferences (1738 of 1781) PASS: lldb-unit :: Utility/./UtilityTests/ArchSpecTest.Compatibility (1739 of 1781) PASS: lldb-api :: commands/command/invalid-args/TestInvalidArgsCommand.py (1740 of 1781) UNSUPPORTED: lldb-api :: functionalities/exec/TestExec.py (1741 of 1781) UNSUPPORTED: lldb-shell :: Register/x86-64-ymm16-read.test (1742 of 1781) PASS: lldb-api :: functionalities/thread/concurrent_events/TestConcurrentWatchBreak.py (1743 of 1781) UNSUPPORTED: lldb-shell :: SymbolFile/PDB/vbases.test (1744 of 1781) PASS: lldb-api :: functionalities/float-display/TestFloatDisplay.py (1745 of 1781) UNSUPPORTED: lldb-shell :: Register/x86-ymm-read.test (1746 of 1781) PASS: lldb-unit :: Utility/./UtilityTests/VMRange.Reset (1747 of 1781) PASS: lldb-unit :: Utility/./UtilityTests/DataExtractorTest.GetCStrUnterminated (1748 of 1781) PASS: lldb-api :: commands/watchpoints/multiple_threads/TestWatchpointMultipleThreads.py (1749 of 1781) PASS: lldb-api :: lang/c/blocks/TestBlocks.py (1750 of 1781) PASS: lldb-api :: commands/expression/argument_passing_restrictions/TestArgumentPassingRestrictions.py (1751 of 1781) PASS: lldb-api :: commands/watchpoints/watchpoint_disable/TestWatchpointDisable.py (1752 of 1781) PASS: lldb-unit :: debugserver/./debugserverTests/RNBSocket.AnyListen (1753 of 1781) PASS: lldb-unit :: Utility/./UtilityTests/ScalarTest.ComparisonFloat (1754 of 1781) PASS: lldb-unit :: UnwindAssembly/x86/./UnwindAssemblyx86Tests/Testx86AssemblyInspectionEngine.TestPushR13 (1755 of 1781) PASS: lldb-api :: functionalities/thread/concurrent_events/TestConcurrentCrashWithBreak.py (1756 of 1781) PASS: lldb-unit :: Utility/./UtilityTests/StringExtractorTest.GetHexBytes (1757 of 1781) PASS: lldb-api :: functionalities/thread/concurrent_events/TestConcurrentTwoBreakpointsOneDelaySignal.py (1758 of 1781) UNSUPPORTED: lldb-shell :: SymbolFile/target-symbols-add-unwind.test (1759 of 1781) PASS: lldb-unit :: Target/./TargetTests/MemoryRegionInfoTest.Formatv (1760 of 1781) PASS: lldb-api :: commands/frame/diagnose/dereference-argument/TestDiagnoseDereferenceArgument.py (1761 of 1781) PASS: lldb-api :: functionalities/gdb_remote_client/TestPlatformClient.py (1762 of 1781) PASS: lldb-unit :: ScriptInterpreter/Python/./ScriptInterpreterPythonTests/PythonDataObjectsTest.TestPythonStringToStructuredString (1763 of 1781) PASS: lldb-unit :: Utility/./UtilityTests/StringExtractorTest.GetHexBytesAvail_OddPair2 (1764 of 1781) PASS: lldb-api :: commands/watchpoints/watchpoint_size/TestWatchpointSizes.py (1765 of 1781) PASS: lldb-unit :: ScriptInterpreter/Python/./ScriptInterpreterPythonTests/PythonExceptionStateTest.TestAutoRestoreSemantics (1766 of 1781) PASS: lldb-shell :: SymbolFile/DWARF/dir-separator-windows.s (1767 of 1781) PASS: lldb-api :: python_api/rdar-12481949/Test-rdar-12481949.py (1768 of 1781) PASS: lldb-api :: commands/expression/import-std-module/vector-dbg-info-content/TestDbgInfoContentVector.py (1769 of 1781) PASS: lldb-api :: functionalities/thread/concurrent_events/TestConcurrentTwoWatchpointsOneDelayBreakpoint.py (1770 of 1781) PASS: lldb-api :: functionalities/set-data/TestSetData.py (1771 of 1781) PASS: lldb-api :: commands/expression/import-std-module/sysroot/TestStdModuleSysroot.py (1772 of 1781) PASS: lldb-api :: functionalities/data-formatter/data-formatter-objc/TestDataFormatterObjCPlain.py (1773 of 1781) PASS: lldb-api :: functionalities/tail_call_frames/disambiguate_paths_to_common_sink/TestDisambiguatePathsToCommonSink.py (1774 of 1781) PASS: lldb-api :: lang/c/shared_lib_stripped_symbols/TestSharedLibStrippedSymbols.py (1775 of 1781) PASS: lldb-api :: functionalities/data-formatter/data-formatter-objc/TestDataFormatterObjCNSError.py (1776 of 1781) PASS: lldb-api :: lang/objc/objc-ivar-offsets/TestObjCIvarOffsets.py (1777 of 1781) PASS: lldb-api :: lang/cpp/template/TestTemplateArgs.py (1778 of 1781) PASS: lldb-api :: lang/objc/objc-struct-return/TestObjCStructReturn.py (1779 of 1781) PASS: lldb-api :: types/TestIntegerTypes.py (1780 of 1781) PASS: lldb-api :: tools/lldb-server/TestLldbGdbServer.py (1781 of 1781) Testing Time: 1609.26s ******************** Failing Tests (3): lldb-api :: tools/lldb-server/TestGdbRemoteKill.py lldb-api :: iohandler/completion/TestIOHandlerCompletion.py lldb-api :: tools/lldb-server/TestGdbRemoteProcessInfo.py

Hide Details

Hide Details

Slowest Tests: -------------------------------------------------------------------------- 111.06s: lldb-api :: lang/objc/foundation/TestObjCMethodsString.py 113.50s: lldb-api :: functionalities/return-value/TestReturnValue.py 115.61s: lldb-api :: commands/expression/import-std-module/stack/TestStack.py 121.62s: lldb-api :: api/check_public_api_headers/TestPublicAPIHeaders.py 126.78s: lldb-api :: functionalities/inferior-crashing/TestInferiorCrashingStep.py 128.12s: lldb-api :: lang/c/anonymous/TestAnonymous.py 132.71s: lldb-api :: lang/objc/objc-new-syntax/TestObjCNewSyntaxDictionary.py 144.66s: lldb-api :: functionalities/load_unload/TestLoadUnload.py 144.72s: lldb-api :: lang/objc/objc-new-syntax/TestObjCNewSyntaxArray.py 149.18s: lldb-api :: functionalities/recursion/TestValueObjectRecursion.py 159.57s: lldb-api :: lang/objc/exceptions/TestObjCExceptions.py 167.42s: lldb-api :: lang/cpp/namespace/TestNamespaceLookup.py 179.06s: lldb-api :: lang/objc/objc-new-syntax/TestObjCNewSyntaxLiteral.py 199.08s: lldb-api :: lang/cpp/enum_types/TestCPP11EnumTypes.py 199.44s: lldb-api :: lang/objc/foundation/TestObjCMethods.py 228.20s: lldb-api :: lang/objc/hidden-ivars/TestHiddenIvars.py 228.29s: lldb-api :: api/multithreaded/TestMultithreaded.py 291.77s: lldb-api :: types/TestIntegerTypes.py 493.79s: lldb-api :: types/TestIntegerTypesExpr.py 685.23s: lldb-api :: lang/objc/foundation/TestFoundationDisassembly.py

Hide Details

Tests Times: -------------------------------------------------------------------------- [ Range ] :: [ Percentage ] :: [ Count ] -------------------------------------------------------------------------- [ 0s, 50s) :: [************************************* ] :: [1660/1781] [ 50s,100s) :: [** ] :: [ 96/1781] [100s,150s) :: [ ] :: [ 14/1781] [150s,200s) :: [ ] :: [ 4/1781] [200s,250s) :: [ ] :: [ 4/1781] [250s,300s) :: [ ] :: [ 1/1781] [300s,350s) :: [ ] :: [ 0/1781] [350s,400s) :: [ ] :: [ 0/1781] [400s,450s) :: [ ] :: [ 0/1781] [450s,500s) :: [ ] :: [ 0/1781] [500s,550s) :: [ ] :: [ 1/1781] [550s,600s) :: [ ] :: [ 0/1781] [600s,650s) :: [ ] :: [ 0/1781] [650s,700s) :: [ ] :: [ 1/1781] Expected Passes : 1631 Expected Failures : 6 Unsupported Tests : 141 Unexpected Failures: 3 FAILED: tools/lldb/test/CMakeFiles/check-lldb-lit cd /Users/buildslave/jenkins/workspace/lldb-cmake-sanitized/lldb-build/tools/lldb/test && /usr/bin/python /Users/buildslave/jenkins/workspace/lldb-cmake-sanitized/lldb-build/./bin/llvm-lit -v --time-tests --shuffle --xunit-xml-output=/Users/buildslave/jenkins/workspace/lldb-cmake-sanitized/test/results.xml -v --timeout 1200 /Users/buildslave/jenkins/workspace/lldb-cmake-sanitized/lldb-build/tools/lldb/test ninja: build stopped: subcommand failed. Command failed Command: ['/usr/bin/env', 'TERM=vt100', '/usr/local/bin/ninja', '-v', 'check-lldb'] [Pipeline] } [Pipeline] // timeout [Pipeline] } [Pipeline] // stage [Pipeline] stage [Pipeline] { (Declarative: Post Actions) [Pipeline] scanForIssues No credentials specified [Clang (LLVM based)] Sleeping for 5 seconds due to JENKINS-32191... [Clang (LLVM based)] Parsing console log (workspace: '/Users/buildslave/jenkins/workspace/lldb-cmake-sanitized') [Pipeline] junit Recording test results [Pipeline] } [Pipeline] // stage [Pipeline] } [Pipeline] // withEnv [Pipeline] } [Pipeline] // node [Pipeline] End of Pipeline [BFA] Scanning build for known causes... [BFA] Found failure cause(s): [BFA] Regression test failed from category Test [BFA] Ninja target failed from category Compile [BFA] Done. 0s ERROR: script returned exit code 1 Finished: FAILURE