FailedConsole Output

Skipping 210 KB.. Full Log
end.a lib/libclangDriver.a lib/libLLVMProfileData.a lib/libclangParse.a lib/libLLVMMCParser.a lib/libLLVMOption.a lib/libclangSerialization.a lib/libLLVMBitReader.a lib/libclangSema.a lib/libclangAnalysis.a lib/libclangASTMatchers.a lib/libclangEdit.a lib/libclangFormat.a lib/libclangToolingInclusions.a lib/libclangToolingCore.a lib/libclangAST.a lib/libclangRewrite.a lib/libclangLex.a lib/libclangBasic.a lib/libLLVMCore.a lib/libLLVMRemarks.a lib/libLLVMBitstreamReader.a lib/libLLVMMC.a lib/libLLVMBinaryFormat.a lib/libLLVMDebugInfoCodeView.a lib/libLLVMDebugInfoMSF.a lib/libLLVMSupport.a -lz -lcurses -lm lib/libLLVMDemangle.a && :
[89/101] : && /Users/buildslave/jenkins/workspace/lldb-cmake/host-compiler/bin/clang++  -Wdocumentation -fPIC -fvisibility-inlines-hidden -Werror=date-time -Werror=unguarded-availability-new -fmodules -fmodules-cache-path=/Users/buildslave/jenkins/workspace/lldb-cmake/lldb-build/module.cache -fcxx-modules -Wall -Wextra -Wno-unused-parameter -Wwrite-strings -Wcast-qual -Wmissing-field-initializers -pedantic -Wno-long-long -Wimplicit-fallthrough -Wcovered-switch-default -Wno-noexcept-type -Wnon-virtual-dtor -Wdelete-non-virtual-dtor -Wstring-conversion -fdiagnostics-color -Wno-deprecated-declarations -Wno-unknown-pragmas -Wno-strict-aliasing -Wno-deprecated-register -Wno-vla-extension -O3  -isysroot /Applications/Xcode.app/Contents/Developer/Platforms/MacOSX.platform/Developer/SDKs/MacOSX10.14.sdk -Wl,-search_paths_first -Wl,-headerpad_max_install_names -Wl,-dead_strip tools/lldb/tools/lldb-instr/CMakeFiles/lldb-instr.dir/Instrument.cpp.o  -o bin/lldb-instr  -Wl,-rpath,@loader_path/../lib lib/libLLVMSupport.a lib/libclangAST.a lib/libclangBasic.a lib/libclangCodeGen.a lib/libclangFrontend.a lib/libclangLex.a lib/libclangRewrite.a lib/libclangSerialization.a lib/libclangTooling.a lib/libLLVMCoroutines.a lib/libLLVMCoverage.a lib/libLLVMLTO.a lib/libLLVMObjCARCOpts.a lib/libLLVMPasses.a lib/libLLVMipo.a lib/libLLVMIRReader.a lib/libLLVMAsmParser.a lib/libLLVMLinker.a lib/libLLVMInstrumentation.a lib/libLLVMVectorize.a lib/libLLVMCodeGen.a lib/libLLVMBitWriter.a lib/libLLVMScalarOpts.a lib/libLLVMAggressiveInstCombine.a lib/libLLVMInstCombine.a lib/libLLVMTarget.a lib/libLLVMTransformUtils.a lib/libLLVMAnalysis.a lib/libLLVMObject.a lib/libLLVMTextAPI.a lib/libclangFrontend.a lib/libclangParse.a lib/libLLVMMCParser.a lib/libclangSerialization.a lib/libLLVMBitReader.a lib/libclangSema.a lib/libclangAnalysis.a lib/libclangEdit.a lib/libclangASTMatchers.a lib/libclangDriver.a lib/libLLVMProfileData.a lib/libLLVMOption.a lib/libclangFormat.a lib/libclangToolingInclusions.a lib/libclangToolingCore.a lib/libclangAST.a lib/libclangRewrite.a lib/libclangLex.a lib/libclangBasic.a lib/libLLVMCore.a lib/libLLVMRemarks.a lib/libLLVMBitstreamReader.a lib/libLLVMMC.a lib/libLLVMBinaryFormat.a lib/libLLVMDebugInfoCodeView.a lib/libLLVMDebugInfoMSF.a lib/libLLVMSupport.a -lz -lcurses -lm lib/libLLVMDemangle.a && :
[90/101] : && /Users/buildslave/jenkins/workspace/lldb-cmake/host-compiler/bin/clang++ -Wdocumentation -fPIC -fvisibility-inlines-hidden -Werror=date-time -Werror=unguarded-availability-new -fmodules -fmodules-cache-path=/Users/buildslave/jenkins/workspace/lldb-cmake/lldb-build/module.cache -fcxx-modules -Wall -Wextra -Wno-unused-parameter -Wwrite-strings -Wcast-qual -Wmissing-field-initializers -pedantic -Wno-long-long -Wimplicit-fallthrough -Wcovered-switch-default -Wno-noexcept-type -Wnon-virtual-dtor -Wdelete-non-virtual-dtor -Wstring-conversion -fdiagnostics-color -O3 -isysroot /Applications/Xcode.app/Contents/Developer/Platforms/MacOSX.platform/Developer/SDKs/MacOSX10.14.sdk -dynamiclib -Wl,-headerpad_max_install_names -Wl,-dead_strip -Wl,-exported_symbols_list,"/Users/buildslave/jenkins/workspace/lldb-cmake/lldb-build/tools/lto/LTO.exports" -compatibility_version 1 -current_version 10.0.99 -o lib/libLTO.dylib -install_name @rpath/libLTO.dylib tools/lto/CMakeFiles/LTO.dir/LTODisassembler.cpp.o tools/lto/CMakeFiles/LTO.dir/lto.cpp.o  -Wl,-rpath,@loader_path/../lib lib/libLLVMAArch64AsmParser.a lib/libLLVMAMDGPUAsmParser.a lib/libLLVMARMAsmParser.a lib/libLLVMBPFAsmParser.a lib/libLLVMHexagonAsmParser.a lib/libLLVMLanaiAsmParser.a lib/libLLVMMipsAsmParser.a lib/libLLVMMSP430AsmParser.a lib/libLLVMPowerPCAsmParser.a lib/libLLVMRISCVAsmParser.a lib/libLLVMSparcAsmParser.a lib/libLLVMSystemZAsmParser.a lib/libLLVMWebAssemblyAsmParser.a lib/libLLVMX86AsmParser.a lib/libLLVMAArch64CodeGen.a lib/libLLVMAMDGPUCodeGen.a lib/libLLVMARMCodeGen.a lib/libLLVMBPFCodeGen.a lib/libLLVMHexagonCodeGen.a lib/libLLVMLanaiCodeGen.a lib/libLLVMMipsCodeGen.a lib/libLLVMMSP430CodeGen.a lib/libLLVMNVPTXCodeGen.a lib/libLLVMPowerPCCodeGen.a lib/libLLVMRISCVCodeGen.a lib/libLLVMSparcCodeGen.a lib/libLLVMSystemZCodeGen.a lib/libLLVMWebAssemblyCodeGen.a lib/libLLVMX86CodeGen.a lib/libLLVMXCoreCodeGen.a lib/libLLVMAArch64Desc.a lib/libLLVMAMDGPUDesc.a lib/libLLVMARMDesc.a lib/libLLVMBPFDesc.a lib/libLLVMHexagonDesc.a lib/libLLVMLanaiDesc.a lib/libLLVMMipsDesc.a lib/libLLVMMSP430Desc.a lib/libLLVMNVPTXDesc.a lib/libLLVMPowerPCDesc.a lib/libLLVMRISCVDesc.a lib/libLLVMSparcDesc.a lib/libLLVMSystemZDesc.a lib/libLLVMWebAssemblyDesc.a lib/libLLVMX86Desc.a lib/libLLVMXCoreDesc.a lib/libLLVMAArch64Disassembler.a lib/libLLVMAMDGPUDisassembler.a lib/libLLVMARMDisassembler.a lib/libLLVMBPFDisassembler.a lib/libLLVMHexagonDisassembler.a lib/libLLVMLanaiDisassembler.a lib/libLLVMMipsDisassembler.a lib/libLLVMMSP430Disassembler.a lib/libLLVMPowerPCDisassembler.a lib/libLLVMRISCVDisassembler.a lib/libLLVMSparcDisassembler.a lib/libLLVMSystemZDisassembler.a lib/libLLVMWebAssemblyDisassembler.a lib/libLLVMX86Disassembler.a lib/libLLVMXCoreDisassembler.a lib/libLLVMAArch64Info.a lib/libLLVMAMDGPUInfo.a lib/libLLVMARMInfo.a lib/libLLVMBPFInfo.a lib/libLLVMHexagonInfo.a lib/libLLVMLanaiInfo.a lib/libLLVMMipsInfo.a lib/libLLVMMSP430Info.a lib/libLLVMNVPTXInfo.a lib/libLLVMPowerPCInfo.a lib/libLLVMRISCVInfo.a lib/libLLVMSparcInfo.a lib/libLLVMSystemZInfo.a lib/libLLVMWebAssemblyInfo.a lib/libLLVMX86Info.a lib/libLLVMXCoreInfo.a lib/libLLVMBitReader.a lib/libLLVMCore.a lib/libLLVMLTO.a lib/libLLVMMC.a lib/libLLVMMCDisassembler.a lib/libLLVMSupport.a lib/libLLVMTarget.a lib/libLLVMMIRParser.a lib/libLLVMHexagonAsmParser.a lib/libLLVMLanaiAsmParser.a lib/libLLVMRISCVUtils.a lib/libLLVMCFGuard.a lib/libLLVMGlobalISel.a lib/libLLVMX86Utils.a lib/libLLVMAsmPrinter.a lib/libLLVMDebugInfoDWARF.a lib/libLLVMSelectionDAG.a lib/libLLVMAArch64Desc.a lib/libLLVMAArch64Info.a lib/libLLVMAArch64Utils.a lib/libLLVMAMDGPUDesc.a lib/libLLVMAMDGPUInfo.a lib/libLLVMAMDGPUUtils.a lib/libLLVMARMDesc.a lib/libLLVMARMInfo.a lib/libLLVMARMUtils.a lib/libLLVMHexagonDesc.a lib/libLLVMHexagonInfo.a lib/libLLVMLanaiDesc.a lib/libLLVMLanaiInfo.a lib/libLLVMSystemZDesc.a lib/libLLVMSystemZInfo.a lib/libLLVMWebAssemblyDesc.a lib/libLLVMWebAssemblyInfo.a lib/libLLVMMCDisassembler.a lib/libLLVMObjCARCOpts.a lib/libLLVMPasses.a lib/libLLVMCodeGen.a lib/libLLVMTarget.a lib/libLLVMipo.a lib/libLLVMScalarOpts.a lib/libLLVMVectorize.a lib/libLLVMBitWriter.a lib/libLLVMLinker.a lib/libLLVMIRReader.a lib/libLLVMAsmParser.a lib/libLLVMAggressiveInstCombine.a lib/libLLVMInstCombine.a lib/libLLVMInstrumentation.a lib/libLLVMTransformUtils.a lib/libLLVMAnalysis.a lib/libLLVMObject.a lib/libLLVMBitReader.a lib/libLLVMMCParser.a lib/libLLVMMC.a lib/libLLVMDebugInfoCodeView.a lib/libLLVMDebugInfoMSF.a lib/libLLVMTextAPI.a lib/libLLVMProfileData.a lib/libLLVMCore.a lib/libLLVMBinaryFormat.a lib/libLLVMRemarks.a lib/libLLVMBitstreamReader.a lib/libLLVMSupport.a -lz -lcurses -lm lib/libLLVMDemangle.a && :
[91/101] : && /Users/buildslave/jenkins/workspace/lldb-cmake/host-compiler/bin/clang++  -Wdocumentation -fPIC -fvisibility-inlines-hidden -Werror=date-time -Werror=unguarded-availability-new -fmodules -fmodules-cache-path=/Users/buildslave/jenkins/workspace/lldb-cmake/lldb-build/module.cache -fcxx-modules -Wall -Wextra -Wno-unused-parameter -Wwrite-strings -Wcast-qual -Wmissing-field-initializers -pedantic -Wno-long-long -Wimplicit-fallthrough -Wcovered-switch-default -Wno-noexcept-type -Wnon-virtual-dtor -Wdelete-non-virtual-dtor -Wstring-conversion -fdiagnostics-color -O3  -isysroot /Applications/Xcode.app/Contents/Developer/Platforms/MacOSX.platform/Developer/SDKs/MacOSX10.14.sdk -Wl,-search_paths_first -Wl,-headerpad_max_install_names -Wl,-dead_strip tools/llvm-lto/CMakeFiles/llvm-lto.dir/llvm-lto.cpp.o  -o bin/llvm-lto  -Wl,-rpath,@loader_path/../lib lib/libLLVMAArch64AsmParser.a lib/libLLVMAMDGPUAsmParser.a lib/libLLVMARMAsmParser.a lib/libLLVMBPFAsmParser.a lib/libLLVMHexagonAsmParser.a lib/libLLVMLanaiAsmParser.a lib/libLLVMMipsAsmParser.a lib/libLLVMMSP430AsmParser.a lib/libLLVMPowerPCAsmParser.a lib/libLLVMRISCVAsmParser.a lib/libLLVMSparcAsmParser.a lib/libLLVMSystemZAsmParser.a lib/libLLVMWebAssemblyAsmParser.a lib/libLLVMX86AsmParser.a lib/libLLVMAArch64CodeGen.a lib/libLLVMAMDGPUCodeGen.a lib/libLLVMARMCodeGen.a lib/libLLVMBPFCodeGen.a lib/libLLVMHexagonCodeGen.a lib/libLLVMLanaiCodeGen.a lib/libLLVMMipsCodeGen.a lib/libLLVMMSP430CodeGen.a lib/libLLVMNVPTXCodeGen.a lib/libLLVMPowerPCCodeGen.a lib/libLLVMRISCVCodeGen.a lib/libLLVMSparcCodeGen.a lib/libLLVMSystemZCodeGen.a lib/libLLVMWebAssemblyCodeGen.a lib/libLLVMX86CodeGen.a lib/libLLVMXCoreCodeGen.a lib/libLLVMAArch64Desc.a lib/libLLVMAMDGPUDesc.a lib/libLLVMARMDesc.a lib/libLLVMBPFDesc.a lib/libLLVMHexagonDesc.a lib/libLLVMLanaiDesc.a lib/libLLVMMipsDesc.a lib/libLLVMMSP430Desc.a lib/libLLVMNVPTXDesc.a lib/libLLVMPowerPCDesc.a lib/libLLVMRISCVDesc.a lib/libLLVMSparcDesc.a lib/libLLVMSystemZDesc.a lib/libLLVMWebAssemblyDesc.a lib/libLLVMX86Desc.a lib/libLLVMXCoreDesc.a lib/libLLVMAArch64Info.a lib/libLLVMAMDGPUInfo.a lib/libLLVMARMInfo.a lib/libLLVMBPFInfo.a lib/libLLVMHexagonInfo.a lib/libLLVMLanaiInfo.a lib/libLLVMMipsInfo.a lib/libLLVMMSP430Info.a lib/libLLVMNVPTXInfo.a lib/libLLVMPowerPCInfo.a lib/libLLVMRISCVInfo.a lib/libLLVMSparcInfo.a lib/libLLVMSystemZInfo.a lib/libLLVMWebAssemblyInfo.a lib/libLLVMX86Info.a lib/libLLVMXCoreInfo.a lib/libLLVMBitReader.a lib/libLLVMBitWriter.a lib/libLLVMCore.a lib/libLLVMIRReader.a lib/libLLVMLTO.a lib/libLLVMMC.a lib/libLLVMObject.a lib/libLLVMSupport.a lib/libLLVMTarget.a lib/libLLVMAArch64Utils.a lib/libLLVMAMDGPUUtils.a lib/libLLVMMIRParser.a lib/libLLVMARMUtils.a lib/libLLVMHexagonAsmParser.a lib/libLLVMHexagonDesc.a lib/libLLVMHexagonInfo.a lib/libLLVMLanaiAsmParser.a lib/libLLVMLanaiDesc.a lib/libLLVMLanaiInfo.a lib/libLLVMRISCVUtils.a lib/libLLVMMCDisassembler.a lib/libLLVMCFGuard.a lib/libLLVMGlobalISel.a lib/libLLVMX86Utils.a lib/libLLVMAsmPrinter.a lib/libLLVMDebugInfoDWARF.a lib/libLLVMSelectionDAG.a lib/libLLVMObjCARCOpts.a lib/libLLVMPasses.a lib/libLLVMCodeGen.a lib/libLLVMTarget.a lib/libLLVMipo.a lib/libLLVMBitWriter.a lib/libLLVMIRReader.a lib/libLLVMAsmParser.a lib/libLLVMScalarOpts.a lib/libLLVMVectorize.a lib/libLLVMLinker.a lib/libLLVMAggressiveInstCombine.a lib/libLLVMInstCombine.a lib/libLLVMInstrumentation.a lib/libLLVMTransformUtils.a lib/libLLVMAnalysis.a lib/libLLVMObject.a lib/libLLVMBitReader.a lib/libLLVMMCParser.a lib/libLLVMMC.a lib/libLLVMDebugInfoCodeView.a lib/libLLVMDebugInfoMSF.a lib/libLLVMTextAPI.a lib/libLLVMProfileData.a lib/libLLVMCore.a lib/libLLVMBinaryFormat.a lib/libLLVMRemarks.a lib/libLLVMBitstreamReader.a lib/libLLVMSupport.a -lz -lcurses -lm lib/libLLVMDemangle.a && :
[92/101] : && /Users/buildslave/jenkins/workspace/lldb-cmake/host-compiler/bin/clang++  -Wdocumentation -fPIC -fvisibility-inlines-hidden -Werror=date-time -Werror=unguarded-availability-new -fmodules -fmodules-cache-path=/Users/buildslave/jenkins/workspace/lldb-cmake/lldb-build/module.cache -fcxx-modules -Wall -Wextra -Wno-unused-parameter -Wwrite-strings -Wcast-qual -Wmissing-field-initializers -pedantic -Wno-long-long -Wimplicit-fallthrough -Wcovered-switch-default -Wno-noexcept-type -Wnon-virtual-dtor -Wdelete-non-virtual-dtor -Wstring-conversion -fdiagnostics-color -O3  -isysroot /Applications/Xcode.app/Contents/Developer/Platforms/MacOSX.platform/Developer/SDKs/MacOSX10.14.sdk -Wl,-search_paths_first -Wl,-headerpad_max_install_names -Wl,-dead_strip tools/llvm-lto2/CMakeFiles/llvm-lto2.dir/llvm-lto2.cpp.o  -o bin/llvm-lto2  -Wl,-rpath,@loader_path/../lib lib/libLLVMAArch64AsmParser.a lib/libLLVMAMDGPUAsmParser.a lib/libLLVMARMAsmParser.a lib/libLLVMBPFAsmParser.a lib/libLLVMHexagonAsmParser.a lib/libLLVMLanaiAsmParser.a lib/libLLVMMipsAsmParser.a lib/libLLVMMSP430AsmParser.a lib/libLLVMPowerPCAsmParser.a lib/libLLVMRISCVAsmParser.a lib/libLLVMSparcAsmParser.a lib/libLLVMSystemZAsmParser.a lib/libLLVMWebAssemblyAsmParser.a lib/libLLVMX86AsmParser.a lib/libLLVMAArch64CodeGen.a lib/libLLVMAMDGPUCodeGen.a lib/libLLVMARMCodeGen.a lib/libLLVMBPFCodeGen.a lib/libLLVMHexagonCodeGen.a lib/libLLVMLanaiCodeGen.a lib/libLLVMMipsCodeGen.a lib/libLLVMMSP430CodeGen.a lib/libLLVMNVPTXCodeGen.a lib/libLLVMPowerPCCodeGen.a lib/libLLVMRISCVCodeGen.a lib/libLLVMSparcCodeGen.a lib/libLLVMSystemZCodeGen.a lib/libLLVMWebAssemblyCodeGen.a lib/libLLVMX86CodeGen.a lib/libLLVMXCoreCodeGen.a lib/libLLVMAArch64Desc.a lib/libLLVMAMDGPUDesc.a lib/libLLVMARMDesc.a lib/libLLVMBPFDesc.a lib/libLLVMHexagonDesc.a lib/libLLVMLanaiDesc.a lib/libLLVMMipsDesc.a lib/libLLVMMSP430Desc.a lib/libLLVMNVPTXDesc.a lib/libLLVMPowerPCDesc.a lib/libLLVMRISCVDesc.a lib/libLLVMSparcDesc.a lib/libLLVMSystemZDesc.a lib/libLLVMWebAssemblyDesc.a lib/libLLVMX86Desc.a lib/libLLVMXCoreDesc.a lib/libLLVMAArch64Info.a lib/libLLVMAMDGPUInfo.a lib/libLLVMARMInfo.a lib/libLLVMBPFInfo.a lib/libLLVMHexagonInfo.a lib/libLLVMLanaiInfo.a lib/libLLVMMipsInfo.a lib/libLLVMMSP430Info.a lib/libLLVMNVPTXInfo.a lib/libLLVMPowerPCInfo.a lib/libLLVMRISCVInfo.a lib/libLLVMSparcInfo.a lib/libLLVMSystemZInfo.a lib/libLLVMWebAssemblyInfo.a lib/libLLVMX86Info.a lib/libLLVMXCoreInfo.a lib/libLLVMBitReader.a lib/libLLVMCore.a lib/libLLVMLinker.a lib/libLLVMLTO.a lib/libLLVMMC.a lib/libLLVMObject.a lib/libLLVMSupport.a lib/libLLVMTarget.a lib/libLLVMAArch64Utils.a lib/libLLVMAMDGPUUtils.a lib/libLLVMMIRParser.a lib/libLLVMARMUtils.a lib/libLLVMHexagonAsmParser.a lib/libLLVMHexagonDesc.a lib/libLLVMHexagonInfo.a lib/libLLVMLanaiAsmParser.a lib/libLLVMLanaiDesc.a lib/libLLVMLanaiInfo.a lib/libLLVMRISCVUtils.a lib/libLLVMMCDisassembler.a lib/libLLVMCFGuard.a lib/libLLVMGlobalISel.a lib/libLLVMX86Utils.a lib/libLLVMAsmPrinter.a lib/libLLVMDebugInfoDWARF.a lib/libLLVMSelectionDAG.a lib/libLLVMObjCARCOpts.a lib/libLLVMPasses.a lib/libLLVMCodeGen.a lib/libLLVMTarget.a lib/libLLVMipo.a lib/libLLVMLinker.a lib/libLLVMScalarOpts.a lib/libLLVMVectorize.a lib/libLLVMBitWriter.a lib/libLLVMIRReader.a lib/libLLVMAsmParser.a lib/libLLVMAggressiveInstCombine.a lib/libLLVMInstCombine.a lib/libLLVMInstrumentation.a lib/libLLVMTransformUtils.a lib/libLLVMAnalysis.a lib/libLLVMObject.a lib/libLLVMBitReader.a lib/libLLVMMCParser.a lib/libLLVMMC.a lib/libLLVMDebugInfoCodeView.a lib/libLLVMDebugInfoMSF.a lib/libLLVMTextAPI.a lib/libLLVMProfileData.a lib/libLLVMCore.a lib/libLLVMBinaryFormat.a lib/libLLVMRemarks.a lib/libLLVMBitstreamReader.a lib/libLLVMSupport.a -lz -lcurses -lm lib/libLLVMDemangle.a && :
[93/101] : && /Users/buildslave/jenkins/workspace/lldb-cmake/host-compiler/bin/clang++ -Wdocumentation -fPIC -fvisibility-inlines-hidden -Werror=date-time -Werror=unguarded-availability-new -fmodules -fmodules-cache-path=/Users/buildslave/jenkins/workspace/lldb-cmake/lldb-build/module.cache -fcxx-modules -Wall -Wextra -Wno-unused-parameter -Wwrite-strings -Wcast-qual -Wmissing-field-initializers -pedantic -Wno-long-long -Wimplicit-fallthrough -Wcovered-switch-default -Wno-noexcept-type -Wnon-virtual-dtor -Wdelete-non-virtual-dtor -Wstring-conversion -fdiagnostics-color -fno-common -Woverloaded-virtual -Wno-nested-anon-types -O3 -isysroot /Applications/Xcode.app/Contents/Developer/Platforms/MacOSX.platform/Developer/SDKs/MacOSX10.14.sdk -dynamiclib -Wl,-headerpad_max_install_names -Wl,-dead_strip -o lib/libclang-cpp.dylib -install_name @rpath/libclang-cpp.dylib tools/clang/lib/Basic/CMakeFiles/obj.clangBasic.dir/Attributes.cpp.o tools/clang/lib/Basic/CMakeFiles/obj.clangBasic.dir/Builtins.cpp.o tools/clang/lib/Basic/CMakeFiles/obj.clangBasic.dir/CharInfo.cpp.o tools/clang/lib/Basic/CMakeFiles/obj.clangBasic.dir/CodeGenOptions.cpp.o tools/clang/lib/Basic/CMakeFiles/obj.clangBasic.dir/Cuda.cpp.o tools/clang/lib/Basic/CMakeFiles/obj.clangBasic.dir/Diagnostic.cpp.o tools/clang/lib/Basic/CMakeFiles/obj.clangBasic.dir/DiagnosticIDs.cpp.o tools/clang/lib/Basic/CMakeFiles/obj.clangBasic.dir/DiagnosticOptions.cpp.o tools/clang/lib/Basic/CMakeFiles/obj.clangBasic.dir/FileManager.cpp.o tools/clang/lib/Basic/CMakeFiles/obj.clangBasic.dir/FileSystemStatCache.cpp.o tools/clang/lib/Basic/CMakeFiles/obj.clangBasic.dir/FixedPoint.cpp.o tools/clang/lib/Basic/CMakeFiles/obj.clangBasic.dir/IdentifierTable.cpp.o tools/clang/lib/Basic/CMakeFiles/obj.clangBasic.dir/LangOptions.cpp.o tools/clang/lib/Basic/CMakeFiles/obj.clangBasic.dir/LangStandards.cpp.o tools/clang/lib/Basic/CMakeFiles/obj.clangBasic.dir/Module.cpp.o tools/clang/lib/Basic/CMakeFiles/obj.clangBasic.dir/ObjCRuntime.cpp.o tools/clang/lib/Basic/CMakeFiles/obj.clangBasic.dir/OpenMPKinds.cpp.o tools/clang/lib/Basic/CMakeFiles/obj.clangBasic.dir/OperatorPrecedence.cpp.o tools/clang/lib/Basic/CMakeFiles/obj.clangBasic.dir/SanitizerBlacklist.cpp.o tools/clang/lib/Basic/CMakeFiles/obj.clangBasic.dir/SanitizerSpecialCaseList.cpp.o tools/clang/lib/Basic/CMakeFiles/obj.clangBasic.dir/Sanitizers.cpp.o tools/clang/lib/Basic/CMakeFiles/obj.clangBasic.dir/SourceLocation.cpp.o tools/clang/lib/Basic/CMakeFiles/obj.clangBasic.dir/SourceManager.cpp.o tools/clang/lib/Basic/CMakeFiles/obj.clangBasic.dir/Stack.cpp.o tools/clang/lib/Basic/CMakeFiles/obj.clangBasic.dir/TargetInfo.cpp.o tools/clang/lib/Basic/CMakeFiles/obj.clangBasic.dir/Targets.cpp.o tools/clang/lib/Basic/CMakeFiles/obj.clangBasic.dir/Targets/AArch64.cpp.o tools/clang/lib/Basic/CMakeFiles/obj.clangBasic.dir/Targets/AMDGPU.cpp.o tools/clang/lib/Basic/CMakeFiles/obj.clangBasic.dir/Targets/ARC.cpp.o tools/clang/lib/Basic/CMakeFiles/obj.clangBasic.dir/Targets/ARM.cpp.o tools/clang/lib/Basic/CMakeFiles/obj.clangBasic.dir/Targets/AVR.cpp.o tools/clang/lib/Basic/CMakeFiles/obj.clangBasic.dir/Targets/BPF.cpp.o tools/clang/lib/Basic/CMakeFiles/obj.clangBasic.dir/Targets/Hexagon.cpp.o tools/clang/lib/Basic/CMakeFiles/obj.clangBasic.dir/Targets/Lanai.cpp.o tools/clang/lib/Basic/CMakeFiles/obj.clangBasic.dir/Targets/Le64.cpp.o tools/clang/lib/Basic/CMakeFiles/obj.clangBasic.dir/Targets/MSP430.cpp.o tools/clang/lib/Basic/CMakeFiles/obj.clangBasic.dir/Targets/Mips.cpp.o tools/clang/lib/Basic/CMakeFiles/obj.clangBasic.dir/Targets/NVPTX.cpp.o tools/clang/lib/Basic/CMakeFiles/obj.clangBasic.dir/Targets/OSTargets.cpp.o tools/clang/lib/Basic/CMakeFiles/obj.clangBasic.dir/Targets/PNaCl.cpp.o tools/clang/lib/Basic/CMakeFiles/obj.clangBasic.dir/Targets/PPC.cpp.o tools/clang/lib/Basic/CMakeFiles/obj.clangBasic.dir/Targets/RISCV.cpp.o tools/clang/lib/Basic/CMakeFiles/obj.clangBasic.dir/Targets/SPIR.cpp.o tools/clang/lib/Basic/CMakeFiles/obj.clangBasic.dir/Targets/Sparc.cpp.o tools/clang/lib/Basic/CMakeFiles/obj.clangBasic.dir/Targets/SystemZ.cpp.o tools/clang/lib/Basic/CMakeFiles/obj.clangBasic.dir/Targets/TCE.cpp.o tools/clang/lib/Basic/CMakeFiles/obj.clangBasic.dir/Targets/WebAssembly.cpp.o tools/clang/lib/Basic/CMakeFiles/obj.clangBasic.dir/Targets/X86.cpp.o tools/clang/lib/Basic/CMakeFiles/obj.clangBasic.dir/Targets/XCore.cpp.o tools/clang/lib/Basic/CMakeFiles/obj.clangBasic.dir/TokenKinds.cpp.o tools/clang/lib/Basic/CMakeFiles/obj.clangBasic.dir/Version.cpp.o tools/clang/lib/Basic/CMakeFiles/obj.clangBasic.dir/Warnings.cpp.o tools/clang/lib/Basic/CMakeFiles/obj.clangBasic.dir/XRayInstr.cpp.o tools/clang/lib/Basic/CMakeFiles/obj.clangBasic.dir/XRayLists.cpp.o tools/clang/lib/Lex/CMakeFiles/obj.clangLex.dir/DependencyDirectivesSourceMinimizer.cpp.o tools/clang/lib/Lex/CMakeFiles/obj.clangLex.dir/HeaderMap.cpp.o tools/clang/lib/Lex/CMakeFiles/obj.clangLex.dir/HeaderSearch.cpp.o tools/clang/lib/Lex/CMakeFiles/obj.clangLex.dir/Lexer.cpp.o tools/clang/lib/Lex/CMakeFiles/obj.clangLex.dir/LiteralSupport.cpp.o tools/clang/lib/Lex/CMakeFiles/obj.clangLex.dir/MacroArgs.cpp.o tools/clang/lib/Lex/CMakeFiles/obj.clangLex.dir/MacroInfo.cpp.o tools/clang/lib/Lex/CMakeFiles/obj.clangLex.dir/ModuleMap.cpp.o tools/clang/lib/Lex/CMakeFiles/obj.clangLex.dir/PPCaching.cpp.o tools/clang/lib/Lex/CMakeFiles/obj.clangLex.dir/PPCallbacks.cpp.o tools/clang/lib/Lex/CMakeFiles/obj.clangLex.dir/PPConditionalDirectiveRecord.cpp.o tools/clang/lib/Lex/CMakeFiles/obj.clangLex.dir/PPDirectives.cpp.o tools/clang/lib/Lex/CMakeFiles/obj.clangLex.dir/PPExpressions.cpp.o tools/clang/lib/Lex/CMakeFiles/obj.clangLex.dir/PPLexerChange.cpp.o tools/clang/lib/Lex/CMakeFiles/obj.clangLex.dir/PPMacroExpansion.cpp.o tools/clang/lib/Lex/CMakeFiles/obj.clangLex.dir/Pragma.cpp.o tools/clang/lib/Lex/CMakeFiles/obj.clangLex.dir/PreprocessingRecord.cpp.o tools/clang/lib/Lex/CMakeFiles/obj.clangLex.dir/Preprocessor.cpp.o tools/clang/lib/Lex/CMakeFiles/obj.clangLex.dir/PreprocessorLexer.cpp.o tools/clang/lib/Lex/CMakeFiles/obj.clangLex.dir/ScratchBuffer.cpp.o tools/clang/lib/Lex/CMakeFiles/obj.clangLex.dir/TokenConcatenation.cpp.o tools/clang/lib/Lex/CMakeFiles/obj.clangLex.dir/TokenLexer.cpp.o tools/clang/lib/Parse/CMakeFiles/obj.clangParse.dir/ParseAST.cpp.o tools/clang/lib/Parse/CMakeFiles/obj.clangParse.dir/ParseCXXInlineMethods.cpp.o tools/clang/lib/Parse/CMakeFiles/obj.clangParse.dir/ParseDecl.cpp.o tools/clang/lib/Parse/CMakeFiles/obj.clangParse.dir/ParseDeclCXX.cpp.o tools/clang/lib/Parse/CMakeFiles/obj.clangParse.dir/ParseExpr.cpp.o tools/clang/lib/Parse/CMakeFiles/obj.clangParse.dir/ParseExprCXX.cpp.o tools/clang/lib/Parse/CMakeFiles/obj.clangParse.dir/ParseInit.cpp.o tools/clang/lib/Parse/CMakeFiles/obj.clangParse.dir/ParseObjc.cpp.o tools/clang/lib/Parse/CMakeFiles/obj.clangParse.dir/ParseOpenMP.cpp.o tools/clang/lib/Parse/CMakeFiles/obj.clangParse.dir/ParsePragma.cpp.o tools/clang/lib/Parse/CMakeFiles/obj.clangParse.dir/ParseStmt.cpp.o tools/clang/lib/Parse/CMakeFiles/obj.clangParse.dir/ParseStmtAsm.cpp.o tools/clang/lib/Parse/CMakeFiles/obj.clangParse.dir/ParseTemplate.cpp.o tools/clang/lib/Parse/CMakeFiles/obj.clangParse.dir/ParseTentative.cpp.o tools/clang/lib/Parse/CMakeFiles/obj.clangParse.dir/Parser.cpp.o tools/clang/lib/AST/CMakeFiles/obj.clangAST.dir/APValue.cpp.o tools/clang/lib/AST/CMakeFiles/obj.clangAST.dir/ASTConsumer.cpp.o tools/clang/lib/AST/CMakeFiles/obj.clangAST.dir/ASTContext.cpp.o tools/clang/lib/AST/CMakeFiles/obj.clangAST.dir/ASTDiagnostic.cpp.o tools/clang/lib/AST/CMakeFiles/obj.clangAST.dir/ASTDumper.cpp.o tools/clang/lib/AST/CMakeFiles/obj.clangAST.dir/ASTImporter.cpp.o tools/clang/lib/AST/CMakeFiles/obj.clangAST.dir/ASTImporterLookupTable.cpp.o tools/clang/lib/AST/CMakeFiles/obj.clangAST.dir/ASTStructuralEquivalence.cpp.o tools/clang/lib/AST/CMakeFiles/obj.clangAST.dir/ASTTypeTraits.cpp.o tools/clang/lib/AST/CMakeFiles/obj.clangAST.dir/AttrImpl.cpp.o tools/clang/lib/AST/CMakeFiles/obj.clangAST.dir/Comment.cpp.o tools/clang/lib/AST/CMakeFiles/obj.clangAST.dir/CommentBriefParser.cpp.o tools/clang/lib/AST/CMakeFiles/obj.clangAST.dir/CommentCommandTraits.cpp.o tools/clang/lib/AST/CMakeFiles/obj.clangAST.dir/CommentLexer.cpp.o tools/clang/lib/AST/CMakeFiles/obj.clangAST.dir/CommentParser.cpp.o tools/clang/lib/AST/CMakeFiles/obj.clangAST.dir/CommentSema.cpp.o tools/clang/lib/AST/CMakeFiles/obj.clangAST.dir/ComparisonCategories.cpp.o tools/clang/lib/AST/CMakeFiles/obj.clangAST.dir/CXXInheritance.cpp.o tools/clang/lib/AST/CMakeFiles/obj.clangAST.dir/DataCollection.cpp.o tools/clang/lib/AST/CMakeFiles/obj.clangAST.dir/Decl.cpp.o tools/clang/lib/AST/CMakeFiles/obj.clangAST.dir/DeclarationName.cpp.o tools/clang/lib/AST/CMakeFiles/obj.clangAST.dir/DeclBase.cpp.o tools/clang/lib/AST/CMakeFiles/obj.clangAST.dir/DeclCXX.cpp.o tools/clang/lib/AST/CMakeFiles/obj.clangAST.dir/DeclFriend.cpp.o tools/clang/lib/AST/CMakeFiles/obj.clangAST.dir/DeclGroup.cpp.o tools/clang/lib/AST/CMakeFiles/obj.clangAST.dir/DeclObjC.cpp.o tools/clang/lib/AST/CMakeFiles/obj.clangAST.dir/DeclOpenMP.cpp.o tools/clang/lib/AST/CMakeFiles/obj.clangAST.dir/DeclPrinter.cpp.o tools/clang/lib/AST/CMakeFiles/obj.clangAST.dir/DeclTemplate.cpp.o tools/clang/lib/AST/CMakeFiles/obj.clangAST.dir/Expr.cpp.o tools/clang/lib/AST/CMakeFiles/obj.clangAST.dir/ExprClassification.cpp.o tools/clang/lib/AST/CMakeFiles/obj.clangAST.dir/ExprConstant.cpp.o tools/clang/lib/AST/CMakeFiles/obj.clangAST.dir/ExprCXX.cpp.o tools/clang/lib/AST/CMakeFiles/obj.clangAST.dir/ExprObjC.cpp.o tools/clang/lib/AST/CMakeFiles/obj.clangAST.dir/ExternalASTMerger.cpp.o tools/clang/lib/AST/CMakeFiles/obj.clangAST.dir/ExternalASTSource.cpp.o tools/clang/lib/AST/CMakeFiles/obj.clangAST.dir/FormatString.cpp.o tools/clang/lib/AST/CMakeFiles/obj.clangAST.dir/InheritViz.cpp.o tools/clang/lib/AST/CMakeFiles/obj.clangAST.dir/Interp/Block.cpp.o tools/clang/lib/AST/CMakeFiles/obj.clangAST.dir/Interp/ByteCodeEmitter.cpp.o tools/clang/lib/AST/CMakeFiles/obj.clangAST.dir/Interp/ByteCodeExprGen.cpp.o tools/clang/lib/AST/CMakeFiles/obj.clangAST.dir/Interp/ByteCodeGenError.cpp.o tools/clang/lib/AST/CMakeFiles/obj.clangAST.dir/Interp/ByteCodeStmtGen.cpp.o tools/clang/lib/AST/CMakeFiles/obj.clangAST.dir/Interp/Context.cpp.o tools/clang/lib/AST/CMakeFiles/obj.clangAST.dir/Interp/Descriptor.cpp.o tools/clang/lib/AST/CMakeFiles/obj.clangAST.dir/Interp/Disasm.cpp.o tools/clang/lib/AST/CMakeFiles/obj.clangAST.dir/Interp/EvalEmitter.cpp.o tools/clang/lib/AST/CMakeFiles/obj.clangAST.dir/Interp/Frame.cpp.o tools/clang/lib/AST/CMakeFiles/obj.clangAST.dir/Interp/Function.cpp.o tools/clang/lib/AST/CMakeFiles/obj.clangAST.dir/Interp/Interp.cpp.o tools/clang/lib/AST/CMakeFiles/obj.clangAST.dir/Interp/InterpFrame.cpp.o tools/clang/lib/AST/CMakeFiles/obj.clangAST.dir/Interp/InterpStack.cpp.o tools/clang/lib/AST/CMakeFiles/obj.clangAST.dir/Interp/InterpState.cpp.o tools/clang/lib/AST/CMakeFiles/obj.clangAST.dir/Interp/Pointer.cpp.o tools/clang/lib/AST/CMakeFiles/obj.clangAST.dir/Interp/PrimType.cpp.o tools/clang/lib/AST/CMakeFiles/obj.clangAST.dir/Interp/Program.cpp.o tools/clang/lib/AST/CMakeFiles/obj.clangAST.dir/Interp/Record.cpp.o tools/clang/lib/AST/CMakeFiles/obj.clangAST.dir/Interp/Source.cpp.o tools/clang/lib/AST/CMakeFiles/obj.clangAST.dir/Interp/State.cpp.o tools/clang/lib/AST/CMakeFiles/obj.clangAST.dir/ItaniumCXXABI.cpp.o tools/clang/lib/AST/CMakeFiles/obj.clangAST.dir/ItaniumMangle.cpp.o tools/clang/lib/AST/CMakeFiles/obj.clangAST.dir/JSONNodeDumper.cpp.o tools/clang/lib/AST/CMakeFiles/obj.clangAST.dir/Mangle.cpp.o tools/clang/lib/AST/CMakeFiles/obj.clangAST.dir/MicrosoftCXXABI.cpp.o tools/clang/lib/AST/CMakeFiles/obj.clangAST.dir/MicrosoftMangle.cpp.o tools/clang/lib/AST/CMakeFiles/obj.clangAST.dir/NestedNameSpecifier.cpp.o tools/clang/lib/AST/CMakeFiles/obj.clangAST.dir/NSAPI.cpp.o tools/clang/lib/AST/CMakeFiles/obj.clangAST.dir/ODRHash.cpp.o tools/clang/lib/AST/CMakeFiles/obj.clangAST.dir/OpenMPClause.cpp.o tools/clang/lib/AST/CMakeFiles/obj.clangAST.dir/OSLog.cpp.o tools/clang/lib/AST/CMakeFiles/obj.clangAST.dir/ParentMap.cpp.o tools/clang/lib/AST/CMakeFiles/obj.clangAST.dir/PrintfFormatString.cpp.o tools/clang/lib/AST/CMakeFiles/obj.clangAST.dir/QualTypeNames.cpp.o tools/clang/lib/AST/CMakeFiles/obj.clangAST.dir/RawCommentList.cpp.o tools/clang/lib/AST/CMakeFiles/obj.clangAST.dir/RecordLayout.cpp.o tools/clang/lib/AST/CMakeFiles/obj.clangAST.dir/RecordLayoutBuilder.cpp.o tools/clang/lib/AST/CMakeFiles/obj.clangAST.dir/ScanfFormatString.cpp.o tools/clang/lib/AST/CMakeFiles/obj.clangAST.dir/SelectorLocationsKind.cpp.o tools/clang/lib/AST/CMakeFiles/obj.clangAST.dir/Stmt.cpp.o tools/clang/lib/AST/CMakeFiles/obj.clangAST.dir/StmtCXX.cpp.o tools/clang/lib/AST/CMakeFiles/obj.clangAST.dir/StmtIterator.cpp.o tools/clang/lib/AST/CMakeFiles/obj.clangAST.dir/StmtObjC.cpp.o tools/clang/lib/AST/CMakeFiles/obj.clangAST.dir/StmtOpenMP.cpp.o tools/clang/lib/AST/CMakeFiles/obj.clangAST.dir/StmtPrinter.cpp.o tools/clang/lib/AST/CMakeFiles/obj.clangAST.dir/StmtProfile.cpp.o tools/clang/lib/AST/CMakeFiles/obj.clangAST.dir/StmtViz.cpp.o tools/clang/lib/AST/CMakeFiles/obj.clangAST.dir/TemplateBase.cpp.o tools/clang/lib/AST/CMakeFiles/obj.clangAST.dir/TemplateName.cpp.o tools/clang/lib/AST/CMakeFiles/obj.clangAST.dir/TextNodeDumper.cpp.o tools/clang/lib/AST/CMakeFiles/obj.clangAST.dir/Type.cpp.o tools/clang/lib/AST/CMakeFiles/obj.clangAST.dir/TypeLoc.cpp.o tools/clang/lib/AST/CMakeFiles/obj.clangAST.dir/TypePrinter.cpp.o tools/clang/lib/AST/CMakeFiles/obj.clangAST.dir/VTableBuilder.cpp.o tools/clang/lib/AST/CMakeFiles/obj.clangAST.dir/VTTBuilder.cpp.o tools/clang/lib/ASTMatchers/Dynamic/CMakeFiles/obj.clangDynamicASTMatchers.dir/Diagnostics.cpp.o tools/clang/lib/ASTMatchers/Dynamic/CMakeFiles/obj.clangDynamicASTMatchers.dir/VariantValue.cpp.o tools/clang/lib/ASTMatchers/Dynamic/CMakeFiles/obj.clangDynamicASTMatchers.dir/Parser.cpp.o tools/clang/lib/ASTMatchers/Dynamic/CMakeFiles/obj.clangDynamicASTMatchers.dir/Registry.cpp.o tools/clang/lib/ASTMatchers/CMakeFiles/obj.clangASTMatchers.dir/ASTMatchFinder.cpp.o tools/clang/lib/ASTMatchers/CMakeFiles/obj.clangASTMatchers.dir/ASTMatchersInternal.cpp.o tools/clang/lib/CrossTU/CMakeFiles/obj.clangCrossTU.dir/CrossTranslationUnit.cpp.o tools/clang/lib/Sema/CMakeFiles/obj.clangSema.dir/AnalysisBasedWarnings.cpp.o tools/clang/lib/Sema/CMakeFiles/obj.clangSema.dir/CodeCompleteConsumer.cpp.o tools/clang/lib/Sema/CMakeFiles/obj.clangSema.dir/DeclSpec.cpp.o tools/clang/lib/Sema/CMakeFiles/obj.clangSema.dir/DelayedDiagnostic.cpp.o tools/clang/lib/Sema/CMakeFiles/obj.clangSema.dir/IdentifierResolver.cpp.o tools/clang/lib/Sema/CMakeFiles/obj.clangSema.dir/JumpDiagnostics.cpp.o tools/clang/lib/Sema/CMakeFiles/obj.clangSema.dir/MultiplexExternalSemaSource.cpp.o tools/clang/lib/Sema/CMakeFiles/obj.clangSema.dir/ParsedAttr.cpp.o tools/clang/lib/Sema/CMakeFiles/obj.clangSema.dir/Scope.cpp.o tools/clang/lib/Sema/CMakeFiles/obj.clangSema.dir/ScopeInfo.cpp.o tools/clang/lib/Sema/CMakeFiles/obj.clangSema.dir/Sema.cpp.o tools/clang/lib/Sema/CMakeFiles/obj.clangSema.dir/SemaAccess.cpp.o tools/clang/lib/Sema/CMakeFiles/obj.clangSema.dir/SemaAttr.cpp.o tools/clang/lib/Sema/CMakeFiles/obj.clangSema.dir/SemaCXXScopeSpec.cpp.o tools/clang/lib/Sema/CMakeFiles/obj.clangSema.dir/SemaCast.cpp.o tools/clang/lib/Sema/CMakeFiles/obj.clangSema.dir/SemaChecking.cpp.o tools/clang/lib/Sema/CMakeFiles/obj.clangSema.dir/SemaCodeComplete.cpp.o tools/clang/lib/Sema/CMakeFiles/obj.clangSema.dir/SemaConcept.cpp.o tools/clang/lib/Sema/CMakeFiles/obj.clangSema.dir/SemaConsumer.cpp.o tools/clang/lib/Sema/CMakeFiles/obj.clangSema.dir/SemaCoroutine.cpp.o tools/clang/lib/Sema/CMakeFiles/obj.clangSema.dir/SemaCUDA.cpp.o tools/clang/lib/Sema/CMakeFiles/obj.clangSema.dir/SemaDecl.cpp.o tools/clang/lib/Sema/CMakeFiles/obj.clangSema.dir/SemaDeclAttr.cpp.o tools/clang/lib/Sema/CMakeFiles/obj.clangSema.dir/SemaDeclCXX.cpp.o tools/clang/lib/Sema/CMakeFiles/obj.clangSema.dir/SemaDeclObjC.cpp.o tools/clang/lib/Sema/CMakeFiles/obj.clangSema.dir/SemaExceptionSpec.cpp.o tools/clang/lib/Sema/CMakeFiles/obj.clangSema.dir/SemaExpr.cpp.o tools/clang/lib/Sema/CMakeFiles/obj.clangSema.dir/SemaExprCXX.cpp.o tools/clang/lib/Sema/CMakeFiles/obj.clangSema.dir/SemaExprMember.cpp.o tools/clang/lib/Sema/CMakeFiles/obj.clangSema.dir/SemaExprObjC.cpp.o tools/clang/lib/Sema/CMakeFiles/obj.clangSema.dir/SemaFixItUtils.cpp.o tools/clang/lib/Sema/CMakeFiles/obj.clangSema.dir/SemaInit.cpp.o tools/clang/lib/Sema/CMakeFiles/obj.clangSema.dir/SemaLambda.cpp.o tools/clang/lib/Sema/CMakeFiles/obj.clangSema.dir/SemaLookup.cpp.o tools/clang/lib/Sema/CMakeFiles/obj.clangSema.dir/SemaModule.cpp.o tools/clang/lib/Sema/CMakeFiles/obj.clangSema.dir/SemaObjCProperty.cpp.o tools/clang/lib/Sema/CMakeFiles/obj.clangSema.dir/SemaOpenMP.cpp.o tools/clang/lib/Sema/CMakeFiles/obj.clangSema.dir/SemaOverload.cpp.o tools/clang/lib/Sema/CMakeFiles/obj.clangSema.dir/SemaPseudoObject.cpp.o tools/clang/lib/Sema/CMakeFiles/obj.clangSema.dir/SemaStmt.cpp.o tools/clang/lib/Sema/CMakeFiles/obj.clangSema.dir/SemaStmtAsm.cpp.o tools/clang/lib/Sema/CMakeFiles/obj.clangSema.dir/SemaStmtAttr.cpp.o tools/clang/lib/Sema/CMakeFiles/obj.clangSema.dir/SemaTemplate.cpp.o tools/clang/lib/Sema/CMakeFiles/obj.clangSema.dir/SemaTemplateDeduction.cpp.o tools/clang/lib/Sema/CMakeFiles/obj.clangSema.dir/SemaTemplateInstantiate.cpp.o tools/clang/lib/Sema/CMakeFiles/obj.clangSema.dir/SemaTemplateInstantiateDecl.cpp.o tools/clang/lib/Sema/CMakeFiles/obj.clangSema.dir/SemaTemplateVariadic.cpp.o tools/clang/lib/Sema/CMakeFiles/obj.clangSema.dir/SemaType.cpp.o tools/clang/lib/Sema/CMakeFiles/obj.clangSema.dir/TypeLocBuilder.cpp.o tools/clang/lib/CodeGen/CMakeFiles/obj.clangCodeGen.dir/BackendUtil.cpp.o tools/clang/lib/CodeGen/CMakeFiles/obj.clangCodeGen.dir/CGAtomic.cpp.o tools/clang/lib/CodeGen/CMakeFiles/obj.clangCodeGen.dir/CGBlocks.cpp.o tools/clang/lib/CodeGen/CMakeFiles/obj.clangCodeGen.dir/CGBuiltin.cpp.o tools/clang/lib/CodeGen/CMakeFiles/obj.clangCodeGen.dir/CGCUDANV.cpp.o tools/clang/lib/CodeGen/CMakeFiles/obj.clangCodeGen.dir/CGCUDARuntime.cpp.o tools/clang/lib/CodeGen/CMakeFiles/obj.clangCodeGen.dir/CGCXX.cpp.o tools/clang/lib/CodeGen/CMakeFiles/obj.clangCodeGen.dir/CGCXXABI.cpp.o tools/clang/lib/CodeGen/CMakeFiles/obj.clangCodeGen.dir/CGCall.cpp.o tools/clang/lib/CodeGen/CMakeFiles/obj.clangCodeGen.dir/CGClass.cpp.o tools/clang/lib/CodeGen/CMakeFiles/obj.clangCodeGen.dir/CGCleanup.cpp.o tools/clang/lib/CodeGen/CMakeFiles/obj.clangCodeGen.dir/CGCoroutine.cpp.o tools/clang/lib/CodeGen/CMakeFiles/obj.clangCodeGen.dir/CGDebugInfo.cpp.o tools/clang/lib/CodeGen/CMakeFiles/obj.clangCodeGen.dir/CGDecl.cpp.o tools/clang/lib/CodeGen/CMakeFiles/obj.clangCodeGen.dir/CGDeclCXX.cpp.o tools/clang/lib/CodeGen/CMakeFiles/obj.clangCodeGen.dir/CGException.cpp.o tools/clang/lib/CodeGen/CMakeFiles/obj.clangCodeGen.dir/CGExpr.cpp.o tools/clang/lib/CodeGen/CMakeFiles/obj.clangCodeGen.dir/CGExprAgg.cpp.o tools/clang/lib/CodeGen/CMakeFiles/obj.clangCodeGen.dir/CGExprCXX.cpp.o tools/clang/lib/CodeGen/CMakeFiles/obj.clangCodeGen.dir/CGExprComplex.cpp.o tools/clang/lib/CodeGen/CMakeFiles/obj.clangCodeGen.dir/CGExprConstant.cpp.o tools/clang/lib/CodeGen/CMakeFiles/obj.clangCodeGen.dir/CGExprScalar.cpp.o tools/clang/lib/CodeGen/CMakeFiles/obj.clangCodeGen.dir/CGGPUBuiltin.cpp.o tools/clang/lib/CodeGen/CMakeFiles/obj.clangCodeGen.dir/CGLoopInfo.cpp.o tools/clang/lib/CodeGen/CMakeFiles/obj.clangCodeGen.dir/CGNonTrivialStruct.cpp.o tools/clang/lib/CodeGen/CMakeFiles/obj.clangCodeGen.dir/CGObjC.cpp.o tools/clang/lib/CodeGen/CMakeFiles/obj.clangCodeGen.dir/CGObjCGNU.cpp.o tools/clang/lib/CodeGen/CMakeFiles/obj.clangCodeGen.dir/CGObjCMac.cpp.o tools/clang/lib/CodeGen/CMakeFiles/obj.clangCodeGen.dir/CGObjCRuntime.cpp.o tools/clang/lib/CodeGen/CMakeFiles/obj.clangCodeGen.dir/CGOpenCLRuntime.cpp.o tools/clang/lib/CodeGen/CMakeFiles/obj.clangCodeGen.dir/CGOpenMPRuntime.cpp.o tools/clang/lib/CodeGen/CMakeFiles/obj.clangCodeGen.dir/CGOpenMPRuntimeNVPTX.cpp.o tools/clang/lib/CodeGen/CMakeFiles/obj.clangCodeGen.dir/CGRecordLayoutBuilder.cpp.o tools/clang/lib/CodeGen/CMakeFiles/obj.clangCodeGen.dir/CGStmt.cpp.o tools/clang/lib/CodeGen/CMakeFiles/obj.clangCodeGen.dir/CGStmtOpenMP.cpp.o tools/clang/lib/CodeGen/CMakeFiles/obj.clangCodeGen.dir/CGVTT.cpp.o tools/clang/lib/CodeGen/CMakeFiles/obj.clangCodeGen.dir/CGVTables.cpp.o tools/clang/lib/CodeGen/CMakeFiles/obj.clangCodeGen.dir/CodeGenABITypes.cpp.o tools/clang/lib/CodeGen/CMakeFiles/obj.clangCodeGen.dir/CodeGenAction.cpp.o tools/clang/lib/CodeGen/CMakeFiles/obj.clangCodeGen.dir/CodeGenFunction.cpp.o tools/clang/lib/CodeGen/CMakeFiles/obj.clangCodeGen.dir/CodeGenModule.cpp.o tools/clang/lib/CodeGen/CMakeFiles/obj.clangCodeGen.dir/CodeGenPGO.cpp.o tools/clang/lib/CodeGen/CMakeFiles/obj.clangCodeGen.dir/CodeGenTBAA.cpp.o tools/clang/lib/CodeGen/CMakeFiles/obj.clangCodeGen.dir/CodeGenTypes.cpp.o tools/clang/lib/CodeGen/CMakeFiles/obj.clangCodeGen.dir/ConstantInitBuilder.cpp.o tools/clang/lib/CodeGen/CMakeFiles/obj.clangCodeGen.dir/CoverageMappingGen.cpp.o tools/clang/lib/CodeGen/CMakeFiles/obj.clangCodeGen.dir/ItaniumCXXABI.cpp.o tools/clang/lib/CodeGen/CMakeFiles/obj.clangCodeGen.dir/MacroPPCallbacks.cpp.o tools/clang/lib/CodeGen/CMakeFiles/obj.clangCodeGen.dir/MicrosoftCXXABI.cpp.o tools/clang/lib/CodeGen/CMakeFiles/obj.clangCodeGen.dir/ModuleBuilder.cpp.o tools/clang/lib/CodeGen/CMakeFiles/obj.clangCodeGen.dir/ObjectFilePCHContainerOperations.cpp.o tools/clang/lib/CodeGen/CMakeFiles/obj.clangCodeGen.dir/PatternInit.cpp.o tools/clang/lib/CodeGen/CMakeFiles/obj.clangCodeGen.dir/SanitizerMetadata.cpp.o tools/clang/lib/CodeGen/CMakeFiles/obj.clangCodeGen.dir/SwiftCallingConv.cpp.o tools/clang/lib/CodeGen/CMakeFiles/obj.clangCodeGen.dir/TargetInfo.cpp.o tools/clang/lib/CodeGen/CMakeFiles/obj.clangCodeGen.dir/VarBypassDetector.cpp.o tools/clang/lib/Analysis/CMakeFiles/obj.clangAnalysis.dir/AnalysisDeclContext.cpp.o tools/clang/lib/Analysis/CMakeFiles/obj.clangAnalysis.dir/BodyFarm.cpp.o tools/clang/lib/Analysis/CMakeFiles/obj.clangAnalysis.dir/CFG.cpp.o tools/clang/lib/Analysis/CMakeFiles/obj.clangAnalysis.dir/CFGReachabilityAnalysis.cpp.o tools/clang/lib/Analysis/CMakeFiles/obj.clangAnalysis.dir/CFGStmtMap.cpp.o tools/clang/lib/Analysis/CMakeFiles/obj.clangAnalysis.dir/CallGraph.cpp.o tools/clang/lib/Analysis/CMakeFiles/obj.clangAnalysis.dir/CloneDetection.cpp.o tools/clang/lib/Analysis/CMakeFiles/obj.clangAnalysis.dir/CocoaConventions.cpp.o tools/clang/lib/Analysis/CMakeFiles/obj.clangAnalysis.dir/ConstructionContext.cpp.o tools/clang/lib/Analysis/CMakeFiles/obj.clangAnalysis.dir/Consumed.cpp.o tools/clang/lib/Analysis/CMakeFiles/obj.clangAnalysis.dir/CodeInjector.cpp.o tools/clang/lib/Analysis/CMakeFiles/obj.clangAnalysis.dir/Dominators.cpp.o tools/clang/lib/Analysis/CMakeFiles/obj.clangAnalysis.dir/ExprMutationAnalyzer.cpp.o tools/clang/lib/Analysis/CMakeFiles/obj.clangAnalysis.dir/LiveVariables.cpp.o tools/clang/lib/Analysis/CMakeFiles/obj.clangAnalysis.dir/ObjCNoReturn.cpp.o tools/clang/lib/Analysis/CMakeFiles/obj.clangAnalysis.dir/PathDiagnostic.cpp.o tools/clang/lib/Analysis/CMakeFiles/obj.clangAnalysis.dir/PostOrderCFGView.cpp.o tools/clang/lib/Analysis/CMakeFiles/obj.clangAnalysis.dir/ProgramPoint.cpp.o tools/clang/lib/Analysis/CMakeFiles/obj.clangAnalysis.dir/ReachableCode.cpp.o tools/clang/lib/Analysis/CMakeFiles/obj.clangAnalysis.dir/RetainSummaryManager.cpp.o tools/clang/lib/Analysis/CMakeFiles/obj.clangAnalysis.dir/ThreadSafety.cpp.o tools/clang/lib/Analysis/CMakeFiles/obj.clangAnalysis.dir/ThreadSafetyCommon.cpp.o tools/clang/lib/Analysis/CMakeFiles/obj.clangAnalysis.dir/ThreadSafetyLogical.cpp.o tools/clang/lib/Analysis/CMakeFiles/obj.clangAnalysis.dir/ThreadSafetyTIL.cpp.o tools/clang/lib/Analysis/CMakeFiles/obj.clangAnalysis.dir/UninitializedValues.cpp.o tools/clang/lib/Edit/CMakeFiles/obj.clangEdit.dir/Commit.cpp.o tools/clang/lib/Edit/CMakeFiles/obj.clangEdit.dir/EditedSource.cpp.o tools/clang/lib/Edit/CMakeFiles/obj.clangEdit.dir/RewriteObjCFoundationAPI.cpp.o tools/clang/lib/Rewrite/CMakeFiles/obj.clangRewrite.dir/DeltaTree.cpp.o tools/clang/lib/Rewrite/CMakeFiles/obj.clangRewrite.dir/HTMLRewrite.cpp.o tools/clang/lib/Rewrite/CMakeFiles/obj.clangRewrite.dir/RewriteRope.cpp.o tools/clang/lib/Rewrite/CMakeFiles/obj.clangRewrite.dir/Rewriter.cpp.o tools/clang/lib/Rewrite/CMakeFiles/obj.clangRewrite.dir/TokenRewriter.cpp.o tools/clang/lib/ARCMigrate/CMakeFiles/obj.clangARCMigrate.dir/ARCMT.cpp.o tools/clang/lib/ARCMigrate/CMakeFiles/obj.clangARCMigrate.dir/ARCMTActions.cpp.o tools/clang/lib/ARCMigrate/CMakeFiles/obj.clangARCMigrate.dir/FileRemapper.cpp.o tools/clang/lib/ARCMigrate/CMakeFiles/obj.clangARCMigrate.dir/ObjCMT.cpp.o tools/clang/lib/ARCMigrate/CMakeFiles/obj.clangARCMigrate.dir/PlistReporter.cpp.o tools/clang/lib/ARCMigrate/CMakeFiles/obj.clangARCMigrate.dir/TransAPIUses.cpp.o tools/clang/lib/ARCMigrate/CMakeFiles/obj.clangARCMigrate.dir/TransARCAssign.cpp.o tools/clang/lib/ARCMigrate/CMakeFiles/obj.clangARCMigrate.dir/TransAutoreleasePool.cpp.o tools/clang/lib/ARCMigrate/CMakeFiles/obj.clangARCMigrate.dir/TransBlockObjCVariable.cpp.o tools/clang/lib/ARCMigrate/CMakeFiles/obj.clangARCMigrate.dir/TransEmptyStatementsAndDealloc.cpp.o tools/clang/lib/ARCMigrate/CMakeFiles/obj.clangARCMigrate.dir/TransGCAttrs.cpp.o tools/clang/lib/ARCMigrate/CMakeFiles/obj.clangARCMigrate.dir/TransGCCalls.cpp.o tools/clang/lib/ARCMigrate/CMakeFiles/obj.clangARCMigrate.dir/TransProperties.cpp.o tools/clang/lib/ARCMigrate/CMakeFiles/obj.clangARCMigrate.dir/TransProtectedScope.cpp.o tools/clang/lib/ARCMigrate/CMakeFiles/obj.clangARCMigrate.dir/TransRetainReleaseDealloc.cpp.o tools/clang/lib/ARCMigrate/CMakeFiles/obj.clangARCMigrate.dir/TransUnbridgedCasts.cpp.o tools/clang/lib/ARCMigrate/CMakeFiles/obj.clangARCMigrate.dir/TransUnusedInitDelegate.cpp.o tools/clang/lib/ARCMigrate/CMakeFiles/obj.clangARCMigrate.dir/TransZeroOutPropsInDealloc.cpp.o tools/clang/lib/ARCMigrate/CMakeFiles/obj.clangARCMigrate.dir/TransformActions.cpp.o tools/clang/lib/ARCMigrate/CMakeFiles/obj.clangARCMigrate.dir/Transforms.cpp.o tools/clang/lib/Driver/CMakeFiles/obj.clangDriver.dir/Action.cpp.o tools/clang/lib/Driver/CMakeFiles/obj.clangDriver.dir/Compilation.cpp.o tools/clang/lib/Driver/CMakeFiles/obj.clangDriver.dir/DarwinSDKInfo.cpp.o tools/clang/lib/Driver/CMakeFiles/obj.clangDriver.dir/Distro.cpp.o tools/clang/lib/Driver/CMakeFiles/obj.clangDriver.dir/Driver.cpp.o tools/clang/lib/Driver/CMakeFiles/obj.clangDriver.dir/DriverOptions.cpp.o tools/clang/lib/Driver/CMakeFiles/obj.clangDriver.dir/Job.cpp.o tools/clang/lib/Driver/CMakeFiles/obj.clangDriver.dir/Multilib.cpp.o tools/clang/lib/Driver/CMakeFiles/obj.clangDriver.dir/Phases.cpp.o tools/clang/lib/Driver/CMakeFiles/obj.clangDriver.dir/SanitizerArgs.cpp.o tools/clang/lib/Driver/CMakeFiles/obj.clangDriver.dir/Tool.cpp.o tools/clang/lib/Driver/CMakeFiles/obj.clangDriver.dir/ToolChain.cpp.o tools/clang/lib/Driver/CMakeFiles/obj.clangDriver.dir/ToolChains/Arch/AArch64.cpp.o tools/clang/lib/Driver/CMakeFiles/obj.clangDriver.dir/ToolChains/Arch/ARM.cpp.o tools/clang/lib/Driver/CMakeFiles/obj.clangDriver.dir/ToolChains/Arch/Mips.cpp.o tools/clang/lib/Driver/CMakeFiles/obj.clangDriver.dir/ToolChains/Arch/PPC.cpp.o tools/clang/lib/Driver/CMakeFiles/obj.clangDriver.dir/ToolChains/Arch/RISCV.cpp.o tools/clang/lib/Driver/CMakeFiles/obj.clangDriver.dir/ToolChains/Arch/Sparc.cpp.o tools/clang/lib/Driver/CMakeFiles/obj.clangDriver.dir/ToolChains/Arch/SystemZ.cpp.o tools/clang/lib/Driver/CMakeFiles/obj.clangDriver.dir/ToolChains/Arch/X86.cpp.o tools/clang/lib/Driver/CMakeFiles/obj.clangDriver.dir/ToolChains/AIX.cpp.o tools/clang/lib/Driver/CMakeFiles/obj.clangDriver.dir/ToolChains/Ananas.cpp.o tools/clang/lib/Driver/CMakeFiles/obj.clangDriver.dir/ToolChains/AMDGPU.cpp.o tools/clang/lib/Driver/CMakeFiles/obj.clangDriver.dir/ToolChains/AVR.cpp.o tools/clang/lib/Driver/CMakeFiles/obj.clangDriver.dir/ToolChains/BareMetal.cpp.o tools/clang/lib/Driver/CMakeFiles/obj.clangDriver.dir/ToolChains/Clang.cpp.o tools/clang/lib/Driver/CMakeFiles/obj.clangDriver.dir/ToolChains/CloudABI.cpp.o tools/clang/lib/Driver/CMakeFiles/obj.clangDriver.dir/ToolChains/CommonArgs.cpp.o tools/clang/lib/Driver/CMakeFiles/obj.clangDriver.dir/ToolChains/Contiki.cpp.o tools/clang/lib/Driver/CMakeFiles/obj.clangDriver.dir/ToolChains/CrossWindows.cpp.o tools/clang/lib/Driver/CMakeFiles/obj.clangDriver.dir/ToolChains/Cuda.cpp.o tools/clang/lib/Driver/CMakeFiles/obj.clangDriver.dir/ToolChains/Darwin.cpp.o tools/clang/lib/Driver/CMakeFiles/obj.clangDriver.dir/ToolChains/DragonFly.cpp.o tools/clang/lib/Driver/CMakeFiles/obj.clangDriver.dir/ToolChains/Flang.cpp.o tools/clang/lib/Driver/CMakeFiles/obj.clangDriver.dir/ToolChains/FreeBSD.cpp.o tools/clang/lib/Driver/CMakeFiles/obj.clangDriver.dir/ToolChains/Fuchsia.cpp.o tools/clang/lib/Driver/CMakeFiles/obj.clangDriver.dir/ToolChains/Gnu.cpp.o tools/clang/lib/Driver/CMakeFiles/obj.clangDriver.dir/ToolChains/Haiku.cpp.o tools/clang/lib/Driver/CMakeFiles/obj.clangDriver.dir/ToolChains/HIP.cpp.o tools/clang/lib/Driver/CMakeFiles/obj.clangDriver.dir/ToolChains/Hexagon.cpp.o tools/clang/lib/Driver/CMakeFiles/obj.clangDriver.dir/ToolChains/Hurd.cpp.o tools/clang/lib/Driver/CMakeFiles/obj.clangDriver.dir/ToolChains/Linux.cpp.o tools/clang/lib/Driver/CMakeFiles/obj.clangDriver.dir/ToolChains/MipsLinux.cpp.o tools/clang/lib/Driver/CMakeFiles/obj.clangDriver.dir/ToolChains/MinGW.cpp.o tools/clang/lib/Driver/CMakeFiles/obj.clangDriver.dir/ToolChains/Minix.cpp.o tools/clang/lib/Driver/CMakeFiles/obj.clangDriver.dir/ToolChains/MSP430.cpp.o tools/clang/lib/Driver/CMakeFiles/obj.clangDriver.dir/ToolChains/MSVC.cpp.o tools/clang/lib/Driver/CMakeFiles/obj.clangDriver.dir/ToolChains/Myriad.cpp.o tools/clang/lib/Driver/CMakeFiles/obj.clangDriver.dir/ToolChains/NaCl.cpp.o tools/clang/lib/Driver/CMakeFiles/obj.clangDriver.dir/ToolChains/NetBSD.cpp.o tools/clang/lib/Driver/CMakeFiles/obj.clangDriver.dir/ToolChains/OpenBSD.cpp.o tools/clang/lib/Driver/CMakeFiles/obj.clangDriver.dir/ToolChains/PS4CPU.cpp.o tools/clang/lib/Driver/CMakeFiles/obj.clangDriver.dir/ToolChains/RISCVToolchain.cpp.o tools/clang/lib/Driver/CMakeFiles/obj.clangDriver.dir/ToolChains/Solaris.cpp.o tools/clang/lib/Driver/CMakeFiles/obj.clangDriver.dir/ToolChains/TCE.cpp.o tools/clang/lib/Driver/CMakeFiles/obj.clangDriver.dir/ToolChains/WebAssembly.cpp.o tools/clang/lib/Driver/CMakeFiles/obj.clangDriver.dir/ToolChains/XCore.cpp.o tools/clang/lib/Driver/CMakeFiles/obj.clangDriver.dir/ToolChains/PPCLinux.cpp.o tools/clang/lib/Driver/CMakeFiles/obj.clangDriver.dir/ToolChains/InterfaceStubs.cpp.o tools/clang/lib/Driver/CMakeFiles/obj.clangDriver.dir/Types.cpp.o tools/clang/lib/Driver/CMakeFiles/obj.clangDriver.dir/XRayArgs.cpp.o tools/clang/lib/Serialization/CMakeFiles/obj.clangSerialization.dir/ASTCommon.cpp.o tools/clang/lib/Serialization/CMakeFiles/obj.clangSerialization.dir/ASTReader.cpp.o tools/clang/lib/Serialization/CMakeFiles/obj.clangSerialization.dir/ASTReaderDecl.cpp.o tools/clang/lib/Serialization/CMakeFiles/obj.clangSerialization.dir/ASTReaderStmt.cpp.o tools/clang/lib/Serialization/CMakeFiles/obj.clangSerialization.dir/ASTWriter.cpp.o tools/clang/lib/Serialization/CMakeFiles/obj.clangSerialization.dir/ASTWriterDecl.cpp.o tools/clang/lib/Serialization/CMakeFiles/obj.clangSerialization.dir/ASTWriterStmt.cpp.o tools/clang/lib/Serialization/CMakeFiles/obj.clangSerialization.dir/GeneratePCH.cpp.o tools/clang/lib/Serialization/CMakeFiles/obj.clangSerialization.dir/GlobalModuleIndex.cpp.o tools/clang/lib/Serialization/CMakeFiles/obj.clangSerialization.dir/InMemoryModuleCache.cpp.o tools/clang/lib/Serialization/CMakeFiles/obj.clangSerialization.dir/Module.cpp.o tools/clang/lib/Serialization/CMakeFiles/obj.clangSerialization.dir/ModuleFileExtension.cpp.o tools/clang/lib/Serialization/CMakeFiles/obj.clangSerialization.dir/ModuleManager.cpp.o tools/clang/lib/Serialization/CMakeFiles/obj.clangSerialization.dir/PCHContainerOperations.cpp.o tools/clang/lib/Frontend/Rewrite/CMakeFiles/obj.clangRewriteFrontend.dir/FixItRewriter.cpp.o tools/clang/lib/Frontend/Rewrite/CMakeFiles/obj.clangRewriteFrontend.dir/FrontendActions.cpp.o tools/clang/lib/Frontend/Rewrite/CMakeFiles/obj.clangRewriteFrontend.dir/HTMLPrint.cpp.o tools/clang/lib/Frontend/Rewrite/CMakeFiles/obj.clangRewriteFrontend.dir/InclusionRewriter.cpp.o tools/clang/lib/Frontend/Rewrite/CMakeFiles/obj.clangRewriteFrontend.dir/RewriteMacros.cpp.o tools/clang/lib/Frontend/Rewrite/CMakeFiles/obj.clangRewriteFrontend.dir/RewriteModernObjC.cpp.o tools/clang/lib/Frontend/Rewrite/CMakeFiles/obj.clangRewriteFrontend.dir/RewriteObjC.cpp.o tools/clang/lib/Frontend/Rewrite/CMakeFiles/obj.clangRewriteFrontend.dir/RewriteTest.cpp.o tools/clang/lib/Frontend/CMakeFiles/obj.clangFrontend.dir/ASTConsumers.cpp.o tools/clang/lib/Frontend/CMakeFiles/obj.clangFrontend.dir/ASTMerge.cpp.o tools/clang/lib/Frontend/CMakeFiles/obj.clangFrontend.dir/ASTUnit.cpp.o tools/clang/lib/Frontend/CMakeFiles/obj.clangFrontend.dir/ChainedDiagnosticConsumer.cpp.o tools/clang/lib/Frontend/CMakeFiles/obj.clangFrontend.dir/ChainedIncludesSource.cpp.o tools/clang/lib/Frontend/CMakeFiles/obj.clangFrontend.dir/CompilerInstance.cpp.o tools/clang/lib/Frontend/CMakeFiles/obj.clangFrontend.dir/CompilerInvocation.cpp.o tools/clang/lib/Frontend/CMakeFiles/obj.clangFrontend.dir/CreateInvocationFromCommandLine.cpp.o tools/clang/lib/Frontend/CMakeFiles/obj.clangFrontend.dir/DependencyFile.cpp.o tools/clang/lib/Frontend/CMakeFiles/obj.clangFrontend.dir/DependencyGraph.cpp.o tools/clang/lib/Frontend/CMakeFiles/obj.clangFrontend.dir/DiagnosticRenderer.cpp.o tools/clang/lib/Frontend/CMakeFiles/obj.clangFrontend.dir/FrontendAction.cpp.o tools/clang/lib/Frontend/CMakeFiles/obj.clangFrontend.dir/FrontendActions.cpp.o tools/clang/lib/Frontend/CMakeFiles/obj.clangFrontend.dir/FrontendOptions.cpp.o tools/clang/lib/Frontend/CMakeFiles/obj.clangFrontend.dir/FrontendTiming.cpp.o tools/clang/lib/Frontend/CMakeFiles/obj.clangFrontend.dir/HeaderIncludeGen.cpp.o tools/clang/lib/Frontend/CMakeFiles/obj.clangFrontend.dir/InitHeaderSearch.cpp.o tools/clang/lib/Frontend/CMakeFiles/obj.clangFrontend.dir/InitPreprocessor.cpp.o tools/clang/lib/Frontend/CMakeFiles/obj.clangFrontend.dir/LayoutOverrideSource.cpp.o tools/clang/lib/Frontend/CMakeFiles/obj.clangFrontend.dir/LogDiagnosticPrinter.cpp.o tools/clang/lib/Frontend/CMakeFiles/obj.clangFrontend.dir/ModuleDependencyCollector.cpp.o tools/clang/lib/Frontend/CMakeFiles/obj.clangFrontend.dir/MultiplexConsumer.cpp.o tools/clang/lib/Frontend/CMakeFiles/obj.clangFrontend.dir/PrecompiledPreamble.cpp.o tools/clang/lib/Frontend/CMakeFiles/obj.clangFrontend.dir/PrintPreprocessedOutput.cpp.o tools/clang/lib/Frontend/CMakeFiles/obj.clangFrontend.dir/SerializedDiagnosticPrinter.cpp.o tools/clang/lib/Frontend/CMakeFiles/obj.clangFrontend.dir/SerializedDiagnosticReader.cpp.o tools/clang/lib/Frontend/CMakeFiles/obj.clangFrontend.dir/TestModuleFileExtension.cpp.o tools/clang/lib/Frontend/CMakeFiles/obj.clangFrontend.dir/TextDiagnostic.cpp.o tools/clang/lib/Frontend/CMakeFiles/obj.clangFrontend.dir/TextDiagnosticBuffer.cpp.o tools/clang/lib/Frontend/CMakeFiles/obj.clangFrontend.dir/TextDiagnosticPrinter.cpp.o tools/clang/lib/Frontend/CMakeFiles/obj.clangFrontend.dir/VerifyDiagnosticConsumer.cpp.o tools/clang/lib/Frontend/CMakeFiles/obj.clangFrontend.dir/InterfaceStubFunctionsConsumer.cpp.o tools/clang/lib/FrontendTool/CMakeFiles/obj.clangFrontendTool.dir/ExecuteCompilerInvocation.cpp.o tools/clang/lib/Tooling/Core/CMakeFiles/obj.clangToolingCore.dir/Diagnostic.cpp.o tools/clang/lib/Tooling/Core/CMakeFiles/obj.clangToolingCore.dir/Lookup.cpp.o tools/clang/lib/Tooling/Core/CMakeFiles/obj.clangToolingCore.dir/Replacement.cpp.o tools/clang/lib/Tooling/Inclusions/CMakeFiles/obj.clangToolingInclusions.dir/HeaderIncludes.cpp.o tools/clang/lib/Tooling/Inclusions/CMakeFiles/obj.clangToolingInclusions.dir/IncludeStyle.cpp.o tools/clang/lib/Tooling/Refactoring/CMakeFiles/obj.clangToolingRefactoring.dir/ASTSelection.cpp.o tools/clang/lib/Tooling/Refactoring/CMakeFiles/obj.clangToolingRefactoring.dir/ASTSelectionRequirements.cpp.o tools/clang/lib/Tooling/Refactoring/CMakeFiles/obj.clangToolingRefactoring.dir/AtomicChange.cpp.o tools/clang/lib/Tooling/Refactoring/CMakeFiles/obj.clangToolingRefactoring.dir/Extract/Extract.cpp.o tools/clang/lib/Tooling/Refactoring/CMakeFiles/obj.clangToolingRefactoring.dir/Extract/SourceExtraction.cpp.o tools/clang/lib/Tooling/Refactoring/CMakeFiles/obj.clangToolingRefactoring.dir/RefactoringActions.cpp.o tools/clang/lib/Tooling/Refactoring/CMakeFiles/obj.clangToolingRefactoring.dir/Rename/RenamingAction.cpp.o tools/clang/lib/Tooling/Refactoring/CMakeFiles/obj.clangToolingRefactoring.dir/Rename/SymbolOccurrences.cpp.o tools/clang/lib/Tooling/Refactoring/CMakeFiles/obj.clangToolingRefactoring.dir/Rename/USRFinder.cpp.o tools/clang/lib/Tooling/Refactoring/CMakeFiles/obj.clangToolingRefactoring.dir/Rename/USRFindingAction.cpp.o tools/clang/lib/Tooling/Refactoring/CMakeFiles/obj.clangToolingRefactoring.dir/Rename/USRLocFinder.cpp.o tools/clang/lib/Tooling/ASTDiff/CMakeFiles/obj.clangToolingASTDiff.dir/ASTDiff.cpp.o tools/clang/lib/Tooling/Syntax/CMakeFiles/obj.clangToolingSyntax.dir/BuildTree.cpp.o tools/clang/lib/Tooling/Syntax/CMakeFiles/obj.clangToolingSyntax.dir/Nodes.cpp.o tools/clang/lib/Tooling/Syntax/CMakeFiles/obj.clangToolingSyntax.dir/Tokens.cpp.o tools/clang/lib/Tooling/Syntax/CMakeFiles/obj.clangToolingSyntax.dir/Tree.cpp.o tools/clang/lib/Tooling/DependencyScanning/CMakeFiles/obj.clangDependencyScanning.dir/DependencyScanningFilesystem.cpp.o tools/clang/lib/Tooling/DependencyScanning/CMakeFiles/obj.clangDependencyScanning.dir/DependencyScanningService.cpp.o tools/clang/lib/Tooling/DependencyScanning/CMakeFiles/obj.clangDependencyScanning.dir/DependencyScanningWorker.cpp.o tools/clang/lib/Tooling/DependencyScanning/CMakeFiles/obj.clangDependencyScanning.dir/DependencyScanningTool.cpp.o tools/clang/lib/Tooling/DependencyScanning/CMakeFiles/obj.clangDependencyScanning.dir/ModuleDepCollector.cpp.o tools/clang/lib/Tooling/Transformer/CMakeFiles/obj.clangTransformer.dir/RangeSelector.cpp.o tools/clang/lib/Tooling/Transformer/CMakeFiles/obj.clangTransformer.dir/RewriteRule.cpp.o tools/clang/lib/Tooling/Transformer/CMakeFiles/obj.clangTransformer.dir/SourceCode.cpp.o tools/clang/lib/Tooling/Transformer/CMakeFiles/obj.clangTransformer.dir/SourceCodeBuilders.cpp.o tools/clang/lib/Tooling/Transformer/CMakeFiles/obj.clangTransformer.dir/Stencil.cpp.o tools/clang/lib/Tooling/Transformer/CMakeFiles/obj.clangTransformer.dir/Transformer.cpp.o tools/clang/lib/Tooling/CMakeFiles/obj.clangTooling.dir/AllTUsExecution.cpp.o tools/clang/lib/Tooling/CMakeFiles/obj.clangTooling.dir/ArgumentsAdjusters.cpp.o tools/clang/lib/Tooling/CMakeFiles/obj.clangTooling.dir/CommonOptionsParser.cpp.o tools/clang/lib/Tooling/CMakeFiles/obj.clangTooling.dir/CompilationDatabase.cpp.o tools/clang/lib/Tooling/CMakeFiles/obj.clangTooling.dir/Execution.cpp.o tools/clang/lib/Tooling/CMakeFiles/obj.clangTooling.dir/FileMatchTrie.cpp.o tools/clang/lib/Tooling/CMakeFiles/obj.clangTooling.dir/FixIt.cpp.o tools/clang/lib/Tooling/CMakeFiles/obj.clangTooling.dir/GuessTargetAndModeCompilationDatabase.cpp.o tools/clang/lib/Tooling/CMakeFiles/obj.clangTooling.dir/InterpolatingCompilationDatabase.cpp.o tools/clang/lib/Tooling/CMakeFiles/obj.clangTooling.dir/JSONCompilationDatabase.cpp.o tools/clang/lib/Tooling/CMakeFiles/obj.clangTooling.dir/Refactoring.cpp.o tools/clang/lib/Tooling/CMakeFiles/obj.clangTooling.dir/RefactoringCallbacks.cpp.o tools/clang/lib/Tooling/CMakeFiles/obj.clangTooling.dir/StandaloneExecution.cpp.o tools/clang/lib/Tooling/CMakeFiles/obj.clangTooling.dir/Tooling.cpp.o tools/clang/lib/DirectoryWatcher/CMakeFiles/obj.clangDirectoryWatcher.dir/DirectoryScanner.cpp.o tools/clang/lib/DirectoryWatcher/CMakeFiles/obj.clangDirectoryWatcher.dir/mac/DirectoryWatcher-mac.cpp.o tools/clang/lib/Index/CMakeFiles/obj.clangIndex.dir/CommentToXML.cpp.o tools/clang/lib/Index/CMakeFiles/obj.clangIndex.dir/FileIndexRecord.cpp.o tools/clang/lib/Index/CMakeFiles/obj.clangIndex.dir/IndexBody.cpp.o tools/clang/lib/Index/CMakeFiles/obj.clangIndex.dir/IndexDecl.cpp.o tools/clang/lib/Index/CMakeFiles/obj.clangIndex.dir/IndexingAction.cpp.o tools/clang/lib/Index/CMakeFiles/obj.clangIndex.dir/IndexingContext.cpp.o tools/clang/lib/Index/CMakeFiles/obj.clangIndex.dir/IndexSymbol.cpp.o tools/clang/lib/Index/CMakeFiles/obj.clangIndex.dir/IndexTypeSourceInfo.cpp.o tools/clang/lib/Index/CMakeFiles/obj.clangIndex.dir/USRGeneration.cpp.o tools/clang/lib/StaticAnalyzer/Core/CMakeFiles/obj.clangStaticAnalyzerCore.dir/APSIntType.cpp.o tools/clang/lib/StaticAnalyzer/Core/CMakeFiles/obj.clangStaticAnalyzerCore.dir/AnalysisManager.cpp.o tools/clang/lib/StaticAnalyzer/Core/CMakeFiles/obj.clangStaticAnalyzerCore.dir/AnalyzerOptions.cpp.o tools/clang/lib/StaticAnalyzer/Core/CMakeFiles/obj.clangStaticAnalyzerCore.dir/BasicValueFactory.cpp.o tools/clang/lib/StaticAnalyzer/Core/CMakeFiles/obj.clangStaticAnalyzerCore.dir/BlockCounter.cpp.o tools/clang/lib/StaticAnalyzer/Core/CMakeFiles/obj.clangStaticAnalyzerCore.dir/BugReporter.cpp.o tools/clang/lib/StaticAnalyzer/Core/CMakeFiles/obj.clangStaticAnalyzerCore.dir/BugReporterVisitors.cpp.o tools/clang/lib/StaticAnalyzer/Core/CMakeFiles/obj.clangStaticAnalyzerCore.dir/CallEvent.cpp.o tools/clang/lib/StaticAnalyzer/Core/CMakeFiles/obj.clangStaticAnalyzerCore.dir/Checker.cpp.o tools/clang/lib/StaticAnalyzer/Core/CMakeFiles/obj.clangStaticAnalyzerCore.dir/CheckerContext.cpp.o tools/clang/lib/StaticAnalyzer/Core/CMakeFiles/obj.clangStaticAnalyzerCore.dir/CheckerHelpers.cpp.o tools/clang/lib/StaticAnalyzer/Core/CMakeFiles/obj.clangStaticAnalyzerCore.dir/CheckerManager.cpp.o tools/clang/lib/StaticAnalyzer/Core/CMakeFiles/obj.clangStaticAnalyzerCore.dir/CommonBugCategories.cpp.o tools/clang/lib/StaticAnalyzer/Core/CMakeFiles/obj.clangStaticAnalyzerCore.dir/ConstraintManager.cpp.o tools/clang/lib/StaticAnalyzer/Core/CMakeFiles/obj.clangStaticAnalyzerCore.dir/CoreEngine.cpp.o tools/clang/lib/StaticAnalyzer/Core/CMakeFiles/obj.clangStaticAnalyzerCore.dir/DynamicType.cpp.o tools/clang/lib/StaticAnalyzer/Core/CMakeFiles/obj.clangStaticAnalyzerCore.dir/Environment.cpp.o tools/clang/lib/StaticAnalyzer/Core/CMakeFiles/obj.clangStaticAnalyzerCore.dir/ExplodedGraph.cpp.o tools/clang/lib/StaticAnalyzer/Core/CMakeFiles/obj.clangStaticAnalyzerCore.dir/ExprEngine.cpp.o tools/clang/lib/StaticAnalyzer/Core/CMakeFiles/obj.clangStaticAnalyzerCore.dir/ExprEngineC.cpp.o tools/clang/lib/StaticAnalyzer/Core/CMakeFiles/obj.clangStaticAnalyzerCore.dir/ExprEngineCXX.cpp.o tools/clang/lib/StaticAnalyzer/Core/CMakeFiles/obj.clangStaticAnalyzerCore.dir/ExprEngineCallAndReturn.cpp.o tools/clang/lib/StaticAnalyzer/Core/CMakeFiles/obj.clangStaticAnalyzerCore.dir/ExprEngineObjC.cpp.o tools/clang/lib/StaticAnalyzer/Core/CMakeFiles/obj.clangStaticAnalyzerCore.dir/FunctionSummary.cpp.o tools/clang/lib/StaticAnalyzer/Core/CMakeFiles/obj.clangStaticAnalyzerCore.dir/HTMLDiagnostics.cpp.o tools/clang/lib/StaticAnalyzer/Core/CMakeFiles/obj.clangStaticAnalyzerCore.dir/IssueHash.cpp.o tools/clang/lib/StaticAnalyzer/Core/CMakeFiles/obj.clangStaticAnalyzerCore.dir/LoopUnrolling.cpp.o tools/clang/lib/StaticAnalyzer/Core/CMakeFiles/obj.clangStaticAnalyzerCore.dir/LoopWidening.cpp.o tools/clang/lib/StaticAnalyzer/Core/CMakeFiles/obj.clangStaticAnalyzerCore.dir/MemRegion.cpp.o tools/clang/lib/StaticAnalyzer/Core/CMakeFiles/obj.clangStaticAnalyzerCore.dir/PlistDiagnostics.cpp.o tools/clang/lib/StaticAnalyzer/Core/CMakeFiles/obj.clangStaticAnalyzerCore.dir/ProgramState.cpp.o tools/clang/lib/StaticAnalyzer/Core/CMakeFiles/obj.clangStaticAnalyzerCore.dir/RangeConstraintManager.cpp.o tools/clang/lib/StaticAnalyzer/Core/CMakeFiles/obj.clangStaticAnalyzerCore.dir/RangedConstraintManager.cpp.o tools/clang/lib/StaticAnalyzer/Core/CMakeFiles/obj.clangStaticAnalyzerCore.dir/RegionStore.cpp.o tools/clang/lib/StaticAnalyzer/Core/CMakeFiles/obj.clangStaticAnalyzerCore.dir/SarifDiagnostics.cpp.o tools/clang/lib/StaticAnalyzer/Core/CMakeFiles/obj.clangStaticAnalyzerCore.dir/SimpleConstraintManager.cpp.o tools/clang/lib/StaticAnalyzer/Core/CMakeFiles/obj.clangStaticAnalyzerCore.dir/SimpleSValBuilder.cpp.o tools/clang/lib/StaticAnalyzer/Core/CMakeFiles/obj.clangStaticAnalyzerCore.dir/SMTConstraintManager.cpp.o tools/clang/lib/StaticAnalyzer/Core/CMakeFiles/obj.clangStaticAnalyzerCore.dir/Store.cpp.o tools/clang/lib/StaticAnalyzer/Core/CMakeFiles/obj.clangStaticAnalyzerCore.dir/SubEngine.cpp.o tools/clang/lib/StaticAnalyzer/Core/CMakeFiles/obj.clangStaticAnalyzerCore.dir/SValBuilder.cpp.o tools/clang/lib/StaticAnalyzer/Core/CMakeFiles/obj.clangStaticAnalyzerCore.dir/SVals.cpp.o tools/clang/lib/StaticAnalyzer/Core/CMakeFiles/obj.clangStaticAnalyzerCore.dir/SymbolManager.cpp.o tools/clang/lib/StaticAnalyzer/Core/CMakeFiles/obj.clangStaticAnalyzerCore.dir/WorkList.cpp.o tools/clang/lib/StaticAnalyzer/Checkers/CMakeFiles/obj.clangStaticAnalyzerCheckers.dir/AnalysisOrderChecker.cpp.o tools/clang/lib/StaticAnalyzer/Checkers/CMakeFiles/obj.clangStaticAnalyzerCheckers.dir/AnalyzerStatsChecker.cpp.o tools/clang/lib/StaticAnalyzer/Checkers/CMakeFiles/obj.clangStaticAnalyzerCheckers.dir/ArrayBoundChecker.cpp.o tools/clang/lib/StaticAnalyzer/Checkers/CMakeFiles/obj.clangStaticAnalyzerCheckers.dir/ArrayBoundCheckerV2.cpp.o tools/clang/lib/StaticAnalyzer/Checkers/CMakeFiles/obj.clangStaticAnalyzerCheckers.dir/BasicObjCFoundationChecks.cpp.o tools/clang/lib/StaticAnalyzer/Checkers/CMakeFiles/obj.clangStaticAnalyzerCheckers.dir/BlockInCriticalSectionChecker.cpp.o tools/clang/lib/StaticAnalyzer/Checkers/CMakeFiles/obj.clangStaticAnalyzerCheckers.dir/BoolAssignmentChecker.cpp.o tools/clang/lib/StaticAnalyzer/Checkers/CMakeFiles/obj.clangStaticAnalyzerCheckers.dir/BuiltinFunctionChecker.cpp.o tools/clang/lib/StaticAnalyzer/Checkers/CMakeFiles/obj.clangStaticAnalyzerCheckers.dir/CStringChecker.cpp.o tools/clang/lib/StaticAnalyzer/Checkers/CMakeFiles/obj.clangStaticAnalyzerCheckers.dir/CStringSyntaxChecker.cpp.o tools/clang/lib/StaticAnalyzer/Checkers/CMakeFiles/obj.clangStaticAnalyzerCheckers.dir/CallAndMessageChecker.cpp.o tools/clang/lib/StaticAnalyzer/Checkers/CMakeFiles/obj.clangStaticAnalyzerCheckers.dir/CastSizeChecker.cpp.o tools/clang/lib/StaticAnalyzer/Checkers/CMakeFiles/obj.clangStaticAnalyzerCheckers.dir/CastToStructChecker.cpp.o tools/clang/lib/StaticAnalyzer/Checkers/CMakeFiles/obj.clangStaticAnalyzerCheckers.dir/CastValueChecker.cpp.o tools/clang/lib/StaticAnalyzer/Checkers/CMakeFiles/obj.clangStaticAnalyzerCheckers.dir/CheckObjCDealloc.cpp.o tools/clang/lib/StaticAnalyzer/Checkers/CMakeFiles/obj.clangStaticAnalyzerCheckers.dir/CheckObjCInstMethSignature.cpp.o tools/clang/lib/StaticAnalyzer/Checkers/CMakeFiles/obj.clangStaticAnalyzerCheckers.dir/CheckSecuritySyntaxOnly.cpp.o tools/clang/lib/StaticAnalyzer/Checkers/CMakeFiles/obj.clangStaticAnalyzerCheckers.dir/CheckSizeofPointer.cpp.o tools/clang/lib/StaticAnalyzer/Checkers/CMakeFiles/obj.clangStaticAnalyzerCheckers.dir/CheckerDocumentation.cpp.o tools/clang/lib/StaticAnalyzer/Checkers/CMakeFiles/obj.clangStaticAnalyzerCheckers.dir/ChrootChecker.cpp.o tools/clang/lib/StaticAnalyzer/Checkers/CMakeFiles/obj.clangStaticAnalyzerCheckers.dir/CloneChecker.cpp.o tools/clang/lib/StaticAnalyzer/Checkers/CMakeFiles/obj.clangStaticAnalyzerCheckers.dir/ConversionChecker.cpp.o tools/clang/lib/StaticAnalyzer/Checkers/CMakeFiles/obj.clangStaticAnalyzerCheckers.dir/CXXSelfAssignmentChecker.cpp.o tools/clang/lib/StaticAnalyzer/Checkers/CMakeFiles/obj.clangStaticAnalyzerCheckers.dir/DeadStoresChecker.cpp.o tools/clang/lib/StaticAnalyzer/Checkers/CMakeFiles/obj.clangStaticAnalyzerCheckers.dir/DebugCheckers.cpp.o tools/clang/lib/StaticAnalyzer/Checkers/CMakeFiles/obj.clangStaticAnalyzerCheckers.dir/DeleteWithNonVirtualDtorChecker.cpp.o tools/clang/lib/StaticAnalyzer/Checkers/CMakeFiles/obj.clangStaticAnalyzerCheckers.dir/DereferenceChecker.cpp.o tools/clang/lib/StaticAnalyzer/Checkers/CMakeFiles/obj.clangStaticAnalyzerCheckers.dir/DirectIvarAssignment.cpp.o tools/clang/lib/StaticAnalyzer/Checkers/CMakeFiles/obj.clangStaticAnalyzerCheckers.dir/DivZeroChecker.cpp.o tools/clang/lib/StaticAnalyzer/Checkers/CMakeFiles/obj.clangStaticAnalyzerCheckers.dir/DynamicTypePropagation.cpp.o tools/clang/lib/StaticAnalyzer/Checkers/CMakeFiles/obj.clangStaticAnalyzerCheckers.dir/DynamicTypeChecker.cpp.o tools/clang/lib/StaticAnalyzer/Checkers/CMakeFiles/obj.clangStaticAnalyzerCheckers.dir/EnumCastOutOfRangeChecker.cpp.o tools/clang/lib/StaticAnalyzer/Checkers/CMakeFiles/obj.clangStaticAnalyzerCheckers.dir/ExprInspectionChecker.cpp.o tools/clang/lib/StaticAnalyzer/Checkers/CMakeFiles/obj.clangStaticAnalyzerCheckers.dir/FixedAddressChecker.cpp.o tools/clang/lib/StaticAnalyzer/Checkers/CMakeFiles/obj.clangStaticAnalyzerCheckers.dir/GCDAntipatternChecker.cpp.o tools/clang/lib/StaticAnalyzer/Checkers/CMakeFiles/obj.clangStaticAnalyzerCheckers.dir/GenericTaintChecker.cpp.o tools/clang/lib/StaticAnalyzer/Checkers/CMakeFiles/obj.clangStaticAnalyzerCheckers.dir/GTestChecker.cpp.o tools/clang/lib/StaticAnalyzer/Checkers/CMakeFiles/obj.clangStaticAnalyzerCheckers.dir/IdenticalExprChecker.cpp.o tools/clang/lib/StaticAnalyzer/Checkers/CMakeFiles/obj.clangStaticAnalyzerCheckers.dir/InnerPointerChecker.cpp.o tools/clang/lib/StaticAnalyzer/Checkers/CMakeFiles/obj.clangStaticAnalyzerCheckers.dir/IteratorChecker.cpp.o tools/clang/lib/StaticAnalyzer/Checkers/CMakeFiles/obj.clangStaticAnalyzerCheckers.dir/IvarInvalidationChecker.cpp.o tools/clang/lib/StaticAnalyzer/Checkers/CMakeFiles/obj.clangStaticAnalyzerCheckers.dir/LLVMConventionsChecker.cpp.o tools/clang/lib/StaticAnalyzer/Checkers/CMakeFiles/obj.clangStaticAnalyzerCheckers.dir/LocalizationChecker.cpp.o tools/clang/lib/StaticAnalyzer/Checkers/CMakeFiles/obj.clangStaticAnalyzerCheckers.dir/MacOSKeychainAPIChecker.cpp.o tools/clang/lib/StaticAnalyzer/Checkers/CMakeFiles/obj.clangStaticAnalyzerCheckers.dir/MacOSXAPIChecker.cpp.o tools/clang/lib/StaticAnalyzer/Checkers/CMakeFiles/obj.clangStaticAnalyzerCheckers.dir/MallocChecker.cpp.o tools/clang/lib/StaticAnalyzer/Checkers/CMakeFiles/obj.clangStaticAnalyzerCheckers.dir/MallocOverflowSecurityChecker.cpp.o tools/clang/lib/StaticAnalyzer/Checkers/CMakeFiles/obj.clangStaticAnalyzerCheckers.dir/MallocSizeofChecker.cpp.o tools/clang/lib/StaticAnalyzer/Checkers/CMakeFiles/obj.clangStaticAnalyzerCheckers.dir/MmapWriteExecChecker.cpp.o tools/clang/lib/StaticAnalyzer/Checkers/CMakeFiles/obj.clangStaticAnalyzerCheckers.dir/MIGChecker.cpp.o tools/clang/lib/StaticAnalyzer/Checkers/CMakeFiles/obj.clangStaticAnalyzerCheckers.dir/MoveChecker.cpp.o tools/clang/lib/StaticAnalyzer/Checkers/CMakeFiles/obj.clangStaticAnalyzerCheckers.dir/MPI-Checker/MPIBugReporter.cpp.o tools/clang/lib/StaticAnalyzer/Checkers/CMakeFiles/obj.clangStaticAnalyzerCheckers.dir/MPI-Checker/MPIChecker.cpp.o tools/clang/lib/StaticAnalyzer/Checkers/CMakeFiles/obj.clangStaticAnalyzerCheckers.dir/MPI-Checker/MPIFunctionClassifier.cpp.o tools/clang/lib/StaticAnalyzer/Checkers/CMakeFiles/obj.clangStaticAnalyzerCheckers.dir/NSAutoreleasePoolChecker.cpp.o tools/clang/lib/StaticAnalyzer/Checkers/CMakeFiles/obj.clangStaticAnalyzerCheckers.dir/NSErrorChecker.cpp.o tools/clang/lib/StaticAnalyzer/Checkers/CMakeFiles/obj.clangStaticAnalyzerCheckers.dir/NoReturnFunctionChecker.cpp.o tools/clang/lib/StaticAnalyzer/Checkers/CMakeFiles/obj.clangStaticAnalyzerCheckers.dir/NonNullParamChecker.cpp.o tools/clang/lib/StaticAnalyzer/Checkers/CMakeFiles/obj.clangStaticAnalyzerCheckers.dir/NonnullGlobalConstantsChecker.cpp.o tools/clang/lib/StaticAnalyzer/Checkers/CMakeFiles/obj.clangStaticAnalyzerCheckers.dir/NullabilityChecker.cpp.o tools/clang/lib/StaticAnalyzer/Checkers/CMakeFiles/obj.clangStaticAnalyzerCheckers.dir/NumberObjectConversionChecker.cpp.o tools/clang/lib/StaticAnalyzer/Checkers/CMakeFiles/obj.clangStaticAnalyzerCheckers.dir/ObjCAtSyncChecker.cpp.o tools/clang/lib/StaticAnalyzer/Checkers/CMakeFiles/obj.clangStaticAnalyzerCheckers.dir/ObjCAutoreleaseWriteChecker.cpp.o tools/clang/lib/StaticAnalyzer/Checkers/CMakeFiles/obj.clangStaticAnalyzerCheckers.dir/ObjCContainersASTChecker.cpp.o tools/clang/lib/StaticAnalyzer/Checkers/CMakeFiles/obj.clangStaticAnalyzerCheckers.dir/ObjCContainersChecker.cpp.o tools/clang/lib/StaticAnalyzer/Checkers/CMakeFiles/obj.clangStaticAnalyzerCheckers.dir/ObjCMissingSuperCallChecker.cpp.o tools/clang/lib/StaticAnalyzer/Checkers/CMakeFiles/obj.clangStaticAnalyzerCheckers.dir/ObjCPropertyChecker.cpp.o tools/clang/lib/StaticAnalyzer/Checkers/CMakeFiles/obj.clangStaticAnalyzerCheckers.dir/ObjCSelfInitChecker.cpp.o tools/clang/lib/StaticAnalyzer/Checkers/CMakeFiles/obj.clangStaticAnalyzerCheckers.dir/ObjCSuperDeallocChecker.cpp.o tools/clang/lib/StaticAnalyzer/Checkers/CMakeFiles/obj.clangStaticAnalyzerCheckers.dir/ObjCUnusedIVarsChecker.cpp.o tools/clang/lib/StaticAnalyzer/Checkers/CMakeFiles/obj.clangStaticAnalyzerCheckers.dir/OSObjectCStyleCast.cpp.o tools/clang/lib/StaticAnalyzer/Checkers/CMakeFiles/obj.clangStaticAnalyzerCheckers.dir/PaddingChecker.cpp.o tools/clang/lib/StaticAnalyzer/Checkers/CMakeFiles/obj.clangStaticAnalyzerCheckers.dir/PointerArithChecker.cpp.o tools/clang/lib/StaticAnalyzer/Checkers/CMakeFiles/obj.clangStaticAnalyzerCheckers.dir/PointerIterationChecker.cpp.o tools/clang/lib/StaticAnalyzer/Checkers/CMakeFiles/obj.clangStaticAnalyzerCheckers.dir/PointerSortingChecker.cpp.o tools/clang/lib/StaticAnalyzer/Checkers/CMakeFiles/obj.clangStaticAnalyzerCheckers.dir/PointerSubChecker.cpp.o tools/clang/lib/StaticAnalyzer/Checkers/CMakeFiles/obj.clangStaticAnalyzerCheckers.dir/PthreadLockChecker.cpp.o tools/clang/lib/StaticAnalyzer/Checkers/CMakeFiles/obj.clangStaticAnalyzerCheckers.dir/RetainCountChecker/RetainCountChecker.cpp.o tools/clang/lib/StaticAnalyzer/Checkers/CMakeFiles/obj.clangStaticAnalyzerCheckers.dir/RetainCountChecker/RetainCountDiagnostics.cpp.o tools/clang/lib/StaticAnalyzer/Checkers/CMakeFiles/obj.clangStaticAnalyzerCheckers.dir/ReturnPointerRangeChecker.cpp.o tools/clang/lib/StaticAnalyzer/Checkers/CMakeFiles/obj.clangStaticAnalyzerCheckers.dir/ReturnUndefChecker.cpp.o tools/clang/lib/StaticAnalyzer/Checkers/CMakeFiles/obj.clangStaticAnalyzerCheckers.dir/ReturnValueChecker.cpp.o tools/clang/lib/StaticAnalyzer/Checkers/CMakeFiles/obj.clangStaticAnalyzerCheckers.dir/RunLoopAutoreleaseLeakChecker.cpp.o tools/clang/lib/StaticAnalyzer/Checkers/CMakeFiles/obj.clangStaticAnalyzerCheckers.dir/SimpleStreamChecker.cpp.o tools/clang/lib/StaticAnalyzer/Checkers/CMakeFiles/obj.clangStaticAnalyzerCheckers.dir/SmartPtrModeling.cpp.o tools/clang/lib/StaticAnalyzer/Checkers/CMakeFiles/obj.clangStaticAnalyzerCheckers.dir/StackAddrEscapeChecker.cpp.o tools/clang/lib/StaticAnalyzer/Checkers/CMakeFiles/obj.clangStaticAnalyzerCheckers.dir/StdLibraryFunctionsChecker.cpp.o tools/clang/lib/StaticAnalyzer/Checkers/CMakeFiles/obj.clangStaticAnalyzerCheckers.dir/StreamChecker.cpp.o tools/clang/lib/StaticAnalyzer/Checkers/CMakeFiles/obj.clangStaticAnalyzerCheckers.dir/Taint.cpp.o tools/clang/lib/StaticAnalyzer/Checkers/CMakeFiles/obj.clangStaticAnalyzerCheckers.dir/TaintTesterChecker.cpp.o tools/clang/lib/StaticAnalyzer/Checkers/CMakeFiles/obj.clangStaticAnalyzerCheckers.dir/TestAfterDivZeroChecker.cpp.o tools/clang/lib/StaticAnalyzer/Checkers/CMakeFiles/obj.clangStaticAnalyzerCheckers.dir/TraversalChecker.cpp.o tools/clang/lib/StaticAnalyzer/Checkers/CMakeFiles/obj.clangStaticAnalyzerCheckers.dir/TrustNonnullChecker.cpp.o tools/clang/lib/StaticAnalyzer/Checkers/CMakeFiles/obj.clangStaticAnalyzerCheckers.dir/UndefBranchChecker.cpp.o tools/clang/lib/StaticAnalyzer/Checkers/CMakeFiles/obj.clangStaticAnalyzerCheckers.dir/UndefCapturedBlockVarChecker.cpp.o tools/clang/lib/StaticAnalyzer/Checkers/CMakeFiles/obj.clangStaticAnalyzerCheckers.dir/UndefResultChecker.cpp.o tools/clang/lib/StaticAnalyzer/Checkers/CMakeFiles/obj.clangStaticAnalyzerCheckers.dir/UndefinedArraySubscriptChecker.cpp.o tools/clang/lib/StaticAnalyzer/Checkers/CMakeFiles/obj.clangStaticAnalyzerCheckers.dir/UndefinedAssignmentChecker.cpp.o tools/clang/lib/StaticAnalyzer/Checkers/CMakeFiles/obj.clangStaticAnalyzerCheckers.dir/UninitializedObject/UninitializedObjectChecker.cpp.o tools/clang/lib/StaticAnalyzer/Checkers/CMakeFiles/obj.clangStaticAnalyzerCheckers.dir/UninitializedObject/UninitializedPointee.cpp.o tools/clang/lib/StaticAnalyzer/Checkers/CMakeFiles/obj.clangStaticAnalyzerCheckers.dir/UnixAPIChecker.cpp.o tools/clang/lib/StaticAnalyzer/Checkers/CMakeFiles/obj.clangStaticAnalyzerCheckers.dir/UnreachableCodeChecker.cpp.o tools/clang/lib/StaticAnalyzer/Checkers/CMakeFiles/obj.clangStaticAnalyzerCheckers.dir/VforkChecker.cpp.o tools/clang/lib/StaticAnalyzer/Checkers/CMakeFiles/obj.clangStaticAnalyzerCheckers.dir/VLASizeChecker.cpp.o tools/clang/lib/StaticAnalyzer/Checkers/CMakeFiles/obj.clangStaticAnalyzerCheckers.dir/ValistChecker.cpp.o tools/clang/lib/StaticAnalyzer/Checkers/CMakeFiles/obj.clangStaticAnalyzerCheckers.dir/VirtualCallChecker.cpp.o tools/clang/lib/StaticAnalyzer/Frontend/CMakeFiles/obj.clangStaticAnalyzerFrontend.dir/AnalysisConsumer.cpp.o tools/clang/lib/StaticAnalyzer/Frontend/CMakeFiles/obj.clangStaticAnalyzerFrontend.dir/CheckerRegistration.cpp.o tools/clang/lib/StaticAnalyzer/Frontend/CMakeFiles/obj.clangStaticAnalyzerFrontend.dir/CheckerRegistry.cpp.o tools/clang/lib/StaticAnalyzer/Frontend/CMakeFiles/obj.clangStaticAnalyzerFrontend.dir/FrontendActions.cpp.o tools/clang/lib/StaticAnalyzer/Frontend/CMakeFiles/obj.clangStaticAnalyzerFrontend.dir/ModelConsumer.cpp.o tools/clang/lib/StaticAnalyzer/Frontend/CMakeFiles/obj.clangStaticAnalyzerFrontend.dir/ModelInjector.cpp.o tools/clang/lib/Format/CMakeFiles/obj.clangFormat.dir/AffectedRangeManager.cpp.o tools/clang/lib/Format/CMakeFiles/obj.clangFormat.dir/BreakableToken.cpp.o tools/clang/lib/Format/CMakeFiles/obj.clangFormat.dir/ContinuationIndenter.cpp.o tools/clang/lib/Format/CMakeFiles/obj.clangFormat.dir/Format.cpp.o tools/clang/lib/Format/CMakeFiles/obj.clangFormat.dir/FormatToken.cpp.o tools/clang/lib/Format/CMakeFiles/obj.clangFormat.dir/FormatTokenLexer.cpp.o tools/clang/lib/Format/CMakeFiles/obj.clangFormat.dir/NamespaceEndCommentsFixer.cpp.o tools/clang/lib/Format/CMakeFiles/obj.clangFormat.dir/SortJavaScriptImports.cpp.o tools/clang/lib/Format/CMakeFiles/obj.clangFormat.dir/TokenAnalyzer.cpp.o tools/clang/lib/Format/CMakeFiles/obj.clangFormat.dir/TokenAnnotator.cpp.o tools/clang/lib/Format/CMakeFiles/obj.clangFormat.dir/UnwrappedLineFormatter.cpp.o tools/clang/lib/Format/CMakeFiles/obj.clangFormat.dir/UnwrappedLineParser.cpp.o tools/clang/lib/Format/CMakeFiles/obj.clangFormat.dir/UsingDeclarationsSorter.cpp.o tools/clang/lib/Format/CMakeFiles/obj.clangFormat.dir/WhitespaceManager.cpp.o tools/clang/tools/clang-fuzzer/handle-cxx/CMakeFiles/obj.clangHandleCXX.dir/handle_cxx.cpp.o tools/clang/tools/clang-fuzzer/handle-llvm/CMakeFiles/obj.clangHandleLLVM.dir/handle_llvm.cpp.o tools/clang/tools/clang-shlib/CMakeFiles/clang-cpp.dir/clang-shlib.cpp.o  -Wl,-rpath,@loader_path/../lib lib/libLLVMCore.a lib/libLLVMMC.a lib/libLLVMSupport.a lib/libclangBasic.a lib/libLLVMSupport.a lib/libclangAST.a lib/libclangBasic.a lib/libclangLex.a lib/libclangSema.a lib/libLLVMMC.a lib/libLLVMMCParser.a lib/libLLVMSupport.a lib/libclangBasic.a lib/libclangLex.a lib/libLLVMBinaryFormat.a lib/libLLVMCore.a lib/libLLVMSupport.a lib/libclangAST.a lib/libclangASTMatchers.a lib/libclangBasic.a lib/libLLVMSupport.a lib/libclangAST.a lib/libclangBasic.a lib/libLLVMSupport.a lib/libclangAST.a lib/libclangBasic.a lib/libclangFrontend.a lib/libclangIndex.a lib/libLLVMSupport.a lib/libclangAST.a lib/libclangAnalysis.a lib/libclangBasic.a lib/libclangEdit.a lib/libclangLex.a lib/libLLVMSupport.a lib/libclangAnalysis.a lib/libclangAST.a lib/libclangASTMatchers.a lib/libclangBasic.a lib/libclangFrontend.a lib/libclangLex.a lib/libclangSerialization.a lib/libLLVMAnalysis.a lib/libLLVMBitReader.a lib/libLLVMBitWriter.a lib/libLLVMCore.a lib/libLLVMCoroutines.a lib/libLLVMCoverage.a lib/libLLVMipo.a lib/libLLVMIRReader.a lib/libLLVMAggressiveInstCombine.a lib/libLLVMInstCombine.a lib/libLLVMInstrumentation.a lib/libLLVMLTO.a lib/libLLVMLinker.a lib/libLLVMMC.a lib/libLLVMObjCARCOpts.a lib/libLLVMObject.a lib/libLLVMPasses.a lib/libLLVMProfileData.a lib/libLLVMRemarks.a lib/libLLVMScalarOpts.a lib/libLLVMSupport.a lib/libLLVMTarget.a lib/libLLVMTransformUtils.a lib/libclangAST.a lib/libclangASTMatchers.a lib/libclangBasic.a lib/libclangLex.a lib/libLLVMSupport.a lib/libclangAST.a lib/libclangBasic.a lib/libclangLex.a lib/libLLVMSupport.a lib/libclangBasic.a lib/libclangLex.a lib/libLLVMSupport.a lib/libclangAST.a lib/libclangAnalysis.a lib/libclangBasic.a lib/libclangEdit.a lib/libclangFrontend.a lib/libclangLex.a lib/libclangRewrite.a lib/libclangSema.a lib/libclangSerialization.a lib/libLLVMSupport.a lib/libclangBasic.a lib/libLLVMBinaryFormat.a lib/libLLVMOption.a lib/libLLVMProfileData.a lib/libLLVMSupport.a lib/libclangAST.a lib/libclangBasic.a lib/libclangLex.a lib/libclangSema.a lib/libLLVMBitReader.a lib/libLLVMBitstreamReader.a lib/libLLVMSupport.a lib/libclangAST.a lib/libclangBasic.a lib/libclangEdit.a lib/libclangFrontend.a lib/libclangLex.a lib/libclangRewrite.a lib/libclangSerialization.a lib/libLLVMSupport.a lib/libclangAST.a lib/libclangBasic.a lib/libclangDriver.a lib/libclangEdit.a lib/libclangLex.a lib/libclangParse.a lib/libclangSema.a lib/libclangSerialization.a lib/libLLVMBitReader.a lib/libLLVMBitstreamReader.a lib/libLLVMOption.a lib/libLLVMProfileData.a lib/libLLVMSupport.a lib/libclangBasic.a lib/libclangCodeGen.a lib/libclangDriver.a lib/libclangFrontend.a lib/libclangRewriteFrontend.a lib/libclangARCMigrate.a lib/libclangStaticAnalyzerFrontend.a lib/libLLVMOption.a lib/libLLVMSupport.a lib/libclangAST.a lib/libclangBasic.a lib/libclangLex.a lib/libclangRewrite.a lib/libLLVMSupport.a lib/libclangBasic.a lib/libclangLex.a lib/libclangRewrite.a lib/libclangToolingCore.a lib/libLLVMSupport.a lib/libclangAST.a lib/libclangASTMatchers.a lib/libclangBasic.a lib/libclangFormat.a lib/libclangIndex.a lib/libclangLex.a lib/libclangRewrite.a lib/libclangToolingCore.a lib/libLLVMSupport.a lib/libclangBasic.a lib/libclangAST.a lib/libclangLex.a lib/libLLVMSupport.a lib/libclangAST.a lib/libclangBasic.a lib/libclangFrontend.a lib/libclangLex.a lib/libclangToolingCore.a lib/libLLVMSupport.a lib/libclangAST.a lib/libclangBasic.a lib/libclangDriver.a lib/libclangFrontend.a lib/libclangFrontendTool.a lib/libclangLex.a lib/libclangParse.a lib/libclangSerialization.a lib/libclangTooling.a lib/libLLVMCore.a lib/libLLVMSupport.a lib/libclangAST.a lib/libclangASTMatchers.a lib/libclangBasic.a lib/libclangLex.a lib/libclangToolingCore.a lib/libclangToolingRefactoring.a lib/libLLVMSupport.a lib/libclangAST.a lib/libclangASTMatchers.a lib/libclangBasic.a lib/libclangDriver.a lib/libclangFormat.a lib/libclangFrontend.a lib/libclangLex.a lib/libclangRewrite.a lib/libclangSerialization.a lib/libclangToolingCore.a lib/libLLVMOption.a lib/libLLVMSupport.a lib/libLLVMSupport.a -framework CoreServices -framework CoreServices lib/libclangAST.a lib/libclangBasic.a lib/libclangFormat.a lib/libclangFrontend.a lib/libclangLex.a lib/libclangRewrite.a lib/libclangSerialization.a lib/libclangToolingCore.a lib/libLLVMCore.a lib/libLLVMSupport.a lib/libclangAST.a lib/libclangASTMatchers.a lib/libclangAnalysis.a lib/libclangBasic.a lib/libclangCrossTU.a lib/libclangFrontend.a lib/libclangLex.a lib/libclangRewrite.a lib/libLLVMSupport.a lib/libclangAST.a lib/libclangASTMatchers.a lib/libclangAnalysis.a lib/libclangBasic.a lib/libclangLex.a lib/libclangStaticAnalyzerCore.a lib/libLLVMSupport.a lib/libclangAST.a lib/libclangAnalysis.a lib/libclangBasic.a lib/libclangCrossTU.a lib/libclangFrontend.a lib/libclangLex.a lib/libclangStaticAnalyzerCheckers.a lib/libclangStaticAnalyzerCore.a lib/libLLVMSupport.a lib/libclangBasic.a lib/libclangLex.a lib/libclangToolingCore.a lib/libclangToolingInclusions.a lib/libLLVMSupport.a lib/libclangBasic.a lib/libclangCodeGen.a lib/libclangFrontend.a lib/libclangLex.a lib/libclangSerialization.a lib/libclangTooling.a lib/libLLVMAArch64CodeGen.a lib/libLLVMAArch64AsmParser.a lib/libLLVMAArch64Desc.a lib/libLLVMAArch64Disassembler.a lib/libLLVMAArch64Info.a lib/libLLVMAArch64Utils.a lib/libLLVMAMDGPUCodeGen.a lib/libLLVMAMDGPUAsmParser.a lib/libLLVMAMDGPUDesc.a lib/libLLVMAMDGPUDisassembler.a lib/libLLVMAMDGPUInfo.a lib/libLLVMAMDGPUUtils.a lib/libLLVMARMCodeGen.a lib/libLLVMARMAsmParser.a lib/libLLVMARMDesc.a lib/libLLVMARMDisassembler.a lib/libLLVMARMInfo.a lib/libLLVMARMUtils.a lib/libLLVMBPFCodeGen.a lib/libLLVMBPFAsmParser.a lib/libLLVMBPFDesc.a lib/libLLVMBPFDisassembler.a lib/libLLVMBPFInfo.a lib/libLLVMHexagonCodeGen.a lib/libLLVMHexagonAsmParser.a lib/libLLVMHexagonDesc.a lib/libLLVMHexagonDisassembler.a lib/libLLVMHexagonInfo.a lib/libLLVMLanaiCodeGen.a lib/libLLVMLanaiAsmParser.a lib/libLLVMLanaiDesc.a lib/libLLVMLanaiDisassembler.a lib/libLLVMLanaiInfo.a lib/libLLVMMipsCodeGen.a lib/libLLVMMipsAsmParser.a lib/libLLVMMipsDesc.a lib/libLLVMMipsDisassembler.a lib/libLLVMMipsInfo.a lib/libLLVMMSP430CodeGen.a lib/libLLVMMSP430AsmParser.a lib/libLLVMMSP430Desc.a lib/libLLVMMSP430Disassembler.a lib/libLLVMMSP430Info.a lib/libLLVMNVPTXCodeGen.a lib/libLLVMNVPTXDesc.a lib/libLLVMNVPTXInfo.a lib/libLLVMPowerPCCodeGen.a lib/libLLVMPowerPCAsmParser.a lib/libLLVMPowerPCDesc.a lib/libLLVMPowerPCDisassembler.a lib/libLLVMPowerPCInfo.a lib/libLLVMRISCVCodeGen.a lib/libLLVMRISCVAsmParser.a lib/libLLVMRISCVDesc.a lib/libLLVMRISCVDisassembler.a lib/libLLVMRISCVInfo.a lib/libLLVMRISCVUtils.a lib/libLLVMSparcCodeGen.a lib/libLLVMSparcAsmParser.a lib/libLLVMSparcDesc.a lib/libLLVMSparcDisassembler.a lib/libLLVMSparcInfo.a lib/libLLVMSystemZCodeGen.a lib/libLLVMSystemZAsmParser.a lib/libLLVMSystemZDesc.a lib/libLLVMSystemZDisassembler.a lib/libLLVMSystemZInfo.a lib/libLLVMWebAssemblyCodeGen.a lib/libLLVMWebAssemblyAsmParser.a lib/libLLVMWebAssemblyDesc.a lib/libLLVMWebAssemblyDisassembler.a lib/libLLVMWebAssemblyInfo.a lib/libLLVMX86CodeGen.a lib/libLLVMX86AsmParser.a lib/libLLVMX86Desc.a lib/libLLVMX86Disassembler.a lib/libLLVMX86Info.a lib/libLLVMX86Utils.a lib/libLLVMXCoreCodeGen.a lib/libLLVMXCoreDesc.a lib/libLLVMXCoreDisassembler.a lib/libLLVMXCoreInfo.a lib/libLLVMSupport.a lib/libLLVMAnalysis.a lib/libLLVMCodeGen.a lib/libLLVMCore.a lib/libLLVMExecutionEngine.a lib/libLLVMipo.a lib/libLLVMIRReader.a lib/libLLVMMC.a lib/libLLVMMCJIT.a lib/libLLVMObject.a lib/libLLVMRuntimeDyld.a lib/libLLVMSelectionDAG.a lib/libLLVMSupport.a lib/libLLVMTarget.a lib/libLLVMTransformUtils.a lib/libLLVMX86CodeGen.a lib/libLLVMX86AsmParser.a lib/libLLVMX86Desc.a lib/libLLVMX86Disassembler.a lib/libLLVMX86Info.a lib/libLLVMX86Utils.a lib/libLLVMCoroutines.a lib/libLLVMCoverage.a lib/libLLVMLTO.a lib/libLLVMObjCARCOpts.a lib/libLLVMPasses.a lib/libclangRewriteFrontend.a lib/libclangARCMigrate.a lib/libclangStaticAnalyzerFrontend.a lib/libclangStaticAnalyzerCheckers.a lib/libclangStaticAnalyzerCore.a lib/libclangCrossTU.a lib/libclangIndex.a lib/libclangFrontend.a lib/libclangDriver.a lib/libLLVMOption.a lib/libclangParse.a lib/libclangSerialization.a lib/libclangSema.a lib/libclangAnalysis.a lib/libclangASTMatchers.a lib/libclangEdit.a lib/libclangFormat.a lib/libclangToolingInclusions.a lib/libclangToolingCore.a lib/libclangAST.a lib/libclangRewrite.a lib/libclangLex.a lib/libclangBasic.a lib/libLLVMAArch64Desc.a lib/libLLVMAArch64Info.a lib/libLLVMAArch64Utils.a lib/libLLVMMIRParser.a lib/libLLVMAMDGPUDesc.a lib/libLLVMAMDGPUInfo.a lib/libLLVMAMDGPUUtils.a lib/libLLVMARMDesc.a lib/libLLVMARMInfo.a lib/libLLVMARMUtils.a lib/libLLVMHexagonDesc.a lib/libLLVMHexagonInfo.a lib/libLLVMLanaiDesc.a lib/libLLVMLanaiInfo.a lib/libLLVMipo.a lib/libLLVMIRReader.a lib/libLLVMAsmParser.a lib/libLLVMInstrumentation.a lib/libLLVMLinker.a lib/libLLVMVectorize.a lib/libLLVMSystemZDesc.a lib/libLLVMSystemZInfo.a lib/libLLVMWebAssemblyDesc.a lib/libLLVMWebAssemblyInfo.a lib/libLLVMCFGuard.a lib/libLLVMGlobalISel.a lib/libLLVMSelectionDAG.a lib/libLLVMAsmPrinter.a lib/libLLVMCodeGen.a lib/libLLVMBitWriter.a lib/libLLVMScalarOpts.a lib/libLLVMAggressiveInstCombine.a lib/libLLVMInstCombine.a lib/libLLVMTransformUtils.a lib/libLLVMDebugInfoDWARF.a lib/libLLVMMCDisassembler.a lib/libLLVMExecutionEngine.a lib/libLLVMTarget.a lib/libLLVMAnalysis.a lib/libLLVMProfileData.a lib/libLLVMRuntimeDyld.a lib/libLLVMObject.a lib/libLLVMMCParser.a lib/libLLVMMC.a lib/libLLVMDebugInfoCodeView.a lib/libLLVMDebugInfoMSF.a lib/libLLVMBitReader.a lib/libLLVMCore.a lib/libLLVMRemarks.a lib/libLLVMBitstreamReader.a lib/libLLVMTextAPI.a lib/libLLVMBinaryFormat.a lib/libLLVMSupport.a -lz -lcurses -lm lib/libLLVMDemangle.a && :
[94/101] : && /Users/buildslave/jenkins/workspace/lldb-cmake/host-compiler/bin/clang++  -Wdocumentation -fPIC -fvisibility-inlines-hidden -Werror=date-time -Werror=unguarded-availability-new -fmodules -fmodules-cache-path=/Users/buildslave/jenkins/workspace/lldb-cmake/lldb-build/module.cache -fcxx-modules -Wall -Wextra -Wno-unused-parameter -Wwrite-strings -Wcast-qual -Wmissing-field-initializers -pedantic -Wno-long-long -Wimplicit-fallthrough -Wcovered-switch-default -Wno-noexcept-type -Wnon-virtual-dtor -Wdelete-non-virtual-dtor -Wstring-conversion -fdiagnostics-color -O3  -isysroot /Applications/Xcode.app/Contents/Developer/Platforms/MacOSX.platform/Developer/SDKs/MacOSX10.14.sdk -Wl,-search_paths_first -Wl,-headerpad_max_install_names -Wl,-dead_strip tools/lld/tools/lld/CMakeFiles/lld.dir/lld.cpp.o  -o bin/lld  -Wl,-rpath,@loader_path/../lib lib/libLLVMSupport.a lib/liblldCommon.a lib/liblldCOFF.a lib/liblldDriver.a lib/liblldELF.a lib/liblldMinGW.a lib/liblldWasm.a lib/liblldMachO.a lib/liblldReaderWriter.a lib/liblldYAML.a lib/liblldCore.a lib/liblldCOFF.a lib/libLLVMDebugInfoPDB.a lib/libLLVMLibDriver.a lib/libLLVMWindowsManifest.a -lxml2 lib/liblldCommon.a lib/libLLVMOption.a lib/libLLVMAArch64CodeGen.a lib/libLLVMAArch64AsmParser.a lib/libLLVMAArch64Disassembler.a lib/libLLVMAArch64Desc.a lib/libLLVMAArch64Info.a lib/libLLVMAArch64Utils.a lib/libLLVMAMDGPUCodeGen.a lib/libLLVMMIRParser.a lib/libLLVMAMDGPUAsmParser.a lib/libLLVMAMDGPUDisassembler.a lib/libLLVMAMDGPUDesc.a lib/libLLVMAMDGPUInfo.a lib/libLLVMAMDGPUUtils.a lib/libLLVMARMCodeGen.a lib/libLLVMARMAsmParser.a lib/libLLVMARMDisassembler.a lib/libLLVMARMDesc.a lib/libLLVMARMInfo.a lib/libLLVMARMUtils.a lib/libLLVMBPFCodeGen.a lib/libLLVMBPFAsmParser.a lib/libLLVMBPFDesc.a lib/libLLVMBPFDisassembler.a lib/libLLVMBPFInfo.a lib/libLLVMHexagonCodeGen.a lib/libLLVMHexagonAsmParser.a lib/libLLVMHexagonDisassembler.a lib/libLLVMHexagonDesc.a lib/libLLVMHexagonInfo.a lib/libLLVMLanaiCodeGen.a lib/libLLVMLanaiAsmParser.a lib/libLLVMLanaiDisassembler.a lib/libLLVMLanaiDesc.a lib/libLLVMLanaiInfo.a lib/libLLVMMipsCodeGen.a lib/libLLVMMipsAsmParser.a lib/libLLVMMipsDesc.a lib/libLLVMMipsDisassembler.a lib/libLLVMMipsInfo.a lib/libLLVMMSP430CodeGen.a lib/libLLVMMSP430AsmParser.a lib/libLLVMMSP430Desc.a lib/libLLVMMSP430Disassembler.a lib/libLLVMMSP430Info.a lib/libLLVMNVPTXCodeGen.a lib/libLLVMNVPTXDesc.a lib/libLLVMNVPTXInfo.a lib/libLLVMPowerPCCodeGen.a lib/libLLVMPowerPCAsmParser.a lib/libLLVMPowerPCDesc.a lib/libLLVMPowerPCDisassembler.a lib/libLLVMPowerPCInfo.a lib/libLLVMRISCVCodeGen.a lib/libLLVMRISCVAsmParser.a lib/libLLVMRISCVDesc.a lib/libLLVMRISCVDisassembler.a lib/libLLVMRISCVInfo.a lib/libLLVMRISCVUtils.a lib/libLLVMSparcCodeGen.a lib/libLLVMSparcAsmParser.a lib/libLLVMSparcDesc.a lib/libLLVMSparcDisassembler.a lib/libLLVMSparcInfo.a lib/libLLVMSystemZCodeGen.a lib/libLLVMSystemZAsmParser.a lib/libLLVMSystemZDisassembler.a lib/libLLVMSystemZDesc.a lib/libLLVMSystemZInfo.a lib/libLLVMWebAssemblyCodeGen.a lib/libLLVMWebAssemblyAsmParser.a lib/libLLVMWebAssemblyDisassembler.a lib/libLLVMWebAssemblyDesc.a lib/libLLVMWebAssemblyInfo.a lib/libLLVMX86CodeGen.a lib/libLLVMCFGuard.a lib/libLLVMGlobalISel.a lib/libLLVMX86AsmParser.a lib/libLLVMX86Desc.a lib/libLLVMX86Disassembler.a lib/libLLVMX86Info.a lib/libLLVMX86Utils.a lib/libLLVMXCoreCodeGen.a lib/libLLVMAsmPrinter.a lib/libLLVMDebugInfoDWARF.a lib/libLLVMSelectionDAG.a lib/libLLVMXCoreDesc.a lib/libLLVMXCoreDisassembler.a lib/libLLVMMCDisassembler.a lib/libLLVMXCoreInfo.a lib/libLLVMLTO.a lib/libLLVMObjCARCOpts.a lib/libLLVMPasses.a lib/libLLVMCodeGen.a lib/libLLVMTarget.a lib/libLLVMipo.a lib/libLLVMBitWriter.a lib/libLLVMScalarOpts.a lib/libLLVMVectorize.a lib/libLLVMLinker.a lib/libLLVMIRReader.a lib/libLLVMAsmParser.a lib/libLLVMAggressiveInstCombine.a lib/libLLVMInstCombine.a lib/libLLVMInstrumentation.a lib/libLLVMTransformUtils.a lib/libLLVMAnalysis.a lib/libLLVMProfileData.a lib/libLLVMObject.a lib/libLLVMBitReader.a lib/libLLVMCore.a lib/libLLVMRemarks.a lib/libLLVMBitstreamReader.a lib/libLLVMMCParser.a lib/libLLVMMC.a lib/libLLVMDebugInfoCodeView.a lib/libLLVMDebugInfoMSF.a lib/libLLVMTextAPI.a lib/libLLVMBinaryFormat.a lib/libLLVMSupport.a -lz -lcurses -lm lib/libLLVMDemangle.a && cd /Users/buildslave/jenkins/workspace/lldb-cmake/lldb-build/tools/lld/tools/lld && /usr/local/Cellar/cmake/3.12.3/bin/cmake -E create_symlink lld /Users/buildslave/jenkins/workspace/lldb-cmake/lldb-build/./bin/lld-link && cd /Users/buildslave/jenkins/workspace/lldb-cmake/lldb-build/tools/lld/tools/lld && /usr/local/Cellar/cmake/3.12.3/bin/cmake -E create_symlink lld /Users/buildslave/jenkins/workspace/lldb-cmake/lldb-build/./bin/ld.lld && cd /Users/buildslave/jenkins/workspace/lldb-cmake/lldb-build/tools/lld/tools/lld && /usr/local/Cellar/cmake/3.12.3/bin/cmake -E create_symlink lld /Users/buildslave/jenkins/workspace/lldb-cmake/lldb-build/./bin/ld64.lld && cd /Users/buildslave/jenkins/workspace/lldb-cmake/lldb-build/tools/lld/tools/lld && /usr/local/Cellar/cmake/3.12.3/bin/cmake -E create_symlink lld /Users/buildslave/jenkins/workspace/lldb-cmake/lldb-build/./bin/wasm-ld
[95/101] : && /Users/buildslave/jenkins/workspace/lldb-cmake/host-compiler/bin/clang++  -Wdocumentation -fPIC -fvisibility-inlines-hidden -Werror=date-time -Werror=unguarded-availability-new -fmodules -fmodules-cache-path=/Users/buildslave/jenkins/workspace/lldb-cmake/lldb-build/module.cache -fcxx-modules -Wall -Wextra -Wno-unused-parameter -Wwrite-strings -Wcast-qual -Wmissing-field-initializers -pedantic -Wno-long-long -Wimplicit-fallthrough -Wcovered-switch-default -Wno-noexcept-type -Wnon-virtual-dtor -Wdelete-non-virtual-dtor -Wstring-conversion -fdiagnostics-color -fno-common -Woverloaded-virtual -Wno-nested-anon-types -O3  -isysroot /Applications/Xcode.app/Contents/Developer/Platforms/MacOSX.platform/Developer/SDKs/MacOSX10.14.sdk -Wl,-search_paths_first -Wl,-headerpad_max_install_names -rdynamic tools/clang/tools/driver/CMakeFiles/clang.dir/driver.cpp.o tools/clang/tools/driver/CMakeFiles/clang.dir/cc1_main.cpp.o tools/clang/tools/driver/CMakeFiles/clang.dir/cc1as_main.cpp.o tools/clang/tools/driver/CMakeFiles/clang.dir/cc1gen_reproducer_main.cpp.o  -o bin/clang-10  -Wl,-rpath,@loader_path/../lib lib/libLLVMAArch64CodeGen.a lib/libLLVMAArch64AsmParser.a lib/libLLVMAArch64Desc.a lib/libLLVMAArch64Disassembler.a lib/libLLVMAArch64Info.a lib/libLLVMAArch64Utils.a lib/libLLVMAMDGPUCodeGen.a lib/libLLVMAMDGPUAsmParser.a lib/libLLVMAMDGPUDesc.a lib/libLLVMAMDGPUDisassembler.a lib/libLLVMAMDGPUInfo.a lib/libLLVMAMDGPUUtils.a lib/libLLVMARMCodeGen.a lib/libLLVMARMAsmParser.a lib/libLLVMARMDesc.a lib/libLLVMARMDisassembler.a lib/libLLVMARMInfo.a lib/libLLVMARMUtils.a lib/libLLVMBPFCodeGen.a lib/libLLVMBPFAsmParser.a lib/libLLVMBPFDesc.a lib/libLLVMBPFDisassembler.a lib/libLLVMBPFInfo.a lib/libLLVMHexagonCodeGen.a lib/libLLVMHexagonAsmParser.a lib/libLLVMHexagonDesc.a lib/libLLVMHexagonDisassembler.a lib/libLLVMHexagonInfo.a lib/libLLVMLanaiCodeGen.a lib/libLLVMLanaiAsmParser.a lib/libLLVMLanaiDesc.a lib/libLLVMLanaiDisassembler.a lib/libLLVMLanaiInfo.a lib/libLLVMMipsCodeGen.a lib/libLLVMMipsAsmParser.a lib/libLLVMMipsDesc.a lib/libLLVMMipsDisassembler.a lib/libLLVMMipsInfo.a lib/libLLVMMSP430CodeGen.a lib/libLLVMMSP430AsmParser.a lib/libLLVMMSP430Desc.a lib/libLLVMMSP430Disassembler.a lib/libLLVMMSP430Info.a lib/libLLVMNVPTXCodeGen.a lib/libLLVMNVPTXDesc.a lib/libLLVMNVPTXInfo.a lib/libLLVMPowerPCCodeGen.a lib/libLLVMPowerPCAsmParser.a lib/libLLVMPowerPCDesc.a lib/libLLVMPowerPCDisassembler.a lib/libLLVMPowerPCInfo.a lib/libLLVMRISCVCodeGen.a lib/libLLVMRISCVAsmParser.a lib/libLLVMRISCVDesc.a lib/libLLVMRISCVDisassembler.a lib/libLLVMRISCVInfo.a lib/libLLVMRISCVUtils.a lib/libLLVMSparcCodeGen.a lib/libLLVMSparcAsmParser.a lib/libLLVMSparcDesc.a lib/libLLVMSparcDisassembler.a lib/libLLVMSparcInfo.a lib/libLLVMSystemZCodeGen.a lib/libLLVMSystemZAsmParser.a lib/libLLVMSystemZDesc.a lib/libLLVMSystemZDisassembler.a lib/libLLVMSystemZInfo.a lib/libLLVMWebAssemblyCodeGen.a lib/libLLVMWebAssemblyAsmParser.a lib/libLLVMWebAssemblyDesc.a lib/libLLVMWebAssemblyDisassembler.a lib/libLLVMWebAssemblyInfo.a lib/libLLVMX86CodeGen.a lib/libLLVMX86AsmParser.a lib/libLLVMX86Desc.a lib/libLLVMX86Disassembler.a lib/libLLVMX86Info.a lib/libLLVMX86Utils.a lib/libLLVMXCoreCodeGen.a lib/libLLVMXCoreDesc.a lib/libLLVMXCoreDisassembler.a lib/libLLVMXCoreInfo.a lib/libLLVMAnalysis.a lib/libLLVMCodeGen.a lib/libLLVMCore.a lib/libLLVMipo.a lib/libLLVMAggressiveInstCombine.a lib/libLLVMInstCombine.a lib/libLLVMInstrumentation.a lib/libLLVMMC.a lib/libLLVMMCParser.a lib/libLLVMObjCARCOpts.a lib/libLLVMOption.a lib/libLLVMScalarOpts.a lib/libLLVMSupport.a lib/libLLVMTransformUtils.a lib/libLLVMVectorize.a lib/libclangBasic.a lib/libclangCodeGen.a lib/libclangDriver.a lib/libclangFrontend.a lib/libclangFrontendTool.a lib/libclangSerialization.a -Wl,-sectcreate,__TEXT,__info_plist,/Users/buildslave/jenkins/workspace/lldb-cmake/lldb-build/tools/clang/tools/driver/Info.plist lib/libLLVMAArch64Desc.a lib/libLLVMAArch64Info.a lib/libLLVMAArch64Utils.a lib/libLLVMMIRParser.a lib/libLLVMAMDGPUDesc.a lib/libLLVMAMDGPUInfo.a lib/libLLVMAMDGPUUtils.a lib/libLLVMARMDesc.a lib/libLLVMARMInfo.a lib/libLLVMARMUtils.a lib/libLLVMHexagonDesc.a lib/libLLVMHexagonInfo.a lib/libLLVMLanaiDesc.a lib/libLLVMLanaiInfo.a lib/libLLVMSystemZDesc.a lib/libLLVMSystemZInfo.a lib/libLLVMWebAssemblyDesc.a lib/libLLVMWebAssemblyInfo.a lib/libLLVMCFGuard.a lib/libLLVMGlobalISel.a lib/libLLVMAsmPrinter.a lib/libLLVMDebugInfoDWARF.a lib/libLLVMSelectionDAG.a lib/libLLVMMCDisassembler.a lib/libclangCodeGen.a lib/libLLVMCoroutines.a lib/libLLVMCoverage.a lib/libLLVMLTO.a lib/libLLVMObjCARCOpts.a lib/libLLVMPasses.a lib/libLLVMCodeGen.a lib/libLLVMipo.a lib/libLLVMBitWriter.a lib/libLLVMIRReader.a lib/libLLVMAsmParser.a lib/libLLVMLinker.a lib/libLLVMInstrumentation.a lib/libLLVMScalarOpts.a lib/libLLVMAggressiveInstCombine.a lib/libLLVMInstCombine.a lib/libLLVMVectorize.a lib/libLLVMTransformUtils.a lib/libLLVMTarget.a lib/libLLVMAnalysis.a lib/libLLVMObject.a lib/libLLVMTextAPI.a lib/libclangRewriteFrontend.a lib/libclangARCMigrate.a lib/libclangStaticAnalyzerFrontend.a lib/libclangStaticAnalyzerCheckers.a lib/libclangStaticAnalyzerCore.a lib/libclangCrossTU.a lib/libclangIndex.a lib/libclangFrontend.a lib/libclangDriver.a lib/libLLVMOption.a lib/libLLVMProfileData.a lib/libclangParse.a lib/libLLVMMCParser.a lib/libclangSerialization.a lib/libLLVMBitReader.a lib/libclangSema.a lib/libclangAnalysis.a lib/libclangASTMatchers.a lib/libclangEdit.a lib/libclangFormat.a lib/libclangToolingInclusions.a lib/libclangToolingCore.a lib/libclangAST.a lib/libclangRewrite.a lib/libclangLex.a lib/libclangBasic.a lib/libLLVMCore.a lib/libLLVMRemarks.a lib/libLLVMBitstreamReader.a lib/libLLVMMC.a lib/libLLVMBinaryFormat.a lib/libLLVMDebugInfoCodeView.a lib/libLLVMDebugInfoMSF.a lib/libLLVMSupport.a -lz -lcurses -lm lib/libLLVMDemangle.a && :
[96/101] /usr/local/Cellar/cmake/3.12.3/bin/cmake -E cmake_symlink_executable bin/clang-10 bin/clang && cd /Users/buildslave/jenkins/workspace/lldb-cmake/lldb-build/tools/clang/tools/driver && /usr/local/Cellar/cmake/3.12.3/bin/cmake -E create_symlink clang-10 /Users/buildslave/jenkins/workspace/lldb-cmake/lldb-build/./bin/clang++ && cd /Users/buildslave/jenkins/workspace/lldb-cmake/lldb-build/tools/clang/tools/driver && /usr/local/Cellar/cmake/3.12.3/bin/cmake -E create_symlink clang-10 /Users/buildslave/jenkins/workspace/lldb-cmake/lldb-build/./bin/clang-cl && cd /Users/buildslave/jenkins/workspace/lldb-cmake/lldb-build/tools/clang/tools/driver && /usr/local/Cellar/cmake/3.12.3/bin/cmake -E create_symlink clang-10 /Users/buildslave/jenkins/workspace/lldb-cmake/lldb-build/./bin/clang-cpp
[97/101] : && /Users/buildslave/jenkins/workspace/lldb-cmake/host-compiler/bin/clang++ -Wdocumentation -fPIC -fvisibility-inlines-hidden -Werror=date-time -Werror=unguarded-availability-new -fmodules -fmodules-cache-path=/Users/buildslave/jenkins/workspace/lldb-cmake/lldb-build/module.cache -fcxx-modules -Wall -Wextra -Wno-unused-parameter -Wwrite-strings -Wcast-qual -Wmissing-field-initializers -pedantic -Wno-long-long -Wimplicit-fallthrough -Wcovered-switch-default -Wno-noexcept-type -Wnon-virtual-dtor -Wdelete-non-virtual-dtor -Wstring-conversion -fdiagnostics-color -Wno-deprecated-declarations -Wno-unknown-pragmas -Wno-strict-aliasing -Wno-deprecated-register -Wno-vla-extension -O3 -isysroot /Applications/Xcode.app/Contents/Developer/Platforms/MacOSX.platform/Developer/SDKs/MacOSX10.14.sdk -dynamiclib -Wl,-headerpad_max_install_names -Wl,-dead_strip -Wl,-exported_symbols_list,"/Users/buildslave/jenkins/workspace/lldb-cmake/lldb-build/tools/lldb/source/API/liblldb.exports"  -current_version 10.0.99 -o lib/lldb.framework/Versions/10.0.99git/lldb -install_name @rpath/lldb.framework/Versions/10.0.99git/lldb tools/lldb/source/API/CMakeFiles/liblldb.dir/SBAddress.cpp.o tools/lldb/source/API/CMakeFiles/liblldb.dir/SBAttachInfo.cpp.o tools/lldb/source/API/CMakeFiles/liblldb.dir/SBBlock.cpp.o tools/lldb/source/API/CMakeFiles/liblldb.dir/SBBreakpoint.cpp.o tools/lldb/source/API/CMakeFiles/liblldb.dir/SBBreakpointLocation.cpp.o tools/lldb/source/API/CMakeFiles/liblldb.dir/SBBreakpointName.cpp.o tools/lldb/source/API/CMakeFiles/liblldb.dir/SBBreakpointOptionCommon.cpp.o tools/lldb/source/API/CMakeFiles/liblldb.dir/SBBroadcaster.cpp.o tools/lldb/source/API/CMakeFiles/liblldb.dir/SBCommandInterpreter.cpp.o tools/lldb/source/API/CMakeFiles/liblldb.dir/SBCommandReturnObject.cpp.o tools/lldb/source/API/CMakeFiles/liblldb.dir/SBCommunication.cpp.o tools/lldb/source/API/CMakeFiles/liblldb.dir/SBCompileUnit.cpp.o tools/lldb/source/API/CMakeFiles/liblldb.dir/SBData.cpp.o tools/lldb/source/API/CMakeFiles/liblldb.dir/SBDebugger.cpp.o tools/lldb/source/API/CMakeFiles/liblldb.dir/SBDeclaration.cpp.o tools/lldb/source/API/CMakeFiles/liblldb.dir/SBError.cpp.o tools/lldb/source/API/CMakeFiles/liblldb.dir/SBEvent.cpp.o tools/lldb/source/API/CMakeFiles/liblldb.dir/SBExecutionContext.cpp.o tools/lldb/source/API/CMakeFiles/liblldb.dir/SBExpressionOptions.cpp.o tools/lldb/source/API/CMakeFiles/liblldb.dir/SBFileSpec.cpp.o tools/lldb/source/API/CMakeFiles/liblldb.dir/SBFile.cpp.o tools/lldb/source/API/CMakeFiles/liblldb.dir/SBFileSpecList.cpp.o tools/lldb/source/API/CMakeFiles/liblldb.dir/SBFrame.cpp.o tools/lldb/source/API/CMakeFiles/liblldb.dir/SBFunction.cpp.o tools/lldb/source/API/CMakeFiles/liblldb.dir/SBHostOS.cpp.o tools/lldb/source/API/CMakeFiles/liblldb.dir/SBInstruction.cpp.o tools/lldb/source/API/CMakeFiles/liblldb.dir/SBInstructionList.cpp.o tools/lldb/source/API/CMakeFiles/liblldb.dir/SBLanguageRuntime.cpp.o tools/lldb/source/API/CMakeFiles/liblldb.dir/SBLaunchInfo.cpp.o tools/lldb/source/API/CMakeFiles/liblldb.dir/SBLineEntry.cpp.o tools/lldb/source/API/CMakeFiles/liblldb.dir/SBListener.cpp.o tools/lldb/source/API/CMakeFiles/liblldb.dir/SBMemoryRegionInfo.cpp.o tools/lldb/source/API/CMakeFiles/liblldb.dir/SBMemoryRegionInfoList.cpp.o tools/lldb/source/API/CMakeFiles/liblldb.dir/SBModule.cpp.o tools/lldb/source/API/CMakeFiles/liblldb.dir/SBModuleSpec.cpp.o tools/lldb/source/API/CMakeFiles/liblldb.dir/SBPlatform.cpp.o tools/lldb/source/API/CMakeFiles/liblldb.dir/SBProcess.cpp.o tools/lldb/source/API/CMakeFiles/liblldb.dir/SBProcessInfo.cpp.o tools/lldb/source/API/CMakeFiles/liblldb.dir/SBQueue.cpp.o tools/lldb/source/API/CMakeFiles/liblldb.dir/SBQueueItem.cpp.o tools/lldb/source/API/CMakeFiles/liblldb.dir/SBReproducer.cpp.o tools/lldb/source/API/CMakeFiles/liblldb.dir/SBSection.cpp.o tools/lldb/source/API/CMakeFiles/liblldb.dir/SBSourceManager.cpp.o tools/lldb/source/API/CMakeFiles/liblldb.dir/SBStream.cpp.o tools/lldb/source/API/CMakeFiles/liblldb.dir/SBStringList.cpp.o tools/lldb/source/API/CMakeFiles/liblldb.dir/SBStructuredData.cpp.o tools/lldb/source/API/CMakeFiles/liblldb.dir/SBSymbol.cpp.o tools/lldb/source/API/CMakeFiles/liblldb.dir/SBSymbolContext.cpp.o tools/lldb/source/API/CMakeFiles/liblldb.dir/SBSymbolContextList.cpp.o tools/lldb/source/API/CMakeFiles/liblldb.dir/SBTarget.cpp.o tools/lldb/source/API/CMakeFiles/liblldb.dir/SBThread.cpp.o tools/lldb/source/API/CMakeFiles/liblldb.dir/SBThreadCollection.cpp.o tools/lldb/source/API/CMakeFiles/liblldb.dir/SBThreadPlan.cpp.o tools/lldb/source/API/CMakeFiles/liblldb.dir/SBTrace.cpp.o tools/lldb/source/API/CMakeFiles/liblldb.dir/SBTraceOptions.cpp.o tools/lldb/source/API/CMakeFiles/liblldb.dir/SBType.cpp.o tools/lldb/source/API/CMakeFiles/liblldb.dir/SBTypeCategory.cpp.o tools/lldb/source/API/CMakeFiles/liblldb.dir/SBTypeEnumMember.cpp.o tools/lldb/source/API/CMakeFiles/liblldb.dir/SBTypeFilter.cpp.o tools/lldb/source/API/CMakeFiles/liblldb.dir/SBTypeFormat.cpp.o tools/lldb/source/API/CMakeFiles/liblldb.dir/SBTypeNameSpecifier.cpp.o tools/lldb/source/API/CMakeFiles/liblldb.dir/SBTypeSummary.cpp.o tools/lldb/source/API/CMakeFiles/liblldb.dir/SBTypeSynthetic.cpp.o tools/lldb/source/API/CMakeFiles/liblldb.dir/SBValue.cpp.o tools/lldb/source/API/CMakeFiles/liblldb.dir/SBValueList.cpp.o tools/lldb/source/API/CMakeFiles/liblldb.dir/SBVariablesOptions.cpp.o tools/lldb/source/API/CMakeFiles/liblldb.dir/SBWatchpoint.cpp.o tools/lldb/source/API/CMakeFiles/liblldb.dir/SBUnixSignals.cpp.o tools/lldb/source/API/CMakeFiles/liblldb.dir/SystemInitializerFull.cpp.o tools/lldb/source/API/CMakeFiles/liblldb.dir/__/__/scripts/LLDBWrapPython.cpp.o  -Wl,-rpath,@loader_path/../lib lib/liblldbBase.a lib/liblldbBreakpoint.a lib/liblldbCore.a lib/liblldbDataFormatters.a lib/liblldbExpression.a lib/liblldbHost.a lib/liblldbInitialization.a lib/liblldbInterpreter.a lib/liblldbSymbol.a lib/liblldbTarget.a lib/liblldbUtility.a lib/liblldbPluginABIMacOSX_arm64.a lib/liblldbPluginABISysV_arm64.a lib/liblldbPluginABIMacOSX_arm.a lib/liblldbPluginABISysV_arm.a lib/liblldbPluginABISysV_hexagon.a lib/liblldbPluginABISysV_mips.a lib/liblldbPluginABISysV_mips64.a lib/liblldbPluginABISysV_ppc.a lib/liblldbPluginABISysV_ppc64.a lib/liblldbPluginABISysV_s390x.a lib/liblldbPluginABISysV_i386.a lib/liblldbPluginABISysV_x86_64.a lib/liblldbPluginABIMacOSX_i386.a lib/liblldbPluginABIWindows_x86_64.a lib/liblldbPluginArchitectureArm.a lib/liblldbPluginArchitectureMips.a lib/liblldbPluginArchitecturePPC64.a lib/liblldbPluginDisassemblerLLVM.a lib/liblldbPluginDynamicLoaderDarwinKernel.a lib/liblldbPluginDynamicLoaderMacOSXDYLD.a lib/liblldbPluginDynamicLoaderPosixDYLD.a lib/liblldbPluginDynamicLoaderStatic.a lib/liblldbPluginDynamicLoaderHexagonDYLD.a lib/liblldbPluginDynamicLoaderWindowsDYLD.a lib/liblldbPluginExpressionParserClang.a lib/liblldbPluginInstructionARM.a lib/liblldbPluginInstructionARM64.a lib/liblldbPluginInstructionMIPS.a lib/liblldbPluginInstructionMIPS64.a lib/liblldbPluginInstructionPPC64.a lib/liblldbPluginInstrumentationRuntimeASan.a lib/liblldbPluginInstrumentationRuntimeMainThreadChecker.a lib/liblldbPluginInstrumentationRuntimeTSan.a lib/liblldbPluginInstrumentationRuntimeUBSan.a lib/liblldbPluginJITLoaderGDB.a lib/liblldbPluginClangCommon.a lib/liblldbPluginCPlusPlusLanguage.a lib/liblldbPluginObjCLanguage.a lib/liblldbPluginObjCPlusPlusLanguage.a lib/liblldbPluginCPPRuntime.a lib/liblldbPluginCXXItaniumABI.a lib/liblldbPluginObjCRuntime.a lib/liblldbPluginAppleObjCRuntime.a lib/liblldbPluginRenderScriptRuntime.a lib/liblldbPluginMemoryHistoryASan.a lib/liblldbPluginObjectContainerBSDArchive.a lib/liblldbPluginObjectContainerMachOArchive.a lib/liblldbPluginObjectFileBreakpad.a lib/liblldbPluginObjectFileELF.a lib/liblldbPluginObjectFileMachO.a lib/liblldbPluginObjectFilePECOFF.a lib/liblldbPluginObjectFileJIT.a lib/liblldbPluginOSPython.a lib/liblldbPluginPlatformLinux.a lib/liblldbPluginPlatformFreeBSD.a lib/liblldbPluginPlatformNetBSD.a lib/liblldbPluginPlatformOpenBSD.a lib/liblldbPluginPlatformMacOSX.a lib/liblldbPluginPlatformWindows.a lib/liblldbPluginPlatformPOSIX.a lib/liblldbPluginPlatformGDB.a lib/liblldbPluginPlatformAndroid.a lib/liblldbPluginProcessMacOSXKernel.a lib/liblldbPluginProcessGDBRemote.a lib/liblldbPluginProcessUtility.a lib/liblldbPluginProcessElfCore.a lib/liblldbPluginProcessMachCore.a lib/liblldbPluginProcessMinidump.a lib/liblldbPluginScriptInterpreterNone.a lib/liblldbPluginScriptInterpreterPython.a lib/liblldbPluginStructuredDataDarwinLog.a lib/liblldbPluginSymbolFileBreakpad.a lib/liblldbPluginSymbolFileDWARF.a lib/liblldbPluginSymbolFileSymtab.a lib/liblldbPluginSymbolFileNativePDB.a lib/liblldbPluginSymbolFilePDB.a lib/liblldbPluginSystemRuntimeMacOSX.a lib/liblldbPluginSymbolVendorMacOSX.a lib/liblldbPluginSymbolVendorELF.a lib/liblldbPluginUnwindAssemblyInstEmulation.a lib/liblldbPluginUnwindAssemblyX86.a lib/libLLVMSupport.a -lcompression lib/libLLVMAArch64CodeGen.a lib/libLLVMAArch64AsmParser.a lib/libLLVMAArch64Disassembler.a lib/libLLVMAArch64Desc.a lib/libLLVMAArch64Info.a lib/libLLVMAArch64Utils.a lib/libLLVMAMDGPUCodeGen.a lib/libLLVMMIRParser.a lib/libLLVMAMDGPUAsmParser.a lib/libLLVMAMDGPUDisassembler.a lib/libLLVMAMDGPUDesc.a lib/libLLVMAMDGPUInfo.a lib/libLLVMAMDGPUUtils.a lib/libLLVMARMCodeGen.a lib/libLLVMARMAsmParser.a lib/libLLVMARMDisassembler.a lib/libLLVMARMDesc.a lib/libLLVMARMInfo.a lib/libLLVMARMUtils.a lib/libLLVMBPFCodeGen.a lib/libLLVMBPFAsmParser.a lib/libLLVMBPFDesc.a lib/libLLVMBPFDisassembler.a lib/libLLVMBPFInfo.a lib/libLLVMHexagonCodeGen.a lib/libLLVMHexagonAsmParser.a lib/libLLVMHexagonDisassembler.a lib/libLLVMHexagonDesc.a lib/libLLVMHexagonInfo.a lib/libLLVMLanaiCodeGen.a lib/libLLVMLanaiAsmParser.a lib/libLLVMLanaiDisassembler.a lib/libLLVMLanaiDesc.a lib/libLLVMLanaiInfo.a lib/libLLVMMSP430CodeGen.a lib/libLLVMMSP430AsmParser.a lib/libLLVMMSP430Desc.a lib/libLLVMMSP430Disassembler.a lib/libLLVMMSP430Info.a lib/libLLVMNVPTXCodeGen.a lib/libLLVMNVPTXDesc.a lib/libLLVMNVPTXInfo.a lib/libLLVMPowerPCCodeGen.a lib/libLLVMPowerPCAsmParser.a lib/libLLVMPowerPCDesc.a lib/libLLVMPowerPCDisassembler.a lib/libLLVMPowerPCInfo.a lib/libLLVMRISCVCodeGen.a lib/libLLVMRISCVAsmParser.a lib/libLLVMRISCVDesc.a lib/libLLVMRISCVDisassembler.a lib/libLLVMRISCVInfo.a lib/libLLVMRISCVUtils.a lib/libLLVMSparcCodeGen.a lib/libLLVMSparcAsmParser.a lib/libLLVMSparcDesc.a lib/libLLVMSparcDisassembler.a lib/libLLVMSparcInfo.a lib/libLLVMSystemZCodeGen.a lib/libLLVMSystemZAsmParser.a lib/libLLVMSystemZDisassembler.a lib/libLLVMSystemZDesc.a lib/libLLVMSystemZInfo.a lib/libLLVMWebAssemblyCodeGen.a lib/libLLVMWebAssemblyAsmParser.a lib/libLLVMWebAssemblyDisassembler.a lib/libLLVMWebAssemblyDesc.a lib/libLLVMWebAssemblyInfo.a lib/libLLVMX86CodeGen.a lib/libLLVMCFGuard.a lib/libLLVMX86AsmParser.a lib/libLLVMX86Desc.a lib/libLLVMX86Disassembler.a lib/libLLVMX86Info.a lib/libLLVMX86Utils.a lib/libLLVMXCoreCodeGen.a lib/libLLVMXCoreDesc.a lib/libLLVMXCoreDisassembler.a lib/libLLVMXCoreInfo.a lib/libLLVMMipsCodeGen.a lib/libLLVMAsmPrinter.a lib/libLLVMGlobalISel.a lib/libLLVMSelectionDAG.a lib/libLLVMMipsAsmParser.a lib/libLLVMMipsDesc.a lib/libLLVMMipsDisassembler.a lib/libLLVMMipsInfo.a lib/liblldbPluginPlatformLinux.a lib/liblldbPluginPlatformGDB.a lib/liblldbPluginDynamicLoaderStatic.a lib/liblldbPluginDynamicLoaderDarwinKernel.a lib/liblldbPluginPlatformMacOSX.a lib/liblldbPluginPlatformPOSIX.a lib/liblldbPluginPlatformMacOSXObjCXX.a lib/liblldbPluginDynamicLoaderMacOSXDYLD.a lib/liblldbPluginDynamicLoaderPosixDYLD.a lib/liblldbPluginProcessElfCore.a lib/liblldbPluginDynamicLoaderPosixDYLD.a lib/liblldbPluginProcessElfCore.a /usr/local/Frameworks/Python.framework/Versions/3.7/lib/libpython3.7m.dylib lib/liblldbPluginObjectFileBreakpad.a lib/liblldbPluginObjectFileMachO.a lib/liblldbPluginObjectFileELF.a lib/liblldbBreakpoint.a lib/liblldbCore.a lib/liblldbDataFormatters.a lib/liblldbExpression.a lib/liblldbInterpreter.a lib/liblldbSymbol.a lib/liblldbTarget.a lib/liblldbPluginExpressionParserClang.a lib/liblldbPluginClangCommon.a lib/liblldbPluginCPlusPlusLanguage.a lib/liblldbPluginObjCLanguage.a lib/liblldbPluginCPPRuntime.a lib/liblldbPluginObjCRuntime.a lib/liblldbPluginAppleObjCRuntime.a lib/liblldbPluginObjectFileJIT.a lib/liblldbPluginProcessUtility.a lib/liblldbPluginSymbolFileDWARF.a lib/liblldbPluginSymbolFileNativePDB.a lib/liblldbPluginSymbolFilePDB.a lib/liblldbCommands.a lib/liblldbBreakpoint.a lib/liblldbCore.a lib/liblldbDataFormatters.a lib/liblldbExpression.a lib/liblldbInterpreter.a lib/liblldbSymbol.a lib/liblldbTarget.a lib/liblldbPluginExpressionParserClang.a lib/liblldbPluginClangCommon.a lib/liblldbPluginCPlusPlusLanguage.a lib/liblldbPluginObjCLanguage.a lib/liblldbPluginCPPRuntime.a lib/liblldbPluginObjCRuntime.a lib/liblldbPluginAppleObjCRuntime.a lib/liblldbPluginObjectFileJIT.a lib/liblldbPluginProcessUtility.a lib/liblldbPluginSymbolFileDWARF.a lib/liblldbPluginSymbolFileNativePDB.a lib/liblldbPluginSymbolFilePDB.a lib/liblldbCommands.a lib/liblldbBreakpoint.a lib/liblldbCore.a lib/liblldbDataFormatters.a lib/liblldbExpression.a lib/liblldbInterpreter.a lib/liblldbSymbol.a lib/liblldbTarget.a lib/liblldbPluginExpressionParserClang.a lib/liblldbPluginClangCommon.a lib/liblldbPluginCPlusPlusLanguage.a lib/liblldbPluginObjCLanguage.a lib/liblldbPluginCPPRuntime.a lib/liblldbPluginObjCRuntime.a lib/liblldbPluginAppleObjCRuntime.a lib/liblldbPluginObjectFileJIT.a lib/liblldbPluginProcessUtility.a lib/liblldbPluginSymbolFileDWARF.a lib/liblldbPluginSymbolFileNativePDB.a lib/liblldbPluginSymbolFilePDB.a lib/liblldbCommands.a lib/liblldbBreakpoint.a lib/liblldbCore.a lib/liblldbDataFormatters.a lib/liblldbExpression.a lib/liblldbInterpreter.a lib/liblldbSymbol.a lib/liblldbTarget.a lib/liblldbPluginExpressionParserClang.a lib/liblldbPluginClangCommon.a lib/liblldbPluginCPlusPlusLanguage.a lib/liblldbPluginObjCLanguage.a lib/liblldbPluginCPPRuntime.a lib/liblldbPluginObjCRuntime.a lib/liblldbPluginAppleObjCRuntime.a lib/liblldbPluginObjectFileJIT.a lib/liblldbPluginProcessUtility.a lib/liblldbPluginSymbolFileDWARF.a lib/liblldbPluginSymbolFileNativePDB.a lib/liblldbPluginSymbolFilePDB.a lib/liblldbCommands.a lib/libLLVMMCJIT.a lib/libLLVMExecutionEngine.a lib/libLLVMRuntimeDyld.a lib/libclangCodeGen.a lib/libLLVMCoroutines.a lib/libLLVMCoverage.a lib/libLLVMLTO.a lib/libLLVMObjCARCOpts.a lib/libLLVMPasses.a lib/libLLVMipo.a lib/libLLVMIRReader.a lib/libLLVMAsmParser.a lib/libLLVMLinker.a lib/libLLVMCodeGen.a lib/libLLVMTarget.a lib/libLLVMBitWriter.a lib/libLLVMScalarOpts.a lib/libLLVMVectorize.a lib/libLLVMAggressiveInstCombine.a lib/libLLVMInstCombine.a lib/libLLVMInstrumentation.a lib/libLLVMTransformUtils.a lib/libLLVMAnalysis.a lib/libclangRewriteFrontend.a lib/libclangFrontend.a lib/libclangDriver.a lib/libclangParse.a lib/libLLVMOption.a lib/libLLVMProfileData.a lib/libclangRewrite.a lib/libclangSerialization.a lib/libclangSema.a lib/libclangEdit.a lib/libclangAnalysis.a lib/libclangASTMatchers.a lib/libLLVMDebugInfoDWARF.a lib/libclangAST.a lib/libclangLex.a lib/libclangBasic.a lib/libLLVMDebugInfoPDB.a lib/liblldbBase.a lib/liblldbHost.a /usr/lib/libedit.dylib /usr/local/lib/liblzma.dylib /usr/lib/libedit.dylib /usr/local/lib/liblzma.dylib lib/liblldbHostMacOSXObjCXX.a lib/libLLVMObject.a lib/libLLVMBitReader.a lib/libLLVMCore.a lib/libLLVMRemarks.a lib/libLLVMBitstreamReader.a lib/libLLVMMCParser.a lib/libLLVMTextAPI.a lib/liblldbUtility.a -lxml2 -framework Foundation -framework CoreFoundation -framework CoreServices -framework Security /usr/lib/libcurses.dylib /usr/lib/libform.dylib /usr/lib/libpanel.dylib lib/libLLVMMCDisassembler.a lib/libLLVMMC.a lib/libLLVMBinaryFormat.a lib/libLLVMDebugInfoCodeView.a lib/libLLVMDebugInfoMSF.a lib/libLLVMSupport.a lib/libLLVMDemangle.a -lz -lcurses -lm && :
[98/101] cd /Users/buildslave/jenkins/workspace/lldb-cmake/lldb-build/tools/lldb && /usr/local/Cellar/cmake/3.12.3/bin/cmake -E make_directory /Users/buildslave/jenkins/workspace/lldb-cmake/lldb-build/./lib/python3.7/site-packages/lldb
[99/101] : && /Users/buildslave/jenkins/workspace/lldb-cmake/host-compiler/bin/clang++  -Wdocumentation -fPIC -fvisibility-inlines-hidden -Werror=date-time -Werror=unguarded-availability-new -fmodules -fmodules-cache-path=/Users/buildslave/jenkins/workspace/lldb-cmake/lldb-build/module.cache -fcxx-modules -Wall -Wextra -Wno-unused-parameter -Wwrite-strings -Wcast-qual -Wmissing-field-initializers -pedantic -Wno-long-long -Wimplicit-fallthrough -Wcovered-switch-default -Wno-noexcept-type -Wnon-virtual-dtor -Wdelete-non-virtual-dtor -Wstring-conversion -fdiagnostics-color -Wno-deprecated-declarations -Wno-unknown-pragmas -Wno-strict-aliasing -Wno-deprecated-register -Wno-vla-extension -O3  -isysroot /Applications/Xcode.app/Contents/Developer/Platforms/MacOSX.platform/Developer/SDKs/MacOSX10.14.sdk -Wl,-search_paths_first -Wl,-headerpad_max_install_names -Wl,-dead_strip tools/lldb/tools/lldb-vscode/CMakeFiles/lldb-vscode.dir/lldb-vscode.cpp.o tools/lldb/tools/lldb-vscode/CMakeFiles/lldb-vscode.dir/BreakpointBase.cpp.o tools/lldb/tools/lldb-vscode/CMakeFiles/lldb-vscode.dir/ExceptionBreakpoint.cpp.o tools/lldb/tools/lldb-vscode/CMakeFiles/lldb-vscode.dir/FunctionBreakpoint.cpp.o tools/lldb/tools/lldb-vscode/CMakeFiles/lldb-vscode.dir/IOStream.cpp.o tools/lldb/tools/lldb-vscode/CMakeFiles/lldb-vscode.dir/JSONUtils.cpp.o tools/lldb/tools/lldb-vscode/CMakeFiles/lldb-vscode.dir/LLDBUtils.cpp.o tools/lldb/tools/lldb-vscode/CMakeFiles/lldb-vscode.dir/SourceBreakpoint.cpp.o tools/lldb/tools/lldb-vscode/CMakeFiles/lldb-vscode.dir/VSCode.cpp.o  -o bin/lldb-vscode  -Wl,-rpath,@loader_path/../lib lib/libLLVMSupport.a lib/libLLVMSupport.a lib/lldb.framework/Versions/10.0.99git/lldb -lpthread -lz -lcurses -lm lib/libLLVMDemangle.a && :
[100/101] cd /Users/buildslave/jenkins/workspace/lldb-cmake/lldb-build/tools/lldb && /usr/local/Cellar/cmake/3.12.3/bin/cmake -E copy /Users/buildslave/jenkins/workspace/lldb-cmake/llvm-project/lldb/third_party/Python/module/six/six.py /Users/buildslave/jenkins/workspace/lldb-cmake/lldb-build/./lib/python3.7/site-packages/lldb/../six.py && cd /Users/buildslave/jenkins/workspace/lldb-cmake/lldb-build/tools/lldb && /usr/local/Cellar/cmake/3.12.3/bin/cmake -E copy /Users/buildslave/jenkins/workspace/lldb-cmake/lldb-build/tools/lldb/scripts/lldb.py /Users/buildslave/jenkins/workspace/lldb-cmake/lldb-build/./lib/python3.7/site-packages/lldb/__init__.py && cd /Users/buildslave/jenkins/workspace/lldb-cmake/lldb-build/tools/lldb && /usr/local/Cellar/cmake/3.12.3/bin/cmake -E make_directory /Users/buildslave/jenkins/workspace/lldb-cmake/lldb-build/./lib/python3.7/site-packages/lldb/macosx/heap && /usr/local/Cellar/cmake/3.12.3/bin/cmake -E copy /Users/buildslave/jenkins/workspace/lldb-cmake/llvm-project/lldb/examples/darwin/heap_find/heap/heap_find.cpp /Users/buildslave/jenkins/workspace/lldb-cmake/llvm-project/lldb/examples/darwin/heap_find/heap/Makefile /Users/buildslave/jenkins/workspace/lldb-cmake/lldb-build/./lib/python3.7/site-packages/lldb/macosx/heap && cd /Users/buildslave/jenkins/workspace/lldb-cmake/lldb-build/tools/lldb && /usr/local/Cellar/cmake/3.12.3/bin/cmake -E copy /Users/buildslave/jenkins/workspace/lldb-cmake/llvm-project/lldb/source/Interpreter/embedded_interpreter.py /Users/buildslave/jenkins/workspace/lldb-cmake/lldb-build/./lib/python3.7/site-packages/lldb && cd /Users/buildslave/jenkins/workspace/lldb-cmake/lldb-build/lib/python3.7/site-packages/lldb && /usr/local/Cellar/cmake/3.12.3/bin/cmake -E make_directory formatters/cpp && /usr/local/Cellar/cmake/3.12.3/bin/cmake -E copy /Users/buildslave/jenkins/workspace/lldb-cmake/llvm-project/lldb/examples/synthetic/gnu_libstdcpp.py /Users/buildslave/jenkins/workspace/lldb-cmake/llvm-project/lldb/examples/synthetic/libcxx.py formatters/cpp && /usr/local/bin/python /Users/buildslave/jenkins/workspace/lldb-cmake/llvm-project/lldb/scripts/Python/createPythonInit.py formatters/cpp /Users/buildslave/jenkins/workspace/lldb-cmake/llvm-project/lldb/examples/synthetic/gnu_libstdcpp.py /Users/buildslave/jenkins/workspace/lldb-cmake/llvm-project/lldb/examples/synthetic/libcxx.py && cd /Users/buildslave/jenkins/workspace/lldb-cmake/lldb-build/lib/python3.7/site-packages/lldb && /usr/local/Cellar/cmake/3.12.3/bin/cmake -E make_directory runtime && /usr/local/bin/python /Users/buildslave/jenkins/workspace/lldb-cmake/llvm-project/lldb/scripts/Python/createPythonInit.py runtime && cd /Users/buildslave/jenkins/workspace/lldb-cmake/lldb-build/lib/python3.7/site-packages/lldb && /usr/local/Cellar/cmake/3.12.3/bin/cmake -E make_directory formatters && /usr/local/Cellar/cmake/3.12.3/bin/cmake -E copy /Users/buildslave/jenkins/workspace/lldb-cmake/llvm-project/lldb/examples/summaries/cocoa/cache.py /Users/buildslave/jenkins/workspace/lldb-cmake/llvm-project/lldb/examples/summaries/synth.py /Users/buildslave/jenkins/workspace/lldb-cmake/llvm-project/lldb/examples/summaries/cocoa/metrics.py /Users/buildslave/jenkins/workspace/lldb-cmake/llvm-project/lldb/examples/summaries/cocoa/attrib_fromdict.py /Users/buildslave/jenkins/workspace/lldb-cmake/llvm-project/lldb/examples/summaries/cocoa/Logger.py formatters && /usr/local/bin/python /Users/buildslave/jenkins/workspace/lldb-cmake/llvm-project/lldb/scripts/Python/createPythonInit.py formatters /Users/buildslave/jenkins/workspace/lldb-cmake/llvm-project/lldb/examples/summaries/cocoa/cache.py /Users/buildslave/jenkins/workspace/lldb-cmake/llvm-project/lldb/examples/summaries/synth.py /Users/buildslave/jenkins/workspace/lldb-cmake/llvm-project/lldb/examples/summaries/cocoa/metrics.py /Users/buildslave/jenkins/workspace/lldb-cmake/llvm-project/lldb/examples/summaries/cocoa/attrib_fromdict.py /Users/buildslave/jenkins/workspace/lldb-cmake/llvm-project/lldb/examples/summaries/cocoa/Logger.py && cd /Users/buildslave/jenkins/workspace/lldb-cmake/lldb-build/lib/python3.7/site-packages/lldb && /usr/local/Cellar/cmake/3.12.3/bin/cmake -E make_directory utils && /usr/local/Cellar/cmake/3.12.3/bin/cmake -E copy /Users/buildslave/jenkins/workspace/lldb-cmake/llvm-project/lldb/examples/python/symbolication.py utils && /usr/local/bin/python /Users/buildslave/jenkins/workspace/lldb-cmake/llvm-project/lldb/scripts/Python/createPythonInit.py utils /Users/buildslave/jenkins/workspace/lldb-cmake/llvm-project/lldb/examples/python/symbolication.py && cd /Users/buildslave/jenkins/workspace/lldb-cmake/lldb-build/lib/python3.7/site-packages/lldb && /usr/local/Cellar/cmake/3.12.3/bin/cmake -E make_directory macosx && /usr/local/Cellar/cmake/3.12.3/bin/cmake -E copy /Users/buildslave/jenkins/workspace/lldb-cmake/llvm-project/lldb/examples/python/crashlog.py /Users/buildslave/jenkins/workspace/lldb-cmake/llvm-project/lldb/examples/darwin/heap_find/heap.py macosx && /usr/local/bin/python /Users/buildslave/jenkins/workspace/lldb-cmake/llvm-project/lldb/scripts/Python/createPythonInit.py macosx /Users/buildslave/jenkins/workspace/lldb-cmake/llvm-project/lldb/examples/python/crashlog.py /Users/buildslave/jenkins/workspace/lldb-cmake/llvm-project/lldb/examples/darwin/heap_find/heap.py && cd /Users/buildslave/jenkins/workspace/lldb-cmake/lldb-build/lib/python3.7/site-packages/lldb && /usr/local/Cellar/cmake/3.12.3/bin/cmake -E make_directory diagnose && /usr/local/Cellar/cmake/3.12.3/bin/cmake -E copy /Users/buildslave/jenkins/workspace/lldb-cmake/llvm-project/lldb/examples/python/diagnose_unwind.py /Users/buildslave/jenkins/workspace/lldb-cmake/llvm-project/lldb/examples/python/diagnose_nsstring.py diagnose && /usr/local/bin/python /Users/buildslave/jenkins/workspace/lldb-cmake/llvm-project/lldb/scripts/Python/createPythonInit.py diagnose /Users/buildslave/jenkins/workspace/lldb-cmake/llvm-project/lldb/examples/python/diagnose_unwind.py /Users/buildslave/jenkins/workspace/lldb-cmake/llvm-project/lldb/examples/python/diagnose_nsstring.py && cd /Users/buildslave/jenkins/workspace/lldb-cmake/lldb-build/lib/python3.7/site-packages/lldb && /usr/local/Cellar/cmake/3.12.3/bin/cmake -E create_symlink ../../../liblldb.dylib _lldb.so && cd /Users/buildslave/jenkins/workspace/lldb-cmake/lldb-build/lib/python3.7/site-packages/lldb && /usr/local/Cellar/cmake/3.12.3/bin/cmake -E create_symlink ../../../../bin/lldb-argdumper lldb-argdumper
[101/101] : && /Users/buildslave/jenkins/workspace/lldb-cmake/host-compiler/bin/clang++  -Wdocumentation -fPIC -fvisibility-inlines-hidden -Werror=date-time -Werror=unguarded-availability-new -fmodules -fmodules-cache-path=/Users/buildslave/jenkins/workspace/lldb-cmake/lldb-build/module.cache -fcxx-modules -Wall -Wextra -Wno-unused-parameter -Wwrite-strings -Wcast-qual -Wmissing-field-initializers -pedantic -Wno-long-long -Wimplicit-fallthrough -Wcovered-switch-default -Wno-noexcept-type -Wnon-virtual-dtor -Wdelete-non-virtual-dtor -Wstring-conversion -fdiagnostics-color -Wno-deprecated-declarations -Wno-unknown-pragmas -Wno-strict-aliasing -Wno-deprecated-register -Wno-vla-extension -O3  -isysroot /Applications/Xcode.app/Contents/Developer/Platforms/MacOSX.platform/Developer/SDKs/MacOSX10.14.sdk -Wl,-search_paths_first -Wl,-headerpad_max_install_names -Wl,-sectcreate,__TEXT,__info_plist,/Users/buildslave/jenkins/workspace/lldb-cmake/llvm-project/lldb/tools/driver/lldb-Info.plist    -Wl,-dead_strip tools/lldb/tools/driver/CMakeFiles/lldb.dir/Driver.cpp.o tools/lldb/tools/driver/CMakeFiles/lldb.dir/Platform.cpp.o  -o bin/lldb  -Wl,-rpath,@loader_path/../lib lib/libLLVMOption.a lib/libLLVMSupport.a lib/lldb.framework/Versions/10.0.99git/lldb -lz -lcurses -lm lib/libLLVMDemangle.a && :
Completed at: 2019-11-12T14:29:54
@@@@@@
[Pipeline] }
[Pipeline] // timeout
[Pipeline] }
[Pipeline] // stage
[Pipeline] stage
[Pipeline] { (Test)
[Pipeline] timeout
Timeout set to expire in 1 hr 0 min
[Pipeline] {
[Pipeline] sh
+ set -u
+ export PATH=/usr/local/bin:/usr/local/sbin:/usr/bin:/bin:/usr/sbin:/sbin:/usr/bin:/usr/local/bin
+ PATH=/usr/local/bin:/usr/local/sbin:/usr/bin:/bin:/usr/sbin:/sbin:/usr/bin:/usr/local/bin
+ rm -rf test/results.xml
+ python llvm-zorg/zorg/jenkins/monorepo_build.py lldb-cmake testlong
Error: missing dependency: os_version v10.13.5, found v10.14 installed, requested from clang_build_dependencies.dep:0: os_version == 10.13.5 # Oldest CI nodes are currently 10.13.3
Dependency met brew cmake v3.11.2
Dependency met brew ninja v1.8.2
Dependency met pip psutil v5.4.5
Dependency met pip six v1.11.0
Error: missing dependency: xcode v9.4.1, found v10.1 installed, requested from clang_build_dependencies.dep:5: xcode == 9.4.1
Clean

Hide Details

@@@ Clean @@@ Removing module cache: /Users/buildslave/jenkins/workspace/lldb-cmake/lldb-build/module.cache Completed at: 2019-11-12T14:30:00 @@@@@@
Run Debug Info Tests

Hide Details

@@@ Run Debug Info Tests @@@ cd /Users/buildslave/jenkins/workspace/lldb-cmake/lldb-build '/usr/local/bin/ninja' '-v' 'check-debuginfo' [0/1] cd /Users/buildslave/jenkins/workspace/lldb-cmake/lldb-build/projects/debuginfo-tests && /usr/local/bin/python /Users/buildslave/jenkins/workspace/lldb-cmake/lldb-build/./bin/llvm-lit -v --time-tests --shuffle --xunit-xml-output=/Users/buildslave/jenkins/workspace/lldb-cmake/test/results.xml -v /Users/buildslave/jenkins/workspace/lldb-cmake/lldb-build/projects/debuginfo-tests -- Testing: 53 tests, 24 workers -- llvm-lit: /Users/buildslave/jenkins/workspace/lldb-cmake/llvm-project/llvm/utils/lit/lit/llvm/config.py:342: note: using clang: /Users/buildslave/jenkins/workspace/lldb-cmake/lldb-build/bin/clang llvm-lit: /Users/buildslave/jenkins/workspace/lldb-cmake/llvm-project/llvm/utils/lit/lit/llvm/config.py:342: note: using clang++: /Users/buildslave/jenkins/workspace/lldb-cmake/lldb-build/bin/clang++ llvm-lit: /Users/buildslave/jenkins/workspace/lldb-cmake/llvm-project/llvm/utils/lit/lit/llvm/config.py:342: note: using clang-cl: /Users/buildslave/jenkins/workspace/lldb-cmake/lldb-build/bin/clang-cl llvm-lit: /Users/buildslave/jenkins/workspace/lldb-cmake/llvm-project/llvm/utils/lit/lit/llvm/config.py:342: note: using lldb: /Users/buildslave/jenkins/workspace/lldb-cmake/lldb-build/bin/lldb llvm-lit: /Users/buildslave/jenkins/workspace/lldb-cmake/llvm-project/llvm/utils/lit/lit/util.py:410: note: using SDKROOT: '/Applications/Xcode.app/Contents/Developer/Platforms/MacOSX.platform/Developer/SDKs/MacOSX10.14.sdk' UNSUPPORTED: debuginfo-tests :: dexter/feature_tests/commands/perfect/expect_step_kind/recursive.cpp (1 of 53) UNSUPPORTED: debuginfo-tests :: dexter/feature_tests/commands/penalty/expect_watch_value.cpp (2 of 53) UNSUPPORTED: debuginfo-tests :: dexter/feature_tests/commands/penalty/unreachable.cpp (3 of 53) UNSUPPORTED: debuginfo-tests :: dexter/feature_tests/commands/perfect/expect_step_order.cpp (4 of 53) UNSUPPORTED: debuginfo-tests :: dexter-tests/hello.c (5 of 53) UNSUPPORTED: debuginfo-tests :: dexter/feature_tests/subtools/view.cpp (6 of 53) UNSUPPORTED: debuginfo-tests :: dexter/feature_tests/commands/perfect/expect_step_kind/direction.cpp (7 of 53) UNSUPPORTED: debuginfo-tests :: dexter/feature_tests/commands/perfect/expect_watch_value.cpp (8 of 53) UNSUPPORTED: debuginfo-tests :: dexter/feature_tests/commands/penalty/expect_watch_type.cpp (9 of 53) UNSUPPORTED: debuginfo-tests :: dexter/feature_tests/commands/penalty/expect_step_kinds.cpp (10 of 53) UNSUPPORTED: debuginfo-tests :: dexter/feature_tests/commands/perfect/expect_step_kind/func.cpp (11 of 53) UNSUPPORTED: debuginfo-tests :: dexter/feature_tests/subtools/clang-opt-bisect/clang-opt-bisect.cpp (12 of 53) UNSUPPORTED: debuginfo-tests :: dexter/feature_tests/commands/perfect/expect_step_kind/func_external.cpp (13 of 53) UNSUPPORTED: debuginfo-tests :: dexter/feature_tests/commands/penalty/expect_step_order.cpp (14 of 53) UNSUPPORTED: debuginfo-tests :: dexter-tests/realigned-frame.cpp (15 of 53) UNSUPPORTED: debuginfo-tests :: dexter/feature_tests/commands/perfect/expect_program_state.cpp (16 of 53) PASS: debuginfo-tests :: llgdb-tests/apple-accel.cpp (17 of 53) UNSUPPORTED: debuginfo-tests :: dexter/feature_tests/commands/perfect/expect_step_kind/small_loop.cpp (18 of 53) UNSUPPORTED: debuginfo-tests :: dexter/feature_tests/commands/perfect/expect_watch_type.cpp (19 of 53) PASS: debuginfo-tests :: dexter/feature_tests/subtools/help/help.test (20 of 53) PASS: debuginfo-tests :: dexter/feature_tests/subtools/list-debuggers/list-debuggers.test (21 of 53) UNSUPPORTED: debuginfo-tests :: dexter-tests/inline-line-gap.cpp (22 of 53) UNSUPPORTED: debuginfo-tests :: dexter-tests/global-constant.cpp (23 of 53) PASS: debuginfo-tests :: dexter/feature_tests/unittests/run.test (24 of 53) UNSUPPORTED: debuginfo-tests :: dexter/feature_tests/commands/penalty/expect_program_state.cpp (25 of 53) PASS: debuginfo-tests :: dexter/feature_tests/subtools/test/err_paren.cpp (26 of 53) PASS: debuginfo-tests :: dexter/feature_tests/subtools/test/err_type.cpp (27 of 53) PASS: debuginfo-tests :: dexter/feature_tests/subtools/test/err_syntax_mline.cpp (28 of 53) UNSUPPORTED: debuginfo-tests :: dexter/feature_tests/commands/perfect/unreachable.cpp (29 of 53) UNSUPPORTED: debuginfo-tests :: llgdb-tests/safestack.c (30 of 53) UNSUPPORTED: debuginfo-tests :: dexter-tests/nrvo.cpp (31 of 53) PASS: debuginfo-tests :: dexter/feature_tests/subtools/test/err_syntax.cpp (32 of 53) PASS: debuginfo-tests :: dexter/feature_tests/subtools/test/err_type_mline.cpp (33 of 53) PASS: debuginfo-tests :: dexter/feature_tests/subtools/test/err_paren_mline.cpp (34 of 53) PASS: debuginfo-tests :: llgdb-tests/nested-struct.cpp (35 of 53) FAIL: debuginfo-tests :: dexter-tests/ctor.cpp (36 of 53) ******************** TEST 'debuginfo-tests :: dexter-tests/ctor.cpp' FAILED ******************** Script: -- : 'RUN: at line 4'; "/usr/local/bin/python" "/Users/buildslave/jenkins/workspace/lldb-cmake/llvm-project/debuginfo-tests/dexter/dexter.py" test --lldb-executable /Users/buildslave/jenkins/workspace/lldb-cmake/lldb-build/bin/lldb --fail-lt 1.0 -w --builder 'clang' --debugger 'lldb' --cflags "-O0 -glldb" -- /Users/buildslave/jenkins/workspace/lldb-cmake/llvm-project/debuginfo-tests/dexter-tests/ctor.cpp -- Exit Code: 2

Hide Details

Command Output (stdout): -- ctor.cpp: nan/nan (nan) [Command '['/usr/local/opt/python/bin/python3.7', '/Users/buildslave/jenkins/workspace/lldb-cmake/llvm-project/debuginfo-tests/dexter/dex/../dexter.py', 'run-debugger-internal-', '/var/folders/09/r4vw4v8n5kb67jl66zvlbljw0000gn/T/dexter/tmpeny1wvko/tmp90pd_hpc', '/var/folders/09/r4vw4v8n5kb67jl66zvlbljw0000gn/T/dexter/tmpeny1wvko/tmpn8_nbf9n', '--working-directory', '/var/folders/09/r4vw4v8n5kb67jl66zvlbljw0000gn/T/dexter/tmpeny1wvko', '--unittest=off', '--indent-timer-level=3']' returned non-zero exit status 1.]

Hide Details

Hide Details

-- Command Output (stderr): --

Hide Details

error: could not load lldb (path "/Users/buildslave/jenkins/workspace/lldb-cmake/lldb-build/lib/lldb.framework/Versions/lib/python3.7/site-packages" does not exist [result of ['/Users/buildslave/jenkins/workspace/lldb-cmake/lldb-build/bin/lldb', '-P']])

Hide Details

Hide Details

--

Hide Details

******************** FAIL: debuginfo-tests :: dexter-tests/dbg-arg.c (37 of 53) ******************** TEST 'debuginfo-tests :: dexter-tests/dbg-arg.c' FAILED ******************** Script: -- : 'RUN: at line 5'; "/usr/local/bin/python" "/Users/buildslave/jenkins/workspace/lldb-cmake/llvm-project/debuginfo-tests/dexter/dexter.py" test --lldb-executable /Users/buildslave/jenkins/workspace/lldb-cmake/lldb-build/bin/lldb --fail-lt 1.0 -w --builder clang-c --debugger 'lldb' --cflags "-m64 -mllvm -fast-isel=false -g" -- /Users/buildslave/jenkins/workspace/lldb-cmake/llvm-project/debuginfo-tests/dexter-tests/dbg-arg.c -- Exit Code: 2

Hide Details

Command Output (stdout): -- dbg-arg.c: nan/nan (nan) [Command '['/usr/local/opt/python/bin/python3.7', '/Users/buildslave/jenkins/workspace/lldb-cmake/llvm-project/debuginfo-tests/dexter/dex/../dexter.py', 'run-debugger-internal-', '/var/folders/09/r4vw4v8n5kb67jl66zvlbljw0000gn/T/dexter/tmpzivx_mep/tmpxlbi_ku5', '/var/folders/09/r4vw4v8n5kb67jl66zvlbljw0000gn/T/dexter/tmpzivx_mep/tmpww2zxwty', '--working-directory', '/var/folders/09/r4vw4v8n5kb67jl66zvlbljw0000gn/T/dexter/tmpzivx_mep', '--unittest=off', '--indent-timer-level=3']' returned non-zero exit status 1.]

Hide Details

Hide Details

-- Command Output (stderr): --

Hide Details

error: could not load lldb (path "/Users/buildslave/jenkins/workspace/lldb-cmake/lldb-build/lib/lldb.framework/Versions/lib/python3.7/site-packages" does not exist [result of ['/Users/buildslave/jenkins/workspace/lldb-cmake/lldb-build/bin/lldb', '-P']])

Hide Details

Hide Details

--

Hide Details

******************** FAIL: debuginfo-tests :: dexter-tests/aggregate-indirect-arg.cpp (38 of 53) ******************** TEST 'debuginfo-tests :: dexter-tests/aggregate-indirect-arg.cpp' FAILED ******************** Script: -- : 'RUN: at line 4'; "/usr/local/bin/python" "/Users/buildslave/jenkins/workspace/lldb-cmake/llvm-project/debuginfo-tests/dexter/dexter.py" test --lldb-executable /Users/buildslave/jenkins/workspace/lldb-cmake/lldb-build/bin/lldb --fail-lt 1.0 -w --builder 'clang' --debugger 'lldb' --cflags "-O0 -g" --ldflags="-lstdc++" -- /Users/buildslave/jenkins/workspace/lldb-cmake/llvm-project/debuginfo-tests/dexter-tests/aggregate-indirect-arg.cpp -- Exit Code: 2

Hide Details

Command Output (stdout): -- aggregate-indirect-arg.cpp: nan/nan (nan) [Command '['/usr/local/opt/python/bin/python3.7', '/Users/buildslave/jenkins/workspace/lldb-cmake/llvm-project/debuginfo-tests/dexter/dex/../dexter.py', 'run-debugger-internal-', '/var/folders/09/r4vw4v8n5kb67jl66zvlbljw0000gn/T/dexter/tmpytczawx0/tmpwye1w98a', '/var/folders/09/r4vw4v8n5kb67jl66zvlbljw0000gn/T/dexter/tmpytczawx0/tmppd63ulpk', '--working-directory', '/var/folders/09/r4vw4v8n5kb67jl66zvlbljw0000gn/T/dexter/tmpytczawx0', '--unittest=off', '--indent-timer-level=3']' returned non-zero exit status 1.]

Hide Details

Hide Details

-- Command Output (stderr): --

Hide Details

error: could not load lldb (path "/Users/buildslave/jenkins/workspace/lldb-cmake/lldb-build/lib/lldb.framework/Versions/lib/python3.7/site-packages" does not exist [result of ['/Users/buildslave/jenkins/workspace/lldb-cmake/lldb-build/bin/lldb', '-P']])

Hide Details

Hide Details

--

Hide Details

******************** FAIL: debuginfo-tests :: dexter-tests/nrvo-string.cpp (39 of 53) ******************** TEST 'debuginfo-tests :: dexter-tests/nrvo-string.cpp' FAILED ******************** Script: -- : 'RUN: at line 10'; "/usr/local/bin/python" "/Users/buildslave/jenkins/workspace/lldb-cmake/llvm-project/debuginfo-tests/dexter/dexter.py" test --lldb-executable /Users/buildslave/jenkins/workspace/lldb-cmake/lldb-build/bin/lldb --fail-lt 1.0 -w --builder 'clang' --debugger 'lldb' --cflags "-O0 -glldb -fno-exceptions" -- /Users/buildslave/jenkins/workspace/lldb-cmake/llvm-project/debuginfo-tests/dexter-tests/nrvo-string.cpp : 'RUN: at line 14'; "/usr/local/bin/python" "/Users/buildslave/jenkins/workspace/lldb-cmake/llvm-project/debuginfo-tests/dexter/dexter.py" test --lldb-executable /Users/buildslave/jenkins/workspace/lldb-cmake/lldb-build/bin/lldb --fail-lt 1.0 -w --builder 'clang' --debugger 'lldb' --cflags "-O1 -glldb -fno-exceptions" -- /Users/buildslave/jenkins/workspace/lldb-cmake/llvm-project/debuginfo-tests/dexter-tests/nrvo-string.cpp -- Exit Code: 2

Hide Details

Command Output (stdout): -- nrvo-string.cpp: nan/nan (nan) [Command '['/usr/local/opt/python/bin/python3.7', '/Users/buildslave/jenkins/workspace/lldb-cmake/llvm-project/debuginfo-tests/dexter/dex/../dexter.py', 'run-debugger-internal-', '/var/folders/09/r4vw4v8n5kb67jl66zvlbljw0000gn/T/dexter/tmphnsvuaoi/tmprfvtlrqi', '/var/folders/09/r4vw4v8n5kb67jl66zvlbljw0000gn/T/dexter/tmphnsvuaoi/tmprf1fn82p', '--working-directory', '/var/folders/09/r4vw4v8n5kb67jl66zvlbljw0000gn/T/dexter/tmphnsvuaoi', '--unittest=off', '--indent-timer-level=3']' returned non-zero exit status 1.]

Hide Details

Hide Details

-- Command Output (stderr): --

Hide Details

error: could not load lldb (path "/Users/buildslave/jenkins/workspace/lldb-cmake/lldb-build/lib/lldb.framework/Versions/lib/python3.7/site-packages" does not exist [result of ['/Users/buildslave/jenkins/workspace/lldb-cmake/lldb-build/bin/lldb', '-P']])

Hide Details

Hide Details

--

Hide Details

******************** FAIL: debuginfo-tests :: dexter-tests/stack-var.c (40 of 53) ******************** TEST 'debuginfo-tests :: dexter-tests/stack-var.c' FAILED ******************** Script: -- : 'RUN: at line 4'; "/usr/local/bin/python" "/Users/buildslave/jenkins/workspace/lldb-cmake/llvm-project/debuginfo-tests/dexter/dexter.py" test --lldb-executable /Users/buildslave/jenkins/workspace/lldb-cmake/lldb-build/bin/lldb --fail-lt 1.0 -w --builder clang-c --debugger 'lldb' --cflags "-O -glldb" -- /Users/buildslave/jenkins/workspace/lldb-cmake/llvm-project/debuginfo-tests/dexter-tests/stack-var.c -- Exit Code: 2

Hide Details

Command Output (stdout): -- stack-var.c: nan/nan (nan) [Command '['/usr/local/opt/python/bin/python3.7', '/Users/buildslave/jenkins/workspace/lldb-cmake/llvm-project/debuginfo-tests/dexter/dex/../dexter.py', 'run-debugger-internal-', '/var/folders/09/r4vw4v8n5kb67jl66zvlbljw0000gn/T/dexter/tmp_xa9r49o/tmpisxwwfxt', '/var/folders/09/r4vw4v8n5kb67jl66zvlbljw0000gn/T/dexter/tmp_xa9r49o/tmpeyf0x6nr', '--working-directory', '/var/folders/09/r4vw4v8n5kb67jl66zvlbljw0000gn/T/dexter/tmp_xa9r49o', '--unittest=off', '--indent-timer-level=3']' returned non-zero exit status 1.]

Hide Details

Hide Details

-- Command Output (stderr): --

Hide Details

error: could not load lldb (path "/Users/buildslave/jenkins/workspace/lldb-cmake/lldb-build/lib/lldb.framework/Versions/lib/python3.7/site-packages" does not exist [result of ['/Users/buildslave/jenkins/workspace/lldb-cmake/lldb-build/bin/lldb', '-P']])

Hide Details

Hide Details

--

Hide Details

******************** PASS: debuginfo-tests :: llgdb-tests/forward-declare-class.cpp (41 of 53) FAIL: debuginfo-tests :: dexter-tests/vla.c (42 of 53) ******************** TEST 'debuginfo-tests :: dexter-tests/vla.c' FAILED ******************** Script: -- : 'RUN: at line 5'; "/usr/local/bin/python" "/Users/buildslave/jenkins/workspace/lldb-cmake/llvm-project/debuginfo-tests/dexter/dexter.py" test --lldb-executable /Users/buildslave/jenkins/workspace/lldb-cmake/lldb-build/bin/lldb --fail-lt 1.0 -w --builder clang-c --debugger 'lldb' --cflags "-O0 -glldb" -- /Users/buildslave/jenkins/workspace/lldb-cmake/llvm-project/debuginfo-tests/dexter-tests/vla.c -- Exit Code: 2

Hide Details

Command Output (stdout): -- vla.c: nan/nan (nan) [Command '['/usr/local/opt/python/bin/python3.7', '/Users/buildslave/jenkins/workspace/lldb-cmake/llvm-project/debuginfo-tests/dexter/dex/../dexter.py', 'run-debugger-internal-', '/var/folders/09/r4vw4v8n5kb67jl66zvlbljw0000gn/T/dexter/tmpggl8u9ox/tmpsh6meemk', '/var/folders/09/r4vw4v8n5kb67jl66zvlbljw0000gn/T/dexter/tmpggl8u9ox/tmpwugmcxw8', '--working-directory', '/var/folders/09/r4vw4v8n5kb67jl66zvlbljw0000gn/T/dexter/tmpggl8u9ox', '--unittest=off', '--indent-timer-level=3']' returned non-zero exit status 1.]

Hide Details

Hide Details

-- Command Output (stderr): --

Hide Details

error: could not load lldb (path "/Users/buildslave/jenkins/workspace/lldb-cmake/lldb-build/lib/lldb.framework/Versions/lib/python3.7/site-packages" does not exist [result of ['/Users/buildslave/jenkins/workspace/lldb-cmake/lldb-build/bin/lldb', '-P']])

Hide Details

Hide Details

--

Hide Details

******************** FAIL: debuginfo-tests :: dexter-tests/asan.c (43 of 53) ******************** TEST 'debuginfo-tests :: dexter-tests/asan.c' FAILED ******************** Script: -- : 'RUN: at line 6'; "/usr/local/bin/python" "/Users/buildslave/jenkins/workspace/lldb-cmake/llvm-project/debuginfo-tests/dexter/dexter.py" test --lldb-executable /Users/buildslave/jenkins/workspace/lldb-cmake/lldb-build/bin/lldb --fail-lt 1.0 -w --builder 'clang-c' --debugger 'lldb' --cflags "--driver-mode=gcc -O0 -glldb -fblocks -arch x86_64 -fsanitize=address" --ldflags="-fsanitize=address" -- /Users/buildslave/jenkins/workspace/lldb-cmake/llvm-project/debuginfo-tests/dexter-tests/asan.c -- Exit Code: 2

Hide Details

Command Output (stdout): -- asan.c: nan/nan (nan) [Command '['/usr/local/opt/python/bin/python3.7', '/Users/buildslave/jenkins/workspace/lldb-cmake/llvm-project/debuginfo-tests/dexter/dex/../dexter.py', 'run-debugger-internal-', '/var/folders/09/r4vw4v8n5kb67jl66zvlbljw0000gn/T/dexter/tmp5m93_uwe/tmpgtwdqef0', '/var/folders/09/r4vw4v8n5kb67jl66zvlbljw0000gn/T/dexter/tmp5m93_uwe/tmp7z1fkrzr', '--working-directory', '/var/folders/09/r4vw4v8n5kb67jl66zvlbljw0000gn/T/dexter/tmp5m93_uwe', '--unittest=off', '--indent-timer-level=3']' returned non-zero exit status 1.]

Hide Details

Hide Details

-- Command Output (stderr): --

Hide Details

error: could not load lldb (path "/Users/buildslave/jenkins/workspace/lldb-cmake/lldb-build/lib/lldb.framework/Versions/lib/python3.7/site-packages" does not exist [result of ['/Users/buildslave/jenkins/workspace/lldb-cmake/lldb-build/bin/lldb', '-P']])

Hide Details

Hide Details

--

Hide Details

******************** XFAIL: debuginfo-tests :: llgdb-tests/static-member-2.cpp (44 of 53) PASS: debuginfo-tests :: llgdb-tests/static-member.cpp (45 of 53) PASS: debuginfo-tests :: llgdb-tests/asan-blocks.c (46 of 53) PASS: debuginfo-tests :: llgdb-tests/asan.c (47 of 53) PASS: debuginfo-tests :: llgdb-tests/nrvo-string.cpp (48 of 53) PASS: debuginfo-tests :: llgdb-tests/asan-deque.cpp (49 of 53) PASS: debuginfo-tests :: llgdb-tests/block_var.m (50 of 53) XFAIL: debuginfo-tests :: dexter-tests/asan-deque.cpp (51 of 53) PASS: debuginfo-tests :: llgdb-tests/foreach.m (52 of 53) PASS: debuginfo-tests :: llgdb-tests/blocks.m (53 of 53)

Hide Details

Testing Time: 4.55s ******************** Failing Tests (7): debuginfo-tests :: dexter-tests/aggregate-indirect-arg.cpp debuginfo-tests :: dexter-tests/stack-var.c debuginfo-tests :: dexter-tests/dbg-arg.c debuginfo-tests :: dexter-tests/nrvo-string.cpp debuginfo-tests :: dexter-tests/ctor.cpp debuginfo-tests :: dexter-tests/vla.c debuginfo-tests :: dexter-tests/asan.c

Hide Details

Hide Details

Slowest Tests: -------------------------------------------------------------------------- 0.57s: debuginfo-tests :: dexter/feature_tests/subtools/test/err_type_mline.cpp 0.58s: debuginfo-tests :: dexter/feature_tests/subtools/test/err_paren_mline.cpp 0.62s: debuginfo-tests :: dexter-tests/asan.c 0.63s: debuginfo-tests :: llgdb-tests/nested-struct.cpp 0.66s: debuginfo-tests :: dexter-tests/vla.c 0.89s: debuginfo-tests :: dexter-tests/ctor.cpp 0.89s: debuginfo-tests :: dexter-tests/dbg-arg.c 0.89s: debuginfo-tests :: dexter-tests/nrvo-string.cpp 0.89s: debuginfo-tests :: dexter-tests/aggregate-indirect-arg.cpp 0.89s: debuginfo-tests :: dexter-tests/stack-var.c 1.25s: debuginfo-tests :: llgdb-tests/static-member-2.cpp 1.33s: debuginfo-tests :: llgdb-tests/static-member.cpp 1.57s: debuginfo-tests :: llgdb-tests/asan.c 1.70s: debuginfo-tests :: llgdb-tests/asan-blocks.c 2.70s: debuginfo-tests :: llgdb-tests/nrvo-string.cpp 2.74s: debuginfo-tests :: llgdb-tests/block_var.m 3.06s: debuginfo-tests :: llgdb-tests/asan-deque.cpp 3.62s: debuginfo-tests :: dexter-tests/asan-deque.cpp 3.93s: debuginfo-tests :: llgdb-tests/foreach.m 4.41s: debuginfo-tests :: llgdb-tests/blocks.m

Hide Details

Tests Times: -------------------------------------------------------------------------- [ Range ] :: [ Percentage ] :: [Count] -------------------------------------------------------------------------- [0.00s,0.20s) :: [****************** ] :: [24/53] [0.20s,0.40s) :: [* ] :: [ 2/53] [0.40s,0.60s) :: [****** ] :: [ 8/53] [0.60s,0.80s) :: [*** ] :: [ 4/53] [0.80s,1.00s) :: [*** ] :: [ 5/53] [1.00s,1.20s) :: [ ] :: [ 0/53] [1.20s,1.40s) :: [* ] :: [ 2/53] [1.40s,1.60s) :: [ ] :: [ 0/53] [1.60s,1.80s) :: [* ] :: [ 2/53] [1.80s,2.00s) :: [ ] :: [ 0/53] [2.00s,2.20s) :: [ ] :: [ 0/53] [2.20s,2.40s) :: [ ] :: [ 0/53] [2.40s,2.60s) :: [ ] :: [ 0/53] [2.60s,2.80s) :: [ ] :: [ 0/53] [2.80s,3.00s) :: [* ] :: [ 2/53] [3.00s,3.20s) :: [ ] :: [ 1/53] [3.20s,3.40s) :: [ ] :: [ 0/53] [3.40s,3.60s) :: [ ] :: [ 0/53] [3.60s,3.80s) :: [ ] :: [ 1/53] [3.80s,4.00s) :: [ ] :: [ 0/53] [4.00s,4.20s) :: [ ] :: [ 1/53] [4.20s,4.40s) :: [ ] :: [ 0/53] [4.40s,4.60s) :: [ ] :: [ 1/53] Expected Passes : 20 Expected Failures : 2 Unsupported Tests : 24 Unexpected Failures: 7 FAILED: projects/debuginfo-tests/CMakeFiles/check-debuginfo cd /Users/buildslave/jenkins/workspace/lldb-cmake/lldb-build/projects/debuginfo-tests && /usr/local/bin/python /Users/buildslave/jenkins/workspace/lldb-cmake/lldb-build/./bin/llvm-lit -v --time-tests --shuffle --xunit-xml-output=/Users/buildslave/jenkins/workspace/lldb-cmake/test/results.xml -v /Users/buildslave/jenkins/workspace/lldb-cmake/lldb-build/projects/debuginfo-tests ninja: build stopped: subcommand failed. Command failed: Command '['/usr/local/bin/ninja', '-v', 'check-debuginfo']' returned non-zero exit status 1. Command: ['/usr/local/bin/ninja', '-v', 'check-debuginfo'] [Pipeline] } [Pipeline] // timeout [Pipeline] } [Pipeline] // stage [Pipeline] stage [Pipeline] { (Declarative: Post Actions) [Pipeline] scanForIssues No credentials specified [Clang (LLVM based)] Sleeping for 5 seconds due to JENKINS-32191... [Clang (LLVM based)] Parsing console log (workspace: '/Users/buildslave/jenkins/workspace/lldb-cmake') [Clang (LLVM based)] [-ERROR-] Git blame errors: [Clang (LLVM based)] [-ERROR-] - no blame results for request <llvm-project/llvm/include/llvm/Analysis/ScalarEvolution.h - [1696]>.

Hide Details

[Clang (LLVM based)] Post processing issues on 'green-dragon-24' with source code encoding 'UTF-8' [Clang (LLVM based)] Resolving absolute file names for all issues in workspace '/Users/buildslave/jenkins/workspace/lldb-cmake' [Clang (LLVM based)] -> 0 resolved, 0 unresolved, 1 already resolved [Clang (LLVM based)] Copying affected files to Jenkins' build folder '/Users/Shared/Jenkins/Home/jobs/lldb-cmake/builds/3694/files-with-issues' [Clang (LLVM based)] -> 1 copied, 0 not in workspace, 0 not-found, 0 with I/O error [Clang (LLVM based)] Resolving module names from module definitions (build.xml, pom.xml, or Manifest.mf files) [Clang (LLVM based)] -> resolved module names for 1 issues [Clang (LLVM based)] Resolving package names (or namespaces) by parsing the affected files [Clang (LLVM based)] -> resolved package names of 1 affected files [Clang (LLVM based)] No filter has been set, publishing all 1 issues [Clang (LLVM based)] Creating fingerprints for all affected code blocks to track issues over different builds [Clang (LLVM based)] -> created fingerprints for 1 issues [Clang (LLVM based)] Invoking Git blamer to create author and commit information for all affected files [Clang (LLVM based)] GIT_COMMIT env = 'HEAD' [Clang (LLVM based)] Git working tree = '/Users/buildslave/jenkins/workspace/lldb-cmake' [Clang (LLVM based)] Git commit ID = '353012a742ef606c9cc20702bb6facdf871473db' [Clang (LLVM based)] Job workspace = '/Users/buildslave/jenkins/workspace/lldb-cmake' [Clang (LLVM based)] Created blame requests for 1 files - invoking Git blame on agent for each of the requests [Clang (LLVM based)] -> blamed authors of issues in 1 files
[Pipeline] junit Recording test results [BFA] Scanning build for known causes... [Pipeline] emailext [BFA] Found failure cause(s): [BFA] Regression test failed from category Test [BFA] Ninja target failed from category Compile [BFA] Done. 0s

Hide Details

Begin Pre-Send Script... Sending email to: mschifer@apple.com jdevlieghere@apple.com Volodymyr Sapsai <vsapsai@apple.com> Azhar Mohammed <azhar@apple.com>
> git rev-parse HEAD^{commit} # timeout=10 [Pipeline] } [Pipeline] // stage [Pipeline] } [Pipeline] // withEnv [Pipeline] } [Pipeline] // node [Pipeline] End of Pipeline ERROR: script returned exit code 1 Finished: FAILURE