FailedConsole Output

Skipping 5,240 KB.. Full Log
pace/lldb-cmake/llvm-project/lldb/include/lldb/Interpreter/CommandObjectRegexCommand.h:14:
/Users/buildslave/jenkins/workspace/lldb-cmake/llvm-project/lldb/include/lldb/Interpreter/CommandObject.h:229:13: warning: unrecognized parameter passing direction, valid directions are '[in]', '[out]' and '[in,out]' [-Wdocumentation]
  /// \param[in/out] request
            ^~~~~~~~
/Users/buildslave/jenkins/workspace/lldb-cmake/llvm-project/lldb/include/lldb/Interpreter/CommandObject.h:238:13: warning: unrecognized parameter passing direction, valid directions are '[in]', '[out]' and '[in,out]' [-Wdocumentation]
  /// \param[in/out] request
            ^~~~~~~~
/Users/buildslave/jenkins/workspace/lldb-cmake/llvm-project/lldb/include/lldb/Interpreter/CommandObject.h:264:18: warning: parameter 'current_command_line' not found in the function declaration [-Wdocumentation]
  /// \param[in] current_command_line
                 ^~~~~~~~~~~~~~~~~~~~
/Users/buildslave/jenkins/workspace/lldb-cmake/llvm-project/lldb/include/lldb/Interpreter/CommandObject.h:264:18: note: did you mean 'current_command_args'?
  /// \param[in] current_command_line
                 ^~~~~~~~~~~~~~~~~~~~
                 current_command_args
While building module 'lldb_Wrapper' imported from /Users/buildslave/jenkins/workspace/lldb-cmake/llvm-project/lldb/source/Plugins/ScriptInterpreter/Python/ScriptInterpreterPython.h:18:
In file included from <module-includes>:156:
/Users/buildslave/jenkins/workspace/lldb-cmake/llvm-project/lldb/include/lldb/Interpreter/CommandInterpreter.h:54:20: warning: parameter 'echo_commands' is already documented [-Wdocumentation]
  ///    if \param echo_commands is \b true.
                   ^~~~~~~~~~~~~
/Users/buildslave/jenkins/workspace/lldb-cmake/llvm-project/lldb/include/lldb/Interpreter/CommandInterpreter.h:48:8: note: previous documentation
  /// \param[in] echo_commands
       ^         ~~~~~~~~~~~~~
While building module 'lldb_Wrapper' imported from /Users/buildslave/jenkins/workspace/lldb-cmake/llvm-project/lldb/source/Plugins/ScriptInterpreter/Python/ScriptInterpreterPython.h:18:
In file included from <module-includes>:178:
/Users/buildslave/jenkins/workspace/lldb-cmake/llvm-project/lldb/include/lldb/Symbol/LineTable.h:138:19: warning: parameter 'line_entry' not found in the function declaration [-Wdocumentation]
  /// \param[out] line_entry
                  ^~~~~~~~~~
/Users/buildslave/jenkins/workspace/lldb-cmake/llvm-project/lldb/include/lldb/Symbol/LineTable.h:138:19: note: did you mean 'line_entry_ptr'?
  /// \param[out] line_entry
                  ^~~~~~~~~~
                  line_entry_ptr
/Users/buildslave/jenkins/workspace/lldb-cmake/llvm-project/lldb/include/lldb/Symbol/LineTable.h:200:8: warning: '\param' command used in a comment that is not attached to a function declaration [-Wdocumentation]
  /// \param[out] file_range_map
       ^~~~~~
/Users/buildslave/jenkins/workspace/lldb-cmake/llvm-project/lldb/include/lldb/Symbol/LineTable.h:204:8: warning: '\return' command used in a comment that is not attached to a function or method declaration [-Wdocumentation]
  /// \return
      ~^~~~~~
While building module 'lldb_Wrapper' imported from /Users/buildslave/jenkins/workspace/lldb-cmake/llvm-project/lldb/source/Plugins/ScriptInterpreter/Python/ScriptInterpreterPython.h:18:
In file included from <module-includes>:186:
In file included from /Users/buildslave/jenkins/workspace/lldb-cmake/llvm-project/lldb/include/lldb/Symbol/SymbolFile.h:16:
In file included from /Users/buildslave/jenkins/workspace/lldb-cmake/llvm-project/lldb/include/lldb/Symbol/Function.h:15:
/Users/buildslave/jenkins/workspace/lldb-cmake/llvm-project/lldb/include/lldb/Symbol/Block.h:60:18: warning: parameter 'depth' not found in the function declaration [-Wdocumentation]
  /// \param[in] depth
                 ^~~~~
/Users/buildslave/jenkins/workspace/lldb-cmake/llvm-project/lldb/include/lldb/Symbol/Block.h:63:18: warning: parameter 'block_list' not found in the function declaration [-Wdocumentation]
  /// \param[in] block_list
                 ^~~~~~~~~~
/Users/buildslave/jenkins/workspace/lldb-cmake/llvm-project/lldb/include/lldb/Symbol/Block.h:81:18: warning: parameter 'start_offset' not found in the function declaration [-Wdocumentation]
  /// \param[in] start_offset
                 ^~~~~~~~~~~~
/Users/buildslave/jenkins/workspace/lldb-cmake/llvm-project/lldb/include/lldb/Symbol/Block.h:81:18: note: did you mean 'range'?
  /// \param[in] start_offset
                 ^~~~~~~~~~~~
                 range
/Users/buildslave/jenkins/workspace/lldb-cmake/llvm-project/lldb/include/lldb/Symbol/Block.h:85:18: warning: parameter 'end_offset' not found in the function declaration [-Wdocumentation]
  /// \param[in] end_offset
                 ^~~~~~~~~~
/Users/buildslave/jenkins/workspace/lldb-cmake/llvm-project/lldb/include/lldb/Symbol/Block.h:85:18: note: did you mean 'range'?
  /// \param[in] end_offset
                 ^~~~~~~~~~
                 range
/Users/buildslave/jenkins/workspace/lldb-cmake/llvm-project/lldb/include/lldb/Symbol/Block.h:235:18: warning: parameter 'get_child_variables' not found in the function declaration [-Wdocumentation]
  /// \param[in] get_child_variables
                 ^~~~~~~~~~~~~~~~~~~
/Users/buildslave/jenkins/workspace/lldb-cmake/llvm-project/lldb/include/lldb/Symbol/Block.h:235:18: note: did you mean 'get_child_block_variables'?
  /// \param[in] get_child_variables
                 ^~~~~~~~~~~~~~~~~~~
                 get_child_block_variables
/Users/buildslave/jenkins/workspace/lldb-cmake/llvm-project/lldb/include/lldb/Symbol/Block.h:246:18: warning: parameter 'add_inline_child_block_variables' not found in the function declaration [-Wdocumentation]
  /// \param[in] add_inline_child_block_variables
                 ^~~~~~~~~~~~~~~~~~~~~~~~~~~~~~~~
/Users/buildslave/jenkins/workspace/lldb-cmake/llvm-project/lldb/include/lldb/Symbol/Block.h:246:18: note: did you mean 'get_child_block_variables'?
  /// \param[in] add_inline_child_block_variables
                 ^~~~~~~~~~~~~~~~~~~~~~~~~~~~~~~~
                 get_child_block_variables
While building module 'lldb_Wrapper' imported from /Users/buildslave/jenkins/workspace/lldb-cmake/llvm-project/lldb/source/Plugins/ScriptInterpreter/Python/ScriptInterpreterPython.h:18:
In file included from <module-includes>:186:
In file included from /Users/buildslave/jenkins/workspace/lldb-cmake/llvm-project/lldb/include/lldb/Symbol/SymbolFile.h:16:
/Users/buildslave/jenkins/workspace/lldb-cmake/llvm-project/lldb/include/lldb/Symbol/Function.h:70:14: warning: empty paragraph passed to '\return' command [-Wdocumentation]
  /// \return
      ~~~~~~~^
/Users/buildslave/jenkins/workspace/lldb-cmake/llvm-project/lldb/include/lldb/Symbol/Function.h:185:14: warning: empty paragraph passed to '\return' command [-Wdocumentation]
  /// \return
      ~~~~~~~^
While building module 'lldb_Wrapper' imported from /Users/buildslave/jenkins/workspace/lldb-cmake/llvm-project/lldb/source/Plugins/ScriptInterpreter/Python/ScriptInterpreterPython.h:18:
In file included from <module-includes>:204:
/Users/buildslave/jenkins/workspace/lldb-cmake/llvm-project/lldb/include/lldb/Symbol/CompileUnit.h:47:18: warning: parameter 'module' not found in the function declaration [-Wdocumentation]
  /// \param[in] module
                 ^~~~~~
/Users/buildslave/jenkins/workspace/lldb-cmake/llvm-project/lldb/include/lldb/Symbol/CompileUnit.h:47:18: note: did you mean 'module_sp'?
  /// \param[in] module
                 ^~~~~~
                 module_sp
/Users/buildslave/jenkins/workspace/lldb-cmake/llvm-project/lldb/include/lldb/Symbol/CompileUnit.h:85:18: warning: parameter 'module' not found in the function declaration [-Wdocumentation]
  /// \param[in] module
                 ^~~~~~
/Users/buildslave/jenkins/workspace/lldb-cmake/llvm-project/lldb/include/lldb/Symbol/CompileUnit.h:85:18: note: did you mean 'module_sp'?
  /// \param[in] module
                 ^~~~~~
                 module_sp
/Users/buildslave/jenkins/workspace/lldb-cmake/llvm-project/lldb/include/lldb/Symbol/CompileUnit.h:244:18: warning: parameter 'lambda' not found in the function declaration [-Wdocumentation]
  /// \param[in] lambda
                 ^~~~~~
/Users/buildslave/jenkins/workspace/lldb-cmake/llvm-project/lldb/include/lldb/Symbol/CompileUnit.h:244:18: note: did you mean 'f'?
  /// \param[in] lambda
                 ^~~~~~
                 f
While building module 'lldb_Wrapper' imported from /Users/buildslave/jenkins/workspace/lldb-cmake/llvm-project/lldb/source/Plugins/ScriptInterpreter/Python/ScriptInterpreterPython.h:18:
In file included from <module-includes>:265:
/Users/buildslave/jenkins/workspace/lldb-cmake/llvm-project/lldb/include/lldb/Target/Queue.h:131:14: warning: empty paragraph passed to '\return' command [-Wdocumentation]
  /// \return
      ~~~~~~~^
162 warnings generated.
[2180/2190] /Users/buildslave/jenkins/workspace/lldb-cmake/host-compiler/bin/clang++  -DGTEST_HAS_RTTI=0 -DHAVE_ROUND -DLIBXML2_DEFINED -DLLDB_CONFIGURATION_RELEASE -DLLDB_PYTHON_RELATIVE_LIBDIR=\"lib/python3.7/site-packages\" -DLLDB_USE_OS_LOG -D_DEBUG -D__STDC_CONSTANT_MACROS -D__STDC_FORMAT_MACROS -D__STDC_LIMIT_MACROS -Itools/lldb/source/Plugins/ScriptInterpreter/Python -I/Users/buildslave/jenkins/workspace/lldb-cmake/llvm-project/lldb/source/Plugins/ScriptInterpreter/Python -Itools/lldb/source -I/Users/buildslave/jenkins/workspace/lldb-cmake/llvm-project/lldb/include -Itools/lldb/include -I/Applications/Xcode.app/Contents/Developer/Platforms/MacOSX.platform/Developer/SDKs/MacOSX10.14.sdk/usr/include/libxml2 -Iinclude -I/Users/buildslave/jenkins/workspace/lldb-cmake/llvm-project/llvm/include -I/usr/local/Frameworks/Python.framework/Versions/3.7/include/python3.7m -I/Users/buildslave/jenkins/workspace/lldb-cmake/llvm-project/llvm/../clang/include -Itools/lldb/../clang/include -I/usr/local/include -I/Users/buildslave/jenkins/workspace/lldb-cmake/llvm-project/lldb/source/. -Wdocumentation -fPIC -fvisibility-inlines-hidden -Werror=date-time -Werror=unguarded-availability-new -fmodules -fmodules-cache-path=/Users/buildslave/jenkins/workspace/lldb-cmake/lldb-build/module.cache -fcxx-modules -Wall -Wextra -Wno-unused-parameter -Wwrite-strings -Wcast-qual -Wmissing-field-initializers -pedantic -Wno-long-long -Wimplicit-fallthrough -Wcovered-switch-default -Wno-noexcept-type -Wnon-virtual-dtor -Wdelete-non-virtual-dtor -Wstring-conversion -fdiagnostics-color -Wno-deprecated-declarations -Wno-unknown-pragmas -Wno-strict-aliasing -Wno-deprecated-register -Wno-vla-extension -O3  -isysroot /Applications/Xcode.app/Contents/Developer/Platforms/MacOSX.platform/Developer/SDKs/MacOSX10.14.sdk   -UNDEBUG  -fno-exceptions -fno-rtti -std=c++14 -MD -MT tools/lldb/source/Plugins/ScriptInterpreter/Python/CMakeFiles/lldbPluginScriptInterpreterPython.dir/ScriptInterpreterPython.cpp.o -MF tools/lldb/source/Plugins/ScriptInterpreter/Python/CMakeFiles/lldbPluginScriptInterpreterPython.dir/ScriptInterpreterPython.cpp.o.d -o tools/lldb/source/Plugins/ScriptInterpreter/Python/CMakeFiles/lldbPluginScriptInterpreterPython.dir/ScriptInterpreterPython.cpp.o -c /Users/buildslave/jenkins/workspace/lldb-cmake/llvm-project/lldb/source/Plugins/ScriptInterpreter/Python/ScriptInterpreterPython.cpp
While building module 'lldb_Wrapper' imported from /Users/buildslave/jenkins/workspace/lldb-cmake/llvm-project/lldb/source/Plugins/ScriptInterpreter/Python/ScriptInterpreterPython.h:18:
In file included from <module-includes>:1:
In file included from /Users/buildslave/jenkins/workspace/lldb-cmake/llvm-project/lldb/include/lldb/Breakpoint/StoppointCallbackContext.h:12:
In file included from /Users/buildslave/jenkins/workspace/lldb-cmake/llvm-project/lldb/include/lldb/Target/ExecutionContext.h:14:
In file included from /Users/buildslave/jenkins/workspace/lldb-cmake/llvm-project/lldb/include/lldb/Target/StackID.h:12:
In file included from /Users/buildslave/jenkins/workspace/lldb-cmake/llvm-project/lldb/include/lldb/Core/AddressRange.h:12:
/Users/buildslave/jenkins/workspace/lldb-cmake/llvm-project/lldb/include/lldb/Core/Address.h:68:54: warning: '\endcode' command does not terminate a verbatim text block [-Wdocumentation]
    /// libSystem.B.dylib.__TEXT.__text + 0x0005cfdf \endcode
                                                     ^~~~~~~~
/Users/buildslave/jenkins/workspace/lldb-cmake/llvm-project/lldb/include/lldb/Core/Address.h:73:63: warning: '\endcode' command does not terminate a verbatim text block [-Wdocumentation]
    /// offset (lldb::Section *)0x35cc50 + 0x000000000005cfdf \endcode
                                                              ^~~~~~~~
/Users/buildslave/jenkins/workspace/lldb-cmake/llvm-project/lldb/include/lldb/Core/Address.h:77:28: warning: '\endcode' command does not terminate a verbatim text block [-Wdocumentation]
    /// 0x000000000005dcff \endcode
                           ^~~~~~~~
/Users/buildslave/jenkins/workspace/lldb-cmake/llvm-project/lldb/include/lldb/Core/Address.h:82:47: warning: '\endcode' command does not terminate a verbatim text block [-Wdocumentation]
    /// libSystem.B.dylib[0x000000000005dcff] \endcode
                                              ^~~~~~~~
/Users/buildslave/jenkins/workspace/lldb-cmake/llvm-project/lldb/include/lldb/Core/Address.h:86:28: warning: '\endcode' command does not terminate a verbatim text block [-Wdocumentation]
    /// 0x00007fff8306bcff \endcode
                           ^~~~~~~~
/Users/buildslave/jenkins/workspace/lldb-cmake/llvm-project/lldb/include/lldb/Core/Address.h:181:14: warning: empty paragraph passed to '\return' command [-Wdocumentation]
  /// \return
      ~~~~~~~^
/Users/buildslave/jenkins/workspace/lldb-cmake/llvm-project/lldb/include/lldb/Core/Address.h:124:18: warning: parameter 'section' not found in the function declaration [-Wdocumentation]
  /// \param[in] section
                 ^~~~~~~
/Users/buildslave/jenkins/workspace/lldb-cmake/llvm-project/lldb/include/lldb/Core/Address.h:124:18: note: did you mean 'section_sp'?
  /// \param[in] section
                 ^~~~~~~
                 section_sp
/Users/buildslave/jenkins/workspace/lldb-cmake/llvm-project/lldb/include/lldb/Core/Address.h:436:18: warning: parameter 'section' not found in the function declaration [-Wdocumentation]
  /// \param[in] section
                 ^~~~~~~
/Users/buildslave/jenkins/workspace/lldb-cmake/llvm-project/lldb/include/lldb/Core/Address.h:436:18: note: did you mean 'section_sp'?
  /// \param[in] section
                 ^~~~~~~
                 section_sp
While building module 'lldb_Wrapper' imported from /Users/buildslave/jenkins/workspace/lldb-cmake/llvm-project/lldb/source/Plugins/ScriptInterpreter/Python/ScriptInterpreterPython.h:18:
In file included from <module-includes>:1:
In file included from /Users/buildslave/jenkins/workspace/lldb-cmake/llvm-project/lldb/include/lldb/Breakpoint/StoppointCallbackContext.h:12:
In file included from /Users/buildslave/jenkins/workspace/lldb-cmake/llvm-project/lldb/include/lldb/Target/ExecutionContext.h:14:
In file included from /Users/buildslave/jenkins/workspace/lldb-cmake/llvm-project/lldb/include/lldb/Target/StackID.h:12:
/Users/buildslave/jenkins/workspace/lldb-cmake/llvm-project/lldb/include/lldb/Core/AddressRange.h:126:18: warning: parameter 'so_addr' not found in the function declaration [-Wdocumentation]
  /// \param[in] so_addr
                 ^~~~~~~
/Users/buildslave/jenkins/workspace/lldb-cmake/llvm-project/lldb/include/lldb/Core/AddressRange.h:126:18: note: did you mean 'file_addr'?
  /// \param[in] so_addr
                 ^~~~~~~
                 file_addr
/Users/buildslave/jenkins/workspace/lldb-cmake/llvm-project/lldb/include/lldb/Core/AddressRange.h:150:18: warning: parameter 'so_addr' not found in the function declaration [-Wdocumentation]
  /// \param[in] so_addr
                 ^~~~~~~
/Users/buildslave/jenkins/workspace/lldb-cmake/llvm-project/lldb/include/lldb/Core/AddressRange.h:150:18: note: did you mean 'load_addr'?
  /// \param[in] so_addr
                 ^~~~~~~
                 load_addr
While building module 'lldb_Wrapper' imported from /Users/buildslave/jenkins/workspace/lldb-cmake/llvm-project/lldb/source/Plugins/ScriptInterpreter/Python/ScriptInterpreterPython.h:18:
In file included from <module-includes>:3:
In file included from /Users/buildslave/jenkins/workspace/lldb-cmake/llvm-project/lldb/include/lldb/Breakpoint/Breakpoint.h:17:
/Users/buildslave/jenkins/workspace/lldb-cmake/llvm-project/lldb/include/lldb/Breakpoint/BreakpointID.h:68:18: warning: parameter 'input' not found in the function declaration [-Wdocumentation]
  /// \param[in] input
                 ^~~~~
/Users/buildslave/jenkins/workspace/lldb-cmake/llvm-project/lldb/include/lldb/Breakpoint/BreakpointID.h:68:18: note: did you mean 'str'?
  /// \param[in] input
                 ^~~~~
                 str
While building module 'lldb_Wrapper' imported from /Users/buildslave/jenkins/workspace/lldb-cmake/llvm-project/lldb/source/Plugins/ScriptInterpreter/Python/ScriptInterpreterPython.h:18:
In file included from <module-includes>:3:
In file included from /Users/buildslave/jenkins/workspace/lldb-cmake/llvm-project/lldb/include/lldb/Breakpoint/Breakpoint.h:18:
/Users/buildslave/jenkins/workspace/lldb-cmake/llvm-project/lldb/include/lldb/Breakpoint/BreakpointLocationCollection.h:34:8: warning: '\result' command used in a comment that is attached to a function returning void [-Wdocumentation]
  /// \result
      ~^~~~~~
/Users/buildslave/jenkins/workspace/lldb-cmake/llvm-project/lldb/include/lldb/Breakpoint/BreakpointLocationCollection.h:30:18: warning: parameter 'bp_sp' not found in the function declaration [-Wdocumentation]
  /// \param[in] bp_sp
                 ^~~~~
/Users/buildslave/jenkins/workspace/lldb-cmake/llvm-project/lldb/include/lldb/Breakpoint/BreakpointLocationCollection.h:30:18: note: did you mean 'bp_loc_sp'?
  /// \param[in] bp_sp
                 ^~~~~
                 bp_loc_sp
/Users/buildslave/jenkins/workspace/lldb-cmake/llvm-project/lldb/include/lldb/Breakpoint/BreakpointLocationCollection.h:69:18: warning: parameter 'breakID' not found in the function declaration [-Wdocumentation]
  /// \param[in] breakID
                 ^~~~~~~
/Users/buildslave/jenkins/workspace/lldb-cmake/llvm-project/lldb/include/lldb/Breakpoint/BreakpointLocationCollection.h:69:18: note: did you mean 'break_id'?
  /// \param[in] breakID
                 ^~~~~~~
                 break_id
/Users/buildslave/jenkins/workspace/lldb-cmake/llvm-project/lldb/include/lldb/Breakpoint/BreakpointLocationCollection.h:115:18: warning: parameter 'breakID' not found in the function declaration [-Wdocumentation]
  /// \param[in] breakID
                 ^~~~~~~
While building module 'lldb_Wrapper' imported from /Users/buildslave/jenkins/workspace/lldb-cmake/llvm-project/lldb/source/Plugins/ScriptInterpreter/Python/ScriptInterpreterPython.h:18:
In file included from <module-includes>:3:
In file included from /Users/buildslave/jenkins/workspace/lldb-cmake/llvm-project/lldb/include/lldb/Breakpoint/Breakpoint.h:19:
/Users/buildslave/jenkins/workspace/lldb-cmake/llvm-project/lldb/include/lldb/Breakpoint/BreakpointLocationList.h:79:11: warning: parameter 'A' not found in the function declaration [-Wdocumentation]
  ///     A breakpoint collection that gets any breakpoint locations
          ^
/Users/buildslave/jenkins/workspace/lldb-cmake/llvm-project/lldb/include/lldb/Breakpoint/BreakpointLocationList.h:79:11: note: did you mean 'bp_loc_list'?
  ///     A breakpoint collection that gets any breakpoint locations
          ^
          bp_loc_list
/Users/buildslave/jenkins/workspace/lldb-cmake/llvm-project/lldb/include/lldb/Breakpoint/BreakpointLocationList.h:171:18: warning: parameter 'bp_sp' not found in the function declaration [-Wdocumentation]
  /// \param[in] bp_sp
                 ^~~~~
While building module 'lldb_Wrapper' imported from /Users/buildslave/jenkins/workspace/lldb-cmake/llvm-project/lldb/source/Plugins/ScriptInterpreter/Python/ScriptInterpreterPython.h:18:
In file included from <module-includes>:3:
In file included from /Users/buildslave/jenkins/workspace/lldb-cmake/llvm-project/lldb/include/lldb/Breakpoint/Breakpoint.h:20:
In file included from /Users/buildslave/jenkins/workspace/lldb-cmake/llvm-project/lldb/include/lldb/Breakpoint/BreakpointName.h:20:
/Users/buildslave/jenkins/workspace/lldb-cmake/llvm-project/lldb/include/lldb/Breakpoint/BreakpointOptions.h:298:18: warning: parameter 'count' not found in the function declaration [-Wdocumentation]
  /// \param[in] count
                 ^~~~~
/Users/buildslave/jenkins/workspace/lldb-cmake/llvm-project/lldb/include/lldb/Breakpoint/BreakpointOptions.h:298:18: note: did you mean 'n'?
  /// \param[in] count
                 ^~~~~
                 n
While building module 'lldb_Wrapper' imported from /Users/buildslave/jenkins/workspace/lldb-cmake/llvm-project/lldb/source/Plugins/ScriptInterpreter/Python/ScriptInterpreterPython.h:18:
In file included from <module-includes>:3:
In file included from /Users/buildslave/jenkins/workspace/lldb-cmake/llvm-project/lldb/include/lldb/Breakpoint/Breakpoint.h:20:
In file included from /Users/buildslave/jenkins/workspace/lldb-cmake/llvm-project/lldb/include/lldb/Breakpoint/BreakpointName.h:22:
/Users/buildslave/jenkins/workspace/lldb-cmake/llvm-project/lldb/include/lldb/Core/SearchFilter.h:87:18: warning: parameter 'target' not found in the function declaration [-Wdocumentation]
  /// \param[in] target
                 ^~~~~~
/Users/buildslave/jenkins/workspace/lldb-cmake/llvm-project/lldb/include/lldb/Core/SearchFilter.h:87:18: note: did you mean 'target_sp'?
  /// \param[in] target
                 ^~~~~~
                 target_sp
/Users/buildslave/jenkins/workspace/lldb-cmake/llvm-project/lldb/include/lldb/Core/SearchFilter.h:105:18: warning: parameter 'module' not found in the function declaration [-Wdocumentation]
  /// \param[in] module
                 ^~~~~~
/Users/buildslave/jenkins/workspace/lldb-cmake/llvm-project/lldb/include/lldb/Core/SearchFilter.h:105:18: note: did you mean 'module_sp'?
  /// \param[in] module
                 ^~~~~~
                 module_sp
/Users/buildslave/jenkins/workspace/lldb-cmake/llvm-project/lldb/include/lldb/Core/SearchFilter.h:309:18: warning: parameter 'target' not found in the function declaration [-Wdocumentation]
  /// \param[in] target
                 ^~~~~~
/Users/buildslave/jenkins/workspace/lldb-cmake/llvm-project/lldb/include/lldb/Core/SearchFilter.h:309:18: note: did you mean 'targetSP'?
  /// \param[in] target
                 ^~~~~~
                 targetSP
/Users/buildslave/jenkins/workspace/lldb-cmake/llvm-project/lldb/include/lldb/Core/SearchFilter.h:355:18: warning: parameter 'target' not found in the function declaration [-Wdocumentation]
  /// \param[in] target
                 ^~~~~~
/Users/buildslave/jenkins/workspace/lldb-cmake/llvm-project/lldb/include/lldb/Core/SearchFilter.h:355:18: note: did you mean 'targetSP'?
  /// \param[in] target
                 ^~~~~~
                 targetSP
/Users/buildslave/jenkins/workspace/lldb-cmake/llvm-project/lldb/include/lldb/Core/SearchFilter.h:358:18: warning: parameter 'module' not found in the function declaration [-Wdocumentation]
  /// \param[in] module
                 ^~~~~~
/Users/buildslave/jenkins/workspace/lldb-cmake/llvm-project/lldb/include/lldb/Core/SearchFilter.h:408:18: warning: parameter 'target' not found in the function declaration [-Wdocumentation]
  /// \param[in] target
                 ^~~~~~
/Users/buildslave/jenkins/workspace/lldb-cmake/llvm-project/lldb/include/lldb/Core/SearchFilter.h:408:18: note: did you mean 'targetSP'?
  /// \param[in] target
                 ^~~~~~
                 targetSP
/Users/buildslave/jenkins/workspace/lldb-cmake/llvm-project/lldb/include/lldb/Core/SearchFilter.h:411:18: warning: parameter 'module' not found in the function declaration [-Wdocumentation]
  /// \param[in] module
                 ^~~~~~
While building module 'lldb_Wrapper' imported from /Users/buildslave/jenkins/workspace/lldb-cmake/llvm-project/lldb/source/Plugins/ScriptInterpreter/Python/ScriptInterpreterPython.h:18:
In file included from <module-includes>:3:
/Users/buildslave/jenkins/workspace/lldb-cmake/llvm-project/lldb/include/lldb/Breakpoint/Breakpoint.h:196:18: warning: parameter 'changed_modules' not found in the function declaration [-Wdocumentation]
  /// \param[in] changed_modules
                 ^~~~~~~~~~~~~~~
/Users/buildslave/jenkins/workspace/lldb-cmake/llvm-project/lldb/include/lldb/Breakpoint/Breakpoint.h:196:18: note: did you mean 'module_list'?
  /// \param[in] changed_modules
                 ^~~~~~~~~~~~~~~
                 module_list
/Users/buildslave/jenkins/workspace/lldb-cmake/llvm-project/lldb/include/lldb/Breakpoint/Breakpoint.h:208:18: warning: parameter 'changedModules' not found in the function declaration [-Wdocumentation]
  /// \param[in] changedModules
                 ^~~~~~~~~~~~~~
/Users/buildslave/jenkins/workspace/lldb-cmake/llvm-project/lldb/include/lldb/Breakpoint/Breakpoint.h:208:18: note: did you mean 'changed_modules'?
  /// \param[in] changedModules
                 ^~~~~~~~~~~~~~
                 changed_modules
/Users/buildslave/jenkins/workspace/lldb-cmake/llvm-project/lldb/include/lldb/Breakpoint/Breakpoint.h:376:8: warning: '\return' command used in a comment that is attached to a function returning void [-Wdocumentation]
  /// \return
      ~^~~~~~
While building module 'lldb_Wrapper' imported from /Users/buildslave/jenkins/workspace/lldb-cmake/llvm-project/lldb/source/Plugins/ScriptInterpreter/Python/ScriptInterpreterPython.h:18:
In file included from <module-includes>:4:
/Users/buildslave/jenkins/workspace/lldb-cmake/llvm-project/lldb/include/lldb/Breakpoint/BreakpointList.h:141:18: warning: parameter 'locker' not found in the function declaration [-Wdocumentation]
  /// \param[in] locker
                 ^~~~~~
/Users/buildslave/jenkins/workspace/lldb-cmake/llvm-project/lldb/include/lldb/Breakpoint/BreakpointList.h:141:18: note: did you mean 'lock'?
  /// \param[in] locker
                 ^~~~~~
                 lock
While building module 'lldb_Wrapper' imported from /Users/buildslave/jenkins/workspace/lldb-cmake/llvm-project/lldb/source/Plugins/ScriptInterpreter/Python/ScriptInterpreterPython.h:18:
In file included from <module-includes>:8:
In file included from /Users/buildslave/jenkins/workspace/lldb-cmake/llvm-project/lldb/include/lldb/Breakpoint/BreakpointResolverFileLine.h:12:
/Users/buildslave/jenkins/workspace/lldb-cmake/llvm-project/lldb/include/lldb/Breakpoint/BreakpointResolver.h:48:8: warning: '\result' command used in a comment that is attached to a constructor [-Wdocumentation]
  /// \result
      ~^~~~~~
/Users/buildslave/jenkins/workspace/lldb-cmake/llvm-project/lldb/include/lldb/Breakpoint/BreakpointResolver.h:75:18: warning: parameter 'offset' not found in the function declaration [-Wdocumentation]
  /// \param[in] offset
                 ^~~~~~
While building module 'lldb_Wrapper' imported from /Users/buildslave/jenkins/workspace/lldb-cmake/llvm-project/lldb/source/Plugins/ScriptInterpreter/Python/ScriptInterpreterPython.h:18:
In file included from <module-includes>:14:
In file included from /Users/buildslave/jenkins/workspace/lldb-cmake/llvm-project/lldb/include/lldb/Breakpoint/BreakpointSiteList.h:16:
/Users/buildslave/jenkins/workspace/lldb-cmake/llvm-project/lldb/include/lldb/Breakpoint/BreakpointSite.h:103:18: warning: parameter 'context' not found in the function declaration [-Wdocumentation]
  /// \param[in] context
                 ^~~~~~~
/Users/buildslave/jenkins/workspace/lldb-cmake/llvm-project/lldb/include/lldb/Breakpoint/BreakpointSite.h:103:18: note: did you mean 's'?
  /// \param[in] context
                 ^~~~~~~
                 s
/Users/buildslave/jenkins/workspace/lldb-cmake/llvm-project/lldb/include/lldb/Breakpoint/BreakpointSite.h:110:18: warning: parameter 'context' not found in the function declaration [-Wdocumentation]
  /// \param[in] context
                 ^~~~~~~
/Users/buildslave/jenkins/workspace/lldb-cmake/llvm-project/lldb/include/lldb/Breakpoint/BreakpointSite.h:110:18: note: did you mean 'owner'?
  /// \param[in] context
                 ^~~~~~~
                 owner
/Users/buildslave/jenkins/workspace/lldb-cmake/llvm-project/lldb/include/lldb/Breakpoint/BreakpointSite.h:126:18: warning: parameter 'index' not found in the function declaration [-Wdocumentation]
  /// \param[in] index
                 ^~~~~
/Users/buildslave/jenkins/workspace/lldb-cmake/llvm-project/lldb/include/lldb/Breakpoint/BreakpointSite.h:126:18: note: did you mean 'idx'?
  /// \param[in] index
                 ^~~~~
                 idx
/Users/buildslave/jenkins/workspace/lldb-cmake/llvm-project/lldb/include/lldb/Breakpoint/BreakpointSite.h:205:18: warning: parameter 'context' not found in the function declaration [-Wdocumentation]
  /// \param[in] context
                 ^~~~~~~
While building module 'lldb_Wrapper' imported from /Users/buildslave/jenkins/workspace/lldb-cmake/llvm-project/lldb/source/Plugins/ScriptInterpreter/Python/ScriptInterpreterPython.h:18:
In file included from <module-includes>:16:
/Users/buildslave/jenkins/workspace/lldb-cmake/llvm-project/lldb/include/lldb/Breakpoint/WatchpointList.h:183:18: warning: parameter 'locker' not found in the function declaration [-Wdocumentation]
  /// \param[in] locker
                 ^~~~~~
/Users/buildslave/jenkins/workspace/lldb-cmake/llvm-project/lldb/include/lldb/Breakpoint/WatchpointList.h:183:18: note: did you mean 'lock'?
  /// \param[in] locker
                 ^~~~~~
                 lock
While building module 'lldb_Wrapper' imported from /Users/buildslave/jenkins/workspace/lldb-cmake/llvm-project/lldb/source/Plugins/ScriptInterpreter/Python/ScriptInterpreterPython.h:18:
In file included from <module-includes>:17:
In file included from /Users/buildslave/jenkins/workspace/lldb-cmake/llvm-project/lldb/include/lldb/Breakpoint/BreakpointResolverName.h:16:
In file included from /Users/buildslave/jenkins/workspace/lldb-cmake/llvm-project/lldb/include/lldb/Core/Module.h:14:
In file included from /Users/buildslave/jenkins/workspace/lldb-cmake/llvm-project/lldb/include/lldb/Symbol/ObjectFile.h:13:
/Users/buildslave/jenkins/workspace/lldb-cmake/llvm-project/lldb/include/lldb/Core/ModuleChild.h:23:18: warning: parameter 'module' not found in the function declaration [-Wdocumentation]
  /// \param[in] module
                 ^~~~~~
/Users/buildslave/jenkins/workspace/lldb-cmake/llvm-project/lldb/include/lldb/Core/ModuleChild.h:23:18: note: did you mean 'module_sp'?
  /// \param[in] module
                 ^~~~~~
                 module_sp
/Users/buildslave/jenkins/workspace/lldb-cmake/llvm-project/lldb/include/lldb/Core/ModuleChild.h:49:18: warning: parameter 'module' not found in the function declaration [-Wdocumentation]
  /// \param[in] module
                 ^~~~~~
/Users/buildslave/jenkins/workspace/lldb-cmake/llvm-project/lldb/include/lldb/Core/ModuleChild.h:49:18: note: did you mean 'module_sp'?
  /// \param[in] module
                 ^~~~~~
                 module_sp
While building module 'lldb_Wrapper' imported from /Users/buildslave/jenkins/workspace/lldb-cmake/llvm-project/lldb/source/Plugins/ScriptInterpreter/Python/ScriptInterpreterPython.h:18:
In file included from <module-includes>:17:
In file included from /Users/buildslave/jenkins/workspace/lldb-cmake/llvm-project/lldb/include/lldb/Breakpoint/BreakpointResolverName.h:16:
In file included from /Users/buildslave/jenkins/workspace/lldb-cmake/llvm-project/lldb/include/lldb/Core/Module.h:14:
In file included from /Users/buildslave/jenkins/workspace/lldb-cmake/llvm-project/lldb/include/lldb/Symbol/ObjectFile.h:15:
In file included from /Users/buildslave/jenkins/workspace/lldb-cmake/llvm-project/lldb/include/lldb/Symbol/Symtab.h:13:
In file included from /Users/buildslave/jenkins/workspace/lldb-cmake/llvm-project/lldb/include/lldb/Symbol/Symbol.h:13:
/Users/buildslave/jenkins/workspace/lldb-cmake/llvm-project/lldb/include/lldb/Core/Mangled.h:110:14: warning: empty paragraph passed to '\return' command [-Wdocumentation]
  /// \return
      ~~~~~~~^
While building module 'lldb_Wrapper' imported from /Users/buildslave/jenkins/workspace/lldb-cmake/llvm-project/lldb/source/Plugins/ScriptInterpreter/Python/ScriptInterpreterPython.h:18:
In file included from <module-includes>:17:
In file included from /Users/buildslave/jenkins/workspace/lldb-cmake/llvm-project/lldb/include/lldb/Breakpoint/BreakpointResolverName.h:16:
In file included from /Users/buildslave/jenkins/workspace/lldb-cmake/llvm-project/lldb/include/lldb/Core/Module.h:14:
/Users/buildslave/jenkins/workspace/lldb-cmake/llvm-project/lldb/include/lldb/Symbol/ObjectFile.h:133:18: warning: parameter 'module' not found in the function declaration [-Wdocumentation]
  /// \param[in] module
                 ^~~~~~
/Users/buildslave/jenkins/workspace/lldb-cmake/llvm-project/lldb/include/lldb/Symbol/ObjectFile.h:161:18: warning: parameter 'module' not found in the function declaration [-Wdocumentation]
  /// \param[in] module
                 ^~~~~~
/Users/buildslave/jenkins/workspace/lldb-cmake/llvm-project/lldb/include/lldb/Symbol/ObjectFile.h:364:8: warning: '\return' command used in a comment that is attached to a function returning void [-Wdocumentation]
  /// \return
      ~^~~~~~
/Users/buildslave/jenkins/workspace/lldb-cmake/llvm-project/lldb/include/lldb/Symbol/ObjectFile.h:360:18: warning: parameter 'flags' not found in the function declaration [-Wdocumentation]
  /// \param[in] flags
                 ^~~~~
/Users/buildslave/jenkins/workspace/lldb-cmake/llvm-project/lldb/include/lldb/Symbol/ObjectFile.h:656:14: warning: empty paragraph passed to '\return' command [-Wdocumentation]
  /// \return
      ~~~~~~~^
While building module 'lldb_Wrapper' imported from /Users/buildslave/jenkins/workspace/lldb-cmake/llvm-project/lldb/source/Plugins/ScriptInterpreter/Python/ScriptInterpreterPython.h:18:
In file included from <module-includes>:17:
In file included from /Users/buildslave/jenkins/workspace/lldb-cmake/llvm-project/lldb/include/lldb/Breakpoint/BreakpointResolverName.h:16:
/Users/buildslave/jenkins/workspace/lldb-cmake/llvm-project/lldb/include/lldb/Core/Module.h:294:18: warning: parameter 'namespace_decl' not found in the function declaration [-Wdocumentation]
  /// \param[in] namespace_decl
                 ^~~~~~~~~~~~~~
/Users/buildslave/jenkins/workspace/lldb-cmake/llvm-project/lldb/include/lldb/Core/Module.h:320:18: warning: parameter 'append' not found in the function declaration [-Wdocumentation]
  /// \param[in] append
                 ^~~~~~
/Users/buildslave/jenkins/workspace/lldb-cmake/llvm-project/lldb/include/lldb/Core/Module.h:419:19: warning: parameter 'type_list' not found in the function declaration [-Wdocumentation]
  /// \param[out] type_list
                  ^~~~~~~~~
/Users/buildslave/jenkins/workspace/lldb-cmake/llvm-project/lldb/include/lldb/Core/Module.h:450:18: warning: parameter 'namespace_decl' not found in the function declaration [-Wdocumentation]
  /// \param[in] namespace_decl
                 ^~~~~~~~~~~~~~
While building module 'lldb_Wrapper' imported from /Users/buildslave/jenkins/workspace/lldb-cmake/llvm-project/lldb/source/Plugins/ScriptInterpreter/Python/ScriptInterpreterPython.h:18:
In file included from <module-includes>:20:
In file included from /Users/buildslave/jenkins/workspace/lldb-cmake/llvm-project/lldb/include/lldb/Breakpoint/Watchpoint.h:18:
In file included from /Users/buildslave/jenkins/workspace/lldb-cmake/llvm-project/lldb/include/lldb/Target/Target.h:22:
In file included from /Users/buildslave/jenkins/workspace/lldb-cmake/llvm-project/lldb/include/lldb/Core/Disassembler.h:18:
/Users/buildslave/jenkins/workspace/lldb-cmake/llvm-project/lldb/include/lldb/Symbol/LineEntry.h:45:18: warning: parameter 'comp_unit' not found in the function declaration [-Wdocumentation]
  /// \param[in] comp_unit
                 ^~~~~~~~~
/Users/buildslave/jenkins/workspace/lldb-cmake/llvm-project/lldb/include/lldb/Symbol/LineEntry.h:78:18: warning: parameter 'comp_unit' not found in the function declaration [-Wdocumentation]
  /// \param[in] comp_unit
                 ^~~~~~~~~
/Users/buildslave/jenkins/workspace/lldb-cmake/llvm-project/lldb/include/lldb/Symbol/LineEntry.h:78:18: note: did you mean 'show_fullpaths'?
  /// \param[in] comp_unit
                 ^~~~~~~~~
                 show_fullpaths
/Users/buildslave/jenkins/workspace/lldb-cmake/llvm-project/lldb/include/lldb/Symbol/LineEntry.h:104:14: warning: empty paragraph passed to '\return' command [-Wdocumentation]
  /// \return
      ~~~~~~~^
While building module 'lldb_Wrapper' imported from /Users/buildslave/jenkins/workspace/lldb-cmake/llvm-project/lldb/source/Plugins/ScriptInterpreter/Python/ScriptInterpreterPython.h:18:
In file included from <module-includes>:20:
In file included from /Users/buildslave/jenkins/workspace/lldb-cmake/llvm-project/lldb/include/lldb/Breakpoint/Watchpoint.h:18:
In file included from /Users/buildslave/jenkins/workspace/lldb-cmake/llvm-project/lldb/include/lldb/Target/Target.h:23:
/Users/buildslave/jenkins/workspace/lldb-cmake/llvm-project/lldb/include/lldb/Core/ModuleList.h:138:26: warning: empty paragraph passed to '\param' command [-Wdocumentation]
  /// \param[in] module_sp
      ~~~~~~~~~~~~~~~~~~~^
/Users/buildslave/jenkins/workspace/lldb-cmake/llvm-project/lldb/include/lldb/Core/ModuleList.h:300:18: warning: parameter 'file_spec_ptr' not found in the function declaration [-Wdocumentation]
  /// \param[in] file_spec_ptr
                 ^~~~~~~~~~~~~
/Users/buildslave/jenkins/workspace/lldb-cmake/llvm-project/lldb/include/lldb/Core/ModuleList.h:300:18: note: did you mean 'module_spec'?
  /// \param[in] file_spec_ptr
                 ^~~~~~~~~~~~~
                 module_spec
/Users/buildslave/jenkins/workspace/lldb-cmake/llvm-project/lldb/include/lldb/Core/ModuleList.h:308:18: warning: parameter 'arch_ptr' not found in the function declaration [-Wdocumentation]
  /// \param[in] arch_ptr
                 ^~~~~~~~
/Users/buildslave/jenkins/workspace/lldb-cmake/llvm-project/lldb/include/lldb/Core/ModuleList.h:308:18: note: did you mean 'module_spec'?
  /// \param[in] arch_ptr
                 ^~~~~~~~
                 module_spec
/Users/buildslave/jenkins/workspace/lldb-cmake/llvm-project/lldb/include/lldb/Core/ModuleList.h:312:18: warning: parameter 'uuid_ptr' not found in the function declaration [-Wdocumentation]
  /// \param[in] uuid_ptr
                 ^~~~~~~~
/Users/buildslave/jenkins/workspace/lldb-cmake/llvm-project/lldb/include/lldb/Core/ModuleList.h:312:18: note: did you mean 'module_spec'?
  /// \param[in] uuid_ptr
                 ^~~~~~~~
                 module_spec
/Users/buildslave/jenkins/workspace/lldb-cmake/llvm-project/lldb/include/lldb/Core/ModuleList.h:316:18: warning: parameter 'object_name' not found in the function declaration [-Wdocumentation]
  /// \param[in] object_name
                 ^~~~~~~~~~~
/Users/buildslave/jenkins/workspace/lldb-cmake/llvm-project/lldb/include/lldb/Core/ModuleList.h:316:18: note: did you mean 'module_spec'?
  /// \param[in] object_name
                 ^~~~~~~~~~~
                 module_spec
/Users/buildslave/jenkins/workspace/lldb-cmake/llvm-project/lldb/include/lldb/Core/ModuleList.h:354:18: warning: parameter 'append' not found in the function declaration [-Wdocumentation]
  /// \param[in] append
                 ^~~~~~
/Users/buildslave/jenkins/workspace/lldb-cmake/llvm-project/lldb/include/lldb/Core/ModuleList.h:363:18: warning: parameter 'encoding' not found in the function declaration [-Wdocumentation]
  /// \param[in] encoding
                 ^~~~~~~~
/Users/buildslave/jenkins/workspace/lldb-cmake/llvm-project/lldb/include/lldb/Core/ModuleList.h:367:18: warning: parameter 'udt_name' not found in the function declaration [-Wdocumentation]
  /// \param[in] udt_name
                 ^~~~~~~~
/Users/buildslave/jenkins/workspace/lldb-cmake/llvm-project/lldb/include/lldb/Core/ModuleList.h:371:19: warning: parameter 'type_list' not found in the function declaration [-Wdocumentation]
  /// \param[out] type_list
                  ^~~~~~~~~
While building module 'lldb_Wrapper' imported from /Users/buildslave/jenkins/workspace/lldb-cmake/llvm-project/lldb/source/Plugins/ScriptInterpreter/Python/ScriptInterpreterPython.h:18:
In file included from <module-includes>:20:
In file included from /Users/buildslave/jenkins/workspace/lldb-cmake/llvm-project/lldb/include/lldb/Breakpoint/Watchpoint.h:18:
/Users/buildslave/jenkins/workspace/lldb-cmake/llvm-project/lldb/include/lldb/Target/Target.h:909:18: warning: parameter 'module_sp' not found in the function declaration [-Wdocumentation]
  /// \param[in] module_sp
                 ^~~~~~~~~
/Users/buildslave/jenkins/workspace/lldb-cmake/llvm-project/lldb/include/lldb/Target/Target.h:909:18: note: did you mean 'module_spec'?
  /// \param[in] module_sp
                 ^~~~~~~~~
                 module_spec
While building module 'lldb_Wrapper' imported from /Users/buildslave/jenkins/workspace/lldb-cmake/llvm-project/lldb/source/Plugins/ScriptInterpreter/Python/ScriptInterpreterPython.h:18:
In file included from <module-includes>:20:
/Users/buildslave/jenkins/workspace/lldb-cmake/llvm-project/lldb/include/lldb/Breakpoint/Watchpoint.h:117:8: warning: '\return' command used in a comment that is attached to a function returning void [-Wdocumentation]
  /// \return
      ~^~~~~~
While building module 'lldb_Wrapper' imported from /Users/buildslave/jenkins/workspace/lldb-cmake/llvm-project/lldb/source/Plugins/ScriptInterpreter/Python/ScriptInterpreterPython.h:18:
In file included from <module-includes>:23:
/Users/buildslave/jenkins/workspace/lldb-cmake/llvm-project/lldb/include/lldb/Breakpoint/BreakpointLocation.h:96:18: warning: parameter 'count' not found in the function declaration [-Wdocumentation]
  /// \param[in] count
                 ^~~~~
/Users/buildslave/jenkins/workspace/lldb-cmake/llvm-project/lldb/include/lldb/Breakpoint/BreakpointLocation.h:96:18: note: did you mean 'n'?
  /// \param[in] count
                 ^~~~~
                 n
/Users/buildslave/jenkins/workspace/lldb-cmake/llvm-project/lldb/include/lldb/Breakpoint/BreakpointLocation.h:227:18: warning: parameter 'bp_loc_id' not found in the function declaration [-Wdocumentation]
  /// \param[in] bp_loc_id
                 ^~~~~~~~~
While building module 'lldb_Wrapper' imported from /Users/buildslave/jenkins/workspace/lldb-cmake/llvm-project/lldb/source/Plugins/ScriptInterpreter/Python/ScriptInterpreterPython.h:18:
In file included from <module-includes>:32:
In file included from /Users/buildslave/jenkins/workspace/lldb-cmake/llvm-project/lldb/include/lldb/Core/ValueObjectCast.h:12:
In file included from /Users/buildslave/jenkins/workspace/lldb-cmake/llvm-project/lldb/include/lldb/Core/ValueObject.h:14:
In file included from /Users/buildslave/jenkins/workspace/lldb-cmake/llvm-project/lldb/include/lldb/Symbol/Type.h:14:
/Users/buildslave/jenkins/workspace/lldb-cmake/llvm-project/lldb/include/lldb/Symbol/Declaration.h:94:14: warning: empty paragraph passed to '\return' command [-Wdocumentation]
  /// \return
      ~~~~~~~^
While building module 'lldb_Wrapper' imported from /Users/buildslave/jenkins/workspace/lldb-cmake/llvm-project/lldb/source/Plugins/ScriptInterpreter/Python/ScriptInterpreterPython.h:18:
In file included from <module-includes>:32:
In file included from /Users/buildslave/jenkins/workspace/lldb-cmake/llvm-project/lldb/include/lldb/Core/ValueObjectCast.h:12:
In file included from /Users/buildslave/jenkins/workspace/lldb-cmake/llvm-project/lldb/include/lldb/Core/ValueObject.h:16:
In file included from /Users/buildslave/jenkins/workspace/lldb-cmake/llvm-project/lldb/include/lldb/Target/Process.h:33:
/Users/buildslave/jenkins/workspace/lldb-cmake/llvm-project/lldb/include/lldb/Interpreter/Options.h:166:13: warning: unrecognized parameter passing direction, valid directions are '[in]', '[out]' and '[in,out]' [-Wdocumentation]
  /// \param[in/out] request
            ^~~~~~~~
/Users/buildslave/jenkins/workspace/lldb-cmake/llvm-project/lldb/include/lldb/Interpreter/Options.h:185:13: warning: unrecognized parameter passing direction, valid directions are '[in]', '[out]' and '[in,out]' [-Wdocumentation]
  /// \param[in/out] request
            ^~~~~~~~
While building module 'lldb_Wrapper' imported from /Users/buildslave/jenkins/workspace/lldb-cmake/llvm-project/lldb/source/Plugins/ScriptInterpreter/Python/ScriptInterpreterPython.h:18:
In file included from <module-includes>:32:
In file included from /Users/buildslave/jenkins/workspace/lldb-cmake/llvm-project/lldb/include/lldb/Core/ValueObjectCast.h:12:
In file included from /Users/buildslave/jenkins/workspace/lldb-cmake/llvm-project/lldb/include/lldb/Core/ValueObject.h:16:
In file included from /Users/buildslave/jenkins/workspace/lldb-cmake/llvm-project/lldb/include/lldb/Target/Process.h:39:
In file included from /Users/buildslave/jenkins/workspace/lldb-cmake/llvm-project/lldb/include/lldb/Target/ThreadList.h:15:
In file included from /Users/buildslave/jenkins/workspace/lldb-cmake/llvm-project/lldb/include/lldb/Target/Thread.h:20:
In file included from /Users/buildslave/jenkins/workspace/lldb-cmake/llvm-project/lldb/include/lldb/Target/StackFrameList.h:16:
In file included from /Users/buildslave/jenkins/workspace/lldb-cmake/llvm-project/lldb/include/lldb/Target/StackFrame.h:18:
/Users/buildslave/jenkins/workspace/lldb-cmake/llvm-project/lldb/include/lldb/Symbol/SymbolContext.h:54:18: warning: parameter 'module' not found in the function declaration [-Wdocumentation]
  /// \param[in] module
                 ^~~~~~
/Users/buildslave/jenkins/workspace/lldb-cmake/llvm-project/lldb/include/lldb/Symbol/SymbolContext.h:270:18: warning: parameter 'prefer_mangled' not found in the function declaration [-Wdocumentation]
  /// \param[in] prefer_mangled
                 ^~~~~~~~~~~~~~
/Users/buildslave/jenkins/workspace/lldb-cmake/llvm-project/lldb/include/lldb/Symbol/SymbolContext.h:270:18: note: did you mean 'preference'?
  /// \param[in] prefer_mangled
                 ^~~~~~~~~~~~~~
                 preference
/Users/buildslave/jenkins/workspace/lldb-cmake/llvm-project/lldb/include/lldb/Symbol/SymbolContext.h:290:18: warning: parameter 'prefer_mangled' not found in the function declaration [-Wdocumentation]
  /// \param[in] prefer_mangled
                 ^~~~~~~~~~~~~~
/Users/buildslave/jenkins/workspace/lldb-cmake/llvm-project/lldb/include/lldb/Symbol/SymbolContext.h:310:19: warning: parameter 'next_frame_addr' not found in the function declaration [-Wdocumentation]
  /// \param[out] next_frame_addr
                  ^~~~~~~~~~~~~~~
/Users/buildslave/jenkins/workspace/lldb-cmake/llvm-project/lldb/include/lldb/Symbol/SymbolContext.h:310:19: note: did you mean 'inlined_frame_addr'?
  /// \param[out] next_frame_addr
                  ^~~~~~~~~~~~~~~
                  inlined_frame_addr
While building module 'lldb_Wrapper' imported from /Users/buildslave/jenkins/workspace/lldb-cmake/llvm-project/lldb/source/Plugins/ScriptInterpreter/Python/ScriptInterpreterPython.h:18:
In file included from <module-includes>:32:
In file included from /Users/buildslave/jenkins/workspace/lldb-cmake/llvm-project/lldb/include/lldb/Core/ValueObjectCast.h:12:
In file included from /Users/buildslave/jenkins/workspace/lldb-cmake/llvm-project/lldb/include/lldb/Core/ValueObject.h:16:
In file included from /Users/buildslave/jenkins/workspace/lldb-cmake/llvm-project/lldb/include/lldb/Target/Process.h:39:
In file included from /Users/buildslave/jenkins/workspace/lldb-cmake/llvm-project/lldb/include/lldb/Target/ThreadList.h:15:
In file included from /Users/buildslave/jenkins/workspace/lldb-cmake/llvm-project/lldb/include/lldb/Target/Thread.h:20:
In file included from /Users/buildslave/jenkins/workspace/lldb-cmake/llvm-project/lldb/include/lldb/Target/StackFrameList.h:16:
/Users/buildslave/jenkins/workspace/lldb-cmake/llvm-project/lldb/include/lldb/Target/StackFrame.h:102:28: warning: empty paragraph passed to '\param' command [-Wdocumentation]
  /// \param [in] frame_kind
      ~~~~~~~~~~~~~~~~~~~~~^
/Users/buildslave/jenkins/workspace/lldb-cmake/llvm-project/lldb/include/lldb/Target/StackFrame.h:294:14: warning: empty paragraph passed to '\return' command [-Wdocumentation]
  /// \return
      ~~~~~~~^
/Users/buildslave/jenkins/workspace/lldb-cmake/llvm-project/lldb/include/lldb/Target/StackFrame.h:302:14: warning: empty paragraph passed to '\return' command [-Wdocumentation]
  /// \return
      ~~~~~~~^
/Users/buildslave/jenkins/workspace/lldb-cmake/llvm-project/lldb/include/lldb/Target/StackFrame.h:409:14: warning: empty paragraph passed to '\return' command [-Wdocumentation]
  /// \return
      ~~~~~~~^
/Users/buildslave/jenkins/workspace/lldb-cmake/llvm-project/lldb/include/lldb/Target/StackFrame.h:426:14: warning: empty paragraph passed to '\return' command [-Wdocumentation]
  /// \return
      ~~~~~~~^
While building module 'lldb_Wrapper' imported from /Users/buildslave/jenkins/workspace/lldb-cmake/llvm-project/lldb/source/Plugins/ScriptInterpreter/Python/ScriptInterpreterPython.h:18:
In file included from <module-includes>:32:
In file included from /Users/buildslave/jenkins/workspace/lldb-cmake/llvm-project/lldb/include/lldb/Core/ValueObjectCast.h:12:
In file included from /Users/buildslave/jenkins/workspace/lldb-cmake/llvm-project/lldb/include/lldb/Core/ValueObject.h:16:
In file included from /Users/buildslave/jenkins/workspace/lldb-cmake/llvm-project/lldb/include/lldb/Target/Process.h:39:
In file included from /Users/buildslave/jenkins/workspace/lldb-cmake/llvm-project/lldb/include/lldb/Target/ThreadList.h:15:
/Users/buildslave/jenkins/workspace/lldb-cmake/llvm-project/lldb/include/lldb/Target/Thread.h:131:25: warning: empty paragraph passed to '\param' command [-Wdocumentation]
  /// \param [in] process
      ~~~~~~~~~~~~~~~~~~^
/Users/buildslave/jenkins/workspace/lldb-cmake/llvm-project/lldb/include/lldb/Target/Thread.h:133:21: warning: empty paragraph passed to '\param' command [-Wdocumentation]
  /// \param [in] tid
      ~~~~~~~~~~~~~~^
/Users/buildslave/jenkins/workspace/lldb-cmake/llvm-project/lldb/include/lldb/Target/Thread.h:762:26: warning: empty paragraph passed to '\param' command [-Wdocumentation]
  /// \param[in] stop_vote
      ~~~~~~~~~~~~~~~~~~~^
/Users/buildslave/jenkins/workspace/lldb-cmake/llvm-project/lldb/include/lldb/Target/Thread.h:809:26: warning: empty paragraph passed to '\param' command [-Wdocumentation]
  /// \param[in] stop_vote
      ~~~~~~~~~~~~~~~~~~~^
/Users/buildslave/jenkins/workspace/lldb-cmake/llvm-project/lldb/include/lldb/Target/Thread.h:814:26: warning: empty paragraph passed to '\param' command [-Wdocumentation]
  /// \param[in] frame_idx
      ~~~~~~~~~~~~~~~~~~~^
/Users/buildslave/jenkins/workspace/lldb-cmake/llvm-project/lldb/include/lldb/Target/Thread.h:1007:18: warning: parameter 'up_to_plan_sp' not found in the function declaration [-Wdocumentation]
  /// \param[in] up_to_plan_sp
                 ^~~~~~~~~~~~~
/Users/buildslave/jenkins/workspace/lldb-cmake/llvm-project/lldb/include/lldb/Target/Thread.h:1007:18: note: did you mean 'thread_index'?
  /// \param[in] up_to_plan_sp
                 ^~~~~~~~~~~~~
                 thread_index
/Users/buildslave/jenkins/workspace/lldb-cmake/llvm-project/lldb/include/lldb/Target/Thread.h:184:8: warning: '\return' command used in a comment that is attached to a function returning void [-Wdocumentation]
  /// \return
      ~^~~~~~
/Users/buildslave/jenkins/workspace/lldb-cmake/llvm-project/lldb/include/lldb/Target/Thread.h:1154:23: warning: empty paragraph passed to '\param' command [-Wdocumentation]
  /// \param [in] token
      ~~~~~~~~~~~~~~~~^
While building module 'lldb_Wrapper' imported from /Users/buildslave/jenkins/workspace/lldb-cmake/llvm-project/lldb/source/Plugins/ScriptInterpreter/Python/ScriptInterpreterPython.h:18:
In file included from <module-includes>:32:
In file included from /Users/buildslave/jenkins/workspace/lldb-cmake/llvm-project/lldb/include/lldb/Core/ValueObjectCast.h:12:
In file included from /Users/buildslave/jenkins/workspace/lldb-cmake/llvm-project/lldb/include/lldb/Core/ValueObject.h:16:
/Users/buildslave/jenkins/workspace/lldb-cmake/llvm-project/lldb/include/lldb/Target/Process.h:523:18: warning: parameter 'module_sp' not found in the function declaration [-Wdocumentation]
  /// \param[in] module_sp
                 ^~~~~~~~~
/Users/buildslave/jenkins/workspace/lldb-cmake/llvm-project/lldb/include/lldb/Target/Process.h:717:18: warning: parameter 'pid' not found in the function declaration [-Wdocumentation]
  /// \param[in] pid
                 ^~~
/Users/buildslave/jenkins/workspace/lldb-cmake/llvm-project/lldb/include/lldb/Target/Process.h:717:18: note: did you mean 'attach_info'?
  /// \param[in] pid
                 ^~~
                 attach_info
/Users/buildslave/jenkins/workspace/lldb-cmake/llvm-project/lldb/include/lldb/Target/Process.h:1725:13: warning: unrecognized parameter passing direction, valid directions are '[in]', '[out]' and '[in,out]' [-Wdocumentation]
  /// \param[in/out] error
            ^~~~~~~~
/Users/buildslave/jenkins/workspace/lldb-cmake/llvm-project/lldb/include/lldb/Target/Process.h:2174:18: warning: parameter 'listener' not found in the function declaration [-Wdocumentation]
  /// \param[in] listener
                 ^~~~~~~~
/Users/buildslave/jenkins/workspace/lldb-cmake/llvm-project/lldb/include/lldb/Target/Process.h:2174:18: note: did you mean 'listener_sp'?
  /// \param[in] listener
                 ^~~~~~~~
                 listener_sp
/Users/buildslave/jenkins/workspace/lldb-cmake/llvm-project/lldb/include/lldb/Target/Process.h:2375:18: warning: parameter 'config' not found in the function declaration [-Wdocumentation]
  /// \param[in] config
                 ^~~~~~
/Users/buildslave/jenkins/workspace/lldb-cmake/llvm-project/lldb/include/lldb/Target/Process.h:2375:18: note: did you mean 'config_sp'?
  /// \param[in] config
                 ^~~~~~
                 config_sp
/Users/buildslave/jenkins/workspace/lldb-cmake/llvm-project/lldb/include/lldb/Target/Process.h:1394:14: warning: empty paragraph passed to '\return' command [-Wdocumentation]
  /// \return
      ~~~~~~~^
While building module 'lldb_Wrapper' imported from /Users/buildslave/jenkins/workspace/lldb-cmake/llvm-project/lldb/source/Plugins/ScriptInterpreter/Python/ScriptInterpreterPython.h:18:
In file included from <module-includes>:44:
/Users/buildslave/jenkins/workspace/lldb-cmake/llvm-project/lldb/include/lldb/Core/Highlighter.h:46:21: warning: empty paragraph passed to '\param' command [-Wdocumentation]
    /// \param prefix
        ~~~~~~~~~~~~^
/Users/buildslave/jenkins/workspace/lldb-cmake/llvm-project/lldb/include/lldb/Core/Highlighter.h:47:21: warning: empty paragraph passed to '\param' command [-Wdocumentation]
    /// \param suffix
        ~~~~~~~~~~~~^
/Users/buildslave/jenkins/workspace/lldb-cmake/llvm-project/lldb/include/lldb/Core/Highlighter.h:102:20: warning: empty paragraph passed to '\param' command [-Wdocumentation]
  /// \param options
      ~~~~~~~~~~~~~^
While building module 'lldb_Wrapper' imported from /Users/buildslave/jenkins/workspace/lldb-cmake/llvm-project/lldb/source/Plugins/ScriptInterpreter/Python/ScriptInterpreterPython.h:18:
In file included from <module-includes>:54:
In file included from /Users/buildslave/jenkins/workspace/lldb-cmake/llvm-project/lldb/include/lldb/Core/Debugger.h:25:
/Users/buildslave/jenkins/workspace/lldb-cmake/llvm-project/lldb/include/lldb/Target/Platform.h:383:18: warning: parameter 'pid' not found in the function declaration [-Wdocumentation]
  /// \param[in] pid
                 ^~~
/Users/buildslave/jenkins/workspace/lldb-cmake/llvm-project/lldb/include/lldb/Target/Platform.h:780:18: warning: parameter 'path_list' not found in the function declaration [-Wdocumentation]
  /// \param[in] path_list
                 ^~~~~~~~~
/Users/buildslave/jenkins/workspace/lldb-cmake/llvm-project/lldb/include/lldb/Target/Platform.h:780:18: note: did you mean 'paths'?
  /// \param[in] path_list
                 ^~~~~~~~~
                 paths
While building module 'lldb_Wrapper' imported from /Users/buildslave/jenkins/workspace/lldb-cmake/llvm-project/lldb/source/Plugins/ScriptInterpreter/Python/ScriptInterpreterPython.h:18:
In file included from <module-includes>:54:
In file included from /Users/buildslave/jenkins/workspace/lldb-cmake/llvm-project/lldb/include/lldb/Core/Debugger.h:26:
/Users/buildslave/jenkins/workspace/lldb-cmake/llvm-project/lldb/include/lldb/Target/TargetList.h:58:18: warning: parameter 'file_spec' not found in the function declaration [-Wdocumentation]
  /// \param[in] file_spec
                 ^~~~~~~~~
/Users/buildslave/jenkins/workspace/lldb-cmake/llvm-project/lldb/include/lldb/Target/TargetList.h:63:18: warning: parameter 'triple_cstr' not found in the function declaration [-Wdocumentation]
  /// \param[in] triple_cstr
                 ^~~~~~~~~~~
/Users/buildslave/jenkins/workspace/lldb-cmake/llvm-project/lldb/include/lldb/Target/TargetList.h:63:18: note: did you mean 'triple_str'?
  /// \param[in] triple_cstr
                 ^~~~~~~~~~~
                 triple_str
While building module 'lldb_Wrapper' imported from /Users/buildslave/jenkins/workspace/lldb-cmake/llvm-project/lldb/source/Plugins/ScriptInterpreter/Python/ScriptInterpreterPython.h:18:
In file included from <module-includes>:105:
/Users/buildslave/jenkins/workspace/lldb-cmake/llvm-project/lldb/include/lldb/Expression/UserExpression.h:50:18: warning: parameter 'expr_prefix' not found in the function declaration [-Wdocumentation]
  /// \param[in] expr_prefix
                 ^~~~~~~~~~~
/Users/buildslave/jenkins/workspace/lldb-cmake/llvm-project/lldb/include/lldb/Expression/UserExpression.h:169:18: warning: parameter 'function_stack_pointer' not found in the function declaration [-Wdocumentation]
  /// \param[in] function_stack_pointer
                 ^~~~~~~~~~~~~~~~~~~~~~
/Users/buildslave/jenkins/workspace/lldb-cmake/llvm-project/lldb/include/lldb/Expression/UserExpression.h:169:18: note: did you mean 'function_stack_bottom'?
  /// \param[in] function_stack_pointer
                 ^~~~~~~~~~~~~~~~~~~~~~
                 function_stack_bottom
While building module 'lldb_Wrapper' imported from /Users/buildslave/jenkins/workspace/lldb-cmake/llvm-project/lldb/source/Plugins/ScriptInterpreter/Python/ScriptInterpreterPython.h:18:
In file included from <module-includes>:107:
/Users/buildslave/jenkins/workspace/lldb-cmake/llvm-project/lldb/include/lldb/Expression/DWARFExpression.h:187:18: warning: parameter 'expr_locals' not found in the function declaration [-Wdocumentation]
  /// \param[in] expr_locals
                 ^~~~~~~~~~~
/Users/buildslave/jenkins/workspace/lldb-cmake/llvm-project/lldb/include/lldb/Expression/DWARFExpression.h:194:18: warning: parameter 'decl_map' not found in the function declaration [-Wdocumentation]
  /// \param[in] decl_map
                 ^~~~~~~~
/Users/buildslave/jenkins/workspace/lldb-cmake/llvm-project/lldb/include/lldb/Expression/DWARFExpression.h:254:18: warning: parameter 'stream' not found in the function declaration [-Wdocumentation]
  /// \param[in] stream
                 ^~~~~~
/Users/buildslave/jenkins/workspace/lldb-cmake/llvm-project/lldb/include/lldb/Expression/DWARFExpression.h:254:18: note: did you mean 's'?
  /// \param[in] stream
                 ^~~~~~
                 s
While building module 'lldb_Wrapper' imported from /Users/buildslave/jenkins/workspace/lldb-cmake/llvm-project/lldb/source/Plugins/ScriptInterpreter/Python/ScriptInterpreterPython.h:18:
In file included from <module-includes>:111:
/Users/buildslave/jenkins/workspace/lldb-cmake/llvm-project/lldb/include/lldb/Expression/ExpressionParser.h:32:18: warning: parameter 'exe_scope,' not found in the function declaration [-Wdocumentation]
  /// \param[in] exe_scope,
                 ^~~~~~~~~~
/Users/buildslave/jenkins/workspace/lldb-cmake/llvm-project/lldb/include/lldb/Expression/ExpressionParser.h:32:18: note: did you mean 'exe_scope'?
  /// \param[in] exe_scope,
                 ^~~~~~~~~~
                 exe_scope
While building module 'lldb_Wrapper' imported from /Users/buildslave/jenkins/workspace/lldb-cmake/llvm-project/lldb/source/Plugins/ScriptInterpreter/Python/ScriptInterpreterPython.h:18:
In file included from <module-includes>:112:
/Users/buildslave/jenkins/workspace/lldb-cmake/llvm-project/lldb/include/lldb/Expression/FunctionCaller.h:70:18: warning: parameter 'ast_context' not found in the function declaration [-Wdocumentation]
  /// \param[in] ast_context
                 ^~~~~~~~~~~
/Users/buildslave/jenkins/workspace/lldb-cmake/llvm-project/lldb/include/lldb/Expression/FunctionCaller.h:73:18: warning: parameter 'return_qualtype' not found in the function declaration [-Wdocumentation]
  /// \param[in] return_qualtype
                 ^~~~~~~~~~~~~~~
/Users/buildslave/jenkins/workspace/lldb-cmake/llvm-project/lldb/include/lldb/Expression/FunctionCaller.h:73:18: note: did you mean 'return_type'?
  /// \param[in] return_qualtype
                 ^~~~~~~~~~~~~~~
                 return_type
/Users/buildslave/jenkins/workspace/lldb-cmake/llvm-project/lldb/include/lldb/Expression/FunctionCaller.h:227:18: warning: parameter 'func_addr' not found in the function declaration [-Wdocumentation]
  /// \param[in] func_addr
                 ^~~~~~~~~
/Users/buildslave/jenkins/workspace/lldb-cmake/llvm-project/lldb/include/lldb/Expression/FunctionCaller.h:227:18: note: did you mean 'options'?
  /// \param[in] func_addr
                 ^~~~~~~~~
                 options
/Users/buildslave/jenkins/workspace/lldb-cmake/llvm-project/lldb/include/lldb/Expression/FunctionCaller.h:236:18: warning: parameter 'stop_others' not found in the function declaration [-Wdocumentation]
  /// \param[in] stop_others
                 ^~~~~~~~~~~
/Users/buildslave/jenkins/workspace/lldb-cmake/llvm-project/lldb/include/lldb/Expression/FunctionCaller.h:236:18: note: did you mean 'options'?
  /// \param[in] stop_others
                 ^~~~~~~~~~~
                 options
/Users/buildslave/jenkins/workspace/lldb-cmake/llvm-project/lldb/include/lldb/Expression/FunctionCaller.h:239:18: warning: parameter 'unwind_on_error' not found in the function declaration [-Wdocumentation]
  /// \param[in] unwind_on_error
                 ^~~~~~~~~~~~~~~
/Users/buildslave/jenkins/workspace/lldb-cmake/llvm-project/lldb/include/lldb/Expression/FunctionCaller.h:239:18: note: did you mean 'options'?
  /// \param[in] unwind_on_error
                 ^~~~~~~~~~~~~~~
                 options
While building module 'lldb_Wrapper' imported from /Users/buildslave/jenkins/workspace/lldb-cmake/llvm-project/lldb/source/Plugins/ScriptInterpreter/Python/ScriptInterpreterPython.h:18:
In file included from <module-includes>:113:
/Users/buildslave/jenkins/workspace/lldb-cmake/llvm-project/lldb/include/lldb/Expression/IRExecutionUnit.h:180:8: warning: '\param' command used in a comment that is not attached to a function declaration [-Wdocumentation]
  /// \param[in] local_address
       ^~~~~~
/Users/buildslave/jenkins/workspace/lldb-cmake/llvm-project/lldb/include/lldb/Expression/IRExecutionUnit.h:183:8: warning: '\return' command used in a comment that is not attached to a function or method declaration [-Wdocumentation]
  /// \return
      ~^~~~~~
/Users/buildslave/jenkins/workspace/lldb-cmake/llvm-project/lldb/include/lldb/Expression/IRExecutionUnit.h:190:18: warning: parameter 'process' not found in the function declaration [-Wdocumentation]
  /// \param[in] process
                 ^~~~~~~
/Users/buildslave/jenkins/workspace/lldb-cmake/llvm-project/lldb/include/lldb/Expression/IRExecutionUnit.h:190:18: note: did you mean 'process_sp'?
  /// \param[in] process
                 ^~~~~~~
                 process_sp
/Users/buildslave/jenkins/workspace/lldb-cmake/llvm-project/lldb/include/lldb/Expression/IRExecutionUnit.h:207:18: warning: parameter 'local_address' not found in the function declaration [-Wdocumentation]
  /// \param[in] local_address
                 ^~~~~~~~~~~~~
/Users/buildslave/jenkins/workspace/lldb-cmake/llvm-project/lldb/include/lldb/Expression/IRExecutionUnit.h:207:18: note: did you mean 'process_sp'?
  /// \param[in] local_address
                 ^~~~~~~~~~~~~
                 process_sp
/Users/buildslave/jenkins/workspace/lldb-cmake/llvm-project/lldb/include/lldb/Expression/IRExecutionUnit.h:331:8: warning: '@class' command should not be used in a comment attached to a non-class declaration [-Wdocumentation]
  /// \class AllocationRecord IRExecutionUnit.h
      ~^~~~~~~~~~~~~~~~~~~~~~~~~~~~~~~~~~~~~~~~
While building module 'lldb_Wrapper' imported from /Users/buildslave/jenkins/workspace/lldb-cmake/llvm-project/lldb/source/Plugins/ScriptInterpreter/Python/ScriptInterpreterPython.h:18:
In file included from <module-includes>:117:
/Users/buildslave/jenkins/workspace/lldb-cmake/llvm-project/lldb/include/lldb/Expression/UtilityFunction.h:68:18: warning: parameter 'pc' not found in the function declaration [-Wdocumentation]
  /// \param[in] pc
                 ^~
/Users/buildslave/jenkins/workspace/lldb-cmake/llvm-project/lldb/include/lldb/Expression/UtilityFunction.h:68:18: note: did you mean 'address'?
  /// \param[in] pc
                 ^~
                 address
While building module 'lldb_Wrapper' imported from /Users/buildslave/jenkins/workspace/lldb-cmake/llvm-project/lldb/source/Plugins/ScriptInterpreter/Python/ScriptInterpreterPython.h:18:
In file included from <module-includes>:122:
In file included from /Users/buildslave/jenkins/workspace/lldb-cmake/llvm-project/lldb/include/lldb/Interpreter/CommandObjectRegexCommand.h:14:
/Users/buildslave/jenkins/workspace/lldb-cmake/llvm-project/lldb/include/lldb/Interpreter/CommandObject.h:229:13: warning: unrecognized parameter passing direction, valid directions are '[in]', '[out]' and '[in,out]' [-Wdocumentation]
  /// \param[in/out] request
            ^~~~~~~~
/Users/buildslave/jenkins/workspace/lldb-cmake/llvm-project/lldb/include/lldb/Interpreter/CommandObject.h:238:13: warning: unrecognized parameter passing direction, valid directions are '[in]', '[out]' and '[in,out]' [-Wdocumentation]
  /// \param[in/out] request
            ^~~~~~~~
/Users/buildslave/jenkins/workspace/lldb-cmake/llvm-project/lldb/include/lldb/Interpreter/CommandObject.h:264:18: warning: parameter 'current_command_line' not found in the function declaration [-Wdocumentation]
  /// \param[in] current_command_line
                 ^~~~~~~~~~~~~~~~~~~~
/Users/buildslave/jenkins/workspace/lldb-cmake/llvm-project/lldb/include/lldb/Interpreter/CommandObject.h:264:18: note: did you mean 'current_command_args'?
  /// \param[in] current_command_line
                 ^~~~~~~~~~~~~~~~~~~~
                 current_command_args
While building module 'lldb_Wrapper' imported from /Users/buildslave/jenkins/workspace/lldb-cmake/llvm-project/lldb/source/Plugins/ScriptInterpreter/Python/ScriptInterpreterPython.h:18:
In file included from <module-includes>:156:
/Users/buildslave/jenkins/workspace/lldb-cmake/llvm-project/lldb/include/lldb/Interpreter/CommandInterpreter.h:54:20: warning: parameter 'echo_commands' is already documented [-Wdocumentation]
  ///    if \param echo_commands is \b true.
                   ^~~~~~~~~~~~~
/Users/buildslave/jenkins/workspace/lldb-cmake/llvm-project/lldb/include/lldb/Interpreter/CommandInterpreter.h:48:8: note: previous documentation
  /// \param[in] echo_commands
       ^         ~~~~~~~~~~~~~
While building module 'lldb_Wrapper' imported from /Users/buildslave/jenkins/workspace/lldb-cmake/llvm-project/lldb/source/Plugins/ScriptInterpreter/Python/ScriptInterpreterPython.h:18:
In file included from <module-includes>:178:
/Users/buildslave/jenkins/workspace/lldb-cmake/llvm-project/lldb/include/lldb/Symbol/LineTable.h:138:19: warning: parameter 'line_entry' not found in the function declaration [-Wdocumentation]
  /// \param[out] line_entry
                  ^~~~~~~~~~
/Users/buildslave/jenkins/workspace/lldb-cmake/llvm-project/lldb/include/lldb/Symbol/LineTable.h:138:19: note: did you mean 'line_entry_ptr'?
  /// \param[out] line_entry
                  ^~~~~~~~~~
                  line_entry_ptr
/Users/buildslave/jenkins/workspace/lldb-cmake/llvm-project/lldb/include/lldb/Symbol/LineTable.h:200:8: warning: '\param' command used in a comment that is not attached to a function declaration [-Wdocumentation]
  /// \param[out] file_range_map
       ^~~~~~
/Users/buildslave/jenkins/workspace/lldb-cmake/llvm-project/lldb/include/lldb/Symbol/LineTable.h:204:8: warning: '\return' command used in a comment that is not attached to a function or method declaration [-Wdocumentation]
  /// \return
      ~^~~~~~
While building module 'lldb_Wrapper' imported from /Users/buildslave/jenkins/workspace/lldb-cmake/llvm-project/lldb/source/Plugins/ScriptInterpreter/Python/ScriptInterpreterPython.h:18:
In file included from <module-includes>:186:
In file included from /Users/buildslave/jenkins/workspace/lldb-cmake/llvm-project/lldb/include/lldb/Symbol/SymbolFile.h:16:
In file included from /Users/buildslave/jenkins/workspace/lldb-cmake/llvm-project/lldb/include/lldb/Symbol/Function.h:15:
/Users/buildslave/jenkins/workspace/lldb-cmake/llvm-project/lldb/include/lldb/Symbol/Block.h:60:18: warning: parameter 'depth' not found in the function declaration [-Wdocumentation]
  /// \param[in] depth
                 ^~~~~
/Users/buildslave/jenkins/workspace/lldb-cmake/llvm-project/lldb/include/lldb/Symbol/Block.h:63:18: warning: parameter 'block_list' not found in the function declaration [-Wdocumentation]
  /// \param[in] block_list
                 ^~~~~~~~~~
/Users/buildslave/jenkins/workspace/lldb-cmake/llvm-project/lldb/include/lldb/Symbol/Block.h:81:18: warning: parameter 'start_offset' not found in the function declaration [-Wdocumentation]
  /// \param[in] start_offset
                 ^~~~~~~~~~~~
/Users/buildslave/jenkins/workspace/lldb-cmake/llvm-project/lldb/include/lldb/Symbol/Block.h:81:18: note: did you mean 'range'?
  /// \param[in] start_offset
                 ^~~~~~~~~~~~
                 range
/Users/buildslave/jenkins/workspace/lldb-cmake/llvm-project/lldb/include/lldb/Symbol/Block.h:85:18: warning: parameter 'end_offset' not found in the function declaration [-Wdocumentation]
  /// \param[in] end_offset
                 ^~~~~~~~~~
/Users/buildslave/jenkins/workspace/lldb-cmake/llvm-project/lldb/include/lldb/Symbol/Block.h:85:18: note: did you mean 'range'?
  /// \param[in] end_offset
                 ^~~~~~~~~~
                 range
/Users/buildslave/jenkins/workspace/lldb-cmake/llvm-project/lldb/include/lldb/Symbol/Block.h:235:18: warning: parameter 'get_child_variables' not found in the function declaration [-Wdocumentation]
  /// \param[in] get_child_variables
                 ^~~~~~~~~~~~~~~~~~~
/Users/buildslave/jenkins/workspace/lldb-cmake/llvm-project/lldb/include/lldb/Symbol/Block.h:235:18: note: did you mean 'get_child_block_variables'?
  /// \param[in] get_child_variables
                 ^~~~~~~~~~~~~~~~~~~
                 get_child_block_variables
/Users/buildslave/jenkins/workspace/lldb-cmake/llvm-project/lldb/include/lldb/Symbol/Block.h:246:18: warning: parameter 'add_inline_child_block_variables' not found in the function declaration [-Wdocumentation]
  /// \param[in] add_inline_child_block_variables
                 ^~~~~~~~~~~~~~~~~~~~~~~~~~~~~~~~
/Users/buildslave/jenkins/workspace/lldb-cmake/llvm-project/lldb/include/lldb/Symbol/Block.h:246:18: note: did you mean 'get_child_block_variables'?
  /// \param[in] add_inline_child_block_variables
                 ^~~~~~~~~~~~~~~~~~~~~~~~~~~~~~~~
                 get_child_block_variables
While building module 'lldb_Wrapper' imported from /Users/buildslave/jenkins/workspace/lldb-cmake/llvm-project/lldb/source/Plugins/ScriptInterpreter/Python/ScriptInterpreterPython.h:18:
In file included from <module-includes>:186:
In file included from /Users/buildslave/jenkins/workspace/lldb-cmake/llvm-project/lldb/include/lldb/Symbol/SymbolFile.h:16:
/Users/buildslave/jenkins/workspace/lldb-cmake/llvm-project/lldb/include/lldb/Symbol/Function.h:70:14: warning: empty paragraph passed to '\return' command [-Wdocumentation]
  /// \return
      ~~~~~~~^
/Users/buildslave/jenkins/workspace/lldb-cmake/llvm-project/lldb/include/lldb/Symbol/Function.h:185:14: warning: empty paragraph passed to '\return' command [-Wdocumentation]
  /// \return
      ~~~~~~~^
While building module 'lldb_Wrapper' imported from /Users/buildslave/jenkins/workspace/lldb-cmake/llvm-project/lldb/source/Plugins/ScriptInterpreter/Python/ScriptInterpreterPython.h:18:
In file included from <module-includes>:204:
/Users/buildslave/jenkins/workspace/lldb-cmake/llvm-project/lldb/include/lldb/Symbol/CompileUnit.h:47:18: warning: parameter 'module' not found in the function declaration [-Wdocumentation]
  /// \param[in] module
                 ^~~~~~
/Users/buildslave/jenkins/workspace/lldb-cmake/llvm-project/lldb/include/lldb/Symbol/CompileUnit.h:47:18: note: did you mean 'module_sp'?
  /// \param[in] module
                 ^~~~~~
                 module_sp
/Users/buildslave/jenkins/workspace/lldb-cmake/llvm-project/lldb/include/lldb/Symbol/CompileUnit.h:85:18: warning: parameter 'module' not found in the function declaration [-Wdocumentation]
  /// \param[in] module
                 ^~~~~~
/Users/buildslave/jenkins/workspace/lldb-cmake/llvm-project/lldb/include/lldb/Symbol/CompileUnit.h:85:18: note: did you mean 'module_sp'?
  /// \param[in] module
                 ^~~~~~
                 module_sp
/Users/buildslave/jenkins/workspace/lldb-cmake/llvm-project/lldb/include/lldb/Symbol/CompileUnit.h:244:18: warning: parameter 'lambda' not found in the function declaration [-Wdocumentation]
  /// \param[in] lambda
                 ^~~~~~
/Users/buildslave/jenkins/workspace/lldb-cmake/llvm-project/lldb/include/lldb/Symbol/CompileUnit.h:244:18: note: did you mean 'f'?
  /// \param[in] lambda
                 ^~~~~~
                 f
While building module 'lldb_Wrapper' imported from /Users/buildslave/jenkins/workspace/lldb-cmake/llvm-project/lldb/source/Plugins/ScriptInterpreter/Python/ScriptInterpreterPython.h:18:
In file included from <module-includes>:265:
/Users/buildslave/jenkins/workspace/lldb-cmake/llvm-project/lldb/include/lldb/Target/Queue.h:131:14: warning: empty paragraph passed to '\return' command [-Wdocumentation]
  /// \return
      ~~~~~~~^
133 warnings generated.
[2181/2190] : && "/Applications/Xcode.app/Contents/Developer/Toolchains/XcodeDefault.xctoolchain/usr/bin/libtool" -static -no_warning_for_no_symbols -o lib/liblldbPluginScriptInterpreterPython.a  tools/lldb/source/Plugins/ScriptInterpreter/Python/CMakeFiles/lldbPluginScriptInterpreterPython.dir/PythonDataObjects.cpp.o tools/lldb/source/Plugins/ScriptInterpreter/Python/CMakeFiles/lldbPluginScriptInterpreterPython.dir/PythonReadline.cpp.o tools/lldb/source/Plugins/ScriptInterpreter/Python/CMakeFiles/lldbPluginScriptInterpreterPython.dir/ScriptInterpreterPython.cpp.o && :
[2182/2190] : && /Users/buildslave/jenkins/workspace/lldb-cmake/host-compiler/bin/clang++ -Wdocumentation -fPIC -fvisibility-inlines-hidden -Werror=date-time -Werror=unguarded-availability-new -fmodules -fmodules-cache-path=/Users/buildslave/jenkins/workspace/lldb-cmake/lldb-build/module.cache -fcxx-modules -Wall -Wextra -Wno-unused-parameter -Wwrite-strings -Wcast-qual -Wmissing-field-initializers -pedantic -Wno-long-long -Wimplicit-fallthrough -Wcovered-switch-default -Wno-noexcept-type -Wnon-virtual-dtor -Wdelete-non-virtual-dtor -Wstring-conversion -fdiagnostics-color -Wno-deprecated-declarations -Wno-unknown-pragmas -Wno-strict-aliasing -Wno-deprecated-register -Wno-vla-extension -O3 -isysroot /Applications/Xcode.app/Contents/Developer/Platforms/MacOSX.platform/Developer/SDKs/MacOSX10.14.sdk -dynamiclib -Wl,-headerpad_max_install_names -Wl,-dead_strip -Wl,-exported_symbols_list,"/Users/buildslave/jenkins/workspace/lldb-cmake/lldb-build/tools/lldb/source/API/liblldb.exports"  -current_version 10.0.99 -o lib/lldb.framework/Versions/10.0.99git/lldb -install_name @rpath/lldb.framework/Versions/10.0.99git/lldb tools/lldb/source/API/CMakeFiles/liblldb.dir/SBAddress.cpp.o tools/lldb/source/API/CMakeFiles/liblldb.dir/SBAttachInfo.cpp.o tools/lldb/source/API/CMakeFiles/liblldb.dir/SBBlock.cpp.o tools/lldb/source/API/CMakeFiles/liblldb.dir/SBBreakpoint.cpp.o tools/lldb/source/API/CMakeFiles/liblldb.dir/SBBreakpointLocation.cpp.o tools/lldb/source/API/CMakeFiles/liblldb.dir/SBBreakpointName.cpp.o tools/lldb/source/API/CMakeFiles/liblldb.dir/SBBreakpointOptionCommon.cpp.o tools/lldb/source/API/CMakeFiles/liblldb.dir/SBBroadcaster.cpp.o tools/lldb/source/API/CMakeFiles/liblldb.dir/SBCommandInterpreter.cpp.o tools/lldb/source/API/CMakeFiles/liblldb.dir/SBCommandReturnObject.cpp.o tools/lldb/source/API/CMakeFiles/liblldb.dir/SBCommunication.cpp.o tools/lldb/source/API/CMakeFiles/liblldb.dir/SBCompileUnit.cpp.o tools/lldb/source/API/CMakeFiles/liblldb.dir/SBData.cpp.o tools/lldb/source/API/CMakeFiles/liblldb.dir/SBDebugger.cpp.o tools/lldb/source/API/CMakeFiles/liblldb.dir/SBDeclaration.cpp.o tools/lldb/source/API/CMakeFiles/liblldb.dir/SBError.cpp.o tools/lldb/source/API/CMakeFiles/liblldb.dir/SBEvent.cpp.o tools/lldb/source/API/CMakeFiles/liblldb.dir/SBExecutionContext.cpp.o tools/lldb/source/API/CMakeFiles/liblldb.dir/SBExpressionOptions.cpp.o tools/lldb/source/API/CMakeFiles/liblldb.dir/SBFileSpec.cpp.o tools/lldb/source/API/CMakeFiles/liblldb.dir/SBFile.cpp.o tools/lldb/source/API/CMakeFiles/liblldb.dir/SBFileSpecList.cpp.o tools/lldb/source/API/CMakeFiles/liblldb.dir/SBFrame.cpp.o tools/lldb/source/API/CMakeFiles/liblldb.dir/SBFunction.cpp.o tools/lldb/source/API/CMakeFiles/liblldb.dir/SBHostOS.cpp.o tools/lldb/source/API/CMakeFiles/liblldb.dir/SBInstruction.cpp.o tools/lldb/source/API/CMakeFiles/liblldb.dir/SBInstructionList.cpp.o tools/lldb/source/API/CMakeFiles/liblldb.dir/SBLanguageRuntime.cpp.o tools/lldb/source/API/CMakeFiles/liblldb.dir/SBLaunchInfo.cpp.o tools/lldb/source/API/CMakeFiles/liblldb.dir/SBLineEntry.cpp.o tools/lldb/source/API/CMakeFiles/liblldb.dir/SBListener.cpp.o tools/lldb/source/API/CMakeFiles/liblldb.dir/SBMemoryRegionInfo.cpp.o tools/lldb/source/API/CMakeFiles/liblldb.dir/SBMemoryRegionInfoList.cpp.o tools/lldb/source/API/CMakeFiles/liblldb.dir/SBModule.cpp.o tools/lldb/source/API/CMakeFiles/liblldb.dir/SBModuleSpec.cpp.o tools/lldb/source/API/CMakeFiles/liblldb.dir/SBPlatform.cpp.o tools/lldb/source/API/CMakeFiles/liblldb.dir/SBProcess.cpp.o tools/lldb/source/API/CMakeFiles/liblldb.dir/SBProcessInfo.cpp.o tools/lldb/source/API/CMakeFiles/liblldb.dir/SBQueue.cpp.o tools/lldb/source/API/CMakeFiles/liblldb.dir/SBQueueItem.cpp.o tools/lldb/source/API/CMakeFiles/liblldb.dir/SBReproducer.cpp.o tools/lldb/source/API/CMakeFiles/liblldb.dir/SBSection.cpp.o tools/lldb/source/API/CMakeFiles/liblldb.dir/SBSourceManager.cpp.o tools/lldb/source/API/CMakeFiles/liblldb.dir/SBStream.cpp.o tools/lldb/source/API/CMakeFiles/liblldb.dir/SBStringList.cpp.o tools/lldb/source/API/CMakeFiles/liblldb.dir/SBStructuredData.cpp.o tools/lldb/source/API/CMakeFiles/liblldb.dir/SBSymbol.cpp.o tools/lldb/source/API/CMakeFiles/liblldb.dir/SBSymbolContext.cpp.o tools/lldb/source/API/CMakeFiles/liblldb.dir/SBSymbolContextList.cpp.o tools/lldb/source/API/CMakeFiles/liblldb.dir/SBTarget.cpp.o tools/lldb/source/API/CMakeFiles/liblldb.dir/SBThread.cpp.o tools/lldb/source/API/CMakeFiles/liblldb.dir/SBThreadCollection.cpp.o tools/lldb/source/API/CMakeFiles/liblldb.dir/SBThreadPlan.cpp.o tools/lldb/source/API/CMakeFiles/liblldb.dir/SBTrace.cpp.o tools/lldb/source/API/CMakeFiles/liblldb.dir/SBTraceOptions.cpp.o tools/lldb/source/API/CMakeFiles/liblldb.dir/SBType.cpp.o tools/lldb/source/API/CMakeFiles/liblldb.dir/SBTypeCategory.cpp.o tools/lldb/source/API/CMakeFiles/liblldb.dir/SBTypeEnumMember.cpp.o tools/lldb/source/API/CMakeFiles/liblldb.dir/SBTypeFilter.cpp.o tools/lldb/source/API/CMakeFiles/liblldb.dir/SBTypeFormat.cpp.o tools/lldb/source/API/CMakeFiles/liblldb.dir/SBTypeNameSpecifier.cpp.o tools/lldb/source/API/CMakeFiles/liblldb.dir/SBTypeSummary.cpp.o tools/lldb/source/API/CMakeFiles/liblldb.dir/SBTypeSynthetic.cpp.o tools/lldb/source/API/CMakeFiles/liblldb.dir/SBValue.cpp.o tools/lldb/source/API/CMakeFiles/liblldb.dir/SBValueList.cpp.o tools/lldb/source/API/CMakeFiles/liblldb.dir/SBVariablesOptions.cpp.o tools/lldb/source/API/CMakeFiles/liblldb.dir/SBWatchpoint.cpp.o tools/lldb/source/API/CMakeFiles/liblldb.dir/SBUnixSignals.cpp.o tools/lldb/source/API/CMakeFiles/liblldb.dir/SystemInitializerFull.cpp.o tools/lldb/source/API/CMakeFiles/liblldb.dir/__/__/scripts/LLDBWrapPython.cpp.o  -Wl,-rpath,@loader_path/../lib lib/liblldbBase.a lib/liblldbBreakpoint.a lib/liblldbCore.a lib/liblldbDataFormatters.a lib/liblldbExpression.a lib/liblldbHost.a lib/liblldbInitialization.a lib/liblldbInterpreter.a lib/liblldbSymbol.a lib/liblldbTarget.a lib/liblldbUtility.a lib/liblldbPluginABIMacOSX_arm64.a lib/liblldbPluginABISysV_arm64.a lib/liblldbPluginABIMacOSX_arm.a lib/liblldbPluginABISysV_arm.a lib/liblldbPluginABISysV_hexagon.a lib/liblldbPluginABISysV_mips.a lib/liblldbPluginABISysV_mips64.a lib/liblldbPluginABISysV_ppc.a lib/liblldbPluginABISysV_ppc64.a lib/liblldbPluginABISysV_s390x.a lib/liblldbPluginABISysV_i386.a lib/liblldbPluginABISysV_x86_64.a lib/liblldbPluginABIMacOSX_i386.a lib/liblldbPluginABIWindows_x86_64.a lib/liblldbPluginArchitectureArm.a lib/liblldbPluginArchitectureMips.a lib/liblldbPluginArchitecturePPC64.a lib/liblldbPluginDisassemblerLLVM.a lib/liblldbPluginDynamicLoaderDarwinKernel.a lib/liblldbPluginDynamicLoaderMacOSXDYLD.a lib/liblldbPluginDynamicLoaderPosixDYLD.a lib/liblldbPluginDynamicLoaderStatic.a lib/liblldbPluginDynamicLoaderHexagonDYLD.a lib/liblldbPluginDynamicLoaderWindowsDYLD.a lib/liblldbPluginExpressionParserClang.a lib/liblldbPluginInstructionARM.a lib/liblldbPluginInstructionARM64.a lib/liblldbPluginInstructionMIPS.a lib/liblldbPluginInstructionMIPS64.a lib/liblldbPluginInstructionPPC64.a lib/liblldbPluginInstrumentationRuntimeASan.a lib/liblldbPluginInstrumentationRuntimeMainThreadChecker.a lib/liblldbPluginInstrumentationRuntimeTSan.a lib/liblldbPluginInstrumentationRuntimeUBSan.a lib/liblldbPluginJITLoaderGDB.a lib/liblldbPluginClangCommon.a lib/liblldbPluginCPlusPlusLanguage.a lib/liblldbPluginObjCLanguage.a lib/liblldbPluginObjCPlusPlusLanguage.a lib/liblldbPluginCPPRuntime.a lib/liblldbPluginCXXItaniumABI.a lib/liblldbPluginObjCRuntime.a lib/liblldbPluginAppleObjCRuntime.a lib/liblldbPluginRenderScriptRuntime.a lib/liblldbPluginMemoryHistoryASan.a lib/liblldbPluginObjectContainerBSDArchive.a lib/liblldbPluginObjectContainerMachOArchive.a lib/liblldbPluginObjectFileBreakpad.a lib/liblldbPluginObjectFileELF.a lib/liblldbPluginObjectFileMachO.a lib/liblldbPluginObjectFilePECOFF.a lib/liblldbPluginObjectFileJIT.a lib/liblldbPluginOSPython.a lib/liblldbPluginPlatformLinux.a lib/liblldbPluginPlatformFreeBSD.a lib/liblldbPluginPlatformNetBSD.a lib/liblldbPluginPlatformOpenBSD.a lib/liblldbPluginPlatformMacOSX.a lib/liblldbPluginPlatformWindows.a lib/liblldbPluginPlatformPOSIX.a lib/liblldbPluginPlatformGDB.a lib/liblldbPluginPlatformAndroid.a lib/liblldbPluginProcessMacOSXKernel.a lib/liblldbPluginProcessGDBRemote.a lib/liblldbPluginProcessUtility.a lib/liblldbPluginProcessElfCore.a lib/liblldbPluginProcessMachCore.a lib/liblldbPluginProcessMinidump.a lib/liblldbPluginScriptInterpreterNone.a lib/liblldbPluginScriptInterpreterPython.a lib/liblldbPluginStructuredDataDarwinLog.a lib/liblldbPluginSymbolFileBreakpad.a lib/liblldbPluginSymbolFileDWARF.a lib/liblldbPluginSymbolFileSymtab.a lib/liblldbPluginSymbolFileNativePDB.a lib/liblldbPluginSymbolFilePDB.a lib/liblldbPluginSystemRuntimeMacOSX.a lib/liblldbPluginSymbolVendorMacOSX.a lib/liblldbPluginSymbolVendorELF.a lib/liblldbPluginUnwindAssemblyInstEmulation.a lib/liblldbPluginUnwindAssemblyX86.a lib/libLLVMSupport.a -lcompression lib/libLLVMAArch64CodeGen.a lib/libLLVMAArch64AsmParser.a lib/libLLVMAArch64Disassembler.a lib/libLLVMAArch64Desc.a lib/libLLVMAArch64Info.a lib/libLLVMAArch64Utils.a lib/libLLVMAMDGPUCodeGen.a lib/libLLVMMIRParser.a lib/libLLVMAMDGPUAsmParser.a lib/libLLVMAMDGPUDisassembler.a lib/libLLVMAMDGPUDesc.a lib/libLLVMAMDGPUInfo.a lib/libLLVMAMDGPUUtils.a lib/libLLVMARMCodeGen.a lib/libLLVMARMAsmParser.a lib/libLLVMARMDisassembler.a lib/libLLVMARMDesc.a lib/libLLVMARMInfo.a lib/libLLVMARMUtils.a lib/libLLVMBPFCodeGen.a lib/libLLVMBPFAsmParser.a lib/libLLVMBPFDesc.a lib/libLLVMBPFDisassembler.a lib/libLLVMBPFInfo.a lib/libLLVMHexagonCodeGen.a lib/libLLVMHexagonAsmParser.a lib/libLLVMHexagonDisassembler.a lib/libLLVMHexagonDesc.a lib/libLLVMHexagonInfo.a lib/libLLVMLanaiCodeGen.a lib/libLLVMLanaiAsmParser.a lib/libLLVMLanaiDisassembler.a lib/libLLVMLanaiDesc.a lib/libLLVMLanaiInfo.a lib/libLLVMMSP430CodeGen.a lib/libLLVMMSP430AsmParser.a lib/libLLVMMSP430Desc.a lib/libLLVMMSP430Disassembler.a lib/libLLVMMSP430Info.a lib/libLLVMNVPTXCodeGen.a lib/libLLVMNVPTXDesc.a lib/libLLVMNVPTXInfo.a lib/libLLVMPowerPCCodeGen.a lib/libLLVMPowerPCAsmParser.a lib/libLLVMPowerPCDesc.a lib/libLLVMPowerPCDisassembler.a lib/libLLVMPowerPCInfo.a lib/libLLVMRISCVCodeGen.a lib/libLLVMRISCVAsmParser.a lib/libLLVMRISCVDesc.a lib/libLLVMRISCVDisassembler.a lib/libLLVMRISCVInfo.a lib/libLLVMRISCVUtils.a lib/libLLVMSparcCodeGen.a lib/libLLVMSparcAsmParser.a lib/libLLVMSparcDesc.a lib/libLLVMSparcDisassembler.a lib/libLLVMSparcInfo.a lib/libLLVMSystemZCodeGen.a lib/libLLVMSystemZAsmParser.a lib/libLLVMSystemZDisassembler.a lib/libLLVMSystemZDesc.a lib/libLLVMSystemZInfo.a lib/libLLVMWebAssemblyCodeGen.a lib/libLLVMWebAssemblyAsmParser.a lib/libLLVMWebAssemblyDisassembler.a lib/libLLVMWebAssemblyDesc.a lib/libLLVMWebAssemblyInfo.a lib/libLLVMX86CodeGen.a lib/libLLVMCFGuard.a lib/libLLVMX86AsmParser.a lib/libLLVMX86Desc.a lib/libLLVMX86Disassembler.a lib/libLLVMX86Info.a lib/libLLVMX86Utils.a lib/libLLVMXCoreCodeGen.a lib/libLLVMXCoreDesc.a lib/libLLVMXCoreDisassembler.a lib/libLLVMXCoreInfo.a lib/libLLVMMipsCodeGen.a lib/libLLVMAsmPrinter.a lib/libLLVMGlobalISel.a lib/libLLVMSelectionDAG.a lib/libLLVMMipsAsmParser.a lib/libLLVMMipsDesc.a lib/libLLVMMipsDisassembler.a lib/libLLVMMipsInfo.a lib/liblldbPluginPlatformLinux.a lib/liblldbPluginPlatformGDB.a lib/liblldbPluginDynamicLoaderStatic.a lib/liblldbPluginDynamicLoaderDarwinKernel.a lib/liblldbPluginPlatformMacOSX.a lib/liblldbPluginPlatformPOSIX.a lib/liblldbPluginPlatformMacOSXObjCXX.a lib/liblldbPluginDynamicLoaderMacOSXDYLD.a lib/liblldbPluginDynamicLoaderPosixDYLD.a lib/liblldbPluginProcessElfCore.a lib/liblldbPluginDynamicLoaderPosixDYLD.a lib/liblldbPluginProcessElfCore.a /usr/local/Frameworks/Python.framework/Versions/3.7/lib/libpython3.7m.dylib lib/liblldbPluginObjectFileBreakpad.a lib/liblldbPluginObjectFileMachO.a lib/liblldbPluginObjectFileELF.a lib/liblldbBreakpoint.a lib/liblldbCore.a lib/liblldbDataFormatters.a lib/liblldbExpression.a lib/liblldbInterpreter.a lib/liblldbSymbol.a lib/liblldbTarget.a lib/liblldbPluginExpressionParserClang.a lib/liblldbPluginClangCommon.a lib/liblldbPluginCPlusPlusLanguage.a lib/liblldbPluginObjCLanguage.a lib/liblldbPluginCPPRuntime.a lib/liblldbPluginObjCRuntime.a lib/liblldbPluginAppleObjCRuntime.a lib/liblldbPluginObjectFileJIT.a lib/liblldbPluginProcessUtility.a lib/liblldbPluginSymbolFileDWARF.a lib/liblldbPluginSymbolFileNativePDB.a lib/liblldbPluginSymbolFilePDB.a lib/liblldbCommands.a lib/liblldbBreakpoint.a lib/liblldbCore.a lib/liblldbDataFormatters.a lib/liblldbExpression.a lib/liblldbInterpreter.a lib/liblldbSymbol.a lib/liblldbTarget.a lib/liblldbPluginExpressionParserClang.a lib/liblldbPluginClangCommon.a lib/liblldbPluginCPlusPlusLanguage.a lib/liblldbPluginObjCLanguage.a lib/liblldbPluginCPPRuntime.a lib/liblldbPluginObjCRuntime.a lib/liblldbPluginAppleObjCRuntime.a lib/liblldbPluginObjectFileJIT.a lib/liblldbPluginProcessUtility.a lib/liblldbPluginSymbolFileDWARF.a lib/liblldbPluginSymbolFileNativePDB.a lib/liblldbPluginSymbolFilePDB.a lib/liblldbCommands.a lib/liblldbBreakpoint.a lib/liblldbCore.a lib/liblldbDataFormatters.a lib/liblldbExpression.a lib/liblldbInterpreter.a lib/liblldbSymbol.a lib/liblldbTarget.a lib/liblldbPluginExpressionParserClang.a lib/liblldbPluginClangCommon.a lib/liblldbPluginCPlusPlusLanguage.a lib/liblldbPluginObjCLanguage.a lib/liblldbPluginCPPRuntime.a lib/liblldbPluginObjCRuntime.a lib/liblldbPluginAppleObjCRuntime.a lib/liblldbPluginObjectFileJIT.a lib/liblldbPluginProcessUtility.a lib/liblldbPluginSymbolFileDWARF.a lib/liblldbPluginSymbolFileNativePDB.a lib/liblldbPluginSymbolFilePDB.a lib/liblldbCommands.a lib/liblldbBreakpoint.a lib/liblldbCore.a lib/liblldbDataFormatters.a lib/liblldbExpression.a lib/liblldbInterpreter.a lib/liblldbSymbol.a lib/liblldbTarget.a lib/liblldbPluginExpressionParserClang.a lib/liblldbPluginClangCommon.a lib/liblldbPluginCPlusPlusLanguage.a lib/liblldbPluginObjCLanguage.a lib/liblldbPluginCPPRuntime.a lib/liblldbPluginObjCRuntime.a lib/liblldbPluginAppleObjCRuntime.a lib/liblldbPluginObjectFileJIT.a lib/liblldbPluginProcessUtility.a lib/liblldbPluginSymbolFileDWARF.a lib/liblldbPluginSymbolFileNativePDB.a lib/liblldbPluginSymbolFilePDB.a lib/liblldbCommands.a lib/libLLVMMCJIT.a lib/libLLVMExecutionEngine.a lib/libLLVMRuntimeDyld.a lib/libclangCodeGen.a lib/libLLVMCoroutines.a lib/libLLVMCoverage.a lib/libLLVMLTO.a lib/libLLVMObjCARCOpts.a lib/libLLVMPasses.a lib/libLLVMipo.a lib/libLLVMIRReader.a lib/libLLVMAsmParser.a lib/libLLVMLinker.a lib/libLLVMCodeGen.a lib/libLLVMTarget.a lib/libLLVMBitWriter.a lib/libLLVMScalarOpts.a lib/libLLVMVectorize.a lib/libLLVMAggressiveInstCombine.a lib/libLLVMInstCombine.a lib/libLLVMInstrumentation.a lib/libLLVMTransformUtils.a lib/libLLVMAnalysis.a lib/libclangRewriteFrontend.a lib/libclangFrontend.a lib/libclangDriver.a lib/libclangParse.a lib/libLLVMOption.a lib/libLLVMProfileData.a lib/libclangRewrite.a lib/libclangSerialization.a lib/libclangSema.a lib/libclangEdit.a lib/libclangAnalysis.a lib/libclangASTMatchers.a lib/libLLVMDebugInfoDWARF.a lib/libclangAST.a lib/libclangLex.a lib/libclangBasic.a lib/libLLVMDebugInfoPDB.a lib/liblldbBase.a lib/liblldbHost.a /usr/lib/libedit.dylib /usr/local/lib/liblzma.dylib /usr/lib/libedit.dylib /usr/local/lib/liblzma.dylib lib/liblldbHostMacOSXObjCXX.a lib/libLLVMObject.a lib/libLLVMBitReader.a lib/libLLVMCore.a lib/libLLVMRemarks.a lib/libLLVMBitstreamReader.a lib/libLLVMMCParser.a lib/libLLVMTextAPI.a lib/liblldbUtility.a -lxml2 -framework Foundation -framework CoreFoundation -framework CoreServices -framework Security /usr/lib/libcurses.dylib /usr/lib/libform.dylib /usr/lib/libpanel.dylib lib/libLLVMMCDisassembler.a lib/libLLVMMC.a lib/libLLVMBinaryFormat.a lib/libLLVMDebugInfoCodeView.a lib/libLLVMDebugInfoMSF.a lib/libLLVMSupport.a lib/libLLVMDemangle.a -lz -lcurses -lm && :
[2183/2190] cd /Users/buildslave/jenkins/workspace/lldb-cmake/lldb-build/tools/lldb && /usr/local/Cellar/cmake/3.12.3/bin/cmake -E make_directory /Users/buildslave/jenkins/workspace/lldb-cmake/lldb-build/./lib/python3.7/site-packages/lldb
[2184/2190] : && /Users/buildslave/jenkins/workspace/lldb-cmake/host-compiler/bin/clang++  -Wdocumentation -fPIC -fvisibility-inlines-hidden -Werror=date-time -Werror=unguarded-availability-new -fmodules -fmodules-cache-path=/Users/buildslave/jenkins/workspace/lldb-cmake/lldb-build/module.cache -fcxx-modules -Wall -Wextra -Wno-unused-parameter -Wwrite-strings -Wcast-qual -Wmissing-field-initializers -pedantic -Wno-long-long -Wimplicit-fallthrough -Wcovered-switch-default -Wno-noexcept-type -Wnon-virtual-dtor -Wdelete-non-virtual-dtor -Wstring-conversion -fdiagnostics-color -Wno-deprecated-declarations -Wno-unknown-pragmas -Wno-strict-aliasing -Wno-deprecated-register -Wno-vla-extension -O3  -isysroot /Applications/Xcode.app/Contents/Developer/Platforms/MacOSX.platform/Developer/SDKs/MacOSX10.14.sdk -Wl,-search_paths_first -Wl,-headerpad_max_install_names -Wl,-dead_strip tools/lldb/tools/lldb-vscode/CMakeFiles/lldb-vscode.dir/lldb-vscode.cpp.o tools/lldb/tools/lldb-vscode/CMakeFiles/lldb-vscode.dir/BreakpointBase.cpp.o tools/lldb/tools/lldb-vscode/CMakeFiles/lldb-vscode.dir/ExceptionBreakpoint.cpp.o tools/lldb/tools/lldb-vscode/CMakeFiles/lldb-vscode.dir/FunctionBreakpoint.cpp.o tools/lldb/tools/lldb-vscode/CMakeFiles/lldb-vscode.dir/IOStream.cpp.o tools/lldb/tools/lldb-vscode/CMakeFiles/lldb-vscode.dir/JSONUtils.cpp.o tools/lldb/tools/lldb-vscode/CMakeFiles/lldb-vscode.dir/LLDBUtils.cpp.o tools/lldb/tools/lldb-vscode/CMakeFiles/lldb-vscode.dir/SourceBreakpoint.cpp.o tools/lldb/tools/lldb-vscode/CMakeFiles/lldb-vscode.dir/VSCode.cpp.o  -o bin/lldb-vscode  -Wl,-rpath,@loader_path/../lib lib/libLLVMSupport.a lib/libLLVMSupport.a lib/lldb.framework/Versions/10.0.99git/lldb -lpthread -lz -lcurses -lm lib/libLLVMDemangle.a && :
[2185/2190] cd /Users/buildslave/jenkins/workspace/lldb-cmake/lldb-build/tools/lldb && /usr/local/Cellar/cmake/3.12.3/bin/cmake -E copy /Users/buildslave/jenkins/workspace/lldb-cmake/llvm-project/lldb/third_party/Python/module/six/six.py /Users/buildslave/jenkins/workspace/lldb-cmake/lldb-build/./lib/python3.7/site-packages/lldb/../six.py && cd /Users/buildslave/jenkins/workspace/lldb-cmake/lldb-build/tools/lldb && /usr/local/Cellar/cmake/3.12.3/bin/cmake -E copy /Users/buildslave/jenkins/workspace/lldb-cmake/lldb-build/tools/lldb/scripts/lldb.py /Users/buildslave/jenkins/workspace/lldb-cmake/lldb-build/./lib/python3.7/site-packages/lldb/__init__.py && cd /Users/buildslave/jenkins/workspace/lldb-cmake/lldb-build/tools/lldb && /usr/local/Cellar/cmake/3.12.3/bin/cmake -E make_directory /Users/buildslave/jenkins/workspace/lldb-cmake/lldb-build/./lib/python3.7/site-packages/lldb/macosx/heap && /usr/local/Cellar/cmake/3.12.3/bin/cmake -E copy /Users/buildslave/jenkins/workspace/lldb-cmake/llvm-project/lldb/examples/darwin/heap_find/heap/heap_find.cpp /Users/buildslave/jenkins/workspace/lldb-cmake/llvm-project/lldb/examples/darwin/heap_find/heap/Makefile /Users/buildslave/jenkins/workspace/lldb-cmake/lldb-build/./lib/python3.7/site-packages/lldb/macosx/heap && cd /Users/buildslave/jenkins/workspace/lldb-cmake/lldb-build/tools/lldb && /usr/local/Cellar/cmake/3.12.3/bin/cmake -E copy /Users/buildslave/jenkins/workspace/lldb-cmake/llvm-project/lldb/source/Interpreter/embedded_interpreter.py /Users/buildslave/jenkins/workspace/lldb-cmake/lldb-build/./lib/python3.7/site-packages/lldb && cd /Users/buildslave/jenkins/workspace/lldb-cmake/lldb-build/lib/python3.7/site-packages/lldb && /usr/local/Cellar/cmake/3.12.3/bin/cmake -E make_directory formatters/cpp && /usr/local/Cellar/cmake/3.12.3/bin/cmake -E copy /Users/buildslave/jenkins/workspace/lldb-cmake/llvm-project/lldb/examples/synthetic/gnu_libstdcpp.py /Users/buildslave/jenkins/workspace/lldb-cmake/llvm-project/lldb/examples/synthetic/libcxx.py formatters/cpp && /usr/local/bin/python /Users/buildslave/jenkins/workspace/lldb-cmake/llvm-project/lldb/scripts/Python/createPythonInit.py formatters/cpp /Users/buildslave/jenkins/workspace/lldb-cmake/llvm-project/lldb/examples/synthetic/gnu_libstdcpp.py /Users/buildslave/jenkins/workspace/lldb-cmake/llvm-project/lldb/examples/synthetic/libcxx.py && cd /Users/buildslave/jenkins/workspace/lldb-cmake/lldb-build/lib/python3.7/site-packages/lldb && /usr/local/Cellar/cmake/3.12.3/bin/cmake -E make_directory runtime && /usr/local/bin/python /Users/buildslave/jenkins/workspace/lldb-cmake/llvm-project/lldb/scripts/Python/createPythonInit.py runtime && cd /Users/buildslave/jenkins/workspace/lldb-cmake/lldb-build/lib/python3.7/site-packages/lldb && /usr/local/Cellar/cmake/3.12.3/bin/cmake -E make_directory formatters && /usr/local/Cellar/cmake/3.12.3/bin/cmake -E copy /Users/buildslave/jenkins/workspace/lldb-cmake/llvm-project/lldb/examples/summaries/cocoa/cache.py /Users/buildslave/jenkins/workspace/lldb-cmake/llvm-project/lldb/examples/summaries/synth.py /Users/buildslave/jenkins/workspace/lldb-cmake/llvm-project/lldb/examples/summaries/cocoa/metrics.py /Users/buildslave/jenkins/workspace/lldb-cmake/llvm-project/lldb/examples/summaries/cocoa/attrib_fromdict.py /Users/buildslave/jenkins/workspace/lldb-cmake/llvm-project/lldb/examples/summaries/cocoa/Logger.py formatters && /usr/local/bin/python /Users/buildslave/jenkins/workspace/lldb-cmake/llvm-project/lldb/scripts/Python/createPythonInit.py formatters /Users/buildslave/jenkins/workspace/lldb-cmake/llvm-project/lldb/examples/summaries/cocoa/cache.py /Users/buildslave/jenkins/workspace/lldb-cmake/llvm-project/lldb/examples/summaries/synth.py /Users/buildslave/jenkins/workspace/lldb-cmake/llvm-project/lldb/examples/summaries/cocoa/metrics.py /Users/buildslave/jenkins/workspace/lldb-cmake/llvm-project/lldb/examples/summaries/cocoa/attrib_fromdict.py /Users/buildslave/jenkins/workspace/lldb-cmake/llvm-project/lldb/examples/summaries/cocoa/Logger.py && cd /Users/buildslave/jenkins/workspace/lldb-cmake/lldb-build/lib/python3.7/site-packages/lldb && /usr/local/Cellar/cmake/3.12.3/bin/cmake -E make_directory utils && /usr/local/Cellar/cmake/3.12.3/bin/cmake -E copy /Users/buildslave/jenkins/workspace/lldb-cmake/llvm-project/lldb/examples/python/symbolication.py utils && /usr/local/bin/python /Users/buildslave/jenkins/workspace/lldb-cmake/llvm-project/lldb/scripts/Python/createPythonInit.py utils /Users/buildslave/jenkins/workspace/lldb-cmake/llvm-project/lldb/examples/python/symbolication.py && cd /Users/buildslave/jenkins/workspace/lldb-cmake/lldb-build/lib/python3.7/site-packages/lldb && /usr/local/Cellar/cmake/3.12.3/bin/cmake -E make_directory macosx && /usr/local/Cellar/cmake/3.12.3/bin/cmake -E copy /Users/buildslave/jenkins/workspace/lldb-cmake/llvm-project/lldb/examples/python/crashlog.py /Users/buildslave/jenkins/workspace/lldb-cmake/llvm-project/lldb/examples/darwin/heap_find/heap.py macosx && /usr/local/bin/python /Users/buildslave/jenkins/workspace/lldb-cmake/llvm-project/lldb/scripts/Python/createPythonInit.py macosx /Users/buildslave/jenkins/workspace/lldb-cmake/llvm-project/lldb/examples/python/crashlog.py /Users/buildslave/jenkins/workspace/lldb-cmake/llvm-project/lldb/examples/darwin/heap_find/heap.py && cd /Users/buildslave/jenkins/workspace/lldb-cmake/lldb-build/lib/python3.7/site-packages/lldb && /usr/local/Cellar/cmake/3.12.3/bin/cmake -E make_directory diagnose && /usr/local/Cellar/cmake/3.12.3/bin/cmake -E copy /Users/buildslave/jenkins/workspace/lldb-cmake/llvm-project/lldb/examples/python/diagnose_unwind.py /Users/buildslave/jenkins/workspace/lldb-cmake/llvm-project/lldb/examples/python/diagnose_nsstring.py diagnose && /usr/local/bin/python /Users/buildslave/jenkins/workspace/lldb-cmake/llvm-project/lldb/scripts/Python/createPythonInit.py diagnose /Users/buildslave/jenkins/workspace/lldb-cmake/llvm-project/lldb/examples/python/diagnose_unwind.py /Users/buildslave/jenkins/workspace/lldb-cmake/llvm-project/lldb/examples/python/diagnose_nsstring.py && cd /Users/buildslave/jenkins/workspace/lldb-cmake/lldb-build/lib/python3.7/site-packages/lldb && /usr/local/Cellar/cmake/3.12.3/bin/cmake -E create_symlink ../../../liblldb.dylib _lldb.so && cd /Users/buildslave/jenkins/workspace/lldb-cmake/lldb-build/lib/python3.7/site-packages/lldb && /usr/local/Cellar/cmake/3.12.3/bin/cmake -E create_symlink ../../../../bin/lldb-argdumper lldb-argdumper
[2186/2190] : && /Users/buildslave/jenkins/workspace/lldb-cmake/host-compiler/bin/clang++  -Wdocumentation -fPIC -fvisibility-inlines-hidden -Werror=date-time -Werror=unguarded-availability-new -fmodules -fmodules-cache-path=/Users/buildslave/jenkins/workspace/lldb-cmake/lldb-build/module.cache -fcxx-modules -Wall -Wextra -Wno-unused-parameter -Wwrite-strings -Wcast-qual -Wmissing-field-initializers -pedantic -Wno-long-long -Wimplicit-fallthrough -Wcovered-switch-default -Wno-noexcept-type -Wnon-virtual-dtor -Wdelete-non-virtual-dtor -Wstring-conversion -fdiagnostics-color -Wno-deprecated-declarations -Wno-unknown-pragmas -Wno-strict-aliasing -Wno-deprecated-register -Wno-vla-extension -O3  -isysroot /Applications/Xcode.app/Contents/Developer/Platforms/MacOSX.platform/Developer/SDKs/MacOSX10.14.sdk -Wl,-search_paths_first -Wl,-headerpad_max_install_names -Wl,-sectcreate,__TEXT,__info_plist,/Users/buildslave/jenkins/workspace/lldb-cmake/llvm-project/lldb/tools/driver/lldb-Info.plist    -Wl,-dead_strip tools/lldb/tools/driver/CMakeFiles/lldb.dir/Driver.cpp.o tools/lldb/tools/driver/CMakeFiles/lldb.dir/Platform.cpp.o  -o bin/lldb  -Wl,-rpath,@loader_path/../lib lib/libLLVMOption.a lib/libLLVMSupport.a lib/lldb.framework/Versions/10.0.99git/lldb -lz -lcurses -lm lib/libLLVMDemangle.a && :
[2187/2190] /Users/buildslave/jenkins/workspace/lldb-cmake/host-compiler/bin/clang++  -DGTEST_HAS_RTTI=0 -DGTEST_HAS_TR1_TUPLE=0 -DGTEST_LANG_CXX11=1 -DLLVM_ENABLE_PLUGINS -D_DEBUG -D__STDC_CONSTANT_MACROS -D__STDC_FORMAT_MACROS -D__STDC_LIMIT_MACROS -Iunittests/Passes -I/Users/buildslave/jenkins/workspace/lldb-cmake/llvm-project/llvm/unittests/Passes -I/Applications/Xcode.app/Contents/Developer/Platforms/MacOSX.platform/Developer/SDKs/MacOSX10.14.sdk/usr/include/libxml2 -Iinclude -I/Users/buildslave/jenkins/workspace/lldb-cmake/llvm-project/llvm/include -I/Users/buildslave/jenkins/workspace/lldb-cmake/llvm-project/llvm/utils/unittest/googletest/include -I/Users/buildslave/jenkins/workspace/lldb-cmake/llvm-project/llvm/utils/unittest/googlemock/include -Wdocumentation -fPIC -fvisibility-inlines-hidden -Werror=date-time -Werror=unguarded-availability-new -fmodules -fmodules-cache-path=/Users/buildslave/jenkins/workspace/lldb-cmake/lldb-build/module.cache -fcxx-modules -Wall -Wextra -Wno-unused-parameter -Wwrite-strings -Wcast-qual -Wmissing-field-initializers -pedantic -Wno-long-long -Wimplicit-fallthrough -Wcovered-switch-default -Wno-noexcept-type -Wnon-virtual-dtor -Wdelete-non-virtual-dtor -Wstring-conversion -fdiagnostics-color -O3  -isysroot /Applications/Xcode.app/Contents/Developer/Platforms/MacOSX.platform/Developer/SDKs/MacOSX10.14.sdk -fPIC   -UNDEBUG  -fno-exceptions -fno-rtti -std=c++14 -MD -MT unittests/Passes/CMakeFiles/TestPlugin.dir/TestPlugin.cpp.o -MF unittests/Passes/CMakeFiles/TestPlugin.dir/TestPlugin.cpp.o.d -o unittests/Passes/CMakeFiles/TestPlugin.dir/TestPlugin.cpp.o -c /Users/buildslave/jenkins/workspace/lldb-cmake/llvm-project/llvm/unittests/Passes/TestPlugin.cpp
While building module 'LLVM_Analysis' imported from /Users/buildslave/jenkins/workspace/lldb-cmake/llvm-project/llvm/include/llvm/Passes/PassBuilder.h:19:
In file included from <module-includes>:1:
/Users/buildslave/jenkins/workspace/lldb-cmake/llvm-project/llvm/include/llvm/Analysis/ScalarEvolution.h:1696:22: warning: '\c' command does not have a valid word argument [-Wdocumentation]
  /// by a call to \c @llvm.experimental.guard in \p BB.
                   ~~^
1 warning generated.
[2188/2190] : && /Users/buildslave/jenkins/workspace/lldb-cmake/host-compiler/bin/clang++ -Wdocumentation -fPIC -fvisibility-inlines-hidden -Werror=date-time -Werror=unguarded-availability-new -fmodules -fmodules-cache-path=/Users/buildslave/jenkins/workspace/lldb-cmake/lldb-build/module.cache -fcxx-modules -Wall -Wextra -Wno-unused-parameter -Wwrite-strings -Wcast-qual -Wmissing-field-initializers -pedantic -Wno-long-long -Wimplicit-fallthrough -Wcovered-switch-default -Wno-noexcept-type -Wnon-virtual-dtor -Wdelete-non-virtual-dtor -Wstring-conversion -fdiagnostics-color -O3 -isysroot /Applications/Xcode.app/Contents/Developer/Platforms/MacOSX.platform/Developer/SDKs/MacOSX10.14.sdk -bundle -Wl,-headerpad_max_install_names -Wl,-flat_namespace -Wl,-undefined -Wl,suppress   -Wl,-dead_strip -o unittests/Passes/TestPlugin.dylib unittests/Passes/CMakeFiles/TestPlugin.dir/TestPlugin.cpp.o  -Wl,-rpath,@loader_path/../lib && :
[2189/2190] /Users/buildslave/jenkins/workspace/lldb-cmake/host-compiler/bin/clang++  -DGTEST_HAS_RTTI=0 -D_DEBUG -D__STDC_CONSTANT_MACROS -D__STDC_FORMAT_MACROS -D__STDC_LIMIT_MACROS -Itools/llvm-exegesis -I/Users/buildslave/jenkins/workspace/lldb-cmake/llvm-project/llvm/tools/llvm-exegesis -I/Applications/Xcode.app/Contents/Developer/Platforms/MacOSX.platform/Developer/SDKs/MacOSX10.14.sdk/usr/include/libxml2 -Iinclude -I/Users/buildslave/jenkins/workspace/lldb-cmake/llvm-project/llvm/include -Wdocumentation -fPIC -fvisibility-inlines-hidden -Werror=date-time -Werror=unguarded-availability-new -fmodules -fmodules-cache-path=/Users/buildslave/jenkins/workspace/lldb-cmake/lldb-build/module.cache -fcxx-modules -Wall -Wextra -Wno-unused-parameter -Wwrite-strings -Wcast-qual -Wmissing-field-initializers -pedantic -Wno-long-long -Wimplicit-fallthrough -Wcovered-switch-default -Wno-noexcept-type -Wnon-virtual-dtor -Wdelete-non-virtual-dtor -Wstring-conversion -fdiagnostics-color -O3  -isysroot /Applications/Xcode.app/Contents/Developer/Platforms/MacOSX.platform/Developer/SDKs/MacOSX10.14.sdk   -UNDEBUG  -fno-exceptions -fno-rtti -std=c++14 -DLLVM_EXEGESIS_INITIALIZE_NATIVE_TARGET=InitializeX86ExegesisTarget -MD -MT tools/llvm-exegesis/CMakeFiles/llvm-exegesis.dir/llvm-exegesis.cpp.o -MF tools/llvm-exegesis/CMakeFiles/llvm-exegesis.dir/llvm-exegesis.cpp.o.d -o tools/llvm-exegesis/CMakeFiles/llvm-exegesis.dir/llvm-exegesis.cpp.o -c /Users/buildslave/jenkins/workspace/lldb-cmake/llvm-project/llvm/tools/llvm-exegesis/llvm-exegesis.cpp
While building module 'LLVM_Backend' imported from /Users/buildslave/jenkins/workspace/lldb-cmake/llvm-project/llvm/tools/llvm-exegesis/lib/Assembler.h:23:
While building module 'LLVM_Analysis' imported from /Users/buildslave/jenkins/workspace/lldb-cmake/llvm-project/llvm/include/llvm/CodeGen/TargetLowering.h:31:
In file included from <module-includes>:1:
/Users/buildslave/jenkins/workspace/lldb-cmake/llvm-project/llvm/include/llvm/Analysis/ScalarEvolution.h:1696:22: warning: '\c' command does not have a valid word argument [-Wdocumentation]
  /// by a call to \c @llvm.experimental.guard in \p BB.
                   ~~^
1 warning generated.
[2190/2190] : && /Users/buildslave/jenkins/workspace/lldb-cmake/host-compiler/bin/clang++  -Wdocumentation -fPIC -fvisibility-inlines-hidden -Werror=date-time -Werror=unguarded-availability-new -fmodules -fmodules-cache-path=/Users/buildslave/jenkins/workspace/lldb-cmake/lldb-build/module.cache -fcxx-modules -Wall -Wextra -Wno-unused-parameter -Wwrite-strings -Wcast-qual -Wmissing-field-initializers -pedantic -Wno-long-long -Wimplicit-fallthrough -Wcovered-switch-default -Wno-noexcept-type -Wnon-virtual-dtor -Wdelete-non-virtual-dtor -Wstring-conversion -fdiagnostics-color -O3  -isysroot /Applications/Xcode.app/Contents/Developer/Platforms/MacOSX.platform/Developer/SDKs/MacOSX10.14.sdk -Wl,-search_paths_first -Wl,-headerpad_max_install_names -Wl,-dead_strip tools/llvm-exegesis/CMakeFiles/llvm-exegesis.dir/llvm-exegesis.cpp.o  -o bin/llvm-exegesis  -Wl,-rpath,@loader_path/../lib lib/libLLVMMCParser.a lib/libLLVMSupport.a lib/libLLVMX86CodeGen.a lib/libLLVMX86AsmParser.a lib/libLLVMX86Desc.a lib/libLLVMX86Disassembler.a lib/libLLVMX86Info.a lib/libLLVMX86Utils.a lib/libLLVMExegesis.a lib/libLLVMExegesisX86.a lib/libLLVMX86CodeGen.a lib/libLLVMAsmPrinter.a lib/libLLVMDebugInfoDWARF.a lib/libLLVMCFGuard.a lib/libLLVMX86AsmParser.a lib/libLLVMX86Desc.a lib/libLLVMX86Disassembler.a lib/libLLVMX86Info.a lib/libLLVMX86Utils.a lib/libLLVMExegesis.a lib/libLLVMGlobalISel.a lib/libLLVMSelectionDAG.a lib/libLLVMCodeGen.a lib/libLLVMBitWriter.a lib/libLLVMScalarOpts.a lib/libLLVMAggressiveInstCombine.a lib/libLLVMInstCombine.a lib/libLLVMTransformUtils.a lib/libLLVMMCDisassembler.a lib/libLLVMMCJIT.a lib/libLLVMExecutionEngine.a lib/libLLVMTarget.a lib/libLLVMAnalysis.a lib/libLLVMProfileData.a lib/libLLVMRuntimeDyld.a lib/libLLVMObjectYAML.a lib/libLLVMObject.a lib/libLLVMMCParser.a lib/libLLVMMC.a lib/libLLVMBitReader.a lib/libLLVMCore.a lib/libLLVMRemarks.a lib/libLLVMBitstreamReader.a lib/libLLVMTextAPI.a lib/libLLVMBinaryFormat.a lib/libLLVMDebugInfoCodeView.a lib/libLLVMDebugInfoMSF.a lib/libLLVMSupport.a -lz -lcurses -lm lib/libLLVMDemangle.a && :
Completed at: 2019-11-12T14:52:58
@@@@@@
[Pipeline] }
[Pipeline] // timeout
[Pipeline] }
[Pipeline] // stage
[Pipeline] stage
[Pipeline] { (Test)
[Pipeline] timeout
Timeout set to expire in 1 hr 0 min
[Pipeline] {
[Pipeline] sh
+ set -u
+ export PATH=/usr/local/bin:/usr/local/sbin:/usr/bin:/bin:/usr/sbin:/sbin:/usr/bin:/usr/local/bin
+ PATH=/usr/local/bin:/usr/local/sbin:/usr/bin:/bin:/usr/sbin:/sbin:/usr/bin:/usr/local/bin
+ rm -rf test/results.xml
+ python llvm-zorg/zorg/jenkins/monorepo_build.py lldb-cmake testlong
Error: missing dependency: os_version v10.13.5, found v10.14 installed, requested from clang_build_dependencies.dep:0: os_version == 10.13.5 # Oldest CI nodes are currently 10.13.3
Dependency met brew cmake v3.11.2
Dependency met brew ninja v1.8.2
Dependency met pip psutil v5.4.5
Dependency met pip six v1.11.0
Error: missing dependency: xcode v9.4.1, found v10.1 installed, requested from clang_build_dependencies.dep:5: xcode == 9.4.1
Clean

Hide Details

@@@ Clean @@@ Removing module cache: /Users/buildslave/jenkins/workspace/lldb-cmake/lldb-build/module.cache Completed at: 2019-11-12T14:53:05 @@@@@@
Run Debug Info Tests

Hide Details

@@@ Run Debug Info Tests @@@ cd /Users/buildslave/jenkins/workspace/lldb-cmake/lldb-build '/usr/local/bin/ninja' '-v' 'check-debuginfo' [0/1] cd /Users/buildslave/jenkins/workspace/lldb-cmake/lldb-build/projects/debuginfo-tests && /usr/local/bin/python /Users/buildslave/jenkins/workspace/lldb-cmake/lldb-build/./bin/llvm-lit -v --time-tests --shuffle --xunit-xml-output=/Users/buildslave/jenkins/workspace/lldb-cmake/test/results.xml -v /Users/buildslave/jenkins/workspace/lldb-cmake/lldb-build/projects/debuginfo-tests -- Testing: 53 tests, 24 workers -- llvm-lit: /Users/buildslave/jenkins/workspace/lldb-cmake/llvm-project/llvm/utils/lit/lit/llvm/config.py:342: note: using clang: /Users/buildslave/jenkins/workspace/lldb-cmake/lldb-build/bin/clang llvm-lit: /Users/buildslave/jenkins/workspace/lldb-cmake/llvm-project/llvm/utils/lit/lit/llvm/config.py:342: note: using clang++: /Users/buildslave/jenkins/workspace/lldb-cmake/lldb-build/bin/clang++ llvm-lit: /Users/buildslave/jenkins/workspace/lldb-cmake/llvm-project/llvm/utils/lit/lit/llvm/config.py:342: note: using clang-cl: /Users/buildslave/jenkins/workspace/lldb-cmake/lldb-build/bin/clang-cl llvm-lit: /Users/buildslave/jenkins/workspace/lldb-cmake/llvm-project/llvm/utils/lit/lit/llvm/config.py:342: note: using lldb: /Users/buildslave/jenkins/workspace/lldb-cmake/lldb-build/bin/lldb llvm-lit: /Users/buildslave/jenkins/workspace/lldb-cmake/llvm-project/llvm/utils/lit/lit/util.py:410: note: using SDKROOT: '/Applications/Xcode.app/Contents/Developer/Platforms/MacOSX.platform/Developer/SDKs/MacOSX10.14.sdk' UNSUPPORTED: debuginfo-tests :: dexter/feature_tests/commands/perfect/expect_step_kind/recursive.cpp (1 of 53) UNSUPPORTED: debuginfo-tests :: dexter/feature_tests/commands/perfect/unreachable.cpp (2 of 53) UNSUPPORTED: debuginfo-tests :: dexter/feature_tests/commands/perfect/expect_program_state.cpp (3 of 53) UNSUPPORTED: debuginfo-tests :: dexter/feature_tests/commands/perfect/expect_step_kind/func.cpp (4 of 53) UNSUPPORTED: debuginfo-tests :: dexter-tests/realigned-frame.cpp (5 of 53) UNSUPPORTED: debuginfo-tests :: dexter-tests/hello.c (6 of 53) UNSUPPORTED: debuginfo-tests :: dexter/feature_tests/commands/perfect/expect_watch_type.cpp (7 of 53) UNSUPPORTED: debuginfo-tests :: dexter/feature_tests/commands/perfect/expect_step_kind/direction.cpp (8 of 53) UNSUPPORTED: debuginfo-tests :: dexter/feature_tests/commands/perfect/expect_watch_value.cpp (9 of 53) UNSUPPORTED: debuginfo-tests :: dexter/feature_tests/commands/penalty/expect_watch_value.cpp (10 of 53) UNSUPPORTED: debuginfo-tests :: dexter/feature_tests/subtools/clang-opt-bisect/clang-opt-bisect.cpp (11 of 53) UNSUPPORTED: debuginfo-tests :: dexter/feature_tests/commands/perfect/expect_step_kind/small_loop.cpp (12 of 53) UNSUPPORTED: debuginfo-tests :: dexter/feature_tests/commands/penalty/unreachable.cpp (13 of 53) UNSUPPORTED: debuginfo-tests :: dexter/feature_tests/commands/penalty/expect_watch_type.cpp (14 of 53) UNSUPPORTED: debuginfo-tests :: dexter-tests/inline-line-gap.cpp (15 of 53) UNSUPPORTED: debuginfo-tests :: dexter-tests/global-constant.cpp (16 of 53) UNSUPPORTED: debuginfo-tests :: dexter/feature_tests/commands/penalty/expect_program_state.cpp (17 of 53) UNSUPPORTED: debuginfo-tests :: dexter/feature_tests/commands/penalty/expect_step_order.cpp (18 of 53) UNSUPPORTED: debuginfo-tests :: dexter/feature_tests/subtools/view.cpp (19 of 53) UNSUPPORTED: debuginfo-tests :: dexter/feature_tests/commands/penalty/expect_step_kinds.cpp (20 of 53) PASS: debuginfo-tests :: llgdb-tests/apple-accel.cpp (21 of 53) UNSUPPORTED: debuginfo-tests :: dexter/feature_tests/commands/perfect/expect_step_kind/func_external.cpp (22 of 53) UNSUPPORTED: debuginfo-tests :: llgdb-tests/safestack.c (23 of 53) PASS: debuginfo-tests :: dexter/feature_tests/subtools/help/help.test (24 of 53) PASS: debuginfo-tests :: dexter/feature_tests/subtools/list-debuggers/list-debuggers.test (25 of 53) PASS: debuginfo-tests :: dexter/feature_tests/unittests/run.test (26 of 53) UNSUPPORTED: debuginfo-tests :: dexter/feature_tests/commands/perfect/expect_step_order.cpp (27 of 53) UNSUPPORTED: debuginfo-tests :: dexter-tests/nrvo.cpp (28 of 53) PASS: debuginfo-tests :: dexter/feature_tests/subtools/test/err_syntax_mline.cpp (29 of 53) PASS: debuginfo-tests :: dexter/feature_tests/subtools/test/err_type_mline.cpp (30 of 53) PASS: debuginfo-tests :: dexter/feature_tests/subtools/test/err_syntax.cpp (31 of 53) PASS: debuginfo-tests :: llgdb-tests/forward-declare-class.cpp (32 of 53) PASS: debuginfo-tests :: llgdb-tests/nested-struct.cpp (33 of 53) PASS: debuginfo-tests :: dexter/feature_tests/subtools/test/err_type.cpp (34 of 53) FAIL: debuginfo-tests :: dexter-tests/aggregate-indirect-arg.cpp (35 of 53) ******************** TEST 'debuginfo-tests :: dexter-tests/aggregate-indirect-arg.cpp' FAILED ******************** Script: -- : 'RUN: at line 4'; "/usr/local/bin/python" "/Users/buildslave/jenkins/workspace/lldb-cmake/llvm-project/debuginfo-tests/dexter/dexter.py" test --lldb-executable /Users/buildslave/jenkins/workspace/lldb-cmake/lldb-build/bin/lldb --fail-lt 1.0 -w --builder 'clang' --debugger 'lldb' --cflags "-O0 -g" --ldflags="-lstdc++" -- /Users/buildslave/jenkins/workspace/lldb-cmake/llvm-project/debuginfo-tests/dexter-tests/aggregate-indirect-arg.cpp -- Exit Code: 2

Hide Details

Command Output (stdout): -- aggregate-indirect-arg.cpp: nan/nan (nan) [Command '['/usr/local/opt/python/bin/python3.7', '/Users/buildslave/jenkins/workspace/lldb-cmake/llvm-project/debuginfo-tests/dexter/dex/../dexter.py', 'run-debugger-internal-', '/var/folders/09/r4vw4v8n5kb67jl66zvlbljw0000gn/T/dexter/tmps3mnli1j/tmpieyri8uv', '/var/folders/09/r4vw4v8n5kb67jl66zvlbljw0000gn/T/dexter/tmps3mnli1j/tmp1khvu92q', '--working-directory', '/var/folders/09/r4vw4v8n5kb67jl66zvlbljw0000gn/T/dexter/tmps3mnli1j', '--unittest=off', '--indent-timer-level=3']' returned non-zero exit status 1.]

Hide Details

Hide Details

-- Command Output (stderr): --

Hide Details

error: could not load lldb (path "/Users/buildslave/jenkins/workspace/lldb-cmake/lldb-build/lib/lldb.framework/Versions/lib/python3.7/site-packages" does not exist [result of ['/Users/buildslave/jenkins/workspace/lldb-cmake/lldb-build/bin/lldb', '-P']])

Hide Details

Hide Details

--

Hide Details

******************** FAIL: debuginfo-tests :: dexter-tests/dbg-arg.c (36 of 53) ******************** TEST 'debuginfo-tests :: dexter-tests/dbg-arg.c' FAILED ******************** Script: -- : 'RUN: at line 5'; "/usr/local/bin/python" "/Users/buildslave/jenkins/workspace/lldb-cmake/llvm-project/debuginfo-tests/dexter/dexter.py" test --lldb-executable /Users/buildslave/jenkins/workspace/lldb-cmake/lldb-build/bin/lldb --fail-lt 1.0 -w --builder clang-c --debugger 'lldb' --cflags "-m64 -mllvm -fast-isel=false -g" -- /Users/buildslave/jenkins/workspace/lldb-cmake/llvm-project/debuginfo-tests/dexter-tests/dbg-arg.c -- Exit Code: 2

Hide Details

Command Output (stdout): -- dbg-arg.c: nan/nan (nan) [Command '['/usr/local/opt/python/bin/python3.7', '/Users/buildslave/jenkins/workspace/lldb-cmake/llvm-project/debuginfo-tests/dexter/dex/../dexter.py', 'run-debugger-internal-', '/var/folders/09/r4vw4v8n5kb67jl66zvlbljw0000gn/T/dexter/tmpghwt1adc/tmpf4uuyzqe', '/var/folders/09/r4vw4v8n5kb67jl66zvlbljw0000gn/T/dexter/tmpghwt1adc/tmp8hbaf_nl', '--working-directory', '/var/folders/09/r4vw4v8n5kb67jl66zvlbljw0000gn/T/dexter/tmpghwt1adc', '--unittest=off', '--indent-timer-level=3']' returned non-zero exit status 1.]

Hide Details

Hide Details

-- Command Output (stderr): --

Hide Details

error: could not load lldb (path "/Users/buildslave/jenkins/workspace/lldb-cmake/lldb-build/lib/lldb.framework/Versions/lib/python3.7/site-packages" does not exist [result of ['/Users/buildslave/jenkins/workspace/lldb-cmake/lldb-build/bin/lldb', '-P']])

Hide Details

Hide Details

--

Hide Details

******************** FAIL: debuginfo-tests :: dexter-tests/ctor.cpp (37 of 53) ******************** TEST 'debuginfo-tests :: dexter-tests/ctor.cpp' FAILED ******************** Script: -- : 'RUN: at line 4'; "/usr/local/bin/python" "/Users/buildslave/jenkins/workspace/lldb-cmake/llvm-project/debuginfo-tests/dexter/dexter.py" test --lldb-executable /Users/buildslave/jenkins/workspace/lldb-cmake/lldb-build/bin/lldb --fail-lt 1.0 -w --builder 'clang' --debugger 'lldb' --cflags "-O0 -glldb" -- /Users/buildslave/jenkins/workspace/lldb-cmake/llvm-project/debuginfo-tests/dexter-tests/ctor.cpp -- Exit Code: 2

Hide Details

Command Output (stdout): -- ctor.cpp: nan/nan (nan) [Command '['/usr/local/opt/python/bin/python3.7', '/Users/buildslave/jenkins/workspace/lldb-cmake/llvm-project/debuginfo-tests/dexter/dex/../dexter.py', 'run-debugger-internal-', '/var/folders/09/r4vw4v8n5kb67jl66zvlbljw0000gn/T/dexter/tmpnfs372ax/tmpc85f09pz', '/var/folders/09/r4vw4v8n5kb67jl66zvlbljw0000gn/T/dexter/tmpnfs372ax/tmpf4z5v5_q', '--working-directory', '/var/folders/09/r4vw4v8n5kb67jl66zvlbljw0000gn/T/dexter/tmpnfs372ax', '--unittest=off', '--indent-timer-level=3']' returned non-zero exit status 1.]

Hide Details

Hide Details

-- Command Output (stderr): --

Hide Details

error: could not load lldb (path "/Users/buildslave/jenkins/workspace/lldb-cmake/lldb-build/lib/lldb.framework/Versions/lib/python3.7/site-packages" does not exist [result of ['/Users/buildslave/jenkins/workspace/lldb-cmake/lldb-build/bin/lldb', '-P']])

Hide Details

Hide Details

--

Hide Details

******************** FAIL: debuginfo-tests :: dexter-tests/vla.c (38 of 53) ******************** TEST 'debuginfo-tests :: dexter-tests/vla.c' FAILED ******************** Script: -- : 'RUN: at line 5'; "/usr/local/bin/python" "/Users/buildslave/jenkins/workspace/lldb-cmake/llvm-project/debuginfo-tests/dexter/dexter.py" test --lldb-executable /Users/buildslave/jenkins/workspace/lldb-cmake/lldb-build/bin/lldb --fail-lt 1.0 -w --builder clang-c --debugger 'lldb' --cflags "-O0 -glldb" -- /Users/buildslave/jenkins/workspace/lldb-cmake/llvm-project/debuginfo-tests/dexter-tests/vla.c -- Exit Code: 2

Hide Details

Command Output (stdout): -- vla.c: nan/nan (nan) [Command '['/usr/local/opt/python/bin/python3.7', '/Users/buildslave/jenkins/workspace/lldb-cmake/llvm-project/debuginfo-tests/dexter/dex/../dexter.py', 'run-debugger-internal-', '/var/folders/09/r4vw4v8n5kb67jl66zvlbljw0000gn/T/dexter/tmppcj4tpu2/tmpx3j5o0q1', '/var/folders/09/r4vw4v8n5kb67jl66zvlbljw0000gn/T/dexter/tmppcj4tpu2/tmp9y9gz5eh', '--working-directory', '/var/folders/09/r4vw4v8n5kb67jl66zvlbljw0000gn/T/dexter/tmppcj4tpu2', '--unittest=off', '--indent-timer-level=3']' returned non-zero exit status 1.]

Hide Details

Hide Details

-- Command Output (stderr): --

Hide Details

error: could not load lldb (path "/Users/buildslave/jenkins/workspace/lldb-cmake/lldb-build/lib/lldb.framework/Versions/lib/python3.7/site-packages" does not exist [result of ['/Users/buildslave/jenkins/workspace/lldb-cmake/lldb-build/bin/lldb', '-P']])

Hide Details

Hide Details

--

Hide Details

******************** FAIL: debuginfo-tests :: dexter-tests/stack-var.c (39 of 53) ******************** TEST 'debuginfo-tests :: dexter-tests/stack-var.c' FAILED ******************** Script: -- : 'RUN: at line 4'; "/usr/local/bin/python" "/Users/buildslave/jenkins/workspace/lldb-cmake/llvm-project/debuginfo-tests/dexter/dexter.py" test --lldb-executable /Users/buildslave/jenkins/workspace/lldb-cmake/lldb-build/bin/lldb --fail-lt 1.0 -w --builder clang-c --debugger 'lldb' --cflags "-O -glldb" -- /Users/buildslave/jenkins/workspace/lldb-cmake/llvm-project/debuginfo-tests/dexter-tests/stack-var.c -- Exit Code: 2

Hide Details

Command Output (stdout): -- stack-var.c: nan/nan (nan) [Command '['/usr/local/opt/python/bin/python3.7', '/Users/buildslave/jenkins/workspace/lldb-cmake/llvm-project/debuginfo-tests/dexter/dex/../dexter.py', 'run-debugger-internal-', '/var/folders/09/r4vw4v8n5kb67jl66zvlbljw0000gn/T/dexter/tmpeur9vxm1/tmpdixd2ul2', '/var/folders/09/r4vw4v8n5kb67jl66zvlbljw0000gn/T/dexter/tmpeur9vxm1/tmpy1xm_1s5', '--working-directory', '/var/folders/09/r4vw4v8n5kb67jl66zvlbljw0000gn/T/dexter/tmpeur9vxm1', '--unittest=off', '--indent-timer-level=3']' returned non-zero exit status 1.]

Hide Details

Hide Details

-- Command Output (stderr): --

Hide Details

error: could not load lldb (path "/Users/buildslave/jenkins/workspace/lldb-cmake/lldb-build/lib/lldb.framework/Versions/lib/python3.7/site-packages" does not exist [result of ['/Users/buildslave/jenkins/workspace/lldb-cmake/lldb-build/bin/lldb', '-P']])

Hide Details

Hide Details

--

Hide Details

******************** FAIL: debuginfo-tests :: dexter-tests/asan.c (40 of 53) ******************** TEST 'debuginfo-tests :: dexter-tests/asan.c' FAILED ******************** Script: -- : 'RUN: at line 6'; "/usr/local/bin/python" "/Users/buildslave/jenkins/workspace/lldb-cmake/llvm-project/debuginfo-tests/dexter/dexter.py" test --lldb-executable /Users/buildslave/jenkins/workspace/lldb-cmake/lldb-build/bin/lldb --fail-lt 1.0 -w --builder 'clang-c' --debugger 'lldb' --cflags "--driver-mode=gcc -O0 -glldb -fblocks -arch x86_64 -fsanitize=address" --ldflags="-fsanitize=address" -- /Users/buildslave/jenkins/workspace/lldb-cmake/llvm-project/debuginfo-tests/dexter-tests/asan.c -- Exit Code: 2

Hide Details

Command Output (stdout): -- asan.c: nan/nan (nan) [Command '['/usr/local/opt/python/bin/python3.7', '/Users/buildslave/jenkins/workspace/lldb-cmake/llvm-project/debuginfo-tests/dexter/dex/../dexter.py', 'run-debugger-internal-', '/var/folders/09/r4vw4v8n5kb67jl66zvlbljw0000gn/T/dexter/tmp7d8t9usd/tmplvdvt3hv', '/var/folders/09/r4vw4v8n5kb67jl66zvlbljw0000gn/T/dexter/tmp7d8t9usd/tmpppe8yfxb', '--working-directory', '/var/folders/09/r4vw4v8n5kb67jl66zvlbljw0000gn/T/dexter/tmp7d8t9usd', '--unittest=off', '--indent-timer-level=3']' returned non-zero exit status 1.]

Hide Details

Hide Details

-- Command Output (stderr): --

Hide Details

error: could not load lldb (path "/Users/buildslave/jenkins/workspace/lldb-cmake/lldb-build/lib/lldb.framework/Versions/lib/python3.7/site-packages" does not exist [result of ['/Users/buildslave/jenkins/workspace/lldb-cmake/lldb-build/bin/lldb', '-P']])

Hide Details

Hide Details

--

Hide Details

******************** PASS: debuginfo-tests :: dexter/feature_tests/subtools/test/err_paren_mline.cpp (41 of 53) PASS: debuginfo-tests :: dexter/feature_tests/subtools/test/err_paren.cpp (42 of 53) FAIL: debuginfo-tests :: dexter-tests/nrvo-string.cpp (43 of 53) ******************** TEST 'debuginfo-tests :: dexter-tests/nrvo-string.cpp' FAILED ******************** Script: -- : 'RUN: at line 10'; "/usr/local/bin/python" "/Users/buildslave/jenkins/workspace/lldb-cmake/llvm-project/debuginfo-tests/dexter/dexter.py" test --lldb-executable /Users/buildslave/jenkins/workspace/lldb-cmake/lldb-build/bin/lldb --fail-lt 1.0 -w --builder 'clang' --debugger 'lldb' --cflags "-O0 -glldb -fno-exceptions" -- /Users/buildslave/jenkins/workspace/lldb-cmake/llvm-project/debuginfo-tests/dexter-tests/nrvo-string.cpp : 'RUN: at line 14'; "/usr/local/bin/python" "/Users/buildslave/jenkins/workspace/lldb-cmake/llvm-project/debuginfo-tests/dexter/dexter.py" test --lldb-executable /Users/buildslave/jenkins/workspace/lldb-cmake/lldb-build/bin/lldb --fail-lt 1.0 -w --builder 'clang' --debugger 'lldb' --cflags "-O1 -glldb -fno-exceptions" -- /Users/buildslave/jenkins/workspace/lldb-cmake/llvm-project/debuginfo-tests/dexter-tests/nrvo-string.cpp -- Exit Code: 2

Hide Details

Command Output (stdout): -- nrvo-string.cpp: nan/nan (nan) [Command '['/usr/local/opt/python/bin/python3.7', '/Users/buildslave/jenkins/workspace/lldb-cmake/llvm-project/debuginfo-tests/dexter/dex/../dexter.py', 'run-debugger-internal-', '/var/folders/09/r4vw4v8n5kb67jl66zvlbljw0000gn/T/dexter/tmpbb1gwfz8/tmpoduweb5b', '/var/folders/09/r4vw4v8n5kb67jl66zvlbljw0000gn/T/dexter/tmpbb1gwfz8/tmps8jzh362', '--working-directory', '/var/folders/09/r4vw4v8n5kb67jl66zvlbljw0000gn/T/dexter/tmpbb1gwfz8', '--unittest=off', '--indent-timer-level=3']' returned non-zero exit status 1.]

Hide Details

Hide Details

-- Command Output (stderr): --

Hide Details

error: could not load lldb (path "/Users/buildslave/jenkins/workspace/lldb-cmake/lldb-build/lib/lldb.framework/Versions/lib/python3.7/site-packages" does not exist [result of ['/Users/buildslave/jenkins/workspace/lldb-cmake/lldb-build/bin/lldb', '-P']])

Hide Details

Hide Details

--

Hide Details

******************** XFAIL: debuginfo-tests :: llgdb-tests/static-member-2.cpp (44 of 53) PASS: debuginfo-tests :: llgdb-tests/static-member.cpp (45 of 53) PASS: debuginfo-tests :: llgdb-tests/asan.c (46 of 53) PASS: debuginfo-tests :: llgdb-tests/asan-blocks.c (47 of 53) PASS: debuginfo-tests :: llgdb-tests/nrvo-string.cpp (48 of 53) PASS: debuginfo-tests :: llgdb-tests/asan-deque.cpp (49 of 53) PASS: debuginfo-tests :: llgdb-tests/block_var.m (50 of 53) XFAIL: debuginfo-tests :: dexter-tests/asan-deque.cpp (51 of 53) PASS: debuginfo-tests :: llgdb-tests/foreach.m (52 of 53) PASS: debuginfo-tests :: llgdb-tests/blocks.m (53 of 53)

Hide Details

Testing Time: 4.54s ******************** Failing Tests (7): debuginfo-tests :: dexter-tests/aggregate-indirect-arg.cpp debuginfo-tests :: dexter-tests/vla.c debuginfo-tests :: dexter-tests/asan.c debuginfo-tests :: dexter-tests/stack-var.c debuginfo-tests :: dexter-tests/ctor.cpp debuginfo-tests :: dexter-tests/dbg-arg.c debuginfo-tests :: dexter-tests/nrvo-string.cpp

Hide Details

Hide Details

Slowest Tests: -------------------------------------------------------------------------- 0.57s: debuginfo-tests :: dexter/feature_tests/subtools/test/err_syntax.cpp 0.61s: debuginfo-tests :: llgdb-tests/nested-struct.cpp 0.61s: debuginfo-tests :: llgdb-tests/forward-declare-class.cpp 0.78s: debuginfo-tests :: dexter-tests/nrvo-string.cpp 0.87s: debuginfo-tests :: dexter-tests/dbg-arg.c 0.88s: debuginfo-tests :: dexter-tests/ctor.cpp 0.88s: debuginfo-tests :: dexter-tests/stack-var.c 0.88s: debuginfo-tests :: dexter-tests/vla.c 0.89s: debuginfo-tests :: dexter-tests/aggregate-indirect-arg.cpp 0.89s: debuginfo-tests :: dexter-tests/asan.c 1.35s: debuginfo-tests :: llgdb-tests/static-member-2.cpp 1.42s: debuginfo-tests :: llgdb-tests/static-member.cpp 1.85s: debuginfo-tests :: llgdb-tests/asan-blocks.c 1.86s: debuginfo-tests :: llgdb-tests/asan.c 2.69s: debuginfo-tests :: llgdb-tests/block_var.m 2.82s: debuginfo-tests :: llgdb-tests/nrvo-string.cpp 3.08s: debuginfo-tests :: llgdb-tests/asan-deque.cpp 3.62s: debuginfo-tests :: dexter-tests/asan-deque.cpp 4.00s: debuginfo-tests :: llgdb-tests/foreach.m 4.46s: debuginfo-tests :: llgdb-tests/blocks.m

Hide Details

Tests Times: -------------------------------------------------------------------------- [ Range ] :: [ Percentage ] :: [Count] -------------------------------------------------------------------------- [0.00s,0.20s) :: [****************** ] :: [24/53] [0.20s,0.40s) :: [ ] :: [ 1/53] [0.40s,0.60s) :: [****** ] :: [ 9/53] [0.60s,0.80s) :: [* ] :: [ 2/53] [0.80s,1.00s) :: [***** ] :: [ 7/53] [1.00s,1.20s) :: [ ] :: [ 0/53] [1.20s,1.40s) :: [ ] :: [ 1/53] [1.40s,1.60s) :: [ ] :: [ 1/53] [1.60s,1.80s) :: [ ] :: [ 0/53] [1.80s,2.00s) :: [* ] :: [ 2/53] [2.00s,2.20s) :: [ ] :: [ 0/53] [2.20s,2.40s) :: [ ] :: [ 0/53] [2.40s,2.60s) :: [ ] :: [ 0/53] [2.60s,2.80s) :: [ ] :: [ 1/53] [2.80s,3.00s) :: [ ] :: [ 1/53] [3.00s,3.20s) :: [ ] :: [ 1/53] [3.20s,3.40s) :: [ ] :: [ 0/53] [3.40s,3.60s) :: [ ] :: [ 0/53] [3.60s,3.80s) :: [ ] :: [ 1/53] [3.80s,4.00s) :: [ ] :: [ 0/53] [4.00s,4.20s) :: [ ] :: [ 1/53] [4.20s,4.40s) :: [ ] :: [ 0/53] [4.40s,4.60s) :: [ ] :: [ 1/53] Expected Passes : 20 Expected Failures : 2 Unsupported Tests : 24 Unexpected Failures: 7 FAILED: projects/debuginfo-tests/CMakeFiles/check-debuginfo cd /Users/buildslave/jenkins/workspace/lldb-cmake/lldb-build/projects/debuginfo-tests && /usr/local/bin/python /Users/buildslave/jenkins/workspace/lldb-cmake/lldb-build/./bin/llvm-lit -v --time-tests --shuffle --xunit-xml-output=/Users/buildslave/jenkins/workspace/lldb-cmake/test/results.xml -v /Users/buildslave/jenkins/workspace/lldb-cmake/lldb-build/projects/debuginfo-tests ninja: build stopped: subcommand failed. Command failed: Command '['/usr/local/bin/ninja', '-v', 'check-debuginfo']' returned non-zero exit status 1. Command: ['/usr/local/bin/ninja', '-v', 'check-debuginfo'] [Pipeline] } [Pipeline] // timeout [Pipeline] } [Pipeline] // stage [Pipeline] stage [Pipeline] { (Declarative: Post Actions) [Pipeline] scanForIssues No credentials specified [Clang (LLVM based)] Sleeping for 5 seconds due to JENKINS-32191... [Clang (LLVM based)] Parsing console log (workspace: '/Users/buildslave/jenkins/workspace/lldb-cmake') [Clang (LLVM based)] [-ERROR-] Git blame errors: [Clang (LLVM based)] [-ERROR-] - no blame results for request <llvm-project/lldb/include/lldb/Target/Process.h - [1394, 2375, 523, 717, 1725, 2174]>.

Hide Details

[Clang (LLVM based)] [-ERROR-] Git blame errors: [Clang (LLVM based)] [-ERROR-] - no blame results for request <llvm-project/lldb/include/lldb/Host/common/NativeProcessProtocol.h - [387, 390]>.

Hide Details

[Clang (LLVM based)] [-ERROR-] Git blame errors: [Clang (LLVM based)] [-ERROR-] - no blame results for request <llvm-project/lldb/include/lldb/Utility/ConstString.h - [337, 149, 168, 330, 191]>.

Hide Details

[Clang (LLVM based)] [-ERROR-] Git blame errors: [Clang (LLVM based)] [-ERROR-] - no blame results for request <llvm-project/lldb/include/lldb/Utility/Broadcaster.h - [370, 263, 311, 392, 267, 271, 351]>.

Hide Details

[Clang (LLVM based)] [-ERROR-] Git blame errors: [Clang (LLVM based)] [-ERROR-] - no blame results for request <llvm-project/lldb/include/lldb/Expression/ExpressionParser.h - [32]>.

Hide Details

[Clang (LLVM based)] [-ERROR-] Git blame errors: [Clang (LLVM based)] [-ERROR-] - no blame results for request <llvm-project/lldb/source/Plugins/ExpressionParser/Clang/ASTResultSynthesizer.h - [148, 141]>.

Hide Details

[Clang (LLVM based)] [-ERROR-] Git blame errors: [Clang (LLVM based)] [-ERROR-] - no blame results for request <llvm-project/lldb/include/lldb/Symbol/Declaration.h - [94]>.

Hide Details

[Clang (LLVM based)] [-ERROR-] Git blame errors: [Clang (LLVM based)] [-ERROR-] - no blame results for request <llvm-project/lldb/include/lldb/Host/PseudoTerminal.h - [64, 68, 168, 107, 139, 172, 143]>.

Hide Details

[Clang (LLVM based)] [-ERROR-] Git blame errors: [Clang (LLVM based)] [-ERROR-] - no blame results for request <llvm-project/lldb/include/lldb/Expression/UtilityFunction.h - [68]>.

Hide Details

[Clang (LLVM based)] [-ERROR-] Git blame errors: [Clang (LLVM based)] [-ERROR-] - no blame results for request <llvm-project/lldb/include/lldb/Target/StackFrame.h - [102, 294, 409, 426, 302]>.

Hide Details

[Clang (LLVM based)] [-ERROR-] Git blame errors: [Clang (LLVM based)] [-ERROR-] - no blame results for request <llvm-project/lldb/source/Plugins/InstrumentationRuntime/MainThreadChecker/MainThreadCheckerRuntime.cpp - [156]>.

Hide Details

[Clang (LLVM based)] [-ERROR-] Git blame errors: [Clang (LLVM based)] [-ERROR-] - no blame results for request <llvm-project/lldb/source/Plugins/ExpressionParser/Clang/ClangExpressionDeclMap.h - [256, 66, 259, 280, 474, 490, 300, 444, 253]>.

Hide Details

[Clang (LLVM based)] [-ERROR-] Git blame errors: [Clang (LLVM based)] [-ERROR-] - no blame results for request <llvm-project/lldb/include/lldb/Host/HostProcess.h - [15]>.

Hide Details

[Clang (LLVM based)] [-ERROR-] Git blame errors: [Clang (LLVM based)] [-ERROR-] - no blame results for request <llvm-project/lldb/include/lldb/Utility/Flags.h - [32]>.

Hide Details

[Clang (LLVM based)] [-ERROR-] Git blame errors: [Clang (LLVM based)] [-ERROR-] - no blame results for request <llvm-project/lldb/include/lldb/Core/SearchFilter.h - [355, 309, 358, 87, 408, 105, 411]>.

Hide Details

[Clang (LLVM based)] [-ERROR-] Git blame errors: [Clang (LLVM based)] [-ERROR-] - no blame results for request <llvm-project/lldb/include/lldb/Core/ModuleChild.h - [49, 23]>.

Hide Details

[Clang (LLVM based)] [-ERROR-] Git blame errors: [Clang (LLVM based)] [-ERROR-] - no blame results for request <llvm-project/lldb/source/Plugins/ExpressionParser/Clang/IRForTarget.h - [384, 145, 497, 290, 74, 394, 108, 365, 525, 78, 190, 494]>.

Hide Details

[Clang (LLVM based)] [-ERROR-] Git blame errors: [Clang (LLVM based)] [-ERROR-] - no blame results for request <llvm-project/lldb/include/lldb/Breakpoint/BreakpointList.h - [141]>.

Hide Details

[Clang (LLVM based)] [-ERROR-] Git blame errors: [Clang (LLVM based)] [-ERROR-] - no blame results for request <llvm-project/lldb/include/lldb/Breakpoint/BreakpointLocationCollection.h - [34, 115, 69, 30]>.

Hide Details

[Clang (LLVM based)] [-ERROR-] Git blame errors: [Clang (LLVM based)] [-ERROR-] - no blame results for request <llvm-project/lldb/include/lldb/Core/AddressRange.h - [150, 126]>.

Hide Details

[Clang (LLVM based)] [-ERROR-] Git blame errors: [Clang (LLVM based)] [-ERROR-] - no blame results for request <llvm-project/lldb/include/lldb/Breakpoint/BreakpointOptions.h - [298]>.

Hide Details

[Clang (LLVM based)] [-ERROR-] Git blame errors: [Clang (LLVM based)] [-ERROR-] - no blame results for request <llvm-project/lldb/include/lldb/Breakpoint/Breakpoint.h - [208, 196, 376]>.

Hide Details

[Clang (LLVM based)] [-ERROR-] Git blame errors: [Clang (LLVM based)] [-ERROR-] - no blame results for request <llvm-project/lldb/include/lldb/Core/Highlighter.h - [102, 46, 47]>.

Hide Details

[Clang (LLVM based)] [-ERROR-] Git blame errors: [Clang (LLVM based)] [-ERROR-] - no blame results for request <llvm-project/lldb/include/lldb/Host/File.h - [96, 81, 79]>.

Hide Details

[Clang (LLVM based)] [-ERROR-] Git blame errors: [Clang (LLVM based)] [-ERROR-] - no blame results for request <llvm-project/lldb/include/lldb/Symbol/Block.h - [81, 85, 246, 235, 60, 63]>.

Hide Details

[Clang (LLVM based)] [-ERROR-] Git blame errors: [Clang (LLVM based)] [-ERROR-] - no blame results for request <llvm-project/llvm/include/llvm/Analysis/ScalarEvolution.h - [1696]>.

Hide Details

[Clang (LLVM based)] [-ERROR-] Git blame errors: [Clang (LLVM based)] [-ERROR-] - no blame results for request <llvm-project/lldb/include/lldb/Core/Module.h - [320, 450, 419, 294]>.

Hide Details

[Clang (LLVM based)] [-ERROR-] Git blame errors: [Clang (LLVM based)] [-ERROR-] - no blame results for request <llvm-project/lldb/include/lldb/Target/Platform.h - [780, 383]>.

Hide Details

[Clang (LLVM based)] [-ERROR-] Git blame errors: [Clang (LLVM based)] [-ERROR-] - no blame results for request <llvm-project/clang/lib/CodeGen/CGDecl.cpp - [1862, 1864]>.

Hide Details

[Clang (LLVM based)] [-ERROR-] Git blame errors: [Clang (LLVM based)] [-ERROR-] - no blame results for request <llvm-project/lldb/source/Plugins/ExpressionParser/Clang/ClangASTSource.h - [324, 327, 344, 92, 158]>.

Hide Details

[Clang (LLVM based)] [-ERROR-] Git blame errors: [Clang (LLVM based)] [-ERROR-] - no blame results for request <llvm-project/lldb/include/lldb/Breakpoint/BreakpointID.h - [68]>.

Hide Details

[Clang (LLVM based)] [-ERROR-] Git blame errors: [Clang (LLVM based)] [-ERROR-] - no blame results for request <llvm-project/lldb/include/lldb/Breakpoint/BreakpointResolver.h - [48, 75]>.

Hide Details

[Clang (LLVM based)] [-ERROR-] Git blame errors: [Clang (LLVM based)] [-ERROR-] - no blame results for request <llvm-project/lldb/include/lldb/Expression/DWARFExpression.h - [194, 187, 254]>.

Hide Details

[Clang (LLVM based)] [-ERROR-] Git blame errors: [Clang (LLVM based)] [-ERROR-] - no blame results for request <llvm-project/lldb/include/lldb/Utility/CompletionRequest.h - [181, 151, 138]>.

Hide Details

[Clang (LLVM based)] [-ERROR-] Git blame errors: [Clang (LLVM based)] [-ERROR-] - no blame results for request <llvm-project/lldb/include/lldb/Target/Queue.h - [131]>.

Hide Details

[Clang (LLVM based)] [-ERROR-] Git blame errors: [Clang (LLVM based)] [-ERROR-] - no blame results for request <llvm-project/lldb/source/Plugins/ExpressionParser/Clang/ClangExpressionParser.h - [102, 106, 45]>.

Hide Details

[Clang (LLVM based)] [-ERROR-] Git blame errors: [Clang (LLVM based)] [-ERROR-] - no blame results for request <llvm-project/lldb/include/lldb/Interpreter/CommandObject.h - [229, 264, 238]>.

Hide Details

[Clang (LLVM based)] [-ERROR-] Git blame errors: [Clang (LLVM based)] [-ERROR-] - no blame results for request <llvm-project/lldb/source/Plugins/ExpressionParser/Clang/IRDynamicChecks.h - [80]>.

Hide Details

[Clang (LLVM based)] [-ERROR-] Git blame errors: [Clang (LLVM based)] [-ERROR-] - no blame results for request <llvm-project/lldb/source/Plugins/InstrumentationRuntime/UBSan/UBSanRuntime.cpp - [210]>.

Hide Details

[Clang (LLVM based)] [-ERROR-] Git blame errors: [Clang (LLVM based)] [-ERROR-] - no blame results for request <llvm-project/lldb/include/lldb/Breakpoint/WatchpointList.h - [183]>.

Hide Details

[Clang (LLVM based)] [-ERROR-] Git blame errors: [Clang (LLVM based)] [-ERROR-] - no blame results for request <llvm-project/lldb/include/lldb/Symbol/Function.h - [70, 185]>.

Hide Details

[Clang (LLVM based)] [-ERROR-] Git blame errors: [Clang (LLVM based)] [-ERROR-] - no blame results for request <llvm-project/lldb/source/Plugins/ExpressionParser/Clang/ClangExpressionParser.cpp - [699]>.

Hide Details

[Clang (LLVM based)] [-ERROR-] Git blame errors: [Clang (LLVM based)] [-ERROR-] - no blame results for request <llvm-project/lldb/include/lldb/Breakpoint/BreakpointLocationList.h - [171, 79]>.

Hide Details

[Clang (LLVM based)] [-ERROR-] Git blame errors: [Clang (LLVM based)] [-ERROR-] - no blame results for request <llvm-project/lldb/include/lldb/Target/Thread.h - [1154, 131, 133, 184, 809, 762, 814, 1007]>.

Hide Details

[Clang (LLVM based)] [-ERROR-] Git blame errors: [Clang (LLVM based)] [-ERROR-] - no blame results for request <llvm-project/lldb/source/Plugins/ExpressionParser/Clang/IRDynamicChecks.cpp - [182]>.

Hide Details

[Clang (LLVM based)] [-ERROR-] Git blame errors: [Clang (LLVM based)] [-ERROR-] - no blame results for request <llvm-project/llvm/lib/Transforms/Utils/FlattenCFG.cpp - [323, 100, 132, 117, 133, 134, 108, 124]>.

Hide Details

[Clang (LLVM based)] [-ERROR-] Git blame errors: [Clang (LLVM based)] [-ERROR-] - no blame results for request <llvm-project/lldb/include/lldb/Symbol/LineEntry.h - [104, 45, 78]>.

Hide Details

[Clang (LLVM based)] [-ERROR-] Git blame errors: [Clang (LLVM based)] [-ERROR-] - no blame results for request <llvm-project/lldb/source/Plugins/SymbolFile/DWARF/SymbolFileDWARFDebugMap.h - [351]>.

Hide Details

[Clang (LLVM based)] [-ERROR-] Git blame errors: [Clang (LLVM based)] [-ERROR-] - no blame results for request <llvm-project/lldb/include/lldb/Interpreter/Options.h - [166, 185]>.

Hide Details

[Clang (LLVM based)] [-ERROR-] Git blame errors: [Clang (LLVM based)] [-ERROR-] - no blame results for request <llvm-project/lldb/include/lldb/Target/Target.h - [909]>.

Hide Details

[Clang (LLVM based)] [-ERROR-] Git blame errors: [Clang (LLVM based)] [-ERROR-] - no blame results for request <llvm-project/lldb/include/lldb/Breakpoint/BreakpointSite.h - [103, 205, 110, 126]>.

Hide Details

[Clang (LLVM based)] [-ERROR-] Git blame errors: [Clang (LLVM based)] [-ERROR-] - no blame results for request <llvm-project/lldb/include/lldb/Expression/REPL.h - [35]>.

Hide Details

[Clang (LLVM based)] [-ERROR-] Git blame errors: [Clang (LLVM based)] [-ERROR-] - no blame results for request <llvm-project/lldb/include/lldb/Symbol/SymbolContext.h - [290, 54, 310, 270]>.

Hide Details

[Clang (LLVM based)] [-ERROR-] Git blame errors: [Clang (LLVM based)] [-ERROR-] - no blame results for request <llvm-project/lldb/include/lldb/Symbol/LineTable.h - [200, 138, 204]>.

Hide Details

[Clang (LLVM based)] [-ERROR-] Git blame errors: [Clang (LLVM based)] [-ERROR-] - no blame results for request <llvm-project/lldb/include/lldb/Expression/FunctionCaller.h - [227, 70, 73, 236, 239]>.

Hide Details

[Clang (LLVM based)] [-ERROR-] Git blame errors: [Clang (LLVM based)] [-ERROR-] - no blame results for request <llvm-project/lldb/include/lldb/Expression/UserExpression.h - [50, 169]>.

Hide Details

[Clang (LLVM based)] [-ERROR-] Git blame errors: [Clang (LLVM based)] [-ERROR-] - no blame results for request <llvm-project/lldb/include/lldb/Core/Mangled.h - [110]>.

Hide Details

[Clang (LLVM based)] [-ERROR-] Git blame errors: [Clang (LLVM based)] [-ERROR-] - no blame results for request <llvm-project/lldb/include/lldb/Breakpoint/BreakpointLocation.h - [96, 227]>.

Hide Details

[Clang (LLVM based)] [-ERROR-] Git blame errors: [Clang (LLVM based)] [-ERROR-] - no blame results for request <llvm-project/lldb/include/lldb/Core/Address.h - [82, 68, 436, 181, 86, 73, 124, 77]>.

Hide Details

[Clang (LLVM based)] [-ERROR-] Git blame errors: [Clang (LLVM based)] [-ERROR-] - no blame results for request <llvm-project/lldb/include/lldb/Expression/IRExecutionUnit.h - [180, 183, 331, 190, 207]>.

Hide Details

[Clang (LLVM based)] [-ERROR-] Git blame errors: [Clang (LLVM based)] [-ERROR-] - no blame results for request <llvm-project/lldb/include/lldb/Symbol/CompileUnit.h - [244, 85, 47]>.

Hide Details

[Clang (LLVM based)] [-ERROR-] Git blame errors: [Clang (LLVM based)] [-ERROR-] - no blame results for request <llvm-project/lldb/include/lldb/Symbol/ObjectFile.h - [656, 161, 133, 360, 364]>.

Hide Details

[Clang (LLVM based)] [-ERROR-] Git blame errors: [Clang (LLVM based)] [-ERROR-] - no blame results for request <llvm-project/lldb/include/lldb/Core/ModuleList.h - [354, 371, 308, 312, 138, 363, 300, 316, 367]>.

Hide Details

[Clang (LLVM based)] [-ERROR-] Git blame errors: [Clang (LLVM based)] [-ERROR-] - no blame results for request <llvm-project/lldb/include/lldb/Interpreter/CommandInterpreter.h - [54]>.

Hide Details

[Clang (LLVM based)] [-ERROR-] Git blame errors: [Clang (LLVM based)] [-ERROR-] - no blame results for request <llvm-project/lldb/include/lldb/Target/TargetList.h - [58, 63]>.

Hide Details

[Clang (LLVM based)] [-ERROR-] Git blame errors: [Clang (LLVM based)] [-ERROR-] - no blame results for request <llvm-project/lldb/include/lldb/Host/HostInfoBase.h - [44]>.

Hide Details

[Clang (LLVM based)] [-ERROR-] Git blame errors: [Clang (LLVM based)] [-ERROR-] - no blame results for request <llvm-project/lldb/source/Plugins/ExpressionParser/Clang/ClangExpressionVariable.h - [77]>.

Hide Details

[Clang (LLVM based)] [-ERROR-] Git blame errors: [Clang (LLVM based)] [-ERROR-] - no blame results for request <llvm-project/lldb/source/Plugins/ExpressionParser/Clang/ClangUserExpression.h - [99]>.

Hide Details

[Clang (LLVM based)] [-ERROR-] Git blame errors: [Clang (LLVM based)] [-ERROR-] - no blame results for request <llvm-project/lldb/source/Plugins/Process/gdb-remote/GDBRemoteCommunicationClient.h - [92, 158]>.

Hide Details

[Clang (LLVM based)] [-ERROR-] Git blame errors: [Clang (LLVM based)] [-ERROR-] - no blame results for request <llvm-project/lldb/source/Plugins/ExpressionParser/Clang/ClangFunctionCaller.h - [104, 107]>.

Hide Details

[Clang (LLVM based)] [-ERROR-] Git blame errors: [Clang (LLVM based)] [-ERROR-] - no blame results for request <llvm-project/lldb/include/lldb/Breakpoint/Watchpoint.h - [117]>.

Hide Details

[Clang (LLVM based)] Post processing issues on 'green-dragon-24' with source code encoding 'UTF-8' [Clang (LLVM based)] Resolving absolute file names for all issues in workspace '/Users/buildslave/jenkins/workspace/lldb-cmake' [Clang (LLVM based)] -> 9 resolved, 0 unresolved, 71 already resolved [Clang (LLVM based)] Copying affected files to Jenkins' build folder '/Users/Shared/Jenkins/Home/jobs/lldb-cmake/builds/3695/files-with-issues' [Clang (LLVM based)] -> 71 copied, 0 not in workspace, 0 not-found, 0 with I/O error [Clang (LLVM based)] Resolving module names from module definitions (build.xml, pom.xml, or Manifest.mf files) [Clang (LLVM based)] -> resolved module names for 254 issues [Clang (LLVM based)] Resolving package names (or namespaces) by parsing the affected files [Clang (LLVM based)] -> resolved package names of 71 affected files [Clang (LLVM based)] No filter has been set, publishing all 219 issues [Clang (LLVM based)] Creating fingerprints for all affected code blocks to track issues over different builds [Clang (LLVM based)] -> created fingerprints for 219 issues [Clang (LLVM based)] Invoking Git blamer to create author and commit information for all affected files [Clang (LLVM based)] GIT_COMMIT env = 'HEAD' [Clang (LLVM based)] Git working tree = '/Users/buildslave/jenkins/workspace/lldb-cmake' [Clang (LLVM based)] Git commit ID = '353012a742ef606c9cc20702bb6facdf871473db' [Clang (LLVM based)] Job workspace = '/Users/buildslave/jenkins/workspace/lldb-cmake' [Clang (LLVM based)] Created blame requests for 71 files - invoking Git blame on agent for each of the requests [Clang (LLVM based)] -> blamed authors of issues in 71 files
[Pipeline] junit Recording test results [Pipeline] } [Pipeline] // stage [Pipeline] } [Pipeline] // withEnv [Pipeline] } [Pipeline] // node [Pipeline] End of Pipeline [BFA] Scanning build for known causes... > git rev-parse HEAD^{commit} # timeout=10 [BFA] Found failure cause(s): [BFA] Regression test failed from category Test [BFA] Ninja target failed from category Compile [BFA] Done. 1s ERROR: script returned exit code 1 Finished: FAILURE