FailedConsole Output

Skipping 1,365 KB.. Full Log

Hide Details

[614/678] /Users/buildslave/jenkins/workspace/lldb-cmake/host-compiler/bin/clang++ -DGTEST_HAS_RTTI=0 -D_DEBUG -D_GNU_SOURCE -D__STDC_CONSTANT_MACROS -D__STDC_FORMAT_MACROS -D__STDC_LIMIT_MACROS -Itools/clang/lib/StaticAnalyzer/Checkers -I/Users/buildslave/jenkins/workspace/lldb-cmake/llvm-project/clang/lib/StaticAnalyzer/Checkers -I/Users/buildslave/jenkins/workspace/lldb-cmake/llvm-project/clang/include -Itools/clang/include -I/Applications/Xcode.app/Contents/Developer/Platforms/MacOSX.platform/Developer/SDKs/MacOSX10.14.sdk/usr/include/libxml2 -Iinclude -I/Users/buildslave/jenkins/workspace/lldb-cmake/llvm-project/llvm/include -Wdocumentation -fPIC -fvisibility-inlines-hidden -Werror=date-time -Werror=unguarded-availability-new -fmodules -fmodules-cache-path=/Users/buildslave/jenkins/workspace/lldb-cmake/lldb-build/module.cache -fcxx-modules -Wall -Wextra -Wno-unused-parameter -Wwrite-strings -Wcast-qual -Wmissing-field-initializers -pedantic -Wno-long-long -Wimplicit-fallthrough -Wcovered-switch-default -Wno-noexcept-type -Wnon-virtual-dtor -Wdelete-non-virtual-dtor -Wstring-conversion -fdiagnostics-color -fno-common -Woverloaded-virtual -Wno-nested-anon-types -O3 -isysroot /Applications/Xcode.app/Contents/Developer/Platforms/MacOSX.platform/Developer/SDKs/MacOSX10.14.sdk -UNDEBUG -fno-exceptions -fno-rtti -std=c++14 -MD -MT tools/clang/lib/StaticAnalyzer/Checkers/CMakeFiles/obj.clangStaticAnalyzerCheckers.dir/SimpleStreamChecker.cpp.o -MF tools/clang/lib/StaticAnalyzer/Checkers/CMakeFiles/obj.clangStaticAnalyzerCheckers.dir/SimpleStreamChecker.cpp.o.d -o tools/clang/lib/StaticAnalyzer/Checkers/CMakeFiles/obj.clangStaticAnalyzerCheckers.dir/SimpleStreamChecker.cpp.o -c /Users/buildslave/jenkins/workspace/lldb-cmake/llvm-project/clang/lib/StaticAnalyzer/Checkers/SimpleStreamChecker.cpp [615/678] /Users/buildslave/jenkins/workspace/lldb-cmake/host-compiler/bin/clang++ -DGTEST_HAS_RTTI=0 -D_DEBUG -D_GNU_SOURCE -D__STDC_CONSTANT_MACROS -D__STDC_FORMAT_MACROS -D__STDC_LIMIT_MACROS -Itools/clang/lib/StaticAnalyzer/Checkers -I/Users/buildslave/jenkins/workspace/lldb-cmake/llvm-project/clang/lib/StaticAnalyzer/Checkers -I/Users/buildslave/jenkins/workspace/lldb-cmake/llvm-project/clang/include -Itools/clang/include -I/Applications/Xcode.app/Contents/Developer/Platforms/MacOSX.platform/Developer/SDKs/MacOSX10.14.sdk/usr/include/libxml2 -Iinclude -I/Users/buildslave/jenkins/workspace/lldb-cmake/llvm-project/llvm/include -Wdocumentation -fPIC -fvisibility-inlines-hidden -Werror=date-time -Werror=unguarded-availability-new -fmodules -fmodules-cache-path=/Users/buildslave/jenkins/workspace/lldb-cmake/lldb-build/module.cache -fcxx-modules -Wall -Wextra -Wno-unused-parameter -Wwrite-strings -Wcast-qual -Wmissing-field-initializers -pedantic -Wno-long-long -Wimplicit-fallthrough -Wcovered-switch-default -Wno-noexcept-type -Wnon-virtual-dtor -Wdelete-non-virtual-dtor -Wstring-conversion -fdiagnostics-color -fno-common -Woverloaded-virtual -Wno-nested-anon-types -O3 -isysroot /Applications/Xcode.app/Contents/Developer/Platforms/MacOSX.platform/Developer/SDKs/MacOSX10.14.sdk -UNDEBUG -fno-exceptions -fno-rtti -std=c++14 -MD -MT tools/clang/lib/StaticAnalyzer/Checkers/CMakeFiles/obj.clangStaticAnalyzerCheckers.dir/StackAddrEscapeChecker.cpp.o -MF tools/clang/lib/StaticAnalyzer/Checkers/CMakeFiles/obj.clangStaticAnalyzerCheckers.dir/StackAddrEscapeChecker.cpp.o.d -o tools/clang/lib/StaticAnalyzer/Checkers/CMakeFiles/obj.clangStaticAnalyzerCheckers.dir/StackAddrEscapeChecker.cpp.o -c /Users/buildslave/jenkins/workspace/lldb-cmake/llvm-project/clang/lib/StaticAnalyzer/Checkers/StackAddrEscapeChecker.cpp [616/678] /Users/buildslave/jenkins/workspace/lldb-cmake/host-compiler/bin/clang++ -DGTEST_HAS_RTTI=0 -D_DEBUG -D_GNU_SOURCE -D__STDC_CONSTANT_MACROS -D__STDC_FORMAT_MACROS -D__STDC_LIMIT_MACROS -Itools/clang/lib/StaticAnalyzer/Checkers -I/Users/buildslave/jenkins/workspace/lldb-cmake/llvm-project/clang/lib/StaticAnalyzer/Checkers -I/Users/buildslave/jenkins/workspace/lldb-cmake/llvm-project/clang/include -Itools/clang/include -I/Applications/Xcode.app/Contents/Developer/Platforms/MacOSX.platform/Developer/SDKs/MacOSX10.14.sdk/usr/include/libxml2 -Iinclude -I/Users/buildslave/jenkins/workspace/lldb-cmake/llvm-project/llvm/include -Wdocumentation -fPIC -fvisibility-inlines-hidden -Werror=date-time -Werror=unguarded-availability-new -fmodules -fmodules-cache-path=/Users/buildslave/jenkins/workspace/lldb-cmake/lldb-build/module.cache -fcxx-modules -Wall -Wextra -Wno-unused-parameter -Wwrite-strings -Wcast-qual -Wmissing-field-initializers -pedantic -Wno-long-long -Wimplicit-fallthrough -Wcovered-switch-default -Wno-noexcept-type -Wnon-virtual-dtor -Wdelete-non-virtual-dtor -Wstring-conversion -fdiagnostics-color -fno-common -Woverloaded-virtual -Wno-nested-anon-types -O3 -isysroot /Applications/Xcode.app/Contents/Developer/Platforms/MacOSX.platform/Developer/SDKs/MacOSX10.14.sdk -UNDEBUG -fno-exceptions -fno-rtti -std=c++14 -MD -MT tools/clang/lib/StaticAnalyzer/Checkers/CMakeFiles/obj.clangStaticAnalyzerCheckers.dir/NumberObjectConversionChecker.cpp.o -MF tools/clang/lib/StaticAnalyzer/Checkers/CMakeFiles/obj.clangStaticAnalyzerCheckers.dir/NumberObjectConversionChecker.cpp.o.d -o tools/clang/lib/StaticAnalyzer/Checkers/CMakeFiles/obj.clangStaticAnalyzerCheckers.dir/NumberObjectConversionChecker.cpp.o -c /Users/buildslave/jenkins/workspace/lldb-cmake/llvm-project/clang/lib/StaticAnalyzer/Checkers/NumberObjectConversionChecker.cpp [617/678] /Users/buildslave/jenkins/workspace/lldb-cmake/host-compiler/bin/clang++ -DGTEST_HAS_RTTI=0 -D_DEBUG -D_GNU_SOURCE -D__STDC_CONSTANT_MACROS -D__STDC_FORMAT_MACROS -D__STDC_LIMIT_MACROS -Itools/clang/lib/StaticAnalyzer/Checkers -I/Users/buildslave/jenkins/workspace/lldb-cmake/llvm-project/clang/lib/StaticAnalyzer/Checkers -I/Users/buildslave/jenkins/workspace/lldb-cmake/llvm-project/clang/include -Itools/clang/include -I/Applications/Xcode.app/Contents/Developer/Platforms/MacOSX.platform/Developer/SDKs/MacOSX10.14.sdk/usr/include/libxml2 -Iinclude -I/Users/buildslave/jenkins/workspace/lldb-cmake/llvm-project/llvm/include -Wdocumentation -fPIC -fvisibility-inlines-hidden -Werror=date-time -Werror=unguarded-availability-new -fmodules -fmodules-cache-path=/Users/buildslave/jenkins/workspace/lldb-cmake/lldb-build/module.cache -fcxx-modules -Wall -Wextra -Wno-unused-parameter -Wwrite-strings -Wcast-qual -Wmissing-field-initializers -pedantic -Wno-long-long -Wimplicit-fallthrough -Wcovered-switch-default -Wno-noexcept-type -Wnon-virtual-dtor -Wdelete-non-virtual-dtor -Wstring-conversion -fdiagnostics-color -fno-common -Woverloaded-virtual -Wno-nested-anon-types -O3 -isysroot /Applications/Xcode.app/Contents/Developer/Platforms/MacOSX.platform/Developer/SDKs/MacOSX10.14.sdk -UNDEBUG -fno-exceptions -fno-rtti -std=c++14 -MD -MT tools/clang/lib/StaticAnalyzer/Checkers/CMakeFiles/obj.clangStaticAnalyzerCheckers.dir/TaintTesterChecker.cpp.o -MF tools/clang/lib/StaticAnalyzer/Checkers/CMakeFiles/obj.clangStaticAnalyzerCheckers.dir/TaintTesterChecker.cpp.o.d -o tools/clang/lib/StaticAnalyzer/Checkers/CMakeFiles/obj.clangStaticAnalyzerCheckers.dir/TaintTesterChecker.cpp.o -c /Users/buildslave/jenkins/workspace/lldb-cmake/llvm-project/clang/lib/StaticAnalyzer/Checkers/TaintTesterChecker.cpp [618/678] /Users/buildslave/jenkins/workspace/lldb-cmake/host-compiler/bin/clang++ -DGTEST_HAS_RTTI=0 -D_DEBUG -D_GNU_SOURCE -D__STDC_CONSTANT_MACROS -D__STDC_FORMAT_MACROS -D__STDC_LIMIT_MACROS -Itools/clang/lib/StaticAnalyzer/Checkers -I/Users/buildslave/jenkins/workspace/lldb-cmake/llvm-project/clang/lib/StaticAnalyzer/Checkers -I/Users/buildslave/jenkins/workspace/lldb-cmake/llvm-project/clang/include -Itools/clang/include -I/Applications/Xcode.app/Contents/Developer/Platforms/MacOSX.platform/Developer/SDKs/MacOSX10.14.sdk/usr/include/libxml2 -Iinclude -I/Users/buildslave/jenkins/workspace/lldb-cmake/llvm-project/llvm/include -Wdocumentation -fPIC -fvisibility-inlines-hidden -Werror=date-time -Werror=unguarded-availability-new -fmodules -fmodules-cache-path=/Users/buildslave/jenkins/workspace/lldb-cmake/lldb-build/module.cache -fcxx-modules -Wall -Wextra -Wno-unused-parameter -Wwrite-strings -Wcast-qual -Wmissing-field-initializers -pedantic -Wno-long-long -Wimplicit-fallthrough -Wcovered-switch-default -Wno-noexcept-type -Wnon-virtual-dtor -Wdelete-non-virtual-dtor -Wstring-conversion -fdiagnostics-color -fno-common -Woverloaded-virtual -Wno-nested-anon-types -O3 -isysroot /Applications/Xcode.app/Contents/Developer/Platforms/MacOSX.platform/Developer/SDKs/MacOSX10.14.sdk -UNDEBUG -fno-exceptions -fno-rtti -std=c++14 -MD -MT tools/clang/lib/StaticAnalyzer/Checkers/CMakeFiles/obj.clangStaticAnalyzerCheckers.dir/TraversalChecker.cpp.o -MF tools/clang/lib/StaticAnalyzer/Checkers/CMakeFiles/obj.clangStaticAnalyzerCheckers.dir/TraversalChecker.cpp.o.d -o tools/clang/lib/StaticAnalyzer/Checkers/CMakeFiles/obj.clangStaticAnalyzerCheckers.dir/TraversalChecker.cpp.o -c /Users/buildslave/jenkins/workspace/lldb-cmake/llvm-project/clang/lib/StaticAnalyzer/Checkers/TraversalChecker.cpp [619/678] /Users/buildslave/jenkins/workspace/lldb-cmake/host-compiler/bin/clang++ -DGTEST_HAS_RTTI=0 -D_DEBUG -D_GNU_SOURCE -D__STDC_CONSTANT_MACROS -D__STDC_FORMAT_MACROS -D__STDC_LIMIT_MACROS -Itools/clang/lib/StaticAnalyzer/Checkers -I/Users/buildslave/jenkins/workspace/lldb-cmake/llvm-project/clang/lib/StaticAnalyzer/Checkers -I/Users/buildslave/jenkins/workspace/lldb-cmake/llvm-project/clang/include -Itools/clang/include -I/Applications/Xcode.app/Contents/Developer/Platforms/MacOSX.platform/Developer/SDKs/MacOSX10.14.sdk/usr/include/libxml2 -Iinclude -I/Users/buildslave/jenkins/workspace/lldb-cmake/llvm-project/llvm/include -Wdocumentation -fPIC -fvisibility-inlines-hidden -Werror=date-time -Werror=unguarded-availability-new -fmodules -fmodules-cache-path=/Users/buildslave/jenkins/workspace/lldb-cmake/lldb-build/module.cache -fcxx-modules -Wall -Wextra -Wno-unused-parameter -Wwrite-strings -Wcast-qual -Wmissing-field-initializers -pedantic -Wno-long-long -Wimplicit-fallthrough -Wcovered-switch-default -Wno-noexcept-type -Wnon-virtual-dtor -Wdelete-non-virtual-dtor -Wstring-conversion -fdiagnostics-color -fno-common -Woverloaded-virtual -Wno-nested-anon-types -O3 -isysroot /Applications/Xcode.app/Contents/Developer/Platforms/MacOSX.platform/Developer/SDKs/MacOSX10.14.sdk -UNDEBUG -fno-exceptions -fno-rtti -std=c++14 -MD -MT tools/clang/lib/StaticAnalyzer/Checkers/CMakeFiles/obj.clangStaticAnalyzerCheckers.dir/RetainCountChecker/RetainCountChecker.cpp.o -MF tools/clang/lib/StaticAnalyzer/Checkers/CMakeFiles/obj.clangStaticAnalyzerCheckers.dir/RetainCountChecker/RetainCountChecker.cpp.o.d -o tools/clang/lib/StaticAnalyzer/Checkers/CMakeFiles/obj.clangStaticAnalyzerCheckers.dir/RetainCountChecker/RetainCountChecker.cpp.o -c /Users/buildslave/jenkins/workspace/lldb-cmake/llvm-project/clang/lib/StaticAnalyzer/Checkers/RetainCountChecker/RetainCountChecker.cpp [620/678] /Users/buildslave/jenkins/workspace/lldb-cmake/host-compiler/bin/clang++ -DGTEST_HAS_RTTI=0 -D_DEBUG -D_GNU_SOURCE -D__STDC_CONSTANT_MACROS -D__STDC_FORMAT_MACROS -D__STDC_LIMIT_MACROS -Itools/clang/lib/StaticAnalyzer/Checkers -I/Users/buildslave/jenkins/workspace/lldb-cmake/llvm-project/clang/lib/StaticAnalyzer/Checkers -I/Users/buildslave/jenkins/workspace/lldb-cmake/llvm-project/clang/include -Itools/clang/include -I/Applications/Xcode.app/Contents/Developer/Platforms/MacOSX.platform/Developer/SDKs/MacOSX10.14.sdk/usr/include/libxml2 -Iinclude -I/Users/buildslave/jenkins/workspace/lldb-cmake/llvm-project/llvm/include -Wdocumentation -fPIC -fvisibility-inlines-hidden -Werror=date-time -Werror=unguarded-availability-new -fmodules -fmodules-cache-path=/Users/buildslave/jenkins/workspace/lldb-cmake/lldb-build/module.cache -fcxx-modules -Wall -Wextra -Wno-unused-parameter -Wwrite-strings -Wcast-qual -Wmissing-field-initializers -pedantic -Wno-long-long -Wimplicit-fallthrough -Wcovered-switch-default -Wno-noexcept-type -Wnon-virtual-dtor -Wdelete-non-virtual-dtor -Wstring-conversion -fdiagnostics-color -fno-common -Woverloaded-virtual -Wno-nested-anon-types -O3 -isysroot /Applications/Xcode.app/Contents/Developer/Platforms/MacOSX.platform/Developer/SDKs/MacOSX10.14.sdk -UNDEBUG -fno-exceptions -fno-rtti -std=c++14 -MD -MT tools/clang/lib/StaticAnalyzer/Checkers/CMakeFiles/obj.clangStaticAnalyzerCheckers.dir/UndefBranchChecker.cpp.o -MF tools/clang/lib/StaticAnalyzer/Checkers/CMakeFiles/obj.clangStaticAnalyzerCheckers.dir/UndefBranchChecker.cpp.o.d -o tools/clang/lib/StaticAnalyzer/Checkers/CMakeFiles/obj.clangStaticAnalyzerCheckers.dir/UndefBranchChecker.cpp.o -c /Users/buildslave/jenkins/workspace/lldb-cmake/llvm-project/clang/lib/StaticAnalyzer/Checkers/UndefBranchChecker.cpp [621/678] /Users/buildslave/jenkins/workspace/lldb-cmake/host-compiler/bin/clang++ -DGTEST_HAS_RTTI=0 -D_DEBUG -D_GNU_SOURCE -D__STDC_CONSTANT_MACROS -D__STDC_FORMAT_MACROS -D__STDC_LIMIT_MACROS -Itools/clang/lib/StaticAnalyzer/Checkers -I/Users/buildslave/jenkins/workspace/lldb-cmake/llvm-project/clang/lib/StaticAnalyzer/Checkers -I/Users/buildslave/jenkins/workspace/lldb-cmake/llvm-project/clang/include -Itools/clang/include -I/Applications/Xcode.app/Contents/Developer/Platforms/MacOSX.platform/Developer/SDKs/MacOSX10.14.sdk/usr/include/libxml2 -Iinclude -I/Users/buildslave/jenkins/workspace/lldb-cmake/llvm-project/llvm/include -Wdocumentation -fPIC -fvisibility-inlines-hidden -Werror=date-time -Werror=unguarded-availability-new -fmodules -fmodules-cache-path=/Users/buildslave/jenkins/workspace/lldb-cmake/lldb-build/module.cache -fcxx-modules -Wall -Wextra -Wno-unused-parameter -Wwrite-strings -Wcast-qual -Wmissing-field-initializers -pedantic -Wno-long-long -Wimplicit-fallthrough -Wcovered-switch-default -Wno-noexcept-type -Wnon-virtual-dtor -Wdelete-non-virtual-dtor -Wstring-conversion -fdiagnostics-color -fno-common -Woverloaded-virtual -Wno-nested-anon-types -O3 -isysroot /Applications/Xcode.app/Contents/Developer/Platforms/MacOSX.platform/Developer/SDKs/MacOSX10.14.sdk -UNDEBUG -fno-exceptions -fno-rtti -std=c++14 -MD -MT tools/clang/lib/StaticAnalyzer/Checkers/CMakeFiles/obj.clangStaticAnalyzerCheckers.dir/StreamChecker.cpp.o -MF tools/clang/lib/StaticAnalyzer/Checkers/CMakeFiles/obj.clangStaticAnalyzerCheckers.dir/StreamChecker.cpp.o.d -o tools/clang/lib/StaticAnalyzer/Checkers/CMakeFiles/obj.clangStaticAnalyzerCheckers.dir/StreamChecker.cpp.o -c /Users/buildslave/jenkins/workspace/lldb-cmake/llvm-project/clang/lib/StaticAnalyzer/Checkers/StreamChecker.cpp [622/678] /Users/buildslave/jenkins/workspace/lldb-cmake/host-compiler/bin/clang++ -DGTEST_HAS_RTTI=0 -D_DEBUG -D_GNU_SOURCE -D__STDC_CONSTANT_MACROS -D__STDC_FORMAT_MACROS -D__STDC_LIMIT_MACROS -Itools/clang/lib/StaticAnalyzer/Checkers -I/Users/buildslave/jenkins/workspace/lldb-cmake/llvm-project/clang/lib/StaticAnalyzer/Checkers -I/Users/buildslave/jenkins/workspace/lldb-cmake/llvm-project/clang/include -Itools/clang/include -I/Applications/Xcode.app/Contents/Developer/Platforms/MacOSX.platform/Developer/SDKs/MacOSX10.14.sdk/usr/include/libxml2 -Iinclude -I/Users/buildslave/jenkins/workspace/lldb-cmake/llvm-project/llvm/include -Wdocumentation -fPIC -fvisibility-inlines-hidden -Werror=date-time -Werror=unguarded-availability-new -fmodules -fmodules-cache-path=/Users/buildslave/jenkins/workspace/lldb-cmake/lldb-build/module.cache -fcxx-modules -Wall -Wextra -Wno-unused-parameter -Wwrite-strings -Wcast-qual -Wmissing-field-initializers -pedantic -Wno-long-long -Wimplicit-fallthrough -Wcovered-switch-default -Wno-noexcept-type -Wnon-virtual-dtor -Wdelete-non-virtual-dtor -Wstring-conversion -fdiagnostics-color -fno-common -Woverloaded-virtual -Wno-nested-anon-types -O3 -isysroot /Applications/Xcode.app/Contents/Developer/Platforms/MacOSX.platform/Developer/SDKs/MacOSX10.14.sdk -UNDEBUG -fno-exceptions -fno-rtti -std=c++14 -MD -MT tools/clang/lib/StaticAnalyzer/Checkers/CMakeFiles/obj.clangStaticAnalyzerCheckers.dir/RunLoopAutoreleaseLeakChecker.cpp.o -MF tools/clang/lib/StaticAnalyzer/Checkers/CMakeFiles/obj.clangStaticAnalyzerCheckers.dir/RunLoopAutoreleaseLeakChecker.cpp.o.d -o tools/clang/lib/StaticAnalyzer/Checkers/CMakeFiles/obj.clangStaticAnalyzerCheckers.dir/RunLoopAutoreleaseLeakChecker.cpp.o -c /Users/buildslave/jenkins/workspace/lldb-cmake/llvm-project/clang/lib/StaticAnalyzer/Checkers/RunLoopAutoreleaseLeakChecker.cpp [623/678] /Users/buildslave/jenkins/workspace/lldb-cmake/host-compiler/bin/clang++ -DGTEST_HAS_RTTI=0 -D_DEBUG -D_GNU_SOURCE -D__STDC_CONSTANT_MACROS -D__STDC_FORMAT_MACROS -D__STDC_LIMIT_MACROS -Itools/clang/lib/StaticAnalyzer/Checkers -I/Users/buildslave/jenkins/workspace/lldb-cmake/llvm-project/clang/lib/StaticAnalyzer/Checkers -I/Users/buildslave/jenkins/workspace/lldb-cmake/llvm-project/clang/include -Itools/clang/include -I/Applications/Xcode.app/Contents/Developer/Platforms/MacOSX.platform/Developer/SDKs/MacOSX10.14.sdk/usr/include/libxml2 -Iinclude -I/Users/buildslave/jenkins/workspace/lldb-cmake/llvm-project/llvm/include -Wdocumentation -fPIC -fvisibility-inlines-hidden -Werror=date-time -Werror=unguarded-availability-new -fmodules -fmodules-cache-path=/Users/buildslave/jenkins/workspace/lldb-cmake/lldb-build/module.cache -fcxx-modules -Wall -Wextra -Wno-unused-parameter -Wwrite-strings -Wcast-qual -Wmissing-field-initializers -pedantic -Wno-long-long -Wimplicit-fallthrough -Wcovered-switch-default -Wno-noexcept-type -Wnon-virtual-dtor -Wdelete-non-virtual-dtor -Wstring-conversion -fdiagnostics-color -fno-common -Woverloaded-virtual -Wno-nested-anon-types -O3 -isysroot /Applications/Xcode.app/Contents/Developer/Platforms/MacOSX.platform/Developer/SDKs/MacOSX10.14.sdk -UNDEBUG -fno-exceptions -fno-rtti -std=c++14 -MD -MT tools/clang/lib/StaticAnalyzer/Checkers/CMakeFiles/obj.clangStaticAnalyzerCheckers.dir/UndefinedArraySubscriptChecker.cpp.o -MF tools/clang/lib/StaticAnalyzer/Checkers/CMakeFiles/obj.clangStaticAnalyzerCheckers.dir/UndefinedArraySubscriptChecker.cpp.o.d -o tools/clang/lib/StaticAnalyzer/Checkers/CMakeFiles/obj.clangStaticAnalyzerCheckers.dir/UndefinedArraySubscriptChecker.cpp.o -c /Users/buildslave/jenkins/workspace/lldb-cmake/llvm-project/clang/lib/StaticAnalyzer/Checkers/UndefinedArraySubscriptChecker.cpp [624/678] /Users/buildslave/jenkins/workspace/lldb-cmake/host-compiler/bin/clang++ -DGTEST_HAS_RTTI=0 -D_DEBUG -D_GNU_SOURCE -D__STDC_CONSTANT_MACROS -D__STDC_FORMAT_MACROS -D__STDC_LIMIT_MACROS -Itools/clang/lib/StaticAnalyzer/Checkers -I/Users/buildslave/jenkins/workspace/lldb-cmake/llvm-project/clang/lib/StaticAnalyzer/Checkers -I/Users/buildslave/jenkins/workspace/lldb-cmake/llvm-project/clang/include -Itools/clang/include -I/Applications/Xcode.app/Contents/Developer/Platforms/MacOSX.platform/Developer/SDKs/MacOSX10.14.sdk/usr/include/libxml2 -Iinclude -I/Users/buildslave/jenkins/workspace/lldb-cmake/llvm-project/llvm/include -Wdocumentation -fPIC -fvisibility-inlines-hidden -Werror=date-time -Werror=unguarded-availability-new -fmodules -fmodules-cache-path=/Users/buildslave/jenkins/workspace/lldb-cmake/lldb-build/module.cache -fcxx-modules -Wall -Wextra -Wno-unused-parameter -Wwrite-strings -Wcast-qual -Wmissing-field-initializers -pedantic -Wno-long-long -Wimplicit-fallthrough -Wcovered-switch-default -Wno-noexcept-type -Wnon-virtual-dtor -Wdelete-non-virtual-dtor -Wstring-conversion -fdiagnostics-color -fno-common -Woverloaded-virtual -Wno-nested-anon-types -O3 -isysroot /Applications/Xcode.app/Contents/Developer/Platforms/MacOSX.platform/Developer/SDKs/MacOSX10.14.sdk -UNDEBUG -fno-exceptions -fno-rtti -std=c++14 -MD -MT tools/clang/lib/StaticAnalyzer/Checkers/CMakeFiles/obj.clangStaticAnalyzerCheckers.dir/UndefCapturedBlockVarChecker.cpp.o -MF tools/clang/lib/StaticAnalyzer/Checkers/CMakeFiles/obj.clangStaticAnalyzerCheckers.dir/UndefCapturedBlockVarChecker.cpp.o.d -o tools/clang/lib/StaticAnalyzer/Checkers/CMakeFiles/obj.clangStaticAnalyzerCheckers.dir/UndefCapturedBlockVarChecker.cpp.o -c /Users/buildslave/jenkins/workspace/lldb-cmake/llvm-project/clang/lib/StaticAnalyzer/Checkers/UndefCapturedBlockVarChecker.cpp [625/678] /Users/buildslave/jenkins/workspace/lldb-cmake/host-compiler/bin/clang++ -DGTEST_HAS_RTTI=0 -D_DEBUG -D_GNU_SOURCE -D__STDC_CONSTANT_MACROS -D__STDC_FORMAT_MACROS -D__STDC_LIMIT_MACROS -Itools/clang/lib/StaticAnalyzer/Checkers -I/Users/buildslave/jenkins/workspace/lldb-cmake/llvm-project/clang/lib/StaticAnalyzer/Checkers -I/Users/buildslave/jenkins/workspace/lldb-cmake/llvm-project/clang/include -Itools/clang/include -I/Applications/Xcode.app/Contents/Developer/Platforms/MacOSX.platform/Developer/SDKs/MacOSX10.14.sdk/usr/include/libxml2 -Iinclude -I/Users/buildslave/jenkins/workspace/lldb-cmake/llvm-project/llvm/include -Wdocumentation -fPIC -fvisibility-inlines-hidden -Werror=date-time -Werror=unguarded-availability-new -fmodules -fmodules-cache-path=/Users/buildslave/jenkins/workspace/lldb-cmake/lldb-build/module.cache -fcxx-modules -Wall -Wextra -Wno-unused-parameter -Wwrite-strings -Wcast-qual -Wmissing-field-initializers -pedantic -Wno-long-long -Wimplicit-fallthrough -Wcovered-switch-default -Wno-noexcept-type -Wnon-virtual-dtor -Wdelete-non-virtual-dtor -Wstring-conversion -fdiagnostics-color -fno-common -Woverloaded-virtual -Wno-nested-anon-types -O3 -isysroot /Applications/Xcode.app/Contents/Developer/Platforms/MacOSX.platform/Developer/SDKs/MacOSX10.14.sdk -UNDEBUG -fno-exceptions -fno-rtti -std=c++14 -MD -MT tools/clang/lib/StaticAnalyzer/Checkers/CMakeFiles/obj.clangStaticAnalyzerCheckers.dir/TrustNonnullChecker.cpp.o -MF tools/clang/lib/StaticAnalyzer/Checkers/CMakeFiles/obj.clangStaticAnalyzerCheckers.dir/TrustNonnullChecker.cpp.o.d -o tools/clang/lib/StaticAnalyzer/Checkers/CMakeFiles/obj.clangStaticAnalyzerCheckers.dir/TrustNonnullChecker.cpp.o -c /Users/buildslave/jenkins/workspace/lldb-cmake/llvm-project/clang/lib/StaticAnalyzer/Checkers/TrustNonnullChecker.cpp [626/678] /Users/buildslave/jenkins/workspace/lldb-cmake/host-compiler/bin/clang++ -DGTEST_HAS_RTTI=0 -D_DEBUG -D_GNU_SOURCE -D__STDC_CONSTANT_MACROS -D__STDC_FORMAT_MACROS -D__STDC_LIMIT_MACROS -Itools/clang/lib/StaticAnalyzer/Checkers -I/Users/buildslave/jenkins/workspace/lldb-cmake/llvm-project/clang/lib/StaticAnalyzer/Checkers -I/Users/buildslave/jenkins/workspace/lldb-cmake/llvm-project/clang/include -Itools/clang/include -I/Applications/Xcode.app/Contents/Developer/Platforms/MacOSX.platform/Developer/SDKs/MacOSX10.14.sdk/usr/include/libxml2 -Iinclude -I/Users/buildslave/jenkins/workspace/lldb-cmake/llvm-project/llvm/include -Wdocumentation -fPIC -fvisibility-inlines-hidden -Werror=date-time -Werror=unguarded-availability-new -fmodules -fmodules-cache-path=/Users/buildslave/jenkins/workspace/lldb-cmake/lldb-build/module.cache -fcxx-modules -Wall -Wextra -Wno-unused-parameter -Wwrite-strings -Wcast-qual -Wmissing-field-initializers -pedantic -Wno-long-long -Wimplicit-fallthrough -Wcovered-switch-default -Wno-noexcept-type -Wnon-virtual-dtor -Wdelete-non-virtual-dtor -Wstring-conversion -fdiagnostics-color -fno-common -Woverloaded-virtual -Wno-nested-anon-types -O3 -isysroot /Applications/Xcode.app/Contents/Developer/Platforms/MacOSX.platform/Developer/SDKs/MacOSX10.14.sdk -UNDEBUG -fno-exceptions -fno-rtti -std=c++14 -MD -MT tools/clang/lib/StaticAnalyzer/Checkers/CMakeFiles/obj.clangStaticAnalyzerCheckers.dir/Taint.cpp.o -MF tools/clang/lib/StaticAnalyzer/Checkers/CMakeFiles/obj.clangStaticAnalyzerCheckers.dir/Taint.cpp.o.d -o tools/clang/lib/StaticAnalyzer/Checkers/CMakeFiles/obj.clangStaticAnalyzerCheckers.dir/Taint.cpp.o -c /Users/buildslave/jenkins/workspace/lldb-cmake/llvm-project/clang/lib/StaticAnalyzer/Checkers/Taint.cpp [627/678] /Users/buildslave/jenkins/workspace/lldb-cmake/host-compiler/bin/clang++ -DGTEST_HAS_RTTI=0 -D_DEBUG -D_GNU_SOURCE -D__STDC_CONSTANT_MACROS -D__STDC_FORMAT_MACROS -D__STDC_LIMIT_MACROS -Itools/clang/lib/StaticAnalyzer/Checkers -I/Users/buildslave/jenkins/workspace/lldb-cmake/llvm-project/clang/lib/StaticAnalyzer/Checkers -I/Users/buildslave/jenkins/workspace/lldb-cmake/llvm-project/clang/include -Itools/clang/include -I/Applications/Xcode.app/Contents/Developer/Platforms/MacOSX.platform/Developer/SDKs/MacOSX10.14.sdk/usr/include/libxml2 -Iinclude -I/Users/buildslave/jenkins/workspace/lldb-cmake/llvm-project/llvm/include -Wdocumentation -fPIC -fvisibility-inlines-hidden -Werror=date-time -Werror=unguarded-availability-new -fmodules -fmodules-cache-path=/Users/buildslave/jenkins/workspace/lldb-cmake/lldb-build/module.cache -fcxx-modules -Wall -Wextra -Wno-unused-parameter -Wwrite-strings -Wcast-qual -Wmissing-field-initializers -pedantic -Wno-long-long -Wimplicit-fallthrough -Wcovered-switch-default -Wno-noexcept-type -Wnon-virtual-dtor -Wdelete-non-virtual-dtor -Wstring-conversion -fdiagnostics-color -fno-common -Woverloaded-virtual -Wno-nested-anon-types -O3 -isysroot /Applications/Xcode.app/Contents/Developer/Platforms/MacOSX.platform/Developer/SDKs/MacOSX10.14.sdk -UNDEBUG -fno-exceptions -fno-rtti -std=c++14 -MD -MT tools/clang/lib/StaticAnalyzer/Checkers/CMakeFiles/obj.clangStaticAnalyzerCheckers.dir/UndefResultChecker.cpp.o -MF tools/clang/lib/StaticAnalyzer/Checkers/CMakeFiles/obj.clangStaticAnalyzerCheckers.dir/UndefResultChecker.cpp.o.d -o tools/clang/lib/StaticAnalyzer/Checkers/CMakeFiles/obj.clangStaticAnalyzerCheckers.dir/UndefResultChecker.cpp.o -c /Users/buildslave/jenkins/workspace/lldb-cmake/llvm-project/clang/lib/StaticAnalyzer/Checkers/UndefResultChecker.cpp [628/678] /Users/buildslave/jenkins/workspace/lldb-cmake/host-compiler/bin/clang++ -DGTEST_HAS_RTTI=0 -D_DEBUG -D_GNU_SOURCE -D__STDC_CONSTANT_MACROS -D__STDC_FORMAT_MACROS -D__STDC_LIMIT_MACROS -Itools/clang/lib/StaticAnalyzer/Checkers -I/Users/buildslave/jenkins/workspace/lldb-cmake/llvm-project/clang/lib/StaticAnalyzer/Checkers -I/Users/buildslave/jenkins/workspace/lldb-cmake/llvm-project/clang/include -Itools/clang/include -I/Applications/Xcode.app/Contents/Developer/Platforms/MacOSX.platform/Developer/SDKs/MacOSX10.14.sdk/usr/include/libxml2 -Iinclude -I/Users/buildslave/jenkins/workspace/lldb-cmake/llvm-project/llvm/include -Wdocumentation -fPIC -fvisibility-inlines-hidden -Werror=date-time -Werror=unguarded-availability-new -fmodules -fmodules-cache-path=/Users/buildslave/jenkins/workspace/lldb-cmake/lldb-build/module.cache -fcxx-modules -Wall -Wextra -Wno-unused-parameter -Wwrite-strings -Wcast-qual -Wmissing-field-initializers -pedantic -Wno-long-long -Wimplicit-fallthrough -Wcovered-switch-default -Wno-noexcept-type -Wnon-virtual-dtor -Wdelete-non-virtual-dtor -Wstring-conversion -fdiagnostics-color -fno-common -Woverloaded-virtual -Wno-nested-anon-types -O3 -isysroot /Applications/Xcode.app/Contents/Developer/Platforms/MacOSX.platform/Developer/SDKs/MacOSX10.14.sdk -UNDEBUG -fno-exceptions -fno-rtti -std=c++14 -MD -MT tools/clang/lib/StaticAnalyzer/Checkers/CMakeFiles/obj.clangStaticAnalyzerCheckers.dir/UndefinedAssignmentChecker.cpp.o -MF tools/clang/lib/StaticAnalyzer/Checkers/CMakeFiles/obj.clangStaticAnalyzerCheckers.dir/UndefinedAssignmentChecker.cpp.o.d -o tools/clang/lib/StaticAnalyzer/Checkers/CMakeFiles/obj.clangStaticAnalyzerCheckers.dir/UndefinedAssignmentChecker.cpp.o -c /Users/buildslave/jenkins/workspace/lldb-cmake/llvm-project/clang/lib/StaticAnalyzer/Checkers/UndefinedAssignmentChecker.cpp [629/678] /Users/buildslave/jenkins/workspace/lldb-cmake/host-compiler/bin/clang++ -DGTEST_HAS_RTTI=0 -D_DEBUG -D_GNU_SOURCE -D__STDC_CONSTANT_MACROS -D__STDC_FORMAT_MACROS -D__STDC_LIMIT_MACROS -Itools/clang/lib/StaticAnalyzer/Checkers -I/Users/buildslave/jenkins/workspace/lldb-cmake/llvm-project/clang/lib/StaticAnalyzer/Checkers -I/Users/buildslave/jenkins/workspace/lldb-cmake/llvm-project/clang/include -Itools/clang/include -I/Applications/Xcode.app/Contents/Developer/Platforms/MacOSX.platform/Developer/SDKs/MacOSX10.14.sdk/usr/include/libxml2 -Iinclude -I/Users/buildslave/jenkins/workspace/lldb-cmake/llvm-project/llvm/include -Wdocumentation -fPIC -fvisibility-inlines-hidden -Werror=date-time -Werror=unguarded-availability-new -fmodules -fmodules-cache-path=/Users/buildslave/jenkins/workspace/lldb-cmake/lldb-build/module.cache -fcxx-modules -Wall -Wextra -Wno-unused-parameter -Wwrite-strings -Wcast-qual -Wmissing-field-initializers -pedantic -Wno-long-long -Wimplicit-fallthrough -Wcovered-switch-default -Wno-noexcept-type -Wnon-virtual-dtor -Wdelete-non-virtual-dtor -Wstring-conversion -fdiagnostics-color -fno-common -Woverloaded-virtual -Wno-nested-anon-types -O3 -isysroot /Applications/Xcode.app/Contents/Developer/Platforms/MacOSX.platform/Developer/SDKs/MacOSX10.14.sdk -UNDEBUG -fno-exceptions -fno-rtti -std=c++14 -MD -MT tools/clang/lib/StaticAnalyzer/Checkers/CMakeFiles/obj.clangStaticAnalyzerCheckers.dir/UninitializedObject/UninitializedPointee.cpp.o -MF tools/clang/lib/StaticAnalyzer/Checkers/CMakeFiles/obj.clangStaticAnalyzerCheckers.dir/UninitializedObject/UninitializedPointee.cpp.o.d -o tools/clang/lib/StaticAnalyzer/Checkers/CMakeFiles/obj.clangStaticAnalyzerCheckers.dir/UninitializedObject/UninitializedPointee.cpp.o -c /Users/buildslave/jenkins/workspace/lldb-cmake/llvm-project/clang/lib/StaticAnalyzer/Checkers/UninitializedObject/UninitializedPointee.cpp [630/678] /Users/buildslave/jenkins/workspace/lldb-cmake/host-compiler/bin/clang++ -DGTEST_HAS_RTTI=0 -D_DEBUG -D_GNU_SOURCE -D__STDC_CONSTANT_MACROS -D__STDC_FORMAT_MACROS -D__STDC_LIMIT_MACROS -Itools/clang/lib/StaticAnalyzer/Checkers -I/Users/buildslave/jenkins/workspace/lldb-cmake/llvm-project/clang/lib/StaticAnalyzer/Checkers -I/Users/buildslave/jenkins/workspace/lldb-cmake/llvm-project/clang/include -Itools/clang/include -I/Applications/Xcode.app/Contents/Developer/Platforms/MacOSX.platform/Developer/SDKs/MacOSX10.14.sdk/usr/include/libxml2 -Iinclude -I/Users/buildslave/jenkins/workspace/lldb-cmake/llvm-project/llvm/include -Wdocumentation -fPIC -fvisibility-inlines-hidden -Werror=date-time -Werror=unguarded-availability-new -fmodules -fmodules-cache-path=/Users/buildslave/jenkins/workspace/lldb-cmake/lldb-build/module.cache -fcxx-modules -Wall -Wextra -Wno-unused-parameter -Wwrite-strings -Wcast-qual -Wmissing-field-initializers -pedantic -Wno-long-long -Wimplicit-fallthrough -Wcovered-switch-default -Wno-noexcept-type -Wnon-virtual-dtor -Wdelete-non-virtual-dtor -Wstring-conversion -fdiagnostics-color -fno-common -Woverloaded-virtual -Wno-nested-anon-types -O3 -isysroot /Applications/Xcode.app/Contents/Developer/Platforms/MacOSX.platform/Developer/SDKs/MacOSX10.14.sdk -UNDEBUG -fno-exceptions -fno-rtti -std=c++14 -MD -MT tools/clang/lib/StaticAnalyzer/Checkers/CMakeFiles/obj.clangStaticAnalyzerCheckers.dir/DeadStoresChecker.cpp.o -MF tools/clang/lib/StaticAnalyzer/Checkers/CMakeFiles/obj.clangStaticAnalyzerCheckers.dir/DeadStoresChecker.cpp.o.d -o tools/clang/lib/StaticAnalyzer/Checkers/CMakeFiles/obj.clangStaticAnalyzerCheckers.dir/DeadStoresChecker.cpp.o -c /Users/buildslave/jenkins/workspace/lldb-cmake/llvm-project/clang/lib/StaticAnalyzer/Checkers/DeadStoresChecker.cpp [631/678] /Users/buildslave/jenkins/workspace/lldb-cmake/host-compiler/bin/clang++ -DGTEST_HAS_RTTI=0 -D_DEBUG -D_GNU_SOURCE -D__STDC_CONSTANT_MACROS -D__STDC_FORMAT_MACROS -D__STDC_LIMIT_MACROS -Itools/clang/lib/StaticAnalyzer/Checkers -I/Users/buildslave/jenkins/workspace/lldb-cmake/llvm-project/clang/lib/StaticAnalyzer/Checkers -I/Users/buildslave/jenkins/workspace/lldb-cmake/llvm-project/clang/include -Itools/clang/include -I/Applications/Xcode.app/Contents/Developer/Platforms/MacOSX.platform/Developer/SDKs/MacOSX10.14.sdk/usr/include/libxml2 -Iinclude -I/Users/buildslave/jenkins/workspace/lldb-cmake/llvm-project/llvm/include -Wdocumentation -fPIC -fvisibility-inlines-hidden -Werror=date-time -Werror=unguarded-availability-new -fmodules -fmodules-cache-path=/Users/buildslave/jenkins/workspace/lldb-cmake/lldb-build/module.cache -fcxx-modules -Wall -Wextra -Wno-unused-parameter -Wwrite-strings -Wcast-qual -Wmissing-field-initializers -pedantic -Wno-long-long -Wimplicit-fallthrough -Wcovered-switch-default -Wno-noexcept-type -Wnon-virtual-dtor -Wdelete-non-virtual-dtor -Wstring-conversion -fdiagnostics-color -fno-common -Woverloaded-virtual -Wno-nested-anon-types -O3 -isysroot /Applications/Xcode.app/Contents/Developer/Platforms/MacOSX.platform/Developer/SDKs/MacOSX10.14.sdk -UNDEBUG -fno-exceptions -fno-rtti -std=c++14 -MD -MT tools/clang/lib/StaticAnalyzer/Checkers/CMakeFiles/obj.clangStaticAnalyzerCheckers.dir/TestAfterDivZeroChecker.cpp.o -MF tools/clang/lib/StaticAnalyzer/Checkers/CMakeFiles/obj.clangStaticAnalyzerCheckers.dir/TestAfterDivZeroChecker.cpp.o.d -o tools/clang/lib/StaticAnalyzer/Checkers/CMakeFiles/obj.clangStaticAnalyzerCheckers.dir/TestAfterDivZeroChecker.cpp.o -c /Users/buildslave/jenkins/workspace/lldb-cmake/llvm-project/clang/lib/StaticAnalyzer/Checkers/TestAfterDivZeroChecker.cpp [632/678] /Users/buildslave/jenkins/workspace/lldb-cmake/host-compiler/bin/clang++ -DGTEST_HAS_RTTI=0 -D_DEBUG -D_GNU_SOURCE -D__STDC_CONSTANT_MACROS -D__STDC_FORMAT_MACROS -D__STDC_LIMIT_MACROS -Itools/clang/lib/StaticAnalyzer/Checkers -I/Users/buildslave/jenkins/workspace/lldb-cmake/llvm-project/clang/lib/StaticAnalyzer/Checkers -I/Users/buildslave/jenkins/workspace/lldb-cmake/llvm-project/clang/include -Itools/clang/include -I/Applications/Xcode.app/Contents/Developer/Platforms/MacOSX.platform/Developer/SDKs/MacOSX10.14.sdk/usr/include/libxml2 -Iinclude -I/Users/buildslave/jenkins/workspace/lldb-cmake/llvm-project/llvm/include -Wdocumentation -fPIC -fvisibility-inlines-hidden -Werror=date-time -Werror=unguarded-availability-new -fmodules -fmodules-cache-path=/Users/buildslave/jenkins/workspace/lldb-cmake/lldb-build/module.cache -fcxx-modules -Wall -Wextra -Wno-unused-parameter -Wwrite-strings -Wcast-qual -Wmissing-field-initializers -pedantic -Wno-long-long -Wimplicit-fallthrough -Wcovered-switch-default -Wno-noexcept-type -Wnon-virtual-dtor -Wdelete-non-virtual-dtor -Wstring-conversion -fdiagnostics-color -fno-common -Woverloaded-virtual -Wno-nested-anon-types -O3 -isysroot /Applications/Xcode.app/Contents/Developer/Platforms/MacOSX.platform/Developer/SDKs/MacOSX10.14.sdk -UNDEBUG -fno-exceptions -fno-rtti -std=c++14 -MD -MT tools/clang/lib/StaticAnalyzer/Checkers/CMakeFiles/obj.clangStaticAnalyzerCheckers.dir/UnixAPIChecker.cpp.o -MF tools/clang/lib/StaticAnalyzer/Checkers/CMakeFiles/obj.clangStaticAnalyzerCheckers.dir/UnixAPIChecker.cpp.o.d -o tools/clang/lib/StaticAnalyzer/Checkers/CMakeFiles/obj.clangStaticAnalyzerCheckers.dir/UnixAPIChecker.cpp.o -c /Users/buildslave/jenkins/workspace/lldb-cmake/llvm-project/clang/lib/StaticAnalyzer/Checkers/UnixAPIChecker.cpp [633/678] /Users/buildslave/jenkins/workspace/lldb-cmake/host-compiler/bin/clang++ -DGTEST_HAS_RTTI=0 -D_DEBUG -D_GNU_SOURCE -D__STDC_CONSTANT_MACROS -D__STDC_FORMAT_MACROS -D__STDC_LIMIT_MACROS -Itools/clang/lib/Format -I/Users/buildslave/jenkins/workspace/lldb-cmake/llvm-project/clang/lib/Format -I/Users/buildslave/jenkins/workspace/lldb-cmake/llvm-project/clang/include -Itools/clang/include -I/Applications/Xcode.app/Contents/Developer/Platforms/MacOSX.platform/Developer/SDKs/MacOSX10.14.sdk/usr/include/libxml2 -Iinclude -I/Users/buildslave/jenkins/workspace/lldb-cmake/llvm-project/llvm/include -Wdocumentation -fPIC -fvisibility-inlines-hidden -Werror=date-time -Werror=unguarded-availability-new -fmodules -fmodules-cache-path=/Users/buildslave/jenkins/workspace/lldb-cmake/lldb-build/module.cache -fcxx-modules -Wall -Wextra -Wno-unused-parameter -Wwrite-strings -Wcast-qual -Wmissing-field-initializers -pedantic -Wno-long-long -Wimplicit-fallthrough -Wcovered-switch-default -Wno-noexcept-type -Wnon-virtual-dtor -Wdelete-non-virtual-dtor -Wstring-conversion -fdiagnostics-color -fno-common -Woverloaded-virtual -Wno-nested-anon-types -O3 -isysroot /Applications/Xcode.app/Contents/Developer/Platforms/MacOSX.platform/Developer/SDKs/MacOSX10.14.sdk -UNDEBUG -fno-exceptions -fno-rtti -std=c++14 -MD -MT tools/clang/lib/Format/CMakeFiles/obj.clangFormat.dir/AffectedRangeManager.cpp.o -MF tools/clang/lib/Format/CMakeFiles/obj.clangFormat.dir/AffectedRangeManager.cpp.o.d -o tools/clang/lib/Format/CMakeFiles/obj.clangFormat.dir/AffectedRangeManager.cpp.o -c /Users/buildslave/jenkins/workspace/lldb-cmake/llvm-project/clang/lib/Format/AffectedRangeManager.cpp [634/678] /Users/buildslave/jenkins/workspace/lldb-cmake/host-compiler/bin/clang++ -DGTEST_HAS_RTTI=0 -D_DEBUG -D_GNU_SOURCE -D__STDC_CONSTANT_MACROS -D__STDC_FORMAT_MACROS -D__STDC_LIMIT_MACROS -Itools/clang/lib/StaticAnalyzer/Checkers -I/Users/buildslave/jenkins/workspace/lldb-cmake/llvm-project/clang/lib/StaticAnalyzer/Checkers -I/Users/buildslave/jenkins/workspace/lldb-cmake/llvm-project/clang/include -Itools/clang/include -I/Applications/Xcode.app/Contents/Developer/Platforms/MacOSX.platform/Developer/SDKs/MacOSX10.14.sdk/usr/include/libxml2 -Iinclude -I/Users/buildslave/jenkins/workspace/lldb-cmake/llvm-project/llvm/include -Wdocumentation -fPIC -fvisibility-inlines-hidden -Werror=date-time -Werror=unguarded-availability-new -fmodules -fmodules-cache-path=/Users/buildslave/jenkins/workspace/lldb-cmake/lldb-build/module.cache -fcxx-modules -Wall -Wextra -Wno-unused-parameter -Wwrite-strings -Wcast-qual -Wmissing-field-initializers -pedantic -Wno-long-long -Wimplicit-fallthrough -Wcovered-switch-default -Wno-noexcept-type -Wnon-virtual-dtor -Wdelete-non-virtual-dtor -Wstring-conversion -fdiagnostics-color -fno-common -Woverloaded-virtual -Wno-nested-anon-types -O3 -isysroot /Applications/Xcode.app/Contents/Developer/Platforms/MacOSX.platform/Developer/SDKs/MacOSX10.14.sdk -UNDEBUG -fno-exceptions -fno-rtti -std=c++14 -MD -MT tools/clang/lib/StaticAnalyzer/Checkers/CMakeFiles/obj.clangStaticAnalyzerCheckers.dir/UnreachableCodeChecker.cpp.o -MF tools/clang/lib/StaticAnalyzer/Checkers/CMakeFiles/obj.clangStaticAnalyzerCheckers.dir/UnreachableCodeChecker.cpp.o.d -o tools/clang/lib/StaticAnalyzer/Checkers/CMakeFiles/obj.clangStaticAnalyzerCheckers.dir/UnreachableCodeChecker.cpp.o -c /Users/buildslave/jenkins/workspace/lldb-cmake/llvm-project/clang/lib/StaticAnalyzer/Checkers/UnreachableCodeChecker.cpp [635/678] /Users/buildslave/jenkins/workspace/lldb-cmake/host-compiler/bin/clang++ -DGTEST_HAS_RTTI=0 -D_DEBUG -D_GNU_SOURCE -D__STDC_CONSTANT_MACROS -D__STDC_FORMAT_MACROS -D__STDC_LIMIT_MACROS -Itools/clang/lib/StaticAnalyzer/Checkers -I/Users/buildslave/jenkins/workspace/lldb-cmake/llvm-project/clang/lib/StaticAnalyzer/Checkers -I/Users/buildslave/jenkins/workspace/lldb-cmake/llvm-project/clang/include -Itools/clang/include -I/Applications/Xcode.app/Contents/Developer/Platforms/MacOSX.platform/Developer/SDKs/MacOSX10.14.sdk/usr/include/libxml2 -Iinclude -I/Users/buildslave/jenkins/workspace/lldb-cmake/llvm-project/llvm/include -Wdocumentation -fPIC -fvisibility-inlines-hidden -Werror=date-time -Werror=unguarded-availability-new -fmodules -fmodules-cache-path=/Users/buildslave/jenkins/workspace/lldb-cmake/lldb-build/module.cache -fcxx-modules -Wall -Wextra -Wno-unused-parameter -Wwrite-strings -Wcast-qual -Wmissing-field-initializers -pedantic -Wno-long-long -Wimplicit-fallthrough -Wcovered-switch-default -Wno-noexcept-type -Wnon-virtual-dtor -Wdelete-non-virtual-dtor -Wstring-conversion -fdiagnostics-color -fno-common -Woverloaded-virtual -Wno-nested-anon-types -O3 -isysroot /Applications/Xcode.app/Contents/Developer/Platforms/MacOSX.platform/Developer/SDKs/MacOSX10.14.sdk -UNDEBUG -fno-exceptions -fno-rtti -std=c++14 -MD -MT tools/clang/lib/StaticAnalyzer/Checkers/CMakeFiles/obj.clangStaticAnalyzerCheckers.dir/VforkChecker.cpp.o -MF tools/clang/lib/StaticAnalyzer/Checkers/CMakeFiles/obj.clangStaticAnalyzerCheckers.dir/VforkChecker.cpp.o.d -o tools/clang/lib/StaticAnalyzer/Checkers/CMakeFiles/obj.clangStaticAnalyzerCheckers.dir/VforkChecker.cpp.o -c /Users/buildslave/jenkins/workspace/lldb-cmake/llvm-project/clang/lib/StaticAnalyzer/Checkers/VforkChecker.cpp [636/678] /Users/buildslave/jenkins/workspace/lldb-cmake/host-compiler/bin/clang++ -DGTEST_HAS_RTTI=0 -D_DEBUG -D_GNU_SOURCE -D__STDC_CONSTANT_MACROS -D__STDC_FORMAT_MACROS -D__STDC_LIMIT_MACROS -Itools/clang/lib/StaticAnalyzer/Checkers -I/Users/buildslave/jenkins/workspace/lldb-cmake/llvm-project/clang/lib/StaticAnalyzer/Checkers -I/Users/buildslave/jenkins/workspace/lldb-cmake/llvm-project/clang/include -Itools/clang/include -I/Applications/Xcode.app/Contents/Developer/Platforms/MacOSX.platform/Developer/SDKs/MacOSX10.14.sdk/usr/include/libxml2 -Iinclude -I/Users/buildslave/jenkins/workspace/lldb-cmake/llvm-project/llvm/include -Wdocumentation -fPIC -fvisibility-inlines-hidden -Werror=date-time -Werror=unguarded-availability-new -fmodules -fmodules-cache-path=/Users/buildslave/jenkins/workspace/lldb-cmake/lldb-build/module.cache -fcxx-modules -Wall -Wextra -Wno-unused-parameter -Wwrite-strings -Wcast-qual -Wmissing-field-initializers -pedantic -Wno-long-long -Wimplicit-fallthrough -Wcovered-switch-default -Wno-noexcept-type -Wnon-virtual-dtor -Wdelete-non-virtual-dtor -Wstring-conversion -fdiagnostics-color -fno-common -Woverloaded-virtual -Wno-nested-anon-types -O3 -isysroot /Applications/Xcode.app/Contents/Developer/Platforms/MacOSX.platform/Developer/SDKs/MacOSX10.14.sdk -UNDEBUG -fno-exceptions -fno-rtti -std=c++14 -MD -MT tools/clang/lib/StaticAnalyzer/Checkers/CMakeFiles/obj.clangStaticAnalyzerCheckers.dir/VLASizeChecker.cpp.o -MF tools/clang/lib/StaticAnalyzer/Checkers/CMakeFiles/obj.clangStaticAnalyzerCheckers.dir/VLASizeChecker.cpp.o.d -o tools/clang/lib/StaticAnalyzer/Checkers/CMakeFiles/obj.clangStaticAnalyzerCheckers.dir/VLASizeChecker.cpp.o -c /Users/buildslave/jenkins/workspace/lldb-cmake/llvm-project/clang/lib/StaticAnalyzer/Checkers/VLASizeChecker.cpp [637/678] /Users/buildslave/jenkins/workspace/lldb-cmake/host-compiler/bin/clang++ -DGTEST_HAS_RTTI=0 -D_DEBUG -D_GNU_SOURCE -D__STDC_CONSTANT_MACROS -D__STDC_FORMAT_MACROS -D__STDC_LIMIT_MACROS -Itools/clang/lib/Format -I/Users/buildslave/jenkins/workspace/lldb-cmake/llvm-project/clang/lib/Format -I/Users/buildslave/jenkins/workspace/lldb-cmake/llvm-project/clang/include -Itools/clang/include -I/Applications/Xcode.app/Contents/Developer/Platforms/MacOSX.platform/Developer/SDKs/MacOSX10.14.sdk/usr/include/libxml2 -Iinclude -I/Users/buildslave/jenkins/workspace/lldb-cmake/llvm-project/llvm/include -Wdocumentation -fPIC -fvisibility-inlines-hidden -Werror=date-time -Werror=unguarded-availability-new -fmodules -fmodules-cache-path=/Users/buildslave/jenkins/workspace/lldb-cmake/lldb-build/module.cache -fcxx-modules -Wall -Wextra -Wno-unused-parameter -Wwrite-strings -Wcast-qual -Wmissing-field-initializers -pedantic -Wno-long-long -Wimplicit-fallthrough -Wcovered-switch-default -Wno-noexcept-type -Wnon-virtual-dtor -Wdelete-non-virtual-dtor -Wstring-conversion -fdiagnostics-color -fno-common -Woverloaded-virtual -Wno-nested-anon-types -O3 -isysroot /Applications/Xcode.app/Contents/Developer/Platforms/MacOSX.platform/Developer/SDKs/MacOSX10.14.sdk -UNDEBUG -fno-exceptions -fno-rtti -std=c++14 -MD -MT tools/clang/lib/Format/CMakeFiles/obj.clangFormat.dir/FormatToken.cpp.o -MF tools/clang/lib/Format/CMakeFiles/obj.clangFormat.dir/FormatToken.cpp.o.d -o tools/clang/lib/Format/CMakeFiles/obj.clangFormat.dir/FormatToken.cpp.o -c /Users/buildslave/jenkins/workspace/lldb-cmake/llvm-project/clang/lib/Format/FormatToken.cpp [638/678] /Users/buildslave/jenkins/workspace/lldb-cmake/host-compiler/bin/clang++ -DGTEST_HAS_RTTI=0 -D_DEBUG -D_GNU_SOURCE -D__STDC_CONSTANT_MACROS -D__STDC_FORMAT_MACROS -D__STDC_LIMIT_MACROS -Itools/clang/lib/StaticAnalyzer/Checkers -I/Users/buildslave/jenkins/workspace/lldb-cmake/llvm-project/clang/lib/StaticAnalyzer/Checkers -I/Users/buildslave/jenkins/workspace/lldb-cmake/llvm-project/clang/include -Itools/clang/include -I/Applications/Xcode.app/Contents/Developer/Platforms/MacOSX.platform/Developer/SDKs/MacOSX10.14.sdk/usr/include/libxml2 -Iinclude -I/Users/buildslave/jenkins/workspace/lldb-cmake/llvm-project/llvm/include -Wdocumentation -fPIC -fvisibility-inlines-hidden -Werror=date-time -Werror=unguarded-availability-new -fmodules -fmodules-cache-path=/Users/buildslave/jenkins/workspace/lldb-cmake/lldb-build/module.cache -fcxx-modules -Wall -Wextra -Wno-unused-parameter -Wwrite-strings -Wcast-qual -Wmissing-field-initializers -pedantic -Wno-long-long -Wimplicit-fallthrough -Wcovered-switch-default -Wno-noexcept-type -Wnon-virtual-dtor -Wdelete-non-virtual-dtor -Wstring-conversion -fdiagnostics-color -fno-common -Woverloaded-virtual -Wno-nested-anon-types -O3 -isysroot /Applications/Xcode.app/Contents/Developer/Platforms/MacOSX.platform/Developer/SDKs/MacOSX10.14.sdk -UNDEBUG -fno-exceptions -fno-rtti -std=c++14 -MD -MT tools/clang/lib/StaticAnalyzer/Checkers/CMakeFiles/obj.clangStaticAnalyzerCheckers.dir/StdLibraryFunctionsChecker.cpp.o -MF tools/clang/lib/StaticAnalyzer/Checkers/CMakeFiles/obj.clangStaticAnalyzerCheckers.dir/StdLibraryFunctionsChecker.cpp.o.d -o tools/clang/lib/StaticAnalyzer/Checkers/CMakeFiles/obj.clangStaticAnalyzerCheckers.dir/StdLibraryFunctionsChecker.cpp.o -c /Users/buildslave/jenkins/workspace/lldb-cmake/llvm-project/clang/lib/StaticAnalyzer/Checkers/StdLibraryFunctionsChecker.cpp [639/678] /Users/buildslave/jenkins/workspace/lldb-cmake/host-compiler/bin/clang++ -DGTEST_HAS_RTTI=0 -D_DEBUG -D_GNU_SOURCE -D__STDC_CONSTANT_MACROS -D__STDC_FORMAT_MACROS -D__STDC_LIMIT_MACROS -Itools/clang/lib/Format -I/Users/buildslave/jenkins/workspace/lldb-cmake/llvm-project/clang/lib/Format -I/Users/buildslave/jenkins/workspace/lldb-cmake/llvm-project/clang/include -Itools/clang/include -I/Applications/Xcode.app/Contents/Developer/Platforms/MacOSX.platform/Developer/SDKs/MacOSX10.14.sdk/usr/include/libxml2 -Iinclude -I/Users/buildslave/jenkins/workspace/lldb-cmake/llvm-project/llvm/include -Wdocumentation -fPIC -fvisibility-inlines-hidden -Werror=date-time -Werror=unguarded-availability-new -fmodules -fmodules-cache-path=/Users/buildslave/jenkins/workspace/lldb-cmake/lldb-build/module.cache -fcxx-modules -Wall -Wextra -Wno-unused-parameter -Wwrite-strings -Wcast-qual -Wmissing-field-initializers -pedantic -Wno-long-long -Wimplicit-fallthrough -Wcovered-switch-default -Wno-noexcept-type -Wnon-virtual-dtor -Wdelete-non-virtual-dtor -Wstring-conversion -fdiagnostics-color -fno-common -Woverloaded-virtual -Wno-nested-anon-types -O3 -isysroot /Applications/Xcode.app/Contents/Developer/Platforms/MacOSX.platform/Developer/SDKs/MacOSX10.14.sdk -UNDEBUG -fno-exceptions -fno-rtti -std=c++14 -MD -MT tools/clang/lib/Format/CMakeFiles/obj.clangFormat.dir/BreakableToken.cpp.o -MF tools/clang/lib/Format/CMakeFiles/obj.clangFormat.dir/BreakableToken.cpp.o.d -o tools/clang/lib/Format/CMakeFiles/obj.clangFormat.dir/BreakableToken.cpp.o -c /Users/buildslave/jenkins/workspace/lldb-cmake/llvm-project/clang/lib/Format/BreakableToken.cpp [640/678] /Users/buildslave/jenkins/workspace/lldb-cmake/host-compiler/bin/clang++ -DGTEST_HAS_RTTI=0 -D_DEBUG -D_GNU_SOURCE -D__STDC_CONSTANT_MACROS -D__STDC_FORMAT_MACROS -D__STDC_LIMIT_MACROS -Itools/clang/lib/StaticAnalyzer/Frontend -I/Users/buildslave/jenkins/workspace/lldb-cmake/llvm-project/clang/lib/StaticAnalyzer/Frontend -I/Users/buildslave/jenkins/workspace/lldb-cmake/llvm-project/clang/include -Itools/clang/include -I/Applications/Xcode.app/Contents/Developer/Platforms/MacOSX.platform/Developer/SDKs/MacOSX10.14.sdk/usr/include/libxml2 -Iinclude -I/Users/buildslave/jenkins/workspace/lldb-cmake/llvm-project/llvm/include -Itools/clang/lib/StaticAnalyzer/Frontend/../Checkers -Wdocumentation -fPIC -fvisibility-inlines-hidden -Werror=date-time -Werror=unguarded-availability-new -fmodules -fmodules-cache-path=/Users/buildslave/jenkins/workspace/lldb-cmake/lldb-build/module.cache -fcxx-modules -Wall -Wextra -Wno-unused-parameter -Wwrite-strings -Wcast-qual -Wmissing-field-initializers -pedantic -Wno-long-long -Wimplicit-fallthrough -Wcovered-switch-default -Wno-noexcept-type -Wnon-virtual-dtor -Wdelete-non-virtual-dtor -Wstring-conversion -fdiagnostics-color -fno-common -Woverloaded-virtual -Wno-nested-anon-types -O3 -isysroot /Applications/Xcode.app/Contents/Developer/Platforms/MacOSX.platform/Developer/SDKs/MacOSX10.14.sdk -UNDEBUG -fno-exceptions -fno-rtti -std=c++14 -MD -MT tools/clang/lib/StaticAnalyzer/Frontend/CMakeFiles/obj.clangStaticAnalyzerFrontend.dir/FrontendActions.cpp.o -MF tools/clang/lib/StaticAnalyzer/Frontend/CMakeFiles/obj.clangStaticAnalyzerFrontend.dir/FrontendActions.cpp.o.d -o tools/clang/lib/StaticAnalyzer/Frontend/CMakeFiles/obj.clangStaticAnalyzerFrontend.dir/FrontendActions.cpp.o -c /Users/buildslave/jenkins/workspace/lldb-cmake/llvm-project/clang/lib/StaticAnalyzer/Frontend/FrontendActions.cpp [641/678] /Users/buildslave/jenkins/workspace/lldb-cmake/host-compiler/bin/clang++ -DGTEST_HAS_RTTI=0 -D_DEBUG -D_GNU_SOURCE -D__STDC_CONSTANT_MACROS -D__STDC_FORMAT_MACROS -D__STDC_LIMIT_MACROS -Itools/clang/lib/StaticAnalyzer/Checkers -I/Users/buildslave/jenkins/workspace/lldb-cmake/llvm-project/clang/lib/StaticAnalyzer/Checkers -I/Users/buildslave/jenkins/workspace/lldb-cmake/llvm-project/clang/include -Itools/clang/include -I/Applications/Xcode.app/Contents/Developer/Platforms/MacOSX.platform/Developer/SDKs/MacOSX10.14.sdk/usr/include/libxml2 -Iinclude -I/Users/buildslave/jenkins/workspace/lldb-cmake/llvm-project/llvm/include -Wdocumentation -fPIC -fvisibility-inlines-hidden -Werror=date-time -Werror=unguarded-availability-new -fmodules -fmodules-cache-path=/Users/buildslave/jenkins/workspace/lldb-cmake/lldb-build/module.cache -fcxx-modules -Wall -Wextra -Wno-unused-parameter -Wwrite-strings -Wcast-qual -Wmissing-field-initializers -pedantic -Wno-long-long -Wimplicit-fallthrough -Wcovered-switch-default -Wno-noexcept-type -Wnon-virtual-dtor -Wdelete-non-virtual-dtor -Wstring-conversion -fdiagnostics-color -fno-common -Woverloaded-virtual -Wno-nested-anon-types -O3 -isysroot /Applications/Xcode.app/Contents/Developer/Platforms/MacOSX.platform/Developer/SDKs/MacOSX10.14.sdk -UNDEBUG -fno-exceptions -fno-rtti -std=c++14 -MD -MT tools/clang/lib/StaticAnalyzer/Checkers/CMakeFiles/obj.clangStaticAnalyzerCheckers.dir/DynamicTypePropagation.cpp.o -MF tools/clang/lib/StaticAnalyzer/Checkers/CMakeFiles/obj.clangStaticAnalyzerCheckers.dir/DynamicTypePropagation.cpp.o.d -o tools/clang/lib/StaticAnalyzer/Checkers/CMakeFiles/obj.clangStaticAnalyzerCheckers.dir/DynamicTypePropagation.cpp.o -c /Users/buildslave/jenkins/workspace/lldb-cmake/llvm-project/clang/lib/StaticAnalyzer/Checkers/DynamicTypePropagation.cpp [642/678] /Users/buildslave/jenkins/workspace/lldb-cmake/host-compiler/bin/clang++ -DGTEST_HAS_RTTI=0 -D_DEBUG -D_GNU_SOURCE -D__STDC_CONSTANT_MACROS -D__STDC_FORMAT_MACROS -D__STDC_LIMIT_MACROS -Itools/clang/lib/StaticAnalyzer/Checkers -I/Users/buildslave/jenkins/workspace/lldb-cmake/llvm-project/clang/lib/StaticAnalyzer/Checkers -I/Users/buildslave/jenkins/workspace/lldb-cmake/llvm-project/clang/include -Itools/clang/include -I/Applications/Xcode.app/Contents/Developer/Platforms/MacOSX.platform/Developer/SDKs/MacOSX10.14.sdk/usr/include/libxml2 -Iinclude -I/Users/buildslave/jenkins/workspace/lldb-cmake/llvm-project/llvm/include -Wdocumentation -fPIC -fvisibility-inlines-hidden -Werror=date-time -Werror=unguarded-availability-new -fmodules -fmodules-cache-path=/Users/buildslave/jenkins/workspace/lldb-cmake/lldb-build/module.cache -fcxx-modules -Wall -Wextra -Wno-unused-parameter -Wwrite-strings -Wcast-qual -Wmissing-field-initializers -pedantic -Wno-long-long -Wimplicit-fallthrough -Wcovered-switch-default -Wno-noexcept-type -Wnon-virtual-dtor -Wdelete-non-virtual-dtor -Wstring-conversion -fdiagnostics-color -fno-common -Woverloaded-virtual -Wno-nested-anon-types -O3 -isysroot /Applications/Xcode.app/Contents/Developer/Platforms/MacOSX.platform/Developer/SDKs/MacOSX10.14.sdk -UNDEBUG -fno-exceptions -fno-rtti -std=c++14 -MD -MT tools/clang/lib/StaticAnalyzer/Checkers/CMakeFiles/obj.clangStaticAnalyzerCheckers.dir/IdenticalExprChecker.cpp.o -MF tools/clang/lib/StaticAnalyzer/Checkers/CMakeFiles/obj.clangStaticAnalyzerCheckers.dir/IdenticalExprChecker.cpp.o.d -o tools/clang/lib/StaticAnalyzer/Checkers/CMakeFiles/obj.clangStaticAnalyzerCheckers.dir/IdenticalExprChecker.cpp.o -c /Users/buildslave/jenkins/workspace/lldb-cmake/llvm-project/clang/lib/StaticAnalyzer/Checkers/IdenticalExprChecker.cpp [643/678] /Users/buildslave/jenkins/workspace/lldb-cmake/host-compiler/bin/clang++ -DGTEST_HAS_RTTI=0 -D_DEBUG -D_GNU_SOURCE -D__STDC_CONSTANT_MACROS -D__STDC_FORMAT_MACROS -D__STDC_LIMIT_MACROS -Itools/clang/lib/Format -I/Users/buildslave/jenkins/workspace/lldb-cmake/llvm-project/clang/lib/Format -I/Users/buildslave/jenkins/workspace/lldb-cmake/llvm-project/clang/include -Itools/clang/include -I/Applications/Xcode.app/Contents/Developer/Platforms/MacOSX.platform/Developer/SDKs/MacOSX10.14.sdk/usr/include/libxml2 -Iinclude -I/Users/buildslave/jenkins/workspace/lldb-cmake/llvm-project/llvm/include -Wdocumentation -fPIC -fvisibility-inlines-hidden -Werror=date-time -Werror=unguarded-availability-new -fmodules -fmodules-cache-path=/Users/buildslave/jenkins/workspace/lldb-cmake/lldb-build/module.cache -fcxx-modules -Wall -Wextra -Wno-unused-parameter -Wwrite-strings -Wcast-qual -Wmissing-field-initializers -pedantic -Wno-long-long -Wimplicit-fallthrough -Wcovered-switch-default -Wno-noexcept-type -Wnon-virtual-dtor -Wdelete-non-virtual-dtor -Wstring-conversion -fdiagnostics-color -fno-common -Woverloaded-virtual -Wno-nested-anon-types -O3 -isysroot /Applications/Xcode.app/Contents/Developer/Platforms/MacOSX.platform/Developer/SDKs/MacOSX10.14.sdk -UNDEBUG -fno-exceptions -fno-rtti -std=c++14 -MD -MT tools/clang/lib/Format/CMakeFiles/obj.clangFormat.dir/NamespaceEndCommentsFixer.cpp.o -MF tools/clang/lib/Format/CMakeFiles/obj.clangFormat.dir/NamespaceEndCommentsFixer.cpp.o.d -o tools/clang/lib/Format/CMakeFiles/obj.clangFormat.dir/NamespaceEndCommentsFixer.cpp.o -c /Users/buildslave/jenkins/workspace/lldb-cmake/llvm-project/clang/lib/Format/NamespaceEndCommentsFixer.cpp [644/678] /Users/buildslave/jenkins/workspace/lldb-cmake/host-compiler/bin/clang++ -DGTEST_HAS_RTTI=0 -D_DEBUG -D_GNU_SOURCE -D__STDC_CONSTANT_MACROS -D__STDC_FORMAT_MACROS -D__STDC_LIMIT_MACROS -Itools/clang/lib/StaticAnalyzer/Frontend -I/Users/buildslave/jenkins/workspace/lldb-cmake/llvm-project/clang/lib/StaticAnalyzer/Frontend -I/Users/buildslave/jenkins/workspace/lldb-cmake/llvm-project/clang/include -Itools/clang/include -I/Applications/Xcode.app/Contents/Developer/Platforms/MacOSX.platform/Developer/SDKs/MacOSX10.14.sdk/usr/include/libxml2 -Iinclude -I/Users/buildslave/jenkins/workspace/lldb-cmake/llvm-project/llvm/include -Itools/clang/lib/StaticAnalyzer/Frontend/../Checkers -Wdocumentation -fPIC -fvisibility-inlines-hidden -Werror=date-time -Werror=unguarded-availability-new -fmodules -fmodules-cache-path=/Users/buildslave/jenkins/workspace/lldb-cmake/lldb-build/module.cache -fcxx-modules -Wall -Wextra -Wno-unused-parameter -Wwrite-strings -Wcast-qual -Wmissing-field-initializers -pedantic -Wno-long-long -Wimplicit-fallthrough -Wcovered-switch-default -Wno-noexcept-type -Wnon-virtual-dtor -Wdelete-non-virtual-dtor -Wstring-conversion -fdiagnostics-color -fno-common -Woverloaded-virtual -Wno-nested-anon-types -O3 -isysroot /Applications/Xcode.app/Contents/Developer/Platforms/MacOSX.platform/Developer/SDKs/MacOSX10.14.sdk -UNDEBUG -fno-exceptions -fno-rtti -std=c++14 -MD -MT tools/clang/lib/StaticAnalyzer/Frontend/CMakeFiles/obj.clangStaticAnalyzerFrontend.dir/ModelConsumer.cpp.o -MF tools/clang/lib/StaticAnalyzer/Frontend/CMakeFiles/obj.clangStaticAnalyzerFrontend.dir/ModelConsumer.cpp.o.d -o tools/clang/lib/StaticAnalyzer/Frontend/CMakeFiles/obj.clangStaticAnalyzerFrontend.dir/ModelConsumer.cpp.o -c /Users/buildslave/jenkins/workspace/lldb-cmake/llvm-project/clang/lib/StaticAnalyzer/Frontend/ModelConsumer.cpp [645/678] /Users/buildslave/jenkins/workspace/lldb-cmake/host-compiler/bin/clang++ -DGTEST_HAS_RTTI=0 -D_DEBUG -D_GNU_SOURCE -D__STDC_CONSTANT_MACROS -D__STDC_FORMAT_MACROS -D__STDC_LIMIT_MACROS -Itools/clang/lib/StaticAnalyzer/Checkers -I/Users/buildslave/jenkins/workspace/lldb-cmake/llvm-project/clang/lib/StaticAnalyzer/Checkers -I/Users/buildslave/jenkins/workspace/lldb-cmake/llvm-project/clang/include -Itools/clang/include -I/Applications/Xcode.app/Contents/Developer/Platforms/MacOSX.platform/Developer/SDKs/MacOSX10.14.sdk/usr/include/libxml2 -Iinclude -I/Users/buildslave/jenkins/workspace/lldb-cmake/llvm-project/llvm/include -Wdocumentation -fPIC -fvisibility-inlines-hidden -Werror=date-time -Werror=unguarded-availability-new -fmodules -fmodules-cache-path=/Users/buildslave/jenkins/workspace/lldb-cmake/lldb-build/module.cache -fcxx-modules -Wall -Wextra -Wno-unused-parameter -Wwrite-strings -Wcast-qual -Wmissing-field-initializers -pedantic -Wno-long-long -Wimplicit-fallthrough -Wcovered-switch-default -Wno-noexcept-type -Wnon-virtual-dtor -Wdelete-non-virtual-dtor -Wstring-conversion -fdiagnostics-color -fno-common -Woverloaded-virtual -Wno-nested-anon-types -O3 -isysroot /Applications/Xcode.app/Contents/Developer/Platforms/MacOSX.platform/Developer/SDKs/MacOSX10.14.sdk -UNDEBUG -fno-exceptions -fno-rtti -std=c++14 -MD -MT tools/clang/lib/StaticAnalyzer/Checkers/CMakeFiles/obj.clangStaticAnalyzerCheckers.dir/VirtualCallChecker.cpp.o -MF tools/clang/lib/StaticAnalyzer/Checkers/CMakeFiles/obj.clangStaticAnalyzerCheckers.dir/VirtualCallChecker.cpp.o.d -o tools/clang/lib/StaticAnalyzer/Checkers/CMakeFiles/obj.clangStaticAnalyzerCheckers.dir/VirtualCallChecker.cpp.o -c /Users/buildslave/jenkins/workspace/lldb-cmake/llvm-project/clang/lib/StaticAnalyzer/Checkers/VirtualCallChecker.cpp [646/678] /Users/buildslave/jenkins/workspace/lldb-cmake/host-compiler/bin/clang++ -DGTEST_HAS_RTTI=0 -D_DEBUG -D_GNU_SOURCE -D__STDC_CONSTANT_MACROS -D__STDC_FORMAT_MACROS -D__STDC_LIMIT_MACROS -Itools/clang/lib/StaticAnalyzer/Frontend -I/Users/buildslave/jenkins/workspace/lldb-cmake/llvm-project/clang/lib/StaticAnalyzer/Frontend -I/Users/buildslave/jenkins/workspace/lldb-cmake/llvm-project/clang/include -Itools/clang/include -I/Applications/Xcode.app/Contents/Developer/Platforms/MacOSX.platform/Developer/SDKs/MacOSX10.14.sdk/usr/include/libxml2 -Iinclude -I/Users/buildslave/jenkins/workspace/lldb-cmake/llvm-project/llvm/include -Itools/clang/lib/StaticAnalyzer/Frontend/../Checkers -Wdocumentation -fPIC -fvisibility-inlines-hidden -Werror=date-time -Werror=unguarded-availability-new -fmodules -fmodules-cache-path=/Users/buildslave/jenkins/workspace/lldb-cmake/lldb-build/module.cache -fcxx-modules -Wall -Wextra -Wno-unused-parameter -Wwrite-strings -Wcast-qual -Wmissing-field-initializers -pedantic -Wno-long-long -Wimplicit-fallthrough -Wcovered-switch-default -Wno-noexcept-type -Wnon-virtual-dtor -Wdelete-non-virtual-dtor -Wstring-conversion -fdiagnostics-color -fno-common -Woverloaded-virtual -Wno-nested-anon-types -O3 -isysroot /Applications/Xcode.app/Contents/Developer/Platforms/MacOSX.platform/Developer/SDKs/MacOSX10.14.sdk -UNDEBUG -fno-exceptions -fno-rtti -std=c++14 -MD -MT tools/clang/lib/StaticAnalyzer/Frontend/CMakeFiles/obj.clangStaticAnalyzerFrontend.dir/CheckerRegistration.cpp.o -MF tools/clang/lib/StaticAnalyzer/Frontend/CMakeFiles/obj.clangStaticAnalyzerFrontend.dir/CheckerRegistration.cpp.o.d -o tools/clang/lib/StaticAnalyzer/Frontend/CMakeFiles/obj.clangStaticAnalyzerFrontend.dir/CheckerRegistration.cpp.o -c /Users/buildslave/jenkins/workspace/lldb-cmake/llvm-project/clang/lib/StaticAnalyzer/Frontend/CheckerRegistration.cpp [647/678] /Users/buildslave/jenkins/workspace/lldb-cmake/host-compiler/bin/clang++ -DGTEST_HAS_RTTI=0 -D_DEBUG -D_GNU_SOURCE -D__STDC_CONSTANT_MACROS -D__STDC_FORMAT_MACROS -D__STDC_LIMIT_MACROS -Itools/clang/lib/StaticAnalyzer/Checkers -I/Users/buildslave/jenkins/workspace/lldb-cmake/llvm-project/clang/lib/StaticAnalyzer/Checkers -I/Users/buildslave/jenkins/workspace/lldb-cmake/llvm-project/clang/include -Itools/clang/include -I/Applications/Xcode.app/Contents/Developer/Platforms/MacOSX.platform/Developer/SDKs/MacOSX10.14.sdk/usr/include/libxml2 -Iinclude -I/Users/buildslave/jenkins/workspace/lldb-cmake/llvm-project/llvm/include -Wdocumentation -fPIC -fvisibility-inlines-hidden -Werror=date-time -Werror=unguarded-availability-new -fmodules -fmodules-cache-path=/Users/buildslave/jenkins/workspace/lldb-cmake/lldb-build/module.cache -fcxx-modules -Wall -Wextra -Wno-unused-parameter -Wwrite-strings -Wcast-qual -Wmissing-field-initializers -pedantic -Wno-long-long -Wimplicit-fallthrough -Wcovered-switch-default -Wno-noexcept-type -Wnon-virtual-dtor -Wdelete-non-virtual-dtor -Wstring-conversion -fdiagnostics-color -fno-common -Woverloaded-virtual -Wno-nested-anon-types -O3 -isysroot /Applications/Xcode.app/Contents/Developer/Platforms/MacOSX.platform/Developer/SDKs/MacOSX10.14.sdk -UNDEBUG -fno-exceptions -fno-rtti -std=c++14 -MD -MT tools/clang/lib/StaticAnalyzer/Checkers/CMakeFiles/obj.clangStaticAnalyzerCheckers.dir/ValistChecker.cpp.o -MF tools/clang/lib/StaticAnalyzer/Checkers/CMakeFiles/obj.clangStaticAnalyzerCheckers.dir/ValistChecker.cpp.o.d -o tools/clang/lib/StaticAnalyzer/Checkers/CMakeFiles/obj.clangStaticAnalyzerCheckers.dir/ValistChecker.cpp.o -c /Users/buildslave/jenkins/workspace/lldb-cmake/llvm-project/clang/lib/StaticAnalyzer/Checkers/ValistChecker.cpp [648/678] /Users/buildslave/jenkins/workspace/lldb-cmake/host-compiler/bin/clang++ -DGTEST_HAS_RTTI=0 -D_DEBUG -D_GNU_SOURCE -D__STDC_CONSTANT_MACROS -D__STDC_FORMAT_MACROS -D__STDC_LIMIT_MACROS -Itools/clang/lib/Format -I/Users/buildslave/jenkins/workspace/lldb-cmake/llvm-project/clang/lib/Format -I/Users/buildslave/jenkins/workspace/lldb-cmake/llvm-project/clang/include -Itools/clang/include -I/Applications/Xcode.app/Contents/Developer/Platforms/MacOSX.platform/Developer/SDKs/MacOSX10.14.sdk/usr/include/libxml2 -Iinclude -I/Users/buildslave/jenkins/workspace/lldb-cmake/llvm-project/llvm/include -Wdocumentation -fPIC -fvisibility-inlines-hidden -Werror=date-time -Werror=unguarded-availability-new -fmodules -fmodules-cache-path=/Users/buildslave/jenkins/workspace/lldb-cmake/lldb-build/module.cache -fcxx-modules -Wall -Wextra -Wno-unused-parameter -Wwrite-strings -Wcast-qual -Wmissing-field-initializers -pedantic -Wno-long-long -Wimplicit-fallthrough -Wcovered-switch-default -Wno-noexcept-type -Wnon-virtual-dtor -Wdelete-non-virtual-dtor -Wstring-conversion -fdiagnostics-color -fno-common -Woverloaded-virtual -Wno-nested-anon-types -O3 -isysroot /Applications/Xcode.app/Contents/Developer/Platforms/MacOSX.platform/Developer/SDKs/MacOSX10.14.sdk -UNDEBUG -fno-exceptions -fno-rtti -std=c++14 -MD -MT tools/clang/lib/Format/CMakeFiles/obj.clangFormat.dir/FormatTokenLexer.cpp.o -MF tools/clang/lib/Format/CMakeFiles/obj.clangFormat.dir/FormatTokenLexer.cpp.o.d -o tools/clang/lib/Format/CMakeFiles/obj.clangFormat.dir/FormatTokenLexer.cpp.o -c /Users/buildslave/jenkins/workspace/lldb-cmake/llvm-project/clang/lib/Format/FormatTokenLexer.cpp [649/678] /Users/buildslave/jenkins/workspace/lldb-cmake/host-compiler/bin/clang++ -DGTEST_HAS_RTTI=0 -D_DEBUG -D_GNU_SOURCE -D__STDC_CONSTANT_MACROS -D__STDC_FORMAT_MACROS -D__STDC_LIMIT_MACROS -Itools/clang/lib/Format -I/Users/buildslave/jenkins/workspace/lldb-cmake/llvm-project/clang/lib/Format -I/Users/buildslave/jenkins/workspace/lldb-cmake/llvm-project/clang/include -Itools/clang/include -I/Applications/Xcode.app/Contents/Developer/Platforms/MacOSX.platform/Developer/SDKs/MacOSX10.14.sdk/usr/include/libxml2 -Iinclude -I/Users/buildslave/jenkins/workspace/lldb-cmake/llvm-project/llvm/include -Wdocumentation -fPIC -fvisibility-inlines-hidden -Werror=date-time -Werror=unguarded-availability-new -fmodules -fmodules-cache-path=/Users/buildslave/jenkins/workspace/lldb-cmake/lldb-build/module.cache -fcxx-modules -Wall -Wextra -Wno-unused-parameter -Wwrite-strings -Wcast-qual -Wmissing-field-initializers -pedantic -Wno-long-long -Wimplicit-fallthrough -Wcovered-switch-default -Wno-noexcept-type -Wnon-virtual-dtor -Wdelete-non-virtual-dtor -Wstring-conversion -fdiagnostics-color -fno-common -Woverloaded-virtual -Wno-nested-anon-types -O3 -isysroot /Applications/Xcode.app/Contents/Developer/Platforms/MacOSX.platform/Developer/SDKs/MacOSX10.14.sdk -UNDEBUG -fno-exceptions -fno-rtti -std=c++14 -MD -MT tools/clang/lib/Format/CMakeFiles/obj.clangFormat.dir/ContinuationIndenter.cpp.o -MF tools/clang/lib/Format/CMakeFiles/obj.clangFormat.dir/ContinuationIndenter.cpp.o.d -o tools/clang/lib/Format/CMakeFiles/obj.clangFormat.dir/ContinuationIndenter.cpp.o -c /Users/buildslave/jenkins/workspace/lldb-cmake/llvm-project/clang/lib/Format/ContinuationIndenter.cpp [650/678] /Users/buildslave/jenkins/workspace/lldb-cmake/host-compiler/bin/clang++ -DGTEST_HAS_RTTI=0 -D_DEBUG -D_GNU_SOURCE -D__STDC_CONSTANT_MACROS -D__STDC_FORMAT_MACROS -D__STDC_LIMIT_MACROS -Itools/clang/lib/Format -I/Users/buildslave/jenkins/workspace/lldb-cmake/llvm-project/clang/lib/Format -I/Users/buildslave/jenkins/workspace/lldb-cmake/llvm-project/clang/include -Itools/clang/include -I/Applications/Xcode.app/Contents/Developer/Platforms/MacOSX.platform/Developer/SDKs/MacOSX10.14.sdk/usr/include/libxml2 -Iinclude -I/Users/buildslave/jenkins/workspace/lldb-cmake/llvm-project/llvm/include -Wdocumentation -fPIC -fvisibility-inlines-hidden -Werror=date-time -Werror=unguarded-availability-new -fmodules -fmodules-cache-path=/Users/buildslave/jenkins/workspace/lldb-cmake/lldb-build/module.cache -fcxx-modules -Wall -Wextra -Wno-unused-parameter -Wwrite-strings -Wcast-qual -Wmissing-field-initializers -pedantic -Wno-long-long -Wimplicit-fallthrough -Wcovered-switch-default -Wno-noexcept-type -Wnon-virtual-dtor -Wdelete-non-virtual-dtor -Wstring-conversion -fdiagnostics-color -fno-common -Woverloaded-virtual -Wno-nested-anon-types -O3 -isysroot /Applications/Xcode.app/Contents/Developer/Platforms/MacOSX.platform/Developer/SDKs/MacOSX10.14.sdk -UNDEBUG -fno-exceptions -fno-rtti -std=c++14 -MD -MT tools/clang/lib/Format/CMakeFiles/obj.clangFormat.dir/TokenAnalyzer.cpp.o -MF tools/clang/lib/Format/CMakeFiles/obj.clangFormat.dir/TokenAnalyzer.cpp.o.d -o tools/clang/lib/Format/CMakeFiles/obj.clangFormat.dir/TokenAnalyzer.cpp.o -c /Users/buildslave/jenkins/workspace/lldb-cmake/llvm-project/clang/lib/Format/TokenAnalyzer.cpp [651/678] /Users/buildslave/jenkins/workspace/lldb-cmake/host-compiler/bin/clang++ -DGTEST_HAS_RTTI=0 -D_DEBUG -D_GNU_SOURCE -D__STDC_CONSTANT_MACROS -D__STDC_FORMAT_MACROS -D__STDC_LIMIT_MACROS -Itools/clang/lib/Format -I/Users/buildslave/jenkins/workspace/lldb-cmake/llvm-project/clang/lib/Format -I/Users/buildslave/jenkins/workspace/lldb-cmake/llvm-project/clang/include -Itools/clang/include -I/Applications/Xcode.app/Contents/Developer/Platforms/MacOSX.platform/Developer/SDKs/MacOSX10.14.sdk/usr/include/libxml2 -Iinclude -I/Users/buildslave/jenkins/workspace/lldb-cmake/llvm-project/llvm/include -Wdocumentation -fPIC -fvisibility-inlines-hidden -Werror=date-time -Werror=unguarded-availability-new -fmodules -fmodules-cache-path=/Users/buildslave/jenkins/workspace/lldb-cmake/lldb-build/module.cache -fcxx-modules -Wall -Wextra -Wno-unused-parameter -Wwrite-strings -Wcast-qual -Wmissing-field-initializers -pedantic -Wno-long-long -Wimplicit-fallthrough -Wcovered-switch-default -Wno-noexcept-type -Wnon-virtual-dtor -Wdelete-non-virtual-dtor -Wstring-conversion -fdiagnostics-color -fno-common -Woverloaded-virtual -Wno-nested-anon-types -O3 -isysroot /Applications/Xcode.app/Contents/Developer/Platforms/MacOSX.platform/Developer/SDKs/MacOSX10.14.sdk -UNDEBUG -fno-exceptions -fno-rtti -std=c++14 -MD -MT tools/clang/lib/Format/CMakeFiles/obj.clangFormat.dir/SortJavaScriptImports.cpp.o -MF tools/clang/lib/Format/CMakeFiles/obj.clangFormat.dir/SortJavaScriptImports.cpp.o.d -o tools/clang/lib/Format/CMakeFiles/obj.clangFormat.dir/SortJavaScriptImports.cpp.o -c /Users/buildslave/jenkins/workspace/lldb-cmake/llvm-project/clang/lib/Format/SortJavaScriptImports.cpp [652/678] /Users/buildslave/jenkins/workspace/lldb-cmake/host-compiler/bin/clang++ -DGTEST_HAS_RTTI=0 -D_DEBUG -D_GNU_SOURCE -D__STDC_CONSTANT_MACROS -D__STDC_FORMAT_MACROS -D__STDC_LIMIT_MACROS -Itools/clang/lib/StaticAnalyzer/Frontend -I/Users/buildslave/jenkins/workspace/lldb-cmake/llvm-project/clang/lib/StaticAnalyzer/Frontend -I/Users/buildslave/jenkins/workspace/lldb-cmake/llvm-project/clang/include -Itools/clang/include -I/Applications/Xcode.app/Contents/Developer/Platforms/MacOSX.platform/Developer/SDKs/MacOSX10.14.sdk/usr/include/libxml2 -Iinclude -I/Users/buildslave/jenkins/workspace/lldb-cmake/llvm-project/llvm/include -Itools/clang/lib/StaticAnalyzer/Frontend/../Checkers -Wdocumentation -fPIC -fvisibility-inlines-hidden -Werror=date-time -Werror=unguarded-availability-new -fmodules -fmodules-cache-path=/Users/buildslave/jenkins/workspace/lldb-cmake/lldb-build/module.cache -fcxx-modules -Wall -Wextra -Wno-unused-parameter -Wwrite-strings -Wcast-qual -Wmissing-field-initializers -pedantic -Wno-long-long -Wimplicit-fallthrough -Wcovered-switch-default -Wno-noexcept-type -Wnon-virtual-dtor -Wdelete-non-virtual-dtor -Wstring-conversion -fdiagnostics-color -fno-common -Woverloaded-virtual -Wno-nested-anon-types -O3 -isysroot /Applications/Xcode.app/Contents/Developer/Platforms/MacOSX.platform/Developer/SDKs/MacOSX10.14.sdk -UNDEBUG -fno-exceptions -fno-rtti -std=c++14 -MD -MT tools/clang/lib/StaticAnalyzer/Frontend/CMakeFiles/obj.clangStaticAnalyzerFrontend.dir/ModelInjector.cpp.o -MF tools/clang/lib/StaticAnalyzer/Frontend/CMakeFiles/obj.clangStaticAnalyzerFrontend.dir/ModelInjector.cpp.o.d -o tools/clang/lib/StaticAnalyzer/Frontend/CMakeFiles/obj.clangStaticAnalyzerFrontend.dir/ModelInjector.cpp.o -c /Users/buildslave/jenkins/workspace/lldb-cmake/llvm-project/clang/lib/StaticAnalyzer/Frontend/ModelInjector.cpp [653/678] /Users/buildslave/jenkins/workspace/lldb-cmake/host-compiler/bin/clang++ -DGTEST_HAS_RTTI=0 -D_DEBUG -D_GNU_SOURCE -D__STDC_CONSTANT_MACROS -D__STDC_FORMAT_MACROS -D__STDC_LIMIT_MACROS -Itools/clang/lib/Format -I/Users/buildslave/jenkins/workspace/lldb-cmake/llvm-project/clang/lib/Format -I/Users/buildslave/jenkins/workspace/lldb-cmake/llvm-project/clang/include -Itools/clang/include -I/Applications/Xcode.app/Contents/Developer/Platforms/MacOSX.platform/Developer/SDKs/MacOSX10.14.sdk/usr/include/libxml2 -Iinclude -I/Users/buildslave/jenkins/workspace/lldb-cmake/llvm-project/llvm/include -Wdocumentation -fPIC -fvisibility-inlines-hidden -Werror=date-time -Werror=unguarded-availability-new -fmodules -fmodules-cache-path=/Users/buildslave/jenkins/workspace/lldb-cmake/lldb-build/module.cache -fcxx-modules -Wall -Wextra -Wno-unused-parameter -Wwrite-strings -Wcast-qual -Wmissing-field-initializers -pedantic -Wno-long-long -Wimplicit-fallthrough -Wcovered-switch-default -Wno-noexcept-type -Wnon-virtual-dtor -Wdelete-non-virtual-dtor -Wstring-conversion -fdiagnostics-color -fno-common -Woverloaded-virtual -Wno-nested-anon-types -O3 -isysroot /Applications/Xcode.app/Contents/Developer/Platforms/MacOSX.platform/Developer/SDKs/MacOSX10.14.sdk -UNDEBUG -fno-exceptions -fno-rtti -std=c++14 -MD -MT tools/clang/lib/Format/CMakeFiles/obj.clangFormat.dir/UsingDeclarationsSorter.cpp.o -MF tools/clang/lib/Format/CMakeFiles/obj.clangFormat.dir/UsingDeclarationsSorter.cpp.o.d -o tools/clang/lib/Format/CMakeFiles/obj.clangFormat.dir/UsingDeclarationsSorter.cpp.o -c /Users/buildslave/jenkins/workspace/lldb-cmake/llvm-project/clang/lib/Format/UsingDeclarationsSorter.cpp [654/678] /Users/buildslave/jenkins/workspace/lldb-cmake/host-compiler/bin/clang++ -DGTEST_HAS_RTTI=0 -D_DEBUG -D_GNU_SOURCE -D__STDC_CONSTANT_MACROS -D__STDC_FORMAT_MACROS -D__STDC_LIMIT_MACROS -Itools/clang/lib/Format -I/Users/buildslave/jenkins/workspace/lldb-cmake/llvm-project/clang/lib/Format -I/Users/buildslave/jenkins/workspace/lldb-cmake/llvm-project/clang/include -Itools/clang/include -I/Applications/Xcode.app/Contents/Developer/Platforms/MacOSX.platform/Developer/SDKs/MacOSX10.14.sdk/usr/include/libxml2 -Iinclude -I/Users/buildslave/jenkins/workspace/lldb-cmake/llvm-project/llvm/include -Wdocumentation -fPIC -fvisibility-inlines-hidden -Werror=date-time -Werror=unguarded-availability-new -fmodules -fmodules-cache-path=/Users/buildslave/jenkins/workspace/lldb-cmake/lldb-build/module.cache -fcxx-modules -Wall -Wextra -Wno-unused-parameter -Wwrite-strings -Wcast-qual -Wmissing-field-initializers -pedantic -Wno-long-long -Wimplicit-fallthrough -Wcovered-switch-default -Wno-noexcept-type -Wnon-virtual-dtor -Wdelete-non-virtual-dtor -Wstring-conversion -fdiagnostics-color -fno-common -Woverloaded-virtual -Wno-nested-anon-types -O3 -isysroot /Applications/Xcode.app/Contents/Developer/Platforms/MacOSX.platform/Developer/SDKs/MacOSX10.14.sdk -UNDEBUG -fno-exceptions -fno-rtti -std=c++14 -MD -MT tools/clang/lib/Format/CMakeFiles/obj.clangFormat.dir/UnwrappedLineParser.cpp.o -MF tools/clang/lib/Format/CMakeFiles/obj.clangFormat.dir/UnwrappedLineParser.cpp.o.d -o tools/clang/lib/Format/CMakeFiles/obj.clangFormat.dir/UnwrappedLineParser.cpp.o -c /Users/buildslave/jenkins/workspace/lldb-cmake/llvm-project/clang/lib/Format/UnwrappedLineParser.cpp [655/678] /Users/buildslave/jenkins/workspace/lldb-cmake/host-compiler/bin/clang++ -DGTEST_HAS_RTTI=0 -D_DEBUG -D_GNU_SOURCE -D__STDC_CONSTANT_MACROS -D__STDC_FORMAT_MACROS -D__STDC_LIMIT_MACROS -Itools/clang/lib/Format -I/Users/buildslave/jenkins/workspace/lldb-cmake/llvm-project/clang/lib/Format -I/Users/buildslave/jenkins/workspace/lldb-cmake/llvm-project/clang/include -Itools/clang/include -I/Applications/Xcode.app/Contents/Developer/Platforms/MacOSX.platform/Developer/SDKs/MacOSX10.14.sdk/usr/include/libxml2 -Iinclude -I/Users/buildslave/jenkins/workspace/lldb-cmake/llvm-project/llvm/include -Wdocumentation -fPIC -fvisibility-inlines-hidden -Werror=date-time -Werror=unguarded-availability-new -fmodules -fmodules-cache-path=/Users/buildslave/jenkins/workspace/lldb-cmake/lldb-build/module.cache -fcxx-modules -Wall -Wextra -Wno-unused-parameter -Wwrite-strings -Wcast-qual -Wmissing-field-initializers -pedantic -Wno-long-long -Wimplicit-fallthrough -Wcovered-switch-default -Wno-noexcept-type -Wnon-virtual-dtor -Wdelete-non-virtual-dtor -Wstring-conversion -fdiagnostics-color -fno-common -Woverloaded-virtual -Wno-nested-anon-types -O3 -isysroot /Applications/Xcode.app/Contents/Developer/Platforms/MacOSX.platform/Developer/SDKs/MacOSX10.14.sdk -UNDEBUG -fno-exceptions -fno-rtti -std=c++14 -MD -MT tools/clang/lib/Format/CMakeFiles/obj.clangFormat.dir/UnwrappedLineFormatter.cpp.o -MF tools/clang/lib/Format/CMakeFiles/obj.clangFormat.dir/UnwrappedLineFormatter.cpp.o.d -o tools/clang/lib/Format/CMakeFiles/obj.clangFormat.dir/UnwrappedLineFormatter.cpp.o -c /Users/buildslave/jenkins/workspace/lldb-cmake/llvm-project/clang/lib/Format/UnwrappedLineFormatter.cpp [656/678] /Users/buildslave/jenkins/workspace/lldb-cmake/host-compiler/bin/clang++ -DGTEST_HAS_RTTI=0 -D_DEBUG -D_GNU_SOURCE -D__STDC_CONSTANT_MACROS -D__STDC_FORMAT_MACROS -D__STDC_LIMIT_MACROS -Itools/clang/lib/Format -I/Users/buildslave/jenkins/workspace/lldb-cmake/llvm-project/clang/lib/Format -I/Users/buildslave/jenkins/workspace/lldb-cmake/llvm-project/clang/include -Itools/clang/include -I/Applications/Xcode.app/Contents/Developer/Platforms/MacOSX.platform/Developer/SDKs/MacOSX10.14.sdk/usr/include/libxml2 -Iinclude -I/Users/buildslave/jenkins/workspace/lldb-cmake/llvm-project/llvm/include -Wdocumentation -fPIC -fvisibility-inlines-hidden -Werror=date-time -Werror=unguarded-availability-new -fmodules -fmodules-cache-path=/Users/buildslave/jenkins/workspace/lldb-cmake/lldb-build/module.cache -fcxx-modules -Wall -Wextra -Wno-unused-parameter -Wwrite-strings -Wcast-qual -Wmissing-field-initializers -pedantic -Wno-long-long -Wimplicit-fallthrough -Wcovered-switch-default -Wno-noexcept-type -Wnon-virtual-dtor -Wdelete-non-virtual-dtor -Wstring-conversion -fdiagnostics-color -fno-common -Woverloaded-virtual -Wno-nested-anon-types -O3 -isysroot /Applications/Xcode.app/Contents/Developer/Platforms/MacOSX.platform/Developer/SDKs/MacOSX10.14.sdk -UNDEBUG -fno-exceptions -fno-rtti -std=c++14 -MD -MT tools/clang/lib/Format/CMakeFiles/obj.clangFormat.dir/WhitespaceManager.cpp.o -MF tools/clang/lib/Format/CMakeFiles/obj.clangFormat.dir/WhitespaceManager.cpp.o.d -o tools/clang/lib/Format/CMakeFiles/obj.clangFormat.dir/WhitespaceManager.cpp.o -c /Users/buildslave/jenkins/workspace/lldb-cmake/llvm-project/clang/lib/Format/WhitespaceManager.cpp [657/678] /Users/buildslave/jenkins/workspace/lldb-cmake/host-compiler/bin/clang++ -DGTEST_HAS_RTTI=0 -D_DEBUG -D_GNU_SOURCE -D__STDC_CONSTANT_MACROS -D__STDC_FORMAT_MACROS -D__STDC_LIMIT_MACROS -Itools/clang/tools/clang-offload-wrapper -I/Users/buildslave/jenkins/workspace/lldb-cmake/llvm-project/clang/tools/clang-offload-wrapper -I/Users/buildslave/jenkins/workspace/lldb-cmake/llvm-project/clang/include -Itools/clang/include -I/Applications/Xcode.app/Contents/Developer/Platforms/MacOSX.platform/Developer/SDKs/MacOSX10.14.sdk/usr/include/libxml2 -Iinclude -I/Users/buildslave/jenkins/workspace/lldb-cmake/llvm-project/llvm/include -Wdocumentation -fPIC -fvisibility-inlines-hidden -Werror=date-time -Werror=unguarded-availability-new -fmodules -fmodules-cache-path=/Users/buildslave/jenkins/workspace/lldb-cmake/lldb-build/module.cache -fcxx-modules -Wall -Wextra -Wno-unused-parameter -Wwrite-strings -Wcast-qual -Wmissing-field-initializers -pedantic -Wno-long-long -Wimplicit-fallthrough -Wcovered-switch-default -Wno-noexcept-type -Wnon-virtual-dtor -Wdelete-non-virtual-dtor -Wstring-conversion -fdiagnostics-color -fno-common -Woverloaded-virtual -Wno-nested-anon-types -O3 -isysroot /Applications/Xcode.app/Contents/Developer/Platforms/MacOSX.platform/Developer/SDKs/MacOSX10.14.sdk -UNDEBUG -fno-exceptions -fno-rtti -std=c++14 -MD -MT tools/clang/tools/clang-offload-wrapper/CMakeFiles/clang-offload-wrapper.dir/ClangOffloadWrapper.cpp.o -MF tools/clang/tools/clang-offload-wrapper/CMakeFiles/clang-offload-wrapper.dir/ClangOffloadWrapper.cpp.o.d -o tools/clang/tools/clang-offload-wrapper/CMakeFiles/clang-offload-wrapper.dir/ClangOffloadWrapper.cpp.o -c /Users/buildslave/jenkins/workspace/lldb-cmake/llvm-project/clang/tools/clang-offload-wrapper/ClangOffloadWrapper.cpp [658/678] /Users/buildslave/jenkins/workspace/lldb-cmake/host-compiler/bin/clang++ -DGTEST_HAS_RTTI=0 -D_DEBUG -D_GNU_SOURCE -D__STDC_CONSTANT_MACROS -D__STDC_FORMAT_MACROS -D__STDC_LIMIT_MACROS -Itools/clang/lib/StaticAnalyzer/Checkers -I/Users/buildslave/jenkins/workspace/lldb-cmake/llvm-project/clang/lib/StaticAnalyzer/Checkers -I/Users/buildslave/jenkins/workspace/lldb-cmake/llvm-project/clang/include -Itools/clang/include -I/Applications/Xcode.app/Contents/Developer/Platforms/MacOSX.platform/Developer/SDKs/MacOSX10.14.sdk/usr/include/libxml2 -Iinclude -I/Users/buildslave/jenkins/workspace/lldb-cmake/llvm-project/llvm/include -Wdocumentation -fPIC -fvisibility-inlines-hidden -Werror=date-time -Werror=unguarded-availability-new -fmodules -fmodules-cache-path=/Users/buildslave/jenkins/workspace/lldb-cmake/lldb-build/module.cache -fcxx-modules -Wall -Wextra -Wno-unused-parameter -Wwrite-strings -Wcast-qual -Wmissing-field-initializers -pedantic -Wno-long-long -Wimplicit-fallthrough -Wcovered-switch-default -Wno-noexcept-type -Wnon-virtual-dtor -Wdelete-non-virtual-dtor -Wstring-conversion -fdiagnostics-color -fno-common -Woverloaded-virtual -Wno-nested-anon-types -O3 -isysroot /Applications/Xcode.app/Contents/Developer/Platforms/MacOSX.platform/Developer/SDKs/MacOSX10.14.sdk -UNDEBUG -fno-exceptions -fno-rtti -std=c++14 -MD -MT tools/clang/lib/StaticAnalyzer/Checkers/CMakeFiles/obj.clangStaticAnalyzerCheckers.dir/UninitializedObject/UninitializedObjectChecker.cpp.o -MF tools/clang/lib/StaticAnalyzer/Checkers/CMakeFiles/obj.clangStaticAnalyzerCheckers.dir/UninitializedObject/UninitializedObjectChecker.cpp.o.d -o tools/clang/lib/StaticAnalyzer/Checkers/CMakeFiles/obj.clangStaticAnalyzerCheckers.dir/UninitializedObject/UninitializedObjectChecker.cpp.o -c /Users/buildslave/jenkins/workspace/lldb-cmake/llvm-project/clang/lib/StaticAnalyzer/Checkers/UninitializedObject/UninitializedObjectChecker.cpp [659/678] /Users/buildslave/jenkins/workspace/lldb-cmake/host-compiler/bin/clang++ -DGTEST_HAS_RTTI=0 -D_DEBUG -D_GNU_SOURCE -D__STDC_CONSTANT_MACROS -D__STDC_FORMAT_MACROS -D__STDC_LIMIT_MACROS -Itools/clang/lib/Format -I/Users/buildslave/jenkins/workspace/lldb-cmake/llvm-project/clang/lib/Format -I/Users/buildslave/jenkins/workspace/lldb-cmake/llvm-project/clang/include -Itools/clang/include -I/Applications/Xcode.app/Contents/Developer/Platforms/MacOSX.platform/Developer/SDKs/MacOSX10.14.sdk/usr/include/libxml2 -Iinclude -I/Users/buildslave/jenkins/workspace/lldb-cmake/llvm-project/llvm/include -Wdocumentation -fPIC -fvisibility-inlines-hidden -Werror=date-time -Werror=unguarded-availability-new -fmodules -fmodules-cache-path=/Users/buildslave/jenkins/workspace/lldb-cmake/lldb-build/module.cache -fcxx-modules -Wall -Wextra -Wno-unused-parameter -Wwrite-strings -Wcast-qual -Wmissing-field-initializers -pedantic -Wno-long-long -Wimplicit-fallthrough -Wcovered-switch-default -Wno-noexcept-type -Wnon-virtual-dtor -Wdelete-non-virtual-dtor -Wstring-conversion -fdiagnostics-color -fno-common -Woverloaded-virtual -Wno-nested-anon-types -O3 -isysroot /Applications/Xcode.app/Contents/Developer/Platforms/MacOSX.platform/Developer/SDKs/MacOSX10.14.sdk -UNDEBUG -fno-exceptions -fno-rtti -std=c++14 -MD -MT tools/clang/lib/Format/CMakeFiles/obj.clangFormat.dir/TokenAnnotator.cpp.o -MF tools/clang/lib/Format/CMakeFiles/obj.clangFormat.dir/TokenAnnotator.cpp.o.d -o tools/clang/lib/Format/CMakeFiles/obj.clangFormat.dir/TokenAnnotator.cpp.o -c /Users/buildslave/jenkins/workspace/lldb-cmake/llvm-project/clang/lib/Format/TokenAnnotator.cpp /Users/buildslave/jenkins/workspace/lldb-cmake/llvm-project/clang/lib/Format/TokenAnnotator.cpp:30:22: warning: '\c' command does not have a valid word argument [-Wdocumentation] /// an Objective-C \c @selector, \c false otherwise. ~~^ 1 warning generated. [660/678] : && /Users/buildslave/jenkins/workspace/lldb-cmake/host-compiler/bin/clang++ -Wdocumentation -fPIC -fvisibility-inlines-hidden -Werror=date-time -Werror=unguarded-availability-new -fmodules -fmodules-cache-path=/Users/buildslave/jenkins/workspace/lldb-cmake/lldb-build/module.cache -fcxx-modules -Wall -Wextra -Wno-unused-parameter -Wwrite-strings -Wcast-qual -Wmissing-field-initializers -pedantic -Wno-long-long -Wimplicit-fallthrough -Wcovered-switch-default -Wno-noexcept-type -Wnon-virtual-dtor -Wdelete-non-virtual-dtor -Wstring-conversion -fdiagnostics-color -fno-common -Woverloaded-virtual -Wno-nested-anon-types -O3 -isysroot /Applications/Xcode.app/Contents/Developer/Platforms/MacOSX.platform/Developer/SDKs/MacOSX10.14.sdk -Wl,-search_paths_first -Wl,-headerpad_max_install_names -Wl,-dead_strip tools/clang/tools/clang-offload-wrapper/CMakeFiles/clang-offload-wrapper.dir/ClangOffloadWrapper.cpp.o -o bin/clang-offload-wrapper -Wl,-rpath,@loader_path/../lib lib/libLLVMBitWriter.a lib/libLLVMCore.a lib/libLLVMSupport.a lib/libLLVMTransformUtils.a lib/libclangBasic.a lib/libLLVMAnalysis.a lib/libLLVMObject.a lib/libLLVMBitReader.a lib/libLLVMMCParser.a lib/libLLVMTextAPI.a lib/libLLVMProfileData.a lib/libLLVMCore.a lib/libLLVMRemarks.a lib/libLLVMBitstreamReader.a lib/libLLVMMC.a lib/libLLVMBinaryFormat.a lib/libLLVMDebugInfoCodeView.a lib/libLLVMDebugInfoMSF.a lib/libLLVMSupport.a -lz -lcurses -lm lib/libLLVMDemangle.a && : [661/678] /Users/buildslave/jenkins/workspace/lldb-cmake/host-compiler/bin/clang++ -DGTEST_HAS_RTTI=0 -D_DEBUG -D_GNU_SOURCE -D__STDC_CONSTANT_MACROS -D__STDC_FORMAT_MACROS -D__STDC_LIMIT_MACROS -Itools/clang/lib/StaticAnalyzer/Frontend -I/Users/buildslave/jenkins/workspace/lldb-cmake/llvm-project/clang/lib/StaticAnalyzer/Frontend -I/Users/buildslave/jenkins/workspace/lldb-cmake/llvm-project/clang/include -Itools/clang/include -I/Applications/Xcode.app/Contents/Developer/Platforms/MacOSX.platform/Developer/SDKs/MacOSX10.14.sdk/usr/include/libxml2 -Iinclude -I/Users/buildslave/jenkins/workspace/lldb-cmake/llvm-project/llvm/include -Itools/clang/lib/StaticAnalyzer/Frontend/../Checkers -Wdocumentation -fPIC -fvisibility-inlines-hidden -Werror=date-time -Werror=unguarded-availability-new -fmodules -fmodules-cache-path=/Users/buildslave/jenkins/workspace/lldb-cmake/lldb-build/module.cache -fcxx-modules -Wall -Wextra -Wno-unused-parameter -Wwrite-strings -Wcast-qual -Wmissing-field-initializers -pedantic -Wno-long-long -Wimplicit-fallthrough -Wcovered-switch-default -Wno-noexcept-type -Wnon-virtual-dtor -Wdelete-non-virtual-dtor -Wstring-conversion -fdiagnostics-color -fno-common -Woverloaded-virtual -Wno-nested-anon-types -O3 -isysroot /Applications/Xcode.app/Contents/Developer/Platforms/MacOSX.platform/Developer/SDKs/MacOSX10.14.sdk -UNDEBUG -fno-exceptions -fno-rtti -std=c++14 -MD -MT tools/clang/lib/StaticAnalyzer/Frontend/CMakeFiles/obj.clangStaticAnalyzerFrontend.dir/CheckerRegistry.cpp.o -MF tools/clang/lib/StaticAnalyzer/Frontend/CMakeFiles/obj.clangStaticAnalyzerFrontend.dir/CheckerRegistry.cpp.o.d -o tools/clang/lib/StaticAnalyzer/Frontend/CMakeFiles/obj.clangStaticAnalyzerFrontend.dir/CheckerRegistry.cpp.o -c /Users/buildslave/jenkins/workspace/lldb-cmake/llvm-project/clang/lib/StaticAnalyzer/Frontend/CheckerRegistry.cpp [662/678] /Users/buildslave/jenkins/workspace/lldb-cmake/host-compiler/bin/clang++ -DGTEST_HAS_RTTI=0 -D_DEBUG -D_GNU_SOURCE -D__STDC_CONSTANT_MACROS -D__STDC_FORMAT_MACROS -D__STDC_LIMIT_MACROS -Itools/clang/tools/clang-offload-bundler -I/Users/buildslave/jenkins/workspace/lldb-cmake/llvm-project/clang/tools/clang-offload-bundler -I/Users/buildslave/jenkins/workspace/lldb-cmake/llvm-project/clang/include -Itools/clang/include -I/Applications/Xcode.app/Contents/Developer/Platforms/MacOSX.platform/Developer/SDKs/MacOSX10.14.sdk/usr/include/libxml2 -Iinclude -I/Users/buildslave/jenkins/workspace/lldb-cmake/llvm-project/llvm/include -Wdocumentation -fPIC -fvisibility-inlines-hidden -Werror=date-time -Werror=unguarded-availability-new -fmodules -fmodules-cache-path=/Users/buildslave/jenkins/workspace/lldb-cmake/lldb-build/module.cache -fcxx-modules -Wall -Wextra -Wno-unused-parameter -Wwrite-strings -Wcast-qual -Wmissing-field-initializers -pedantic -Wno-long-long -Wimplicit-fallthrough -Wcovered-switch-default -Wno-noexcept-type -Wnon-virtual-dtor -Wdelete-non-virtual-dtor -Wstring-conversion -fdiagnostics-color -fno-common -Woverloaded-virtual -Wno-nested-anon-types -O3 -isysroot /Applications/Xcode.app/Contents/Developer/Platforms/MacOSX.platform/Developer/SDKs/MacOSX10.14.sdk -UNDEBUG -fno-exceptions -fno-rtti -std=c++14 -MD -MT tools/clang/tools/clang-offload-bundler/CMakeFiles/clang-offload-bundler.dir/ClangOffloadBundler.cpp.o -MF tools/clang/tools/clang-offload-bundler/CMakeFiles/clang-offload-bundler.dir/ClangOffloadBundler.cpp.o.d -o tools/clang/tools/clang-offload-bundler/CMakeFiles/clang-offload-bundler.dir/ClangOffloadBundler.cpp.o -c /Users/buildslave/jenkins/workspace/lldb-cmake/llvm-project/clang/tools/clang-offload-bundler/ClangOffloadBundler.cpp [663/678] : && /Users/buildslave/jenkins/workspace/lldb-cmake/host-compiler/bin/clang++ -Wdocumentation -fPIC -fvisibility-inlines-hidden -Werror=date-time -Werror=unguarded-availability-new -fmodules -fmodules-cache-path=/Users/buildslave/jenkins/workspace/lldb-cmake/lldb-build/module.cache -fcxx-modules -Wall -Wextra -Wno-unused-parameter -Wwrite-strings -Wcast-qual -Wmissing-field-initializers -pedantic -Wno-long-long -Wimplicit-fallthrough -Wcovered-switch-default -Wno-noexcept-type -Wnon-virtual-dtor -Wdelete-non-virtual-dtor -Wstring-conversion -fdiagnostics-color -fno-common -Woverloaded-virtual -Wno-nested-anon-types -O3 -isysroot /Applications/Xcode.app/Contents/Developer/Platforms/MacOSX.platform/Developer/SDKs/MacOSX10.14.sdk -Wl,-search_paths_first -Wl,-headerpad_max_install_names -Wl,-dead_strip tools/clang/tools/clang-offload-bundler/CMakeFiles/clang-offload-bundler.dir/ClangOffloadBundler.cpp.o -o bin/clang-offload-bundler -Wl,-rpath,@loader_path/../lib lib/libLLVMObject.a lib/libLLVMSupport.a lib/libclangBasic.a lib/libLLVMBitReader.a lib/libLLVMMCParser.a lib/libLLVMTextAPI.a lib/libLLVMCore.a lib/libLLVMRemarks.a lib/libLLVMBitstreamReader.a lib/libLLVMMC.a lib/libLLVMBinaryFormat.a lib/libLLVMDebugInfoCodeView.a lib/libLLVMDebugInfoMSF.a lib/libLLVMSupport.a -lz -lcurses -lm lib/libLLVMDemangle.a && : [664/678] /Users/buildslave/jenkins/workspace/lldb-cmake/host-compiler/bin/clang++ -DGTEST_HAS_RTTI=0 -D_DEBUG -D_GNU_SOURCE -D__STDC_CONSTANT_MACROS -D__STDC_FORMAT_MACROS -D__STDC_LIMIT_MACROS -Itools/clang/lib/StaticAnalyzer/Checkers -I/Users/buildslave/jenkins/workspace/lldb-cmake/llvm-project/clang/lib/StaticAnalyzer/Checkers -I/Users/buildslave/jenkins/workspace/lldb-cmake/llvm-project/clang/include -Itools/clang/include -I/Applications/Xcode.app/Contents/Developer/Platforms/MacOSX.platform/Developer/SDKs/MacOSX10.14.sdk/usr/include/libxml2 -Iinclude -I/Users/buildslave/jenkins/workspace/lldb-cmake/llvm-project/llvm/include -Wdocumentation -fPIC -fvisibility-inlines-hidden -Werror=date-time -Werror=unguarded-availability-new -fmodules -fmodules-cache-path=/Users/buildslave/jenkins/workspace/lldb-cmake/lldb-build/module.cache -fcxx-modules -Wall -Wextra -Wno-unused-parameter -Wwrite-strings -Wcast-qual -Wmissing-field-initializers -pedantic -Wno-long-long -Wimplicit-fallthrough -Wcovered-switch-default -Wno-noexcept-type -Wnon-virtual-dtor -Wdelete-non-virtual-dtor -Wstring-conversion -fdiagnostics-color -fno-common -Woverloaded-virtual -Wno-nested-anon-types -O3 -isysroot /Applications/Xcode.app/Contents/Developer/Platforms/MacOSX.platform/Developer/SDKs/MacOSX10.14.sdk -UNDEBUG -fno-exceptions -fno-rtti -std=c++14 -MD -MT tools/clang/lib/StaticAnalyzer/Checkers/CMakeFiles/obj.clangStaticAnalyzerCheckers.dir/ObjCMissingSuperCallChecker.cpp.o -MF tools/clang/lib/StaticAnalyzer/Checkers/CMakeFiles/obj.clangStaticAnalyzerCheckers.dir/ObjCMissingSuperCallChecker.cpp.o.d -o tools/clang/lib/StaticAnalyzer/Checkers/CMakeFiles/obj.clangStaticAnalyzerCheckers.dir/ObjCMissingSuperCallChecker.cpp.o -c /Users/buildslave/jenkins/workspace/lldb-cmake/llvm-project/clang/lib/StaticAnalyzer/Checkers/ObjCMissingSuperCallChecker.cpp [665/678] /Users/buildslave/jenkins/workspace/lldb-cmake/host-compiler/bin/clang++ -DGTEST_HAS_RTTI=0 -D_DEBUG -D_GNU_SOURCE -D__STDC_CONSTANT_MACROS -D__STDC_FORMAT_MACROS -D__STDC_LIMIT_MACROS -Itools/clang/tools/driver -I/Users/buildslave/jenkins/workspace/lldb-cmake/llvm-project/clang/tools/driver -I/Users/buildslave/jenkins/workspace/lldb-cmake/llvm-project/clang/include -Itools/clang/include -I/Applications/Xcode.app/Contents/Developer/Platforms/MacOSX.platform/Developer/SDKs/MacOSX10.14.sdk/usr/include/libxml2 -Iinclude -I/Users/buildslave/jenkins/workspace/lldb-cmake/llvm-project/llvm/include -Wdocumentation -fPIC -fvisibility-inlines-hidden -Werror=date-time -Werror=unguarded-availability-new -fmodules -fmodules-cache-path=/Users/buildslave/jenkins/workspace/lldb-cmake/lldb-build/module.cache -fcxx-modules -Wall -Wextra -Wno-unused-parameter -Wwrite-strings -Wcast-qual -Wmissing-field-initializers -pedantic -Wno-long-long -Wimplicit-fallthrough -Wcovered-switch-default -Wno-noexcept-type -Wnon-virtual-dtor -Wdelete-non-virtual-dtor -Wstring-conversion -fdiagnostics-color -fno-common -Woverloaded-virtual -Wno-nested-anon-types -O3 -isysroot /Applications/Xcode.app/Contents/Developer/Platforms/MacOSX.platform/Developer/SDKs/MacOSX10.14.sdk -UNDEBUG -fno-exceptions -fno-rtti -std=c++14 -MD -MT tools/clang/tools/driver/CMakeFiles/clang.dir/cc1gen_reproducer_main.cpp.o -MF tools/clang/tools/driver/CMakeFiles/clang.dir/cc1gen_reproducer_main.cpp.o.d -o tools/clang/tools/driver/CMakeFiles/clang.dir/cc1gen_reproducer_main.cpp.o -c /Users/buildslave/jenkins/workspace/lldb-cmake/llvm-project/clang/tools/driver/cc1gen_reproducer_main.cpp [666/678] /Users/buildslave/jenkins/workspace/lldb-cmake/host-compiler/bin/clang++ -DGTEST_HAS_RTTI=0 -D_DEBUG -D_GNU_SOURCE -D__STDC_CONSTANT_MACROS -D__STDC_FORMAT_MACROS -D__STDC_LIMIT_MACROS -Itools/clang/lib/StaticAnalyzer/Checkers -I/Users/buildslave/jenkins/workspace/lldb-cmake/llvm-project/clang/lib/StaticAnalyzer/Checkers -I/Users/buildslave/jenkins/workspace/lldb-cmake/llvm-project/clang/include -Itools/clang/include -I/Applications/Xcode.app/Contents/Developer/Platforms/MacOSX.platform/Developer/SDKs/MacOSX10.14.sdk/usr/include/libxml2 -Iinclude -I/Users/buildslave/jenkins/workspace/lldb-cmake/llvm-project/llvm/include -Wdocumentation -fPIC -fvisibility-inlines-hidden -Werror=date-time -Werror=unguarded-availability-new -fmodules -fmodules-cache-path=/Users/buildslave/jenkins/workspace/lldb-cmake/lldb-build/module.cache -fcxx-modules -Wall -Wextra -Wno-unused-parameter -Wwrite-strings -Wcast-qual -Wmissing-field-initializers -pedantic -Wno-long-long -Wimplicit-fallthrough -Wcovered-switch-default -Wno-noexcept-type -Wnon-virtual-dtor -Wdelete-non-virtual-dtor -Wstring-conversion -fdiagnostics-color -fno-common -Woverloaded-virtual -Wno-nested-anon-types -O3 -isysroot /Applications/Xcode.app/Contents/Developer/Platforms/MacOSX.platform/Developer/SDKs/MacOSX10.14.sdk -UNDEBUG -fno-exceptions -fno-rtti -std=c++14 -MD -MT tools/clang/lib/StaticAnalyzer/Checkers/CMakeFiles/obj.clangStaticAnalyzerCheckers.dir/LocalizationChecker.cpp.o -MF tools/clang/lib/StaticAnalyzer/Checkers/CMakeFiles/obj.clangStaticAnalyzerCheckers.dir/LocalizationChecker.cpp.o.d -o tools/clang/lib/StaticAnalyzer/Checkers/CMakeFiles/obj.clangStaticAnalyzerCheckers.dir/LocalizationChecker.cpp.o -c /Users/buildslave/jenkins/workspace/lldb-cmake/llvm-project/clang/lib/StaticAnalyzer/Checkers/LocalizationChecker.cpp [667/678] /Users/buildslave/jenkins/workspace/lldb-cmake/host-compiler/bin/clang++ -DGTEST_HAS_RTTI=0 -D_DEBUG -D_GNU_SOURCE -D__STDC_CONSTANT_MACROS -D__STDC_FORMAT_MACROS -D__STDC_LIMIT_MACROS -Itools/clang/lib/StaticAnalyzer/Checkers -I/Users/buildslave/jenkins/workspace/lldb-cmake/llvm-project/clang/lib/StaticAnalyzer/Checkers -I/Users/buildslave/jenkins/workspace/lldb-cmake/llvm-project/clang/include -Itools/clang/include -I/Applications/Xcode.app/Contents/Developer/Platforms/MacOSX.platform/Developer/SDKs/MacOSX10.14.sdk/usr/include/libxml2 -Iinclude -I/Users/buildslave/jenkins/workspace/lldb-cmake/llvm-project/llvm/include -Wdocumentation -fPIC -fvisibility-inlines-hidden -Werror=date-time -Werror=unguarded-availability-new -fmodules -fmodules-cache-path=/Users/buildslave/jenkins/workspace/lldb-cmake/lldb-build/module.cache -fcxx-modules -Wall -Wextra -Wno-unused-parameter -Wwrite-strings -Wcast-qual -Wmissing-field-initializers -pedantic -Wno-long-long -Wimplicit-fallthrough -Wcovered-switch-default -Wno-noexcept-type -Wnon-virtual-dtor -Wdelete-non-virtual-dtor -Wstring-conversion -fdiagnostics-color -fno-common -Woverloaded-virtual -Wno-nested-anon-types -O3 -isysroot /Applications/Xcode.app/Contents/Developer/Platforms/MacOSX.platform/Developer/SDKs/MacOSX10.14.sdk -UNDEBUG -fno-exceptions -fno-rtti -std=c++14 -MD -MT tools/clang/lib/StaticAnalyzer/Checkers/CMakeFiles/obj.clangStaticAnalyzerCheckers.dir/PaddingChecker.cpp.o -MF tools/clang/lib/StaticAnalyzer/Checkers/CMakeFiles/obj.clangStaticAnalyzerCheckers.dir/PaddingChecker.cpp.o.d -o tools/clang/lib/StaticAnalyzer/Checkers/CMakeFiles/obj.clangStaticAnalyzerCheckers.dir/PaddingChecker.cpp.o -c /Users/buildslave/jenkins/workspace/lldb-cmake/llvm-project/clang/lib/StaticAnalyzer/Checkers/PaddingChecker.cpp [668/678] : && "/Applications/Xcode.app/Contents/Developer/Toolchains/XcodeDefault.xctoolchain/usr/bin/libtool" -static -no_warning_for_no_symbols -o lib/libclangStaticAnalyzerCheckers.a tools/clang/lib/StaticAnalyzer/Checkers/CMakeFiles/obj.clangStaticAnalyzerCheckers.dir/AnalysisOrderChecker.cpp.o tools/clang/lib/StaticAnalyzer/Checkers/CMakeFiles/obj.clangStaticAnalyzerCheckers.dir/AnalyzerStatsChecker.cpp.o tools/clang/lib/StaticAnalyzer/Checkers/CMakeFiles/obj.clangStaticAnalyzerCheckers.dir/ArrayBoundChecker.cpp.o tools/clang/lib/StaticAnalyzer/Checkers/CMakeFiles/obj.clangStaticAnalyzerCheckers.dir/ArrayBoundCheckerV2.cpp.o tools/clang/lib/StaticAnalyzer/Checkers/CMakeFiles/obj.clangStaticAnalyzerCheckers.dir/BasicObjCFoundationChecks.cpp.o tools/clang/lib/StaticAnalyzer/Checkers/CMakeFiles/obj.clangStaticAnalyzerCheckers.dir/BlockInCriticalSectionChecker.cpp.o tools/clang/lib/StaticAnalyzer/Checkers/CMakeFiles/obj.clangStaticAnalyzerCheckers.dir/BoolAssignmentChecker.cpp.o tools/clang/lib/StaticAnalyzer/Checkers/CMakeFiles/obj.clangStaticAnalyzerCheckers.dir/BuiltinFunctionChecker.cpp.o tools/clang/lib/StaticAnalyzer/Checkers/CMakeFiles/obj.clangStaticAnalyzerCheckers.dir/CStringChecker.cpp.o tools/clang/lib/StaticAnalyzer/Checkers/CMakeFiles/obj.clangStaticAnalyzerCheckers.dir/CStringSyntaxChecker.cpp.o tools/clang/lib/StaticAnalyzer/Checkers/CMakeFiles/obj.clangStaticAnalyzerCheckers.dir/CallAndMessageChecker.cpp.o tools/clang/lib/StaticAnalyzer/Checkers/CMakeFiles/obj.clangStaticAnalyzerCheckers.dir/CastSizeChecker.cpp.o tools/clang/lib/StaticAnalyzer/Checkers/CMakeFiles/obj.clangStaticAnalyzerCheckers.dir/CastToStructChecker.cpp.o tools/clang/lib/StaticAnalyzer/Checkers/CMakeFiles/obj.clangStaticAnalyzerCheckers.dir/CastValueChecker.cpp.o tools/clang/lib/StaticAnalyzer/Checkers/CMakeFiles/obj.clangStaticAnalyzerCheckers.dir/CheckObjCDealloc.cpp.o tools/clang/lib/StaticAnalyzer/Checkers/CMakeFiles/obj.clangStaticAnalyzerCheckers.dir/CheckObjCInstMethSignature.cpp.o tools/clang/lib/StaticAnalyzer/Checkers/CMakeFiles/obj.clangStaticAnalyzerCheckers.dir/CheckSecuritySyntaxOnly.cpp.o tools/clang/lib/StaticAnalyzer/Checkers/CMakeFiles/obj.clangStaticAnalyzerCheckers.dir/CheckSizeofPointer.cpp.o tools/clang/lib/StaticAnalyzer/Checkers/CMakeFiles/obj.clangStaticAnalyzerCheckers.dir/CheckerDocumentation.cpp.o tools/clang/lib/StaticAnalyzer/Checkers/CMakeFiles/obj.clangStaticAnalyzerCheckers.dir/ChrootChecker.cpp.o tools/clang/lib/StaticAnalyzer/Checkers/CMakeFiles/obj.clangStaticAnalyzerCheckers.dir/CloneChecker.cpp.o tools/clang/lib/StaticAnalyzer/Checkers/CMakeFiles/obj.clangStaticAnalyzerCheckers.dir/ConversionChecker.cpp.o tools/clang/lib/StaticAnalyzer/Checkers/CMakeFiles/obj.clangStaticAnalyzerCheckers.dir/CXXSelfAssignmentChecker.cpp.o tools/clang/lib/StaticAnalyzer/Checkers/CMakeFiles/obj.clangStaticAnalyzerCheckers.dir/DeadStoresChecker.cpp.o tools/clang/lib/StaticAnalyzer/Checkers/CMakeFiles/obj.clangStaticAnalyzerCheckers.dir/DebugCheckers.cpp.o tools/clang/lib/StaticAnalyzer/Checkers/CMakeFiles/obj.clangStaticAnalyzerCheckers.dir/DeleteWithNonVirtualDtorChecker.cpp.o tools/clang/lib/StaticAnalyzer/Checkers/CMakeFiles/obj.clangStaticAnalyzerCheckers.dir/DereferenceChecker.cpp.o tools/clang/lib/StaticAnalyzer/Checkers/CMakeFiles/obj.clangStaticAnalyzerCheckers.dir/DirectIvarAssignment.cpp.o tools/clang/lib/StaticAnalyzer/Checkers/CMakeFiles/obj.clangStaticAnalyzerCheckers.dir/DivZeroChecker.cpp.o tools/clang/lib/StaticAnalyzer/Checkers/CMakeFiles/obj.clangStaticAnalyzerCheckers.dir/DynamicTypePropagation.cpp.o tools/clang/lib/StaticAnalyzer/Checkers/CMakeFiles/obj.clangStaticAnalyzerCheckers.dir/DynamicTypeChecker.cpp.o tools/clang/lib/StaticAnalyzer/Checkers/CMakeFiles/obj.clangStaticAnalyzerCheckers.dir/EnumCastOutOfRangeChecker.cpp.o tools/clang/lib/StaticAnalyzer/Checkers/CMakeFiles/obj.clangStaticAnalyzerCheckers.dir/ExprInspectionChecker.cpp.o tools/clang/lib/StaticAnalyzer/Checkers/CMakeFiles/obj.clangStaticAnalyzerCheckers.dir/FixedAddressChecker.cpp.o tools/clang/lib/StaticAnalyzer/Checkers/CMakeFiles/obj.clangStaticAnalyzerCheckers.dir/GCDAntipatternChecker.cpp.o tools/clang/lib/StaticAnalyzer/Checkers/CMakeFiles/obj.clangStaticAnalyzerCheckers.dir/GenericTaintChecker.cpp.o tools/clang/lib/StaticAnalyzer/Checkers/CMakeFiles/obj.clangStaticAnalyzerCheckers.dir/GTestChecker.cpp.o tools/clang/lib/StaticAnalyzer/Checkers/CMakeFiles/obj.clangStaticAnalyzerCheckers.dir/IdenticalExprChecker.cpp.o tools/clang/lib/StaticAnalyzer/Checkers/CMakeFiles/obj.clangStaticAnalyzerCheckers.dir/InnerPointerChecker.cpp.o tools/clang/lib/StaticAnalyzer/Checkers/CMakeFiles/obj.clangStaticAnalyzerCheckers.dir/IteratorChecker.cpp.o tools/clang/lib/StaticAnalyzer/Checkers/CMakeFiles/obj.clangStaticAnalyzerCheckers.dir/IvarInvalidationChecker.cpp.o tools/clang/lib/StaticAnalyzer/Checkers/CMakeFiles/obj.clangStaticAnalyzerCheckers.dir/LLVMConventionsChecker.cpp.o tools/clang/lib/StaticAnalyzer/Checkers/CMakeFiles/obj.clangStaticAnalyzerCheckers.dir/LocalizationChecker.cpp.o tools/clang/lib/StaticAnalyzer/Checkers/CMakeFiles/obj.clangStaticAnalyzerCheckers.dir/MacOSKeychainAPIChecker.cpp.o tools/clang/lib/StaticAnalyzer/Checkers/CMakeFiles/obj.clangStaticAnalyzerCheckers.dir/MacOSXAPIChecker.cpp.o tools/clang/lib/StaticAnalyzer/Checkers/CMakeFiles/obj.clangStaticAnalyzerCheckers.dir/MallocChecker.cpp.o tools/clang/lib/StaticAnalyzer/Checkers/CMakeFiles/obj.clangStaticAnalyzerCheckers.dir/MallocOverflowSecurityChecker.cpp.o tools/clang/lib/StaticAnalyzer/Checkers/CMakeFiles/obj.clangStaticAnalyzerCheckers.dir/MallocSizeofChecker.cpp.o tools/clang/lib/StaticAnalyzer/Checkers/CMakeFiles/obj.clangStaticAnalyzerCheckers.dir/MmapWriteExecChecker.cpp.o tools/clang/lib/StaticAnalyzer/Checkers/CMakeFiles/obj.clangStaticAnalyzerCheckers.dir/MIGChecker.cpp.o tools/clang/lib/StaticAnalyzer/Checkers/CMakeFiles/obj.clangStaticAnalyzerCheckers.dir/MoveChecker.cpp.o tools/clang/lib/StaticAnalyzer/Checkers/CMakeFiles/obj.clangStaticAnalyzerCheckers.dir/MPI-Checker/MPIBugReporter.cpp.o tools/clang/lib/StaticAnalyzer/Checkers/CMakeFiles/obj.clangStaticAnalyzerCheckers.dir/MPI-Checker/MPIChecker.cpp.o tools/clang/lib/StaticAnalyzer/Checkers/CMakeFiles/obj.clangStaticAnalyzerCheckers.dir/MPI-Checker/MPIFunctionClassifier.cpp.o tools/clang/lib/StaticAnalyzer/Checkers/CMakeFiles/obj.clangStaticAnalyzerCheckers.dir/NSAutoreleasePoolChecker.cpp.o tools/clang/lib/StaticAnalyzer/Checkers/CMakeFiles/obj.clangStaticAnalyzerCheckers.dir/NSErrorChecker.cpp.o tools/clang/lib/StaticAnalyzer/Checkers/CMakeFiles/obj.clangStaticAnalyzerCheckers.dir/NoReturnFunctionChecker.cpp.o tools/clang/lib/StaticAnalyzer/Checkers/CMakeFiles/obj.clangStaticAnalyzerCheckers.dir/NonNullParamChecker.cpp.o tools/clang/lib/StaticAnalyzer/Checkers/CMakeFiles/obj.clangStaticAnalyzerCheckers.dir/NonnullGlobalConstantsChecker.cpp.o tools/clang/lib/StaticAnalyzer/Checkers/CMakeFiles/obj.clangStaticAnalyzerCheckers.dir/NullabilityChecker.cpp.o tools/clang/lib/StaticAnalyzer/Checkers/CMakeFiles/obj.clangStaticAnalyzerCheckers.dir/NumberObjectConversionChecker.cpp.o tools/clang/lib/StaticAnalyzer/Checkers/CMakeFiles/obj.clangStaticAnalyzerCheckers.dir/ObjCAtSyncChecker.cpp.o tools/clang/lib/StaticAnalyzer/Checkers/CMakeFiles/obj.clangStaticAnalyzerCheckers.dir/ObjCAutoreleaseWriteChecker.cpp.o tools/clang/lib/StaticAnalyzer/Checkers/CMakeFiles/obj.clangStaticAnalyzerCheckers.dir/ObjCContainersASTChecker.cpp.o tools/clang/lib/StaticAnalyzer/Checkers/CMakeFiles/obj.clangStaticAnalyzerCheckers.dir/ObjCContainersChecker.cpp.o tools/clang/lib/StaticAnalyzer/Checkers/CMakeFiles/obj.clangStaticAnalyzerCheckers.dir/ObjCMissingSuperCallChecker.cpp.o tools/clang/lib/StaticAnalyzer/Checkers/CMakeFiles/obj.clangStaticAnalyzerCheckers.dir/ObjCPropertyChecker.cpp.o tools/clang/lib/StaticAnalyzer/Checkers/CMakeFiles/obj.clangStaticAnalyzerCheckers.dir/ObjCSelfInitChecker.cpp.o tools/clang/lib/StaticAnalyzer/Checkers/CMakeFiles/obj.clangStaticAnalyzerCheckers.dir/ObjCSuperDeallocChecker.cpp.o tools/clang/lib/StaticAnalyzer/Checkers/CMakeFiles/obj.clangStaticAnalyzerCheckers.dir/ObjCUnusedIVarsChecker.cpp.o tools/clang/lib/StaticAnalyzer/Checkers/CMakeFiles/obj.clangStaticAnalyzerCheckers.dir/OSObjectCStyleCast.cpp.o tools/clang/lib/StaticAnalyzer/Checkers/CMakeFiles/obj.clangStaticAnalyzerCheckers.dir/PaddingChecker.cpp.o tools/clang/lib/StaticAnalyzer/Checkers/CMakeFiles/obj.clangStaticAnalyzerCheckers.dir/PointerArithChecker.cpp.o tools/clang/lib/StaticAnalyzer/Checkers/CMakeFiles/obj.clangStaticAnalyzerCheckers.dir/PointerIterationChecker.cpp.o tools/clang/lib/StaticAnalyzer/Checkers/CMakeFiles/obj.clangStaticAnalyzerCheckers.dir/PointerSortingChecker.cpp.o tools/clang/lib/StaticAnalyzer/Checkers/CMakeFiles/obj.clangStaticAnalyzerCheckers.dir/PointerSubChecker.cpp.o tools/clang/lib/StaticAnalyzer/Checkers/CMakeFiles/obj.clangStaticAnalyzerCheckers.dir/PthreadLockChecker.cpp.o tools/clang/lib/StaticAnalyzer/Checkers/CMakeFiles/obj.clangStaticAnalyzerCheckers.dir/RetainCountChecker/RetainCountChecker.cpp.o tools/clang/lib/StaticAnalyzer/Checkers/CMakeFiles/obj.clangStaticAnalyzerCheckers.dir/RetainCountChecker/RetainCountDiagnostics.cpp.o tools/clang/lib/StaticAnalyzer/Checkers/CMakeFiles/obj.clangStaticAnalyzerCheckers.dir/ReturnPointerRangeChecker.cpp.o tools/clang/lib/StaticAnalyzer/Checkers/CMakeFiles/obj.clangStaticAnalyzerCheckers.dir/ReturnUndefChecker.cpp.o tools/clang/lib/StaticAnalyzer/Checkers/CMakeFiles/obj.clangStaticAnalyzerCheckers.dir/ReturnValueChecker.cpp.o tools/clang/lib/StaticAnalyzer/Checkers/CMakeFiles/obj.clangStaticAnalyzerCheckers.dir/RunLoopAutoreleaseLeakChecker.cpp.o tools/clang/lib/StaticAnalyzer/Checkers/CMakeFiles/obj.clangStaticAnalyzerCheckers.dir/SimpleStreamChecker.cpp.o tools/clang/lib/StaticAnalyzer/Checkers/CMakeFiles/obj.clangStaticAnalyzerCheckers.dir/SmartPtrModeling.cpp.o tools/clang/lib/StaticAnalyzer/Checkers/CMakeFiles/obj.clangStaticAnalyzerCheckers.dir/StackAddrEscapeChecker.cpp.o tools/clang/lib/StaticAnalyzer/Checkers/CMakeFiles/obj.clangStaticAnalyzerCheckers.dir/StdLibraryFunctionsChecker.cpp.o tools/clang/lib/StaticAnalyzer/Checkers/CMakeFiles/obj.clangStaticAnalyzerCheckers.dir/StreamChecker.cpp.o tools/clang/lib/StaticAnalyzer/Checkers/CMakeFiles/obj.clangStaticAnalyzerCheckers.dir/Taint.cpp.o tools/clang/lib/StaticAnalyzer/Checkers/CMakeFiles/obj.clangStaticAnalyzerCheckers.dir/TaintTesterChecker.cpp.o tools/clang/lib/StaticAnalyzer/Checkers/CMakeFiles/obj.clangStaticAnalyzerCheckers.dir/TestAfterDivZeroChecker.cpp.o tools/clang/lib/StaticAnalyzer/Checkers/CMakeFiles/obj.clangStaticAnalyzerCheckers.dir/TraversalChecker.cpp.o tools/clang/lib/StaticAnalyzer/Checkers/CMakeFiles/obj.clangStaticAnalyzerCheckers.dir/TrustNonnullChecker.cpp.o tools/clang/lib/StaticAnalyzer/Checkers/CMakeFiles/obj.clangStaticAnalyzerCheckers.dir/UndefBranchChecker.cpp.o tools/clang/lib/StaticAnalyzer/Checkers/CMakeFiles/obj.clangStaticAnalyzerCheckers.dir/UndefCapturedBlockVarChecker.cpp.o tools/clang/lib/StaticAnalyzer/Checkers/CMakeFiles/obj.clangStaticAnalyzerCheckers.dir/UndefResultChecker.cpp.o tools/clang/lib/StaticAnalyzer/Checkers/CMakeFiles/obj.clangStaticAnalyzerCheckers.dir/UndefinedArraySubscriptChecker.cpp.o tools/clang/lib/StaticAnalyzer/Checkers/CMakeFiles/obj.clangStaticAnalyzerCheckers.dir/UndefinedAssignmentChecker.cpp.o tools/clang/lib/StaticAnalyzer/Checkers/CMakeFiles/obj.clangStaticAnalyzerCheckers.dir/UninitializedObject/UninitializedObjectChecker.cpp.o tools/clang/lib/StaticAnalyzer/Checkers/CMakeFiles/obj.clangStaticAnalyzerCheckers.dir/UninitializedObject/UninitializedPointee.cpp.o tools/clang/lib/StaticAnalyzer/Checkers/CMakeFiles/obj.clangStaticAnalyzerCheckers.dir/UnixAPIChecker.cpp.o tools/clang/lib/StaticAnalyzer/Checkers/CMakeFiles/obj.clangStaticAnalyzerCheckers.dir/UnreachableCodeChecker.cpp.o tools/clang/lib/StaticAnalyzer/Checkers/CMakeFiles/obj.clangStaticAnalyzerCheckers.dir/VforkChecker.cpp.o tools/clang/lib/StaticAnalyzer/Checkers/CMakeFiles/obj.clangStaticAnalyzerCheckers.dir/VLASizeChecker.cpp.o tools/clang/lib/StaticAnalyzer/Checkers/CMakeFiles/obj.clangStaticAnalyzerCheckers.dir/ValistChecker.cpp.o tools/clang/lib/StaticAnalyzer/Checkers/CMakeFiles/obj.clangStaticAnalyzerCheckers.dir/VirtualCallChecker.cpp.o && : [669/678] /Users/buildslave/jenkins/workspace/lldb-cmake/host-compiler/bin/clang++ -DGTEST_HAS_RTTI=0 -D_DEBUG -D_GNU_SOURCE -D__STDC_CONSTANT_MACROS -D__STDC_FORMAT_MACROS -D__STDC_LIMIT_MACROS -Itools/clang/lib/Format -I/Users/buildslave/jenkins/workspace/lldb-cmake/llvm-project/clang/lib/Format -I/Users/buildslave/jenkins/workspace/lldb-cmake/llvm-project/clang/include -Itools/clang/include -I/Applications/Xcode.app/Contents/Developer/Platforms/MacOSX.platform/Developer/SDKs/MacOSX10.14.sdk/usr/include/libxml2 -Iinclude -I/Users/buildslave/jenkins/workspace/lldb-cmake/llvm-project/llvm/include -Wdocumentation -fPIC -fvisibility-inlines-hidden -Werror=date-time -Werror=unguarded-availability-new -fmodules -fmodules-cache-path=/Users/buildslave/jenkins/workspace/lldb-cmake/lldb-build/module.cache -fcxx-modules -Wall -Wextra -Wno-unused-parameter -Wwrite-strings -Wcast-qual -Wmissing-field-initializers -pedantic -Wno-long-long -Wimplicit-fallthrough -Wcovered-switch-default -Wno-noexcept-type -Wnon-virtual-dtor -Wdelete-non-virtual-dtor -Wstring-conversion -fdiagnostics-color -fno-common -Woverloaded-virtual -Wno-nested-anon-types -O3 -isysroot /Applications/Xcode.app/Contents/Developer/Platforms/MacOSX.platform/Developer/SDKs/MacOSX10.14.sdk -UNDEBUG -fno-exceptions -fno-rtti -std=c++14 -MD -MT tools/clang/lib/Format/CMakeFiles/obj.clangFormat.dir/Format.cpp.o -MF tools/clang/lib/Format/CMakeFiles/obj.clangFormat.dir/Format.cpp.o.d -o tools/clang/lib/Format/CMakeFiles/obj.clangFormat.dir/Format.cpp.o -c /Users/buildslave/jenkins/workspace/lldb-cmake/llvm-project/clang/lib/Format/Format.cpp [670/678] : && "/Applications/Xcode.app/Contents/Developer/Toolchains/XcodeDefault.xctoolchain/usr/bin/libtool" -static -no_warning_for_no_symbols -o lib/libclangFormat.a tools/clang/lib/Format/CMakeFiles/obj.clangFormat.dir/AffectedRangeManager.cpp.o tools/clang/lib/Format/CMakeFiles/obj.clangFormat.dir/BreakableToken.cpp.o tools/clang/lib/Format/CMakeFiles/obj.clangFormat.dir/ContinuationIndenter.cpp.o tools/clang/lib/Format/CMakeFiles/obj.clangFormat.dir/Format.cpp.o tools/clang/lib/Format/CMakeFiles/obj.clangFormat.dir/FormatToken.cpp.o tools/clang/lib/Format/CMakeFiles/obj.clangFormat.dir/FormatTokenLexer.cpp.o tools/clang/lib/Format/CMakeFiles/obj.clangFormat.dir/NamespaceEndCommentsFixer.cpp.o tools/clang/lib/Format/CMakeFiles/obj.clangFormat.dir/SortJavaScriptImports.cpp.o tools/clang/lib/Format/CMakeFiles/obj.clangFormat.dir/TokenAnalyzer.cpp.o tools/clang/lib/Format/CMakeFiles/obj.clangFormat.dir/TokenAnnotator.cpp.o tools/clang/lib/Format/CMakeFiles/obj.clangFormat.dir/UnwrappedLineFormatter.cpp.o tools/clang/lib/Format/CMakeFiles/obj.clangFormat.dir/UnwrappedLineParser.cpp.o tools/clang/lib/Format/CMakeFiles/obj.clangFormat.dir/UsingDeclarationsSorter.cpp.o tools/clang/lib/Format/CMakeFiles/obj.clangFormat.dir/WhitespaceManager.cpp.o && : [671/678] /Users/buildslave/jenkins/workspace/lldb-cmake/host-compiler/bin/clang++ -DGTEST_HAS_RTTI=0 -D_DEBUG -D_GNU_SOURCE -D__STDC_CONSTANT_MACROS -D__STDC_FORMAT_MACROS -D__STDC_LIMIT_MACROS -Itools/clang/tools/driver -I/Users/buildslave/jenkins/workspace/lldb-cmake/llvm-project/clang/tools/driver -I/Users/buildslave/jenkins/workspace/lldb-cmake/llvm-project/clang/include -Itools/clang/include -I/Applications/Xcode.app/Contents/Developer/Platforms/MacOSX.platform/Developer/SDKs/MacOSX10.14.sdk/usr/include/libxml2 -Iinclude -I/Users/buildslave/jenkins/workspace/lldb-cmake/llvm-project/llvm/include -Wdocumentation -fPIC -fvisibility-inlines-hidden -Werror=date-time -Werror=unguarded-availability-new -fmodules -fmodules-cache-path=/Users/buildslave/jenkins/workspace/lldb-cmake/lldb-build/module.cache -fcxx-modules -Wall -Wextra -Wno-unused-parameter -Wwrite-strings -Wcast-qual -Wmissing-field-initializers -pedantic -Wno-long-long -Wimplicit-fallthrough -Wcovered-switch-default -Wno-noexcept-type -Wnon-virtual-dtor -Wdelete-non-virtual-dtor -Wstring-conversion -fdiagnostics-color -fno-common -Woverloaded-virtual -Wno-nested-anon-types -O3 -isysroot /Applications/Xcode.app/Contents/Developer/Platforms/MacOSX.platform/Developer/SDKs/MacOSX10.14.sdk -UNDEBUG -fno-exceptions -fno-rtti -std=c++14 -MD -MT tools/clang/tools/driver/CMakeFiles/clang.dir/driver.cpp.o -MF tools/clang/tools/driver/CMakeFiles/clang.dir/driver.cpp.o.d -o tools/clang/tools/driver/CMakeFiles/clang.dir/driver.cpp.o -c /Users/buildslave/jenkins/workspace/lldb-cmake/llvm-project/clang/tools/driver/driver.cpp [672/678] /Users/buildslave/jenkins/workspace/lldb-cmake/host-compiler/bin/clang++ -DGTEST_HAS_RTTI=0 -D_DEBUG -D_GNU_SOURCE -D__STDC_CONSTANT_MACROS -D__STDC_FORMAT_MACROS -D__STDC_LIMIT_MACROS -Itools/clang/tools/driver -I/Users/buildslave/jenkins/workspace/lldb-cmake/llvm-project/clang/tools/driver -I/Users/buildslave/jenkins/workspace/lldb-cmake/llvm-project/clang/include -Itools/clang/include -I/Applications/Xcode.app/Contents/Developer/Platforms/MacOSX.platform/Developer/SDKs/MacOSX10.14.sdk/usr/include/libxml2 -Iinclude -I/Users/buildslave/jenkins/workspace/lldb-cmake/llvm-project/llvm/include -Wdocumentation -fPIC -fvisibility-inlines-hidden -Werror=date-time -Werror=unguarded-availability-new -fmodules -fmodules-cache-path=/Users/buildslave/jenkins/workspace/lldb-cmake/lldb-build/module.cache -fcxx-modules -Wall -Wextra -Wno-unused-parameter -Wwrite-strings -Wcast-qual -Wmissing-field-initializers -pedantic -Wno-long-long -Wimplicit-fallthrough -Wcovered-switch-default -Wno-noexcept-type -Wnon-virtual-dtor -Wdelete-non-virtual-dtor -Wstring-conversion -fdiagnostics-color -fno-common -Woverloaded-virtual -Wno-nested-anon-types -O3 -isysroot /Applications/Xcode.app/Contents/Developer/Platforms/MacOSX.platform/Developer/SDKs/MacOSX10.14.sdk -UNDEBUG -fno-exceptions -fno-rtti -std=c++14 -MD -MT tools/clang/tools/driver/CMakeFiles/clang.dir/cc1_main.cpp.o -MF tools/clang/tools/driver/CMakeFiles/clang.dir/cc1_main.cpp.o.d -o tools/clang/tools/driver/CMakeFiles/clang.dir/cc1_main.cpp.o -c /Users/buildslave/jenkins/workspace/lldb-cmake/llvm-project/clang/tools/driver/cc1_main.cpp [673/678] /Users/buildslave/jenkins/workspace/lldb-cmake/host-compiler/bin/clang++ -DGTEST_HAS_RTTI=0 -D_DEBUG -D_GNU_SOURCE -D__STDC_CONSTANT_MACROS -D__STDC_FORMAT_MACROS -D__STDC_LIMIT_MACROS -Itools/clang/tools/driver -I/Users/buildslave/jenkins/workspace/lldb-cmake/llvm-project/clang/tools/driver -I/Users/buildslave/jenkins/workspace/lldb-cmake/llvm-project/clang/include -Itools/clang/include -I/Applications/Xcode.app/Contents/Developer/Platforms/MacOSX.platform/Developer/SDKs/MacOSX10.14.sdk/usr/include/libxml2 -Iinclude -I/Users/buildslave/jenkins/workspace/lldb-cmake/llvm-project/llvm/include -Wdocumentation -fPIC -fvisibility-inlines-hidden -Werror=date-time -Werror=unguarded-availability-new -fmodules -fmodules-cache-path=/Users/buildslave/jenkins/workspace/lldb-cmake/lldb-build/module.cache -fcxx-modules -Wall -Wextra -Wno-unused-parameter -Wwrite-strings -Wcast-qual -Wmissing-field-initializers -pedantic -Wno-long-long -Wimplicit-fallthrough -Wcovered-switch-default -Wno-noexcept-type -Wnon-virtual-dtor -Wdelete-non-virtual-dtor -Wstring-conversion -fdiagnostics-color -fno-common -Woverloaded-virtual -Wno-nested-anon-types -O3 -isysroot /Applications/Xcode.app/Contents/Developer/Platforms/MacOSX.platform/Developer/SDKs/MacOSX10.14.sdk -UNDEBUG -fno-exceptions -fno-rtti -std=c++14 -MD -MT tools/clang/tools/driver/CMakeFiles/clang.dir/cc1as_main.cpp.o -MF tools/clang/tools/driver/CMakeFiles/clang.dir/cc1as_main.cpp.o.d -o tools/clang/tools/driver/CMakeFiles/clang.dir/cc1as_main.cpp.o -c /Users/buildslave/jenkins/workspace/lldb-cmake/llvm-project/clang/tools/driver/cc1as_main.cpp [674/678] /Users/buildslave/jenkins/workspace/lldb-cmake/host-compiler/bin/clang++ -DGTEST_HAS_RTTI=0 -D_DEBUG -D_GNU_SOURCE -D__STDC_CONSTANT_MACROS -D__STDC_FORMAT_MACROS -D__STDC_LIMIT_MACROS -Itools/clang/lib/StaticAnalyzer/Frontend -I/Users/buildslave/jenkins/workspace/lldb-cmake/llvm-project/clang/lib/StaticAnalyzer/Frontend -I/Users/buildslave/jenkins/workspace/lldb-cmake/llvm-project/clang/include -Itools/clang/include -I/Applications/Xcode.app/Contents/Developer/Platforms/MacOSX.platform/Developer/SDKs/MacOSX10.14.sdk/usr/include/libxml2 -Iinclude -I/Users/buildslave/jenkins/workspace/lldb-cmake/llvm-project/llvm/include -Itools/clang/lib/StaticAnalyzer/Frontend/../Checkers -Wdocumentation -fPIC -fvisibility-inlines-hidden -Werror=date-time -Werror=unguarded-availability-new -fmodules -fmodules-cache-path=/Users/buildslave/jenkins/workspace/lldb-cmake/lldb-build/module.cache -fcxx-modules -Wall -Wextra -Wno-unused-parameter -Wwrite-strings -Wcast-qual -Wmissing-field-initializers -pedantic -Wno-long-long -Wimplicit-fallthrough -Wcovered-switch-default -Wno-noexcept-type -Wnon-virtual-dtor -Wdelete-non-virtual-dtor -Wstring-conversion -fdiagnostics-color -fno-common -Woverloaded-virtual -Wno-nested-anon-types -O3 -isysroot /Applications/Xcode.app/Contents/Developer/Platforms/MacOSX.platform/Developer/SDKs/MacOSX10.14.sdk -UNDEBUG -fno-exceptions -fno-rtti -std=c++14 -MD -MT tools/clang/lib/StaticAnalyzer/Frontend/CMakeFiles/obj.clangStaticAnalyzerFrontend.dir/AnalysisConsumer.cpp.o -MF tools/clang/lib/StaticAnalyzer/Frontend/CMakeFiles/obj.clangStaticAnalyzerFrontend.dir/AnalysisConsumer.cpp.o.d -o tools/clang/lib/StaticAnalyzer/Frontend/CMakeFiles/obj.clangStaticAnalyzerFrontend.dir/AnalysisConsumer.cpp.o -c /Users/buildslave/jenkins/workspace/lldb-cmake/llvm-project/clang/lib/StaticAnalyzer/Frontend/AnalysisConsumer.cpp [675/678] : && "/Applications/Xcode.app/Contents/Developer/Toolchains/XcodeDefault.xctoolchain/usr/bin/libtool" -static -no_warning_for_no_symbols -o lib/libclangStaticAnalyzerFrontend.a tools/clang/lib/StaticAnalyzer/Frontend/CMakeFiles/obj.clangStaticAnalyzerFrontend.dir/AnalysisConsumer.cpp.o tools/clang/lib/StaticAnalyzer/Frontend/CMakeFiles/obj.clangStaticAnalyzerFrontend.dir/CheckerRegistration.cpp.o tools/clang/lib/StaticAnalyzer/Frontend/CMakeFiles/obj.clangStaticAnalyzerFrontend.dir/CheckerRegistry.cpp.o tools/clang/lib/StaticAnalyzer/Frontend/CMakeFiles/obj.clangStaticAnalyzerFrontend.dir/FrontendActions.cpp.o tools/clang/lib/StaticAnalyzer/Frontend/CMakeFiles/obj.clangStaticAnalyzerFrontend.dir/ModelConsumer.cpp.o tools/clang/lib/StaticAnalyzer/Frontend/CMakeFiles/obj.clangStaticAnalyzerFrontend.dir/ModelInjector.cpp.o && : [676/678] : && /Users/buildslave/jenkins/workspace/lldb-cmake/host-compiler/bin/clang++ -Wdocumentation -fPIC -fvisibility-inlines-hidden -Werror=date-time -Werror=unguarded-availability-new -fmodules -fmodules-cache-path=/Users/buildslave/jenkins/workspace/lldb-cmake/lldb-build/module.cache -fcxx-modules -Wall -Wextra -Wno-unused-parameter -Wwrite-strings -Wcast-qual -Wmissing-field-initializers -pedantic -Wno-long-long -Wimplicit-fallthrough -Wcovered-switch-default -Wno-noexcept-type -Wnon-virtual-dtor -Wdelete-non-virtual-dtor -Wstring-conversion -fdiagnostics-color -fno-common -Woverloaded-virtual -Wno-nested-anon-types -O3 -isysroot /Applications/Xcode.app/Contents/Developer/Platforms/MacOSX.platform/Developer/SDKs/MacOSX10.14.sdk -Wl,-search_paths_first -Wl,-headerpad_max_install_names -rdynamic tools/clang/tools/driver/CMakeFiles/clang.dir/driver.cpp.o tools/clang/tools/driver/CMakeFiles/clang.dir/cc1_main.cpp.o tools/clang/tools/driver/CMakeFiles/clang.dir/cc1as_main.cpp.o tools/clang/tools/driver/CMakeFiles/clang.dir/cc1gen_reproducer_main.cpp.o -o bin/clang-10 -Wl,-rpath,@loader_path/../lib lib/libLLVMAArch64CodeGen.a lib/libLLVMAArch64AsmParser.a lib/libLLVMAArch64Desc.a lib/libLLVMAArch64Disassembler.a lib/libLLVMAArch64Info.a lib/libLLVMAArch64Utils.a lib/libLLVMAMDGPUCodeGen.a lib/libLLVMAMDGPUAsmParser.a lib/libLLVMAMDGPUDesc.a lib/libLLVMAMDGPUDisassembler.a lib/libLLVMAMDGPUInfo.a lib/libLLVMAMDGPUUtils.a lib/libLLVMARMCodeGen.a lib/libLLVMARMAsmParser.a lib/libLLVMARMDesc.a lib/libLLVMARMDisassembler.a lib/libLLVMARMInfo.a lib/libLLVMARMUtils.a lib/libLLVMBPFCodeGen.a lib/libLLVMBPFAsmParser.a lib/libLLVMBPFDesc.a lib/libLLVMBPFDisassembler.a lib/libLLVMBPFInfo.a lib/libLLVMHexagonCodeGen.a lib/libLLVMHexagonAsmParser.a lib/libLLVMHexagonDesc.a lib/libLLVMHexagonDisassembler.a lib/libLLVMHexagonInfo.a lib/libLLVMLanaiCodeGen.a lib/libLLVMLanaiAsmParser.a lib/libLLVMLanaiDesc.a lib/libLLVMLanaiDisassembler.a lib/libLLVMLanaiInfo.a lib/libLLVMMipsCodeGen.a lib/libLLVMMipsAsmParser.a lib/libLLVMMipsDesc.a lib/libLLVMMipsDisassembler.a lib/libLLVMMipsInfo.a lib/libLLVMMSP430CodeGen.a lib/libLLVMMSP430AsmParser.a lib/libLLVMMSP430Desc.a lib/libLLVMMSP430Disassembler.a lib/libLLVMMSP430Info.a lib/libLLVMNVPTXCodeGen.a lib/libLLVMNVPTXDesc.a lib/libLLVMNVPTXInfo.a lib/libLLVMPowerPCCodeGen.a lib/libLLVMPowerPCAsmParser.a lib/libLLVMPowerPCDesc.a lib/libLLVMPowerPCDisassembler.a lib/libLLVMPowerPCInfo.a lib/libLLVMRISCVCodeGen.a lib/libLLVMRISCVAsmParser.a lib/libLLVMRISCVDesc.a lib/libLLVMRISCVDisassembler.a lib/libLLVMRISCVInfo.a lib/libLLVMRISCVUtils.a lib/libLLVMSparcCodeGen.a lib/libLLVMSparcAsmParser.a lib/libLLVMSparcDesc.a lib/libLLVMSparcDisassembler.a lib/libLLVMSparcInfo.a lib/libLLVMSystemZCodeGen.a lib/libLLVMSystemZAsmParser.a lib/libLLVMSystemZDesc.a lib/libLLVMSystemZDisassembler.a lib/libLLVMSystemZInfo.a lib/libLLVMWebAssemblyCodeGen.a lib/libLLVMWebAssemblyAsmParser.a lib/libLLVMWebAssemblyDesc.a lib/libLLVMWebAssemblyDisassembler.a lib/libLLVMWebAssemblyInfo.a lib/libLLVMX86CodeGen.a lib/libLLVMX86AsmParser.a lib/libLLVMX86Desc.a lib/libLLVMX86Disassembler.a lib/libLLVMX86Info.a lib/libLLVMX86Utils.a lib/libLLVMXCoreCodeGen.a lib/libLLVMXCoreDesc.a lib/libLLVMXCoreDisassembler.a lib/libLLVMXCoreInfo.a lib/libLLVMAnalysis.a lib/libLLVMCodeGen.a lib/libLLVMCore.a lib/libLLVMipo.a lib/libLLVMAggressiveInstCombine.a lib/libLLVMInstCombine.a lib/libLLVMInstrumentation.a lib/libLLVMMC.a lib/libLLVMMCParser.a lib/libLLVMObjCARCOpts.a lib/libLLVMOption.a lib/libLLVMScalarOpts.a lib/libLLVMSupport.a lib/libLLVMTransformUtils.a lib/libLLVMVectorize.a lib/libclangBasic.a lib/libclangCodeGen.a lib/libclangDriver.a lib/libclangFrontend.a lib/libclangFrontendTool.a lib/libclangSerialization.a -Wl,-sectcreate,__TEXT,__info_plist,/Users/buildslave/jenkins/workspace/lldb-cmake/lldb-build/tools/clang/tools/driver/Info.plist lib/libLLVMAArch64Desc.a lib/libLLVMAArch64Info.a lib/libLLVMAArch64Utils.a lib/libLLVMMIRParser.a lib/libLLVMAMDGPUDesc.a lib/libLLVMAMDGPUInfo.a lib/libLLVMAMDGPUUtils.a lib/libLLVMARMDesc.a lib/libLLVMARMInfo.a lib/libLLVMARMUtils.a lib/libLLVMHexagonDesc.a lib/libLLVMHexagonInfo.a lib/libLLVMLanaiDesc.a lib/libLLVMLanaiInfo.a lib/libLLVMSystemZDesc.a lib/libLLVMSystemZInfo.a lib/libLLVMWebAssemblyDesc.a lib/libLLVMWebAssemblyInfo.a lib/libLLVMCFGuard.a lib/libLLVMGlobalISel.a lib/libLLVMAsmPrinter.a lib/libLLVMDebugInfoDWARF.a lib/libLLVMSelectionDAG.a lib/libLLVMMCDisassembler.a lib/libclangCodeGen.a lib/libLLVMCoroutines.a lib/libLLVMCoverage.a lib/libLLVMLTO.a lib/libLLVMObjCARCOpts.a lib/libLLVMPasses.a lib/libLLVMCodeGen.a lib/libLLVMipo.a lib/libLLVMBitWriter.a lib/libLLVMIRReader.a lib/libLLVMAsmParser.a lib/libLLVMLinker.a lib/libLLVMInstrumentation.a lib/libLLVMScalarOpts.a lib/libLLVMAggressiveInstCombine.a lib/libLLVMInstCombine.a lib/libLLVMVectorize.a lib/libLLVMTransformUtils.a lib/libLLVMTarget.a lib/libLLVMAnalysis.a lib/libLLVMObject.a lib/libLLVMTextAPI.a lib/libclangRewriteFrontend.a lib/libclangARCMigrate.a lib/libclangStaticAnalyzerFrontend.a lib/libclangStaticAnalyzerCheckers.a lib/libclangStaticAnalyzerCore.a lib/libclangCrossTU.a lib/libclangIndex.a lib/libclangFrontend.a lib/libclangDriver.a lib/libLLVMOption.a lib/libLLVMProfileData.a lib/libclangParse.a lib/libLLVMMCParser.a lib/libclangSerialization.a lib/libLLVMBitReader.a lib/libclangSema.a lib/libclangAnalysis.a lib/libclangASTMatchers.a lib/libclangEdit.a lib/libclangFormat.a lib/libclangToolingInclusions.a lib/libclangToolingCore.a lib/libclangAST.a lib/libclangRewrite.a lib/libclangLex.a lib/libclangBasic.a lib/libLLVMCore.a lib/libLLVMRemarks.a lib/libLLVMBitstreamReader.a lib/libLLVMMC.a lib/libLLVMBinaryFormat.a lib/libLLVMDebugInfoCodeView.a lib/libLLVMDebugInfoMSF.a lib/libLLVMSupport.a -lz -lcurses -lm lib/libLLVMDemangle.a && : [677/678] /usr/local/Cellar/cmake/3.12.3/bin/cmake -E cmake_symlink_executable bin/clang-10 bin/clang && cd /Users/buildslave/jenkins/workspace/lldb-cmake/lldb-build/tools/clang/tools/driver && /usr/local/Cellar/cmake/3.12.3/bin/cmake -E create_symlink clang-10 /Users/buildslave/jenkins/workspace/lldb-cmake/lldb-build/./bin/clang++ && cd /Users/buildslave/jenkins/workspace/lldb-cmake/lldb-build/tools/clang/tools/driver && /usr/local/Cellar/cmake/3.12.3/bin/cmake -E create_symlink clang-10 /Users/buildslave/jenkins/workspace/lldb-cmake/lldb-build/./bin/clang-cl && cd /Users/buildslave/jenkins/workspace/lldb-cmake/lldb-build/tools/clang/tools/driver && /usr/local/Cellar/cmake/3.12.3/bin/cmake -E create_symlink clang-10 /Users/buildslave/jenkins/workspace/lldb-cmake/lldb-build/./bin/clang-cpp [677/678] cd /Users/buildslave/jenkins/workspace/lldb-cmake/lldb-build/projects/debuginfo-tests && /usr/local/bin/python /Users/buildslave/jenkins/workspace/lldb-cmake/lldb-build/./bin/llvm-lit -v --time-tests --shuffle --xunit-xml-output=/Users/buildslave/jenkins/workspace/lldb-cmake/test/results.xml -v /Users/buildslave/jenkins/workspace/lldb-cmake/lldb-build/projects/debuginfo-tests -- Testing: 53 tests, 24 workers -- llvm-lit: /Users/buildslave/jenkins/workspace/lldb-cmake/llvm-project/llvm/utils/lit/lit/llvm/config.py:342: note: using clang: /Users/buildslave/jenkins/workspace/lldb-cmake/lldb-build/bin/clang llvm-lit: /Users/buildslave/jenkins/workspace/lldb-cmake/llvm-project/llvm/utils/lit/lit/llvm/config.py:342: note: using clang++: /Users/buildslave/jenkins/workspace/lldb-cmake/lldb-build/bin/clang++ llvm-lit: /Users/buildslave/jenkins/workspace/lldb-cmake/llvm-project/llvm/utils/lit/lit/llvm/config.py:342: note: using clang-cl: /Users/buildslave/jenkins/workspace/lldb-cmake/lldb-build/bin/clang-cl llvm-lit: /Users/buildslave/jenkins/workspace/lldb-cmake/llvm-project/llvm/utils/lit/lit/llvm/config.py:342: note: using lldb: /Users/buildslave/jenkins/workspace/lldb-cmake/lldb-build/bin/lldb llvm-lit: /Users/buildslave/jenkins/workspace/lldb-cmake/llvm-project/llvm/utils/lit/lit/util.py:410: note: using SDKROOT: '/Applications/Xcode.app/Contents/Developer/Platforms/MacOSX.platform/Developer/SDKs/MacOSX10.14.sdk' UNSUPPORTED: debuginfo-tests :: dexter/feature_tests/commands/perfect/expect_watch_value.cpp (1 of 53) UNSUPPORTED: debuginfo-tests :: dexter/feature_tests/commands/perfect/unreachable.cpp (2 of 53) UNSUPPORTED: debuginfo-tests :: dexter-tests/nrvo.cpp (3 of 53) UNSUPPORTED: debuginfo-tests :: dexter/feature_tests/commands/perfect/expect_step_kind/small_loop.cpp (4 of 53) UNSUPPORTED: debuginfo-tests :: dexter/feature_tests/commands/perfect/expect_step_kind/func_external.cpp (5 of 53) UNSUPPORTED: debuginfo-tests :: dexter/feature_tests/commands/perfect/expect_program_state.cpp (6 of 53) UNSUPPORTED: debuginfo-tests :: dexter-tests/global-constant.cpp (7 of 53) UNSUPPORTED: debuginfo-tests :: dexter/feature_tests/commands/penalty/expect_program_state.cpp (8 of 53) UNSUPPORTED: debuginfo-tests :: dexter/feature_tests/commands/penalty/expect_step_order.cpp (9 of 53) UNSUPPORTED: debuginfo-tests :: dexter/feature_tests/commands/perfect/expect_watch_type.cpp (10 of 53) UNSUPPORTED: debuginfo-tests :: llgdb-tests/safestack.c (11 of 53) UNSUPPORTED: debuginfo-tests :: dexter/feature_tests/commands/perfect/expect_step_order.cpp (12 of 53) UNSUPPORTED: debuginfo-tests :: dexter/feature_tests/subtools/view.cpp (13 of 53) UNSUPPORTED: debuginfo-tests :: dexter/feature_tests/commands/penalty/expect_watch_value.cpp (14 of 53) UNSUPPORTED: debuginfo-tests :: dexter/feature_tests/commands/penalty/expect_step_kinds.cpp (15 of 53) UNSUPPORTED: debuginfo-tests :: dexter/feature_tests/commands/perfect/expect_step_kind/func.cpp (16 of 53) UNSUPPORTED: debuginfo-tests :: dexter/feature_tests/commands/perfect/expect_step_kind/direction.cpp (17 of 53) PASS: debuginfo-tests :: llgdb-tests/apple-accel.cpp (18 of 53) UNSUPPORTED: debuginfo-tests :: dexter-tests/inline-line-gap.cpp (19 of 53) UNSUPPORTED: debuginfo-tests :: dexter/feature_tests/commands/penalty/unreachable.cpp (20 of 53) PASS: debuginfo-tests :: dexter/feature_tests/subtools/help/help.test (21 of 53) UNSUPPORTED: debuginfo-tests :: dexter-tests/realigned-frame.cpp (22 of 53) UNSUPPORTED: debuginfo-tests :: dexter/feature_tests/commands/perfect/expect_step_kind/recursive.cpp (23 of 53) PASS: debuginfo-tests :: dexter/feature_tests/subtools/list-debuggers/list-debuggers.test (24 of 53) PASS: debuginfo-tests :: dexter/feature_tests/unittests/run.test (25 of 53) UNSUPPORTED: debuginfo-tests :: dexter/feature_tests/subtools/clang-opt-bisect/clang-opt-bisect.cpp (26 of 53) PASS: debuginfo-tests :: dexter/feature_tests/subtools/test/err_type.cpp (27 of 53) PASS: debuginfo-tests :: dexter/feature_tests/subtools/test/err_type_mline.cpp (28 of 53) PASS: debuginfo-tests :: dexter/feature_tests/subtools/test/err_paren_mline.cpp (29 of 53) UNSUPPORTED: debuginfo-tests :: dexter-tests/hello.c (30 of 53) UNSUPPORTED: debuginfo-tests :: dexter/feature_tests/commands/penalty/expect_watch_type.cpp (31 of 53) PASS: debuginfo-tests :: dexter/feature_tests/subtools/test/err_paren.cpp (32 of 53) PASS: debuginfo-tests :: dexter/feature_tests/subtools/test/err_syntax_mline.cpp (33 of 53) PASS: debuginfo-tests :: dexter/feature_tests/subtools/test/err_syntax.cpp (34 of 53) PASS: debuginfo-tests :: llgdb-tests/nested-struct.cpp (35 of 53) PASS: debuginfo-tests :: llgdb-tests/forward-declare-class.cpp (36 of 53) FAIL: debuginfo-tests :: dexter-tests/dbg-arg.c (37 of 53) ******************** TEST 'debuginfo-tests :: dexter-tests/dbg-arg.c' FAILED ******************** Script: -- : 'RUN: at line 5'; "/usr/local/bin/python" "/Users/buildslave/jenkins/workspace/lldb-cmake/llvm-project/debuginfo-tests/dexter/dexter.py" test --lldb-executable /Users/buildslave/jenkins/workspace/lldb-cmake/lldb-build/bin/lldb --fail-lt 1.0 -w --builder clang-c --debugger 'lldb' --cflags "-m64 -mllvm -fast-isel=false -g" -- /Users/buildslave/jenkins/workspace/lldb-cmake/llvm-project/debuginfo-tests/dexter-tests/dbg-arg.c -- Exit Code: 2

Hide Details

Command Output (stdout): -- dbg-arg.c: nan/nan (nan) [Command '['/usr/local/opt/python/bin/python3.7', '/Users/buildslave/jenkins/workspace/lldb-cmake/llvm-project/debuginfo-tests/dexter/dex/../dexter.py', 'run-debugger-internal-', '/var/folders/09/r4vw4v8n5kb67jl66zvlbljw0000gn/T/dexter/tmpwv4naj3q/tmpa__zlmza', '/var/folders/09/r4vw4v8n5kb67jl66zvlbljw0000gn/T/dexter/tmpwv4naj3q/tmpi9gvzf0f', '--working-directory', '/var/folders/09/r4vw4v8n5kb67jl66zvlbljw0000gn/T/dexter/tmpwv4naj3q', '--unittest=off', '--indent-timer-level=3']' returned non-zero exit status 1.]

Hide Details

Hide Details

-- Command Output (stderr): --

Hide Details

error: could not load lldb (path "/Users/buildslave/jenkins/workspace/lldb-cmake/lldb-build/lib/lldb.framework/Versions/lib/python3.7/site-packages" does not exist [result of ['/Users/buildslave/jenkins/workspace/lldb-cmake/lldb-build/bin/lldb', '-P']])

Hide Details

Hide Details

--

Hide Details

******************** FAIL: debuginfo-tests :: dexter-tests/asan.c (38 of 53) ******************** TEST 'debuginfo-tests :: dexter-tests/asan.c' FAILED ******************** Script: -- : 'RUN: at line 6'; "/usr/local/bin/python" "/Users/buildslave/jenkins/workspace/lldb-cmake/llvm-project/debuginfo-tests/dexter/dexter.py" test --lldb-executable /Users/buildslave/jenkins/workspace/lldb-cmake/lldb-build/bin/lldb --fail-lt 1.0 -w --builder 'clang-c' --debugger 'lldb' --cflags "--driver-mode=gcc -O0 -glldb -fblocks -arch x86_64 -fsanitize=address" --ldflags="-fsanitize=address" -- /Users/buildslave/jenkins/workspace/lldb-cmake/llvm-project/debuginfo-tests/dexter-tests/asan.c -- Exit Code: 2

Hide Details

Command Output (stdout): -- asan.c: nan/nan (nan) [Command '['/usr/local/opt/python/bin/python3.7', '/Users/buildslave/jenkins/workspace/lldb-cmake/llvm-project/debuginfo-tests/dexter/dex/../dexter.py', 'run-debugger-internal-', '/var/folders/09/r4vw4v8n5kb67jl66zvlbljw0000gn/T/dexter/tmpbsuc7d5y/tmpwxq8h1oh', '/var/folders/09/r4vw4v8n5kb67jl66zvlbljw0000gn/T/dexter/tmpbsuc7d5y/tmpi876gzuk', '--working-directory', '/var/folders/09/r4vw4v8n5kb67jl66zvlbljw0000gn/T/dexter/tmpbsuc7d5y', '--unittest=off', '--indent-timer-level=3']' returned non-zero exit status 1.]

Hide Details

Hide Details

-- Command Output (stderr): --

Hide Details

error: could not load lldb (path "/Users/buildslave/jenkins/workspace/lldb-cmake/lldb-build/lib/lldb.framework/Versions/lib/python3.7/site-packages" does not exist [result of ['/Users/buildslave/jenkins/workspace/lldb-cmake/lldb-build/bin/lldb', '-P']])

Hide Details

Hide Details

--

Hide Details

******************** FAIL: debuginfo-tests :: dexter-tests/ctor.cpp (39 of 53) ******************** TEST 'debuginfo-tests :: dexter-tests/ctor.cpp' FAILED ******************** Script: -- : 'RUN: at line 4'; "/usr/local/bin/python" "/Users/buildslave/jenkins/workspace/lldb-cmake/llvm-project/debuginfo-tests/dexter/dexter.py" test --lldb-executable /Users/buildslave/jenkins/workspace/lldb-cmake/lldb-build/bin/lldb --fail-lt 1.0 -w --builder 'clang' --debugger 'lldb' --cflags "-O0 -glldb" -- /Users/buildslave/jenkins/workspace/lldb-cmake/llvm-project/debuginfo-tests/dexter-tests/ctor.cpp -- Exit Code: 2

Hide Details

Command Output (stdout): -- ctor.cpp: nan/nan (nan) [Command '['/usr/local/opt/python/bin/python3.7', '/Users/buildslave/jenkins/workspace/lldb-cmake/llvm-project/debuginfo-tests/dexter/dex/../dexter.py', 'run-debugger-internal-', '/var/folders/09/r4vw4v8n5kb67jl66zvlbljw0000gn/T/dexter/tmprz24ea8j/tmpvlpw743q', '/var/folders/09/r4vw4v8n5kb67jl66zvlbljw0000gn/T/dexter/tmprz24ea8j/tmphejyiw2w', '--working-directory', '/var/folders/09/r4vw4v8n5kb67jl66zvlbljw0000gn/T/dexter/tmprz24ea8j', '--unittest=off', '--indent-timer-level=3']' returned non-zero exit status 1.]

Hide Details

Hide Details

-- Command Output (stderr): --

Hide Details

error: could not load lldb (path "/Users/buildslave/jenkins/workspace/lldb-cmake/lldb-build/lib/lldb.framework/Versions/lib/python3.7/site-packages" does not exist [result of ['/Users/buildslave/jenkins/workspace/lldb-cmake/lldb-build/bin/lldb', '-P']])

Hide Details

Hide Details

--

Hide Details

******************** FAIL: debuginfo-tests :: dexter-tests/stack-var.c (40 of 53) ******************** TEST 'debuginfo-tests :: dexter-tests/stack-var.c' FAILED ******************** Script: -- : 'RUN: at line 4'; "/usr/local/bin/python" "/Users/buildslave/jenkins/workspace/lldb-cmake/llvm-project/debuginfo-tests/dexter/dexter.py" test --lldb-executable /Users/buildslave/jenkins/workspace/lldb-cmake/lldb-build/bin/lldb --fail-lt 1.0 -w --builder clang-c --debugger 'lldb' --cflags "-O -glldb" -- /Users/buildslave/jenkins/workspace/lldb-cmake/llvm-project/debuginfo-tests/dexter-tests/stack-var.c -- Exit Code: 2

Hide Details

Command Output (stdout): -- stack-var.c: nan/nan (nan) [Command '['/usr/local/opt/python/bin/python3.7', '/Users/buildslave/jenkins/workspace/lldb-cmake/llvm-project/debuginfo-tests/dexter/dex/../dexter.py', 'run-debugger-internal-', '/var/folders/09/r4vw4v8n5kb67jl66zvlbljw0000gn/T/dexter/tmp3smbd1pc/tmpx_ub13jq', '/var/folders/09/r4vw4v8n5kb67jl66zvlbljw0000gn/T/dexter/tmp3smbd1pc/tmp_4nngu5n', '--working-directory', '/var/folders/09/r4vw4v8n5kb67jl66zvlbljw0000gn/T/dexter/tmp3smbd1pc', '--unittest=off', '--indent-timer-level=3']' returned non-zero exit status 1.]

Hide Details

Hide Details

-- Command Output (stderr): --

Hide Details

error: could not load lldb (path "/Users/buildslave/jenkins/workspace/lldb-cmake/lldb-build/lib/lldb.framework/Versions/lib/python3.7/site-packages" does not exist [result of ['/Users/buildslave/jenkins/workspace/lldb-cmake/lldb-build/bin/lldb', '-P']])

Hide Details

Hide Details

--

Hide Details

******************** FAIL: debuginfo-tests :: dexter-tests/aggregate-indirect-arg.cpp (41 of 53) ******************** TEST 'debuginfo-tests :: dexter-tests/aggregate-indirect-arg.cpp' FAILED ******************** Script: -- : 'RUN: at line 4'; "/usr/local/bin/python" "/Users/buildslave/jenkins/workspace/lldb-cmake/llvm-project/debuginfo-tests/dexter/dexter.py" test --lldb-executable /Users/buildslave/jenkins/workspace/lldb-cmake/lldb-build/bin/lldb --fail-lt 1.0 -w --builder 'clang' --debugger 'lldb' --cflags "-O0 -g" --ldflags="-lstdc++" -- /Users/buildslave/jenkins/workspace/lldb-cmake/llvm-project/debuginfo-tests/dexter-tests/aggregate-indirect-arg.cpp -- Exit Code: 2

Hide Details

Command Output (stdout): -- aggregate-indirect-arg.cpp: nan/nan (nan) [Command '['/usr/local/opt/python/bin/python3.7', '/Users/buildslave/jenkins/workspace/lldb-cmake/llvm-project/debuginfo-tests/dexter/dex/../dexter.py', 'run-debugger-internal-', '/var/folders/09/r4vw4v8n5kb67jl66zvlbljw0000gn/T/dexter/tmpv47v7l_f/tmputw6_358', '/var/folders/09/r4vw4v8n5kb67jl66zvlbljw0000gn/T/dexter/tmpv47v7l_f/tmprcp1b722', '--working-directory', '/var/folders/09/r4vw4v8n5kb67jl66zvlbljw0000gn/T/dexter/tmpv47v7l_f', '--unittest=off', '--indent-timer-level=3']' returned non-zero exit status 1.]

Hide Details

Hide Details

-- Command Output (stderr): --

Hide Details

error: could not load lldb (path "/Users/buildslave/jenkins/workspace/lldb-cmake/lldb-build/lib/lldb.framework/Versions/lib/python3.7/site-packages" does not exist [result of ['/Users/buildslave/jenkins/workspace/lldb-cmake/lldb-build/bin/lldb', '-P']])

Hide Details

Hide Details

--

Hide Details

******************** FAIL: debuginfo-tests :: dexter-tests/vla.c (42 of 53) ******************** TEST 'debuginfo-tests :: dexter-tests/vla.c' FAILED ******************** Script: -- : 'RUN: at line 5'; "/usr/local/bin/python" "/Users/buildslave/jenkins/workspace/lldb-cmake/llvm-project/debuginfo-tests/dexter/dexter.py" test --lldb-executable /Users/buildslave/jenkins/workspace/lldb-cmake/lldb-build/bin/lldb --fail-lt 1.0 -w --builder clang-c --debugger 'lldb' --cflags "-O0 -glldb" -- /Users/buildslave/jenkins/workspace/lldb-cmake/llvm-project/debuginfo-tests/dexter-tests/vla.c -- Exit Code: 2

Hide Details

Command Output (stdout): -- vla.c: nan/nan (nan) [Command '['/usr/local/opt/python/bin/python3.7', '/Users/buildslave/jenkins/workspace/lldb-cmake/llvm-project/debuginfo-tests/dexter/dex/../dexter.py', 'run-debugger-internal-', '/var/folders/09/r4vw4v8n5kb67jl66zvlbljw0000gn/T/dexter/tmp0b697uji/tmpcynmc9cj', '/var/folders/09/r4vw4v8n5kb67jl66zvlbljw0000gn/T/dexter/tmp0b697uji/tmpqqux2ifi', '--working-directory', '/var/folders/09/r4vw4v8n5kb67jl66zvlbljw0000gn/T/dexter/tmp0b697uji', '--unittest=off', '--indent-timer-level=3']' returned non-zero exit status 1.]

Hide Details

Hide Details

-- Command Output (stderr): --

Hide Details

error: could not load lldb (path "/Users/buildslave/jenkins/workspace/lldb-cmake/lldb-build/lib/lldb.framework/Versions/lib/python3.7/site-packages" does not exist [result of ['/Users/buildslave/jenkins/workspace/lldb-cmake/lldb-build/bin/lldb', '-P']])

Hide Details

Hide Details

--

Hide Details

******************** FAIL: debuginfo-tests :: dexter-tests/nrvo-string.cpp (43 of 53) ******************** TEST 'debuginfo-tests :: dexter-tests/nrvo-string.cpp' FAILED ******************** Script: -- : 'RUN: at line 10'; "/usr/local/bin/python" "/Users/buildslave/jenkins/workspace/lldb-cmake/llvm-project/debuginfo-tests/dexter/dexter.py" test --lldb-executable /Users/buildslave/jenkins/workspace/lldb-cmake/lldb-build/bin/lldb --fail-lt 1.0 -w --builder 'clang' --debugger 'lldb' --cflags "-O0 -glldb -fno-exceptions" -- /Users/buildslave/jenkins/workspace/lldb-cmake/llvm-project/debuginfo-tests/dexter-tests/nrvo-string.cpp : 'RUN: at line 14'; "/usr/local/bin/python" "/Users/buildslave/jenkins/workspace/lldb-cmake/llvm-project/debuginfo-tests/dexter/dexter.py" test --lldb-executable /Users/buildslave/jenkins/workspace/lldb-cmake/lldb-build/bin/lldb --fail-lt 1.0 -w --builder 'clang' --debugger 'lldb' --cflags "-O1 -glldb -fno-exceptions" -- /Users/buildslave/jenkins/workspace/lldb-cmake/llvm-project/debuginfo-tests/dexter-tests/nrvo-string.cpp -- Exit Code: 2

Hide Details

Command Output (stdout): -- nrvo-string.cpp: nan/nan (nan) [Command '['/usr/local/opt/python/bin/python3.7', '/Users/buildslave/jenkins/workspace/lldb-cmake/llvm-project/debuginfo-tests/dexter/dex/../dexter.py', 'run-debugger-internal-', '/var/folders/09/r4vw4v8n5kb67jl66zvlbljw0000gn/T/dexter/tmpmi1zflux/tmpokdpbnoz', '/var/folders/09/r4vw4v8n5kb67jl66zvlbljw0000gn/T/dexter/tmpmi1zflux/tmpp3t2zdtk', '--working-directory', '/var/folders/09/r4vw4v8n5kb67jl66zvlbljw0000gn/T/dexter/tmpmi1zflux', '--unittest=off', '--indent-timer-level=3']' returned non-zero exit status 1.]

Hide Details

Hide Details

-- Command Output (stderr): --

Hide Details

error: could not load lldb (path "/Users/buildslave/jenkins/workspace/lldb-cmake/lldb-build/lib/lldb.framework/Versions/lib/python3.7/site-packages" does not exist [result of ['/Users/buildslave/jenkins/workspace/lldb-cmake/lldb-build/bin/lldb', '-P']])

Hide Details

Hide Details

--

Hide Details

******************** PASS: debuginfo-tests :: llgdb-tests/static-member.cpp (44 of 53) XFAIL: debuginfo-tests :: llgdb-tests/static-member-2.cpp (45 of 53) PASS: debuginfo-tests :: llgdb-tests/asan.c (46 of 53) PASS: debuginfo-tests :: llgdb-tests/asan-blocks.c (47 of 53) PASS: debuginfo-tests :: llgdb-tests/nrvo-string.cpp (48 of 53) PASS: debuginfo-tests :: llgdb-tests/block_var.m (49 of 53) PASS: debuginfo-tests :: llgdb-tests/asan-deque.cpp (50 of 53) XFAIL: debuginfo-tests :: dexter-tests/asan-deque.cpp (51 of 53) PASS: debuginfo-tests :: llgdb-tests/foreach.m (52 of 53) PASS: debuginfo-tests :: llgdb-tests/blocks.m (53 of 53)

Hide Details

Testing Time: 4.59s ******************** Failing Tests (7): debuginfo-tests :: dexter-tests/dbg-arg.c debuginfo-tests :: dexter-tests/ctor.cpp debuginfo-tests :: dexter-tests/aggregate-indirect-arg.cpp debuginfo-tests :: dexter-tests/stack-var.c debuginfo-tests :: dexter-tests/asan.c debuginfo-tests :: dexter-tests/vla.c debuginfo-tests :: dexter-tests/nrvo-string.cpp

Hide Details

Hide Details

Slowest Tests: -------------------------------------------------------------------------- 0.58s: debuginfo-tests :: dexter/feature_tests/subtools/test/err_syntax.cpp 0.58s: debuginfo-tests :: dexter/feature_tests/subtools/test/err_type_mline.cpp 0.59s: debuginfo-tests :: dexter-tests/nrvo-string.cpp 0.62s: debuginfo-tests :: dexter-tests/vla.c 0.62s: debuginfo-tests :: llgdb-tests/nested-struct.cpp 0.85s: debuginfo-tests :: dexter-tests/asan.c 0.85s: debuginfo-tests :: dexter-tests/stack-var.c 0.86s: debuginfo-tests :: dexter-tests/dbg-arg.c 0.86s: debuginfo-tests :: dexter-tests/ctor.cpp 0.87s: debuginfo-tests :: dexter-tests/aggregate-indirect-arg.cpp 0.88s: debuginfo-tests :: llgdb-tests/static-member-2.cpp 1.37s: debuginfo-tests :: llgdb-tests/static-member.cpp 1.78s: debuginfo-tests :: llgdb-tests/asan.c 1.79s: debuginfo-tests :: llgdb-tests/asan-blocks.c 2.78s: debuginfo-tests :: llgdb-tests/nrvo-string.cpp 2.80s: debuginfo-tests :: llgdb-tests/asan-deque.cpp 3.04s: debuginfo-tests :: llgdb-tests/block_var.m 3.61s: debuginfo-tests :: dexter-tests/asan-deque.cpp 3.98s: debuginfo-tests :: llgdb-tests/foreach.m 4.44s: debuginfo-tests :: llgdb-tests/blocks.m

Hide Details

Tests Times: -------------------------------------------------------------------------- [ Range ] :: [ Percentage ] :: [Count] -------------------------------------------------------------------------- [0.00s,0.20s) :: [****************** ] :: [24/53] [0.20s,0.40s) :: [ ] :: [ 1/53] [0.40s,0.60s) :: [***** ] :: [ 7/53] [0.60s,0.80s) :: [**** ] :: [ 6/53] [0.80s,1.00s) :: [**** ] :: [ 6/53] [1.00s,1.20s) :: [ ] :: [ 0/53] [1.20s,1.40s) :: [ ] :: [ 0/53] [1.40s,1.60s) :: [ ] :: [ 1/53] [1.60s,1.80s) :: [ ] :: [ 0/53] [1.80s,2.00s) :: [* ] :: [ 2/53] [2.00s,2.20s) :: [ ] :: [ 0/53] [2.20s,2.40s) :: [ ] :: [ 0/53] [2.40s,2.60s) :: [ ] :: [ 0/53] [2.60s,2.80s) :: [ ] :: [ 0/53] [2.80s,3.00s) :: [* ] :: [ 2/53] [3.00s,3.20s) :: [ ] :: [ 1/53] [3.20s,3.40s) :: [ ] :: [ 0/53] [3.40s,3.60s) :: [ ] :: [ 0/53] [3.60s,3.80s) :: [ ] :: [ 1/53] [3.80s,4.00s) :: [ ] :: [ 0/53] [4.00s,4.20s) :: [ ] :: [ 1/53] [4.20s,4.40s) :: [ ] :: [ 0/53] [4.40s,4.60s) :: [ ] :: [ 1/53] Expected Passes : 20 Expected Failures : 2 Unsupported Tests : 24 Unexpected Failures: 7 FAILED: projects/debuginfo-tests/CMakeFiles/check-debuginfo cd /Users/buildslave/jenkins/workspace/lldb-cmake/lldb-build/projects/debuginfo-tests && /usr/local/bin/python /Users/buildslave/jenkins/workspace/lldb-cmake/lldb-build/./bin/llvm-lit -v --time-tests --shuffle --xunit-xml-output=/Users/buildslave/jenkins/workspace/lldb-cmake/test/results.xml -v /Users/buildslave/jenkins/workspace/lldb-cmake/lldb-build/projects/debuginfo-tests ninja: build stopped: subcommand failed. Command failed: Command '['/usr/local/bin/ninja', '-v', 'check-debuginfo']' returned non-zero exit status 1. Command: ['/usr/local/bin/ninja', '-v', 'check-debuginfo'] [Pipeline] } [Pipeline] // timeout [Pipeline] } [Pipeline] // stage [Pipeline] stage [Pipeline] { (Declarative: Post Actions) [Pipeline] scanForIssues No credentials specified [Clang (LLVM based)] Sleeping for 5 seconds due to JENKINS-32191... [Clang (LLVM based)] Parsing console log (workspace: '/Users/buildslave/jenkins/workspace/lldb-cmake') [Clang (LLVM based)] [-ERROR-] Git blame errors: [Clang (LLVM based)] [-ERROR-] - no blame results for request <llvm-project/clang/lib/Format/TokenAnnotator.cpp - [30]>.

Hide Details

[Clang (LLVM based)] [-ERROR-] Git blame errors: [Clang (LLVM based)] [-ERROR-] - no blame results for request <llvm-project/llvm/include/llvm/Analysis/ScalarEvolution.h - [1696]>.

Hide Details

[Clang (LLVM based)] [-ERROR-] Git blame errors: [Clang (LLVM based)] [-ERROR-] - no blame results for request <llvm-project/clang/lib/CodeGen/CGDecl.cpp - [1862, 1864]>.

Hide Details

[Clang (LLVM based)] Post processing issues on 'green-dragon-24' with source code encoding 'UTF-8' [Clang (LLVM based)] Resolving absolute file names for all issues in workspace '/Users/buildslave/jenkins/workspace/lldb-cmake' [Clang (LLVM based)] -> 0 resolved, 0 unresolved, 3 already resolved [Clang (LLVM based)] Copying affected files to Jenkins' build folder '/Users/Shared/Jenkins/Home/jobs/lldb-cmake/builds/3696/files-with-issues' [Clang (LLVM based)] -> 3 copied, 0 not in workspace, 0 not-found, 0 with I/O error [Clang (LLVM based)] Resolving module names from module definitions (build.xml, pom.xml, or Manifest.mf files) [Clang (LLVM based)] -> resolved module names for 4 issues [Clang (LLVM based)] Resolving package names (or namespaces) by parsing the affected files [Clang (LLVM based)] -> resolved package names of 3 affected files [Clang (LLVM based)] No filter has been set, publishing all 4 issues [Clang (LLVM based)] Creating fingerprints for all affected code blocks to track issues over different builds [Clang (LLVM based)] -> created fingerprints for 4 issues [Clang (LLVM based)] Invoking Git blamer to create author and commit information for all affected files [Clang (LLVM based)] GIT_COMMIT env = 'HEAD' [Clang (LLVM based)] Git working tree = '/Users/buildslave/jenkins/workspace/lldb-cmake' [Clang (LLVM based)] Git commit ID = '353012a742ef606c9cc20702bb6facdf871473db' [Clang (LLVM based)] Job workspace = '/Users/buildslave/jenkins/workspace/lldb-cmake' [Clang (LLVM based)] Created blame requests for 3 files - invoking Git blame on agent for each of the requests [Clang (LLVM based)] -> blamed authors of issues in 3 files
[Pipeline] junit Recording test results [Pipeline] } [Pipeline] // stage [Pipeline] } [Pipeline] // withEnv [Pipeline] } [Pipeline] // node [Pipeline] End of Pipeline [BFA] Scanning build for known causes... [BFA] Found failure cause(s): [BFA] Regression test failed from category Test [BFA] Ninja target failed from category Compile [BFA] Done. 0s ERROR: script returned exit code 1 Finished: FAILURE