FailedConsole Output

Skipping 1,159 KB.. Full Log
of 1807)
PASS: lldb-api :: lang/objc/foundation/TestObjCMethodsNSArray.py (764 of 1807)
PASS: lldb-unit :: Utility/./UtilityTests/RecordReplayTest.InstrumentedBarPtr (765 of 1807)
PASS: lldb-shell :: Driver/TestRepl.test (766 of 1807)
PASS: lldb-unit :: Utility/./UtilityTests/DataExtractorTest.GetBitfield (767 of 1807)
PASS: lldb-api :: functionalities/tsan/thread_numbers/TestTsanThreadNumbers.py (768 of 1807)
PASS: lldb-api :: functionalities/gdb_remote_client/TestPlatformClient.py (769 of 1807)
PASS: lldb-api :: functionalities/breakpoint/dummy_target_breakpoints/TestBreakpointsWithNoTargets.py (770 of 1807)
PASS: lldb-api :: functionalities/breakpoint/scripted_bkpt/TestScriptedResolver.py (771 of 1807)
PASS: lldb-unit :: Utility/./UtilityTests/StringListTest.ForRange (772 of 1807)
PASS: lldb-unit :: Utility/./UtilityTests/UUIDTest.Validity (773 of 1807)
PASS: lldb-shell :: ObjectFile/ELF/PT_LOAD-overlap.yaml (774 of 1807)
PASS: lldb-api :: functionalities/param_entry_vals/basic_entry_values_x86_64/TestBasicEntryValuesX86_64.py (775 of 1807)
UNSUPPORTED: lldb-api :: macosx/macabi/TestMacABImacOSFramework.py (776 of 1807)
PASS: lldb-shell :: ObjectFile/ELF/section-types.yaml (777 of 1807)
PASS: lldb-api :: functionalities/abbreviation/TestCommonShortSpellings.py (778 of 1807)
PASS: lldb-unit :: ScriptInterpreter/Python/./ScriptInterpreterPythonTests/PythonDataObjectsTest.TestObjectAttributes (779 of 1807)
PASS: lldb-unit :: Utility/./UtilityTests/UriParserTest.SchemeHostSeparator2 (780 of 1807)
PASS: lldb-unit :: UnwindAssembly/x86/./UnwindAssemblyx86Tests/Testx86AssemblyInspectionEngine.TestPopR15 (781 of 1807)
PASS: lldb-api :: functionalities/data-formatter/data-formatter-categories/TestDataFormatterCategories.py (782 of 1807)
PASS: lldb-api :: functionalities/thread/step_out/TestThreadStepOut.py (783 of 1807)
PASS: lldb-unit :: Language/Highlighting/./HighlighterTests/HighlighterTest.HighlighterSelectionPath (784 of 1807)
PASS: lldb-shell :: Breakpoint/jitbp_elf.test (785 of 1807)
PASS: lldb-api :: functionalities/thread/concurrent_events/TestConcurrentWatchpointDelayWatchpointOneBreakpoint.py (786 of 1807)
UNSUPPORTED: lldb-api :: functionalities/data-formatter/data-formatter-stl/libstdcpp/iterator/TestDataFormatterStdIterator.py (787 of 1807)
PASS: lldb-api :: functionalities/inferior-crashing/TestInferiorCrashingStep.py (788 of 1807)
PASS: lldb-api :: functionalities/thread/exit_during_step/TestExitDuringStep.py (789 of 1807)
PASS: lldb-shell :: SymbolFile/NativePDB/globals-fundamental.cpp (790 of 1807)
PASS: lldb-api :: functionalities/unwind/noreturn/TestNoreturnUnwind.py (791 of 1807)
PASS: lldb-api :: lang/objc/objc-checker/TestObjCCheckers.py (792 of 1807)
PASS: lldb-shell :: Reproducer/TestRelativePath.test (793 of 1807)
PASS: lldb-api :: functionalities/breakpoint/comp_dir_symlink/TestCompDirSymLink.py (794 of 1807)
PASS: lldb-api :: python_api/frame/inlines/TestInlinedFrame.py (795 of 1807)
PASS: lldb-unit :: UnwindAssembly/x86/./UnwindAssemblyx86Tests/Testx86AssemblyInspectionEngine.TestDisassemblyMidFunctionEpilogues (796 of 1807)
PASS: lldb-api :: functionalities/thread/concurrent_events/TestConcurrentWatchBreak.py (797 of 1807)
PASS: lldb-unit :: Language/Highlighting/./HighlighterTests/HighlighterTest.Colons (798 of 1807)
PASS: lldb-unit :: SymbolFile/NativePDB/./SymbolFileNativePDBTests/PDBFPOProgramToDWARFExpressionTests.UnknownOp (799 of 1807)
PASS: lldb-unit :: ObjectFile/Breakpad/./ObjectFileBreakpadTests/ModuleRecord.parse (800 of 1807)
PASS: lldb-unit :: Utility/./UtilityTests/VMRange.CollectionContains (801 of 1807)
UNSUPPORTED: lldb-api :: functionalities/darwin_log/format/TestDarwinLogMessageFormat.py (802 of 1807)
PASS: lldb-unit :: Utility/./UtilityTests/BinaryStreamTest.PutULEB128Zero (803 of 1807)
PASS: lldb-unit :: Language/Highlighting/./HighlighterTests/HighlighterTest.ClangStringLiterals (804 of 1807)
PASS: lldb-unit :: Expression/./ExpressionTests/CppModuleConfigurationTest.IgnoreLibStdCpp (805 of 1807)
PASS: lldb-api :: functionalities/breakpoint/step_over_breakpoint/TestStepOverBreakpoint.py (806 of 1807)
PASS: lldb-api :: functionalities/wrong_commands/TestWrongCommands.py (807 of 1807)
PASS: lldb-unit :: ScriptInterpreter/Python/./ScriptInterpreterPythonTests/PythonDataObjectsTest.TestExtractingUInt64ThroughStructuredData (808 of 1807)
PASS: lldb-api :: lang/objc/foundation/TestConstStrings.py (809 of 1807)
PASS: lldb-api :: lang/c/stepping/TestStepAndBreakpoints.py (810 of 1807)
PASS: lldb-unit :: Utility/./UtilityTests/StringListTest.ShiftStdString (811 of 1807)
PASS: lldb-unit :: Utility/./UtilityTests/UriParserTest.Empty (812 of 1807)
PASS: lldb-unit :: Utility/./UtilityTests/ArchSpecTest.TestSetTriple (813 of 1807)
PASS: lldb-unit :: ObjectFile/Breakpad/./ObjectFileBreakpadTests/FuncRecord.parse (814 of 1807)
PASS: lldb-api :: lang/c/bitfields/TestBitfields.py (815 of 1807)
PASS: lldb-api :: commands/add-dsym/uuid/TestAddDsymCommand.py (816 of 1807)
PASS: lldb-unit :: Utility/./UtilityTests/FileSpecTest.RemoveLastPathComponent (817 of 1807)
PASS: lldb-api :: lang/cpp/inlines/TestInlines.py (818 of 1807)
PASS: lldb-api :: functionalities/data-formatter/data-formatter-smart-array/TestDataFormatterSmartArray.py (819 of 1807)
PASS: lldb-unit :: Process/minidump/./LLDBMinidumpTests/MinidumpParserTest.GetMemory (820 of 1807)
PASS: lldb-unit :: Host/./HostTests/SocketTest.UDPGetConnectURI (821 of 1807)
PASS: lldb-api :: functionalities/tail_call_frames/unambiguous_sequence/TestUnambiguousTailCalls.py (822 of 1807)
PASS: lldb-unit :: Utility/./UtilityTests/StringLexerTest.HasAtLeast (823 of 1807)
PASS: lldb-api :: lang/objc/foundation/TestObjCMethodsNSError.py (824 of 1807)
PASS: lldb-api :: lang/objc/objc-property/TestObjCProperty.py (825 of 1807)
PASS: lldb-unit :: Utility/./UtilityTests/StreamTest.PutHex32ByteOrderBig (826 of 1807)
PASS: lldb-unit :: Utility/./UtilityTests/StreamTest.PutBytesAsRawHex8ToMixedEndian (827 of 1807)
PASS: lldb-unit :: Utility/./UtilityTests/LogChannelTest.EnableOptions (828 of 1807)
PASS: lldb-unit :: Utility/./UtilityTests/StringListTest.LongestCommonPrefixNoPrefix (829 of 1807)
PASS: lldb-api :: lang/c/unions/TestUnionMembers.py (830 of 1807)
PASS: lldb-shell :: ObjectFile/PECOFF/basic-info-arm.yaml (831 of 1807)
UNSUPPORTED: lldb-shell :: Register/x86-zmm-read.test (832 of 1807)
PASS: lldb-api :: functionalities/postmortem/minidump-new/TestMiniDumpUUID.py (833 of 1807)
PASS: lldb-unit :: Utility/./UtilityTests/StatusTest.Formatv (834 of 1807)
PASS: lldb-api :: functionalities/inferior-assert/TestInferiorAssert.py (835 of 1807)
PASS: lldb-api :: commands/reproducer/invalid-args/TestInvalidArgsReproducer.py (836 of 1807)
PASS: lldb-api :: functionalities/data-formatter/nssetsynth/TestNSSetSynthetic.py (837 of 1807)
PASS: lldb-shell :: SymbolFile/DWARF/debug_rnglists.s (838 of 1807)
PASS: lldb-shell :: SymbolFile/DWARF/dwarf5-partial-index.cpp (839 of 1807)
PASS: lldb-unit :: Interpreter/./InterpreterTests/CompletionTest.DirCompletionAbsolute (840 of 1807)
PASS: lldb-api :: functionalities/thread/jump/TestThreadJump.py (841 of 1807)
PASS: lldb-unit :: Utility/./UtilityTests/StreamTest.PutCharWhitespace (842 of 1807)
PASS: lldb-api :: functionalities/data-formatter/dump_dynamic/TestDumpDynamic.py (843 of 1807)
PASS: lldb-api :: functionalities/abbreviation/TestAbbreviations.py (844 of 1807)
PASS: lldb-api :: commands/target/dump-symtab-demangle/TestDumpSymtabDemangle.py (845 of 1807)
PASS: lldb-api :: lang/objc/objc-stepping/TestObjCStepping.py (846 of 1807)
PASS: lldb-shell :: Quit/TestQuitExitCodeHex0.test (847 of 1807)
PASS: lldb-shell :: ObjectFile/ELF/netbsd-core-amd64.test (848 of 1807)
PASS: lldb-unit :: Utility/./UtilityTests/StringExtractorTest.InitMisc (849 of 1807)
PASS: lldb-api :: functionalities/stats_api/TestStatisticsAPI.py (850 of 1807)
PASS: lldb-unit :: Utility/./UtilityTests/StringExtractorTest.GetHexBytes_OddPair (851 of 1807)
PASS: lldb-api :: python_api/watchpoint/TestWatchpointIgnoreCount.py (852 of 1807)
PASS: lldb-api :: lang/cpp/operators/TestCppOperators.py (853 of 1807)
PASS: lldb-unit :: Expression/./ExpressionTests/DiagnosticManagerTest.GetStringNoDiags (854 of 1807)
PASS: lldb-api :: functionalities/gdb_remote_client/TestRecognizeBreakpoint.py (855 of 1807)
PASS: lldb-shell :: ObjectFile/ELF/basic-info.yaml (856 of 1807)
PASS: lldb-api :: python_api/formatters/TestFormattersSBAPI.py (857 of 1807)
PASS: lldb-api :: functionalities/data-formatter/data-formatter-script/TestDataFormatterScript.py (858 of 1807)
PASS: lldb-unit :: Utility/./UtilityTests/StringExtractorTest.GetHexU8_Exact_NoEof (859 of 1807)
PASS: lldb-shell :: ObjectFile/MachO/symtab.yaml (860 of 1807)
PASS: lldb-unit :: Utility/./UtilityTests/StringExtractorTest.GetHexBytesAvail_Partial (861 of 1807)
PASS: lldb-api :: commands/expression/save_jit_objects/TestSaveJITObjects.py (862 of 1807)
PASS: lldb-unit :: Utility/./UtilityTests/Flags.AllClear (863 of 1807)
PASS: lldb-unit :: Utility/./UtilityTests/StringListTest.InsertStringAtIndexStart (864 of 1807)
PASS: lldb-api :: functionalities/ubsan/user-expression/TestUbsanUserExpression.py (865 of 1807)
PASS: lldb-unit :: Utility/./UtilityTests/ScalarTest.Scalar_512 (866 of 1807)
PASS: lldb-api :: lang/objc/ptr_refs/TestPtrRefsObjC.py (867 of 1807)
PASS: lldb-api :: commands/expression/import-std-module/list-dbg-info-content/TestDbgInfoContentList.py (868 of 1807)
UNSUPPORTED: lldb-api :: functionalities/thread/create_during_step/TestCreateDuringStep.py (869 of 1807)
PASS: lldb-unit :: ScriptInterpreter/Python/./ScriptInterpreterPythonTests/PythonDataObjectsTest.TestPythonTupleValues (870 of 1807)
PASS: lldb-unit :: Utility/./UtilityTests/ConstStringTest.format_provider (871 of 1807)
PASS: lldb-unit :: SymbolFile/NativePDB/./SymbolFileNativePDBTests/PDBFPOProgramToDWARFExpressionTests.UnresolvedRegisterReference (872 of 1807)
PASS: lldb-api :: lang/objc/real-definition/TestRealDefinition.py (873 of 1807)
PASS: lldb-unit :: Utility/./UtilityTests/BinaryStreamTest.PutULEB128OneByte (874 of 1807)
PASS: lldb-unit :: SymbolFile/NativePDB/./SymbolFileNativePDBTests/PDBFPOProgramToDWARFExpressionTests.InvalidAssignmentMultiple (875 of 1807)
PASS: lldb-unit :: Utility/./UtilityTests/StreamTest.PutHex32ByteOrderLittle (876 of 1807)
PASS: lldb-api :: lang/cpp/unicode-literals/TestUnicodeLiterals.py (877 of 1807)
PASS: lldb-api :: functionalities/gdb_remote_client/TestTargetXMLArch.py (878 of 1807)
PASS: lldb-api :: lang/c/array_types/TestArrayTypes.py (879 of 1807)
PASS: lldb-shell :: Reproducer/TestSynchronous.test (880 of 1807)
UNSUPPORTED: lldb-api :: functionalities/data-formatter/data-formatter-stl/libstdcpp/vector/TestDataFormatterStdVector.py (881 of 1807)
PASS: lldb-unit :: Host/./HostTests/NativeProcessProtocolTest.ReadMemoryWithoutTrap (882 of 1807)
PASS: lldb-api :: commands/process/launch/TestProcessLaunch.py (883 of 1807)
PASS: lldb-unit :: SymbolFile/NativePDB/./SymbolFileNativePDBTests/PDBFPOProgramToDWARFExpressionTests.MissingTargetRegister (884 of 1807)
PASS: lldb-api :: functionalities/data-formatter/data-formatter-stl/libcxx/map/TestDataFormatterLibccMap.py (885 of 1807)
PASS: lldb-api :: commands/expression/two-files/TestObjCTypeQueryFromOtherCompileUnit.py (886 of 1807)
PASS: lldb-unit :: Utility/./UtilityTests/StringListTest.InsertStringAtIndexMove (887 of 1807)
PASS: lldb-shell :: Expr/TestTypeOfDeclTypeExpr.test (888 of 1807)
UNSUPPORTED: lldb-api :: functionalities/darwin_log/source/debug/TestDarwinLogSourceDebug.py (889 of 1807)
PASS: lldb-unit :: Process/gdb-remote/./ProcessGdbRemoteTests/GDBRemoteClientBaseTest.SendContinueAndWait (890 of 1807)
PASS: lldb-api :: functionalities/breakpoint/breakpoint_options/TestBreakpointOptions.py (891 of 1807)
PASS: lldb-api :: api/command-return-object/TestSBCommandReturnObject.py (892 of 1807)
PASS: lldb-unit :: Utility/./UtilityTests/SerializationRountripTest.SerializeDeserializePod (893 of 1807)
PASS: lldb-unit :: Expression/./ExpressionTests/DiagnosticManagerTest.GetStringBasic (894 of 1807)
PASS: lldb-unit :: Utility/./UtilityTests/ArgsTest.DoubleQuotedItem (895 of 1807)
PASS: lldb-api :: commands/expression/namespace_local_var_same_name_cpp_and_c/TestNamespaceLocalVarSameNameCppAndC.py (896 of 1807)
PASS: lldb-unit :: Utility/./UtilityTests/StringExtractorTest.GetNameColonValueSuccess (897 of 1807)
PASS: lldb-api :: functionalities/data-formatter/data-formatter-objc/TestDataFormatterObjCPlain.py (898 of 1807)
PASS: lldb-unit :: ScriptInterpreter/Python/./ScriptInterpreterPythonTests/PythonDataObjectsTest.TestPythonString (899 of 1807)
PASS: lldb-api :: commands/expression/import-std-module/sysroot/TestStdModuleSysroot.py (900 of 1807)
PASS: lldb-unit :: Utility/./UtilityTests/StreamTeeTest.AppendStream (901 of 1807)
PASS: lldb-shell :: Settings/TestStopCommandSourceOnError.test (902 of 1807)
PASS: lldb-api :: functionalities/breakpoint/source_regexp/TestSourceRegexBreakpoints.py (903 of 1807)
PASS: lldb-unit :: Disassembler/./DisassemblerTests/TestArm64Disassembly.TestArmv81Instruction (904 of 1807)
PASS: lldb-shell :: SymbolFile/DWARF/debug-types-dwarf5.s (905 of 1807)
PASS: lldb-api :: commands/frame/var/TestFrameVar.py (906 of 1807)
PASS: lldb-unit :: Utility/./UtilityTests/DataExtractorTest.GetMaxU64 (907 of 1807)
PASS: lldb-api :: lang/objc/objc++/TestObjCXX.py (908 of 1807)
PASS: lldb-unit :: Host/./HostTests/MainLoopTest.Signal (909 of 1807)
PASS: lldb-unit :: Utility/./UtilityTests/ArgsTest.TestQuotedTrailingBackslash (910 of 1807)
PASS: lldb-unit :: Editline/./EditlineTests/EditlineTestFixture.EditlineReceivesMultiLineText (911 of 1807)
PASS: lldb-unit :: Expression/./ExpressionTests/DiagnosticManagerTest.AppendMessageSubsequentDiags (912 of 1807)
UNSUPPORTED: lldb-api :: functionalities/tty/TestTerminal.py (913 of 1807)
PASS: lldb-shell :: Breakpoint/single-file-split-dwarf.test (914 of 1807)
PASS: lldb-api :: commands/watchpoints/watchpoint_commands/TestWatchpointCommands.py (915 of 1807)
PASS: lldb-api :: functionalities/tsan/thread_leak/TestTsanThreadLeak.py (916 of 1807)
PASS: lldb-unit :: Host/./HostTests/SocketAddressTest.GetAddressInfo (917 of 1807)
PASS: lldb-api :: lang/cpp/function_refs/TestFunctionRefs.py (918 of 1807)
PASS: lldb-shell :: SymbolFile/DWARF/find-basic-type.cpp (919 of 1807)
PASS: lldb-shell :: Commands/command-script-import.test (920 of 1807)
PASS: lldb-shell :: Commands/command-source.test (921 of 1807)
PASS: lldb-shell :: SymbolFile/NativePDB/function-types-builtins.cpp (922 of 1807)
PASS: lldb-unit :: Process/minidump/./LLDBMinidumpTests/MinidumpParserTest.GetArchitectureWindows (923 of 1807)
PASS: lldb-unit :: Utility/./UtilityTests/StringExtractorTest.DecodeHexU8_InvalidHex2 (924 of 1807)
PASS: lldb-unit :: Utility/./UtilityTests/LogChannelEnabledTest.LogVerboseThread (925 of 1807)
PASS: lldb-shell :: ObjectFile/ELF/PT_LOAD.yaml (926 of 1807)
PASS: lldb-unit :: Utility/./UtilityTests/StreamTest.PutHex64ByteOrderBig (927 of 1807)
PASS: lldb-api :: python_api/disassemble-raw-data/TestDisassembleRawData.py (928 of 1807)
PASS: lldb-api :: commands/expression/import-std-module/weak_ptr-dbg-info-content/TestDbgInfoContentWeakPtr.py (929 of 1807)
UNSUPPORTED: lldb-api :: commands/watchpoints/hello_watchlocation/TestWatchLocation.py (930 of 1807)
PASS: lldb-api :: commands/frame/language/TestGuessLanguage.py (931 of 1807)
PASS: lldb-api :: lang/objc/modules-inline-functions/TestModulesInlineFunctions.py (932 of 1807)
PASS: lldb-unit :: Host/./HostTests/SocketTest.DecodeHostAndPort (933 of 1807)
UNSUPPORTED: lldb-shell :: SymbolFile/PDB/function-nested-block.test (934 of 1807)
PASS: lldb-unit :: SymbolFile/NativePDB/./SymbolFileNativePDBTests/PDBFPOProgramToDWARFExpressionTests.UnresolvedCyclicRegisterAssignmentReference (935 of 1807)
PASS: lldb-unit :: Symbol/./SymbolTests/LineEntryTest.GetSameLineContiguousAddressRangeNestedInline (936 of 1807)
PASS: lldb-unit :: Target/./TargetTests/PathMappingListTest.RemapRoot (937 of 1807)
PASS: lldb-api :: macosx/queues/TestQueues.py (938 of 1807)
UNSUPPORTED: lldb-shell :: SymbolFile/PDB/enums-layout.test (939 of 1807)
PASS: lldb-api :: lang/cpp/frame-var-anon-unions/TestFrameVariableAnonymousUnions.py (940 of 1807)
UNSUPPORTED: lldb-api :: benchmarks/libcxxlist/TestBenchmarkLibcxxList.py (941 of 1807)
UNSUPPORTED: lldb-api :: benchmarks/turnaround/TestCompileRunToBreakpointTurnaround.py (942 of 1807)
PASS: lldb-api :: lang/objc/objc-runtime-ivars/TestRuntimeIvars.py (943 of 1807)
PASS: lldb-api :: functionalities/tail_call_frames/disambiguate_call_site/TestDisambiguateCallSite.py (944 of 1807)
PASS: lldb-api :: functionalities/thread/concurrent_events/TestConcurrentSignalWatchBreak.py (945 of 1807)
PASS: lldb-unit :: Utility/./UtilityTests/StringListTest.JoinThree (946 of 1807)
PASS: lldb-unit :: Symbol/./SymbolTests/LineEntryTest.GetSameLineContiguousAddressRangeOneInline (947 of 1807)
PASS: lldb-unit :: Utility/./UtilityTests/StringListTest.CopyListEmpty (948 of 1807)
PASS: lldb-unit :: Process/gdb-remote/./ProcessGdbRemoteTests/GDBRemoteCommunicationServerTest.SendErrorResponse_ErrorList (949 of 1807)
PASS: lldb-api :: commands/log/invalid-args/TestInvalidArgsLog.py (950 of 1807)
PASS: lldb-unit :: Utility/./UtilityTests/StringListTest.PopBack (951 of 1807)
PASS: lldb-api :: lang/objc/foundation/TestObjCMethodsString.py (952 of 1807)
PASS: lldb-unit :: Utility/./UtilityTests/StreamTest.PutCharNull (953 of 1807)
PASS: lldb-api :: lang/cpp/stl/TestSTL.py (954 of 1807)
PASS: lldb-unit :: Utility/./UtilityTests/FileSpecTest.GuessPathStyle (955 of 1807)
PASS: lldb-api :: functionalities/data-formatter/data-formatter-stl/libcxx/queue/TestDataFormatterLibcxxQueue.py (956 of 1807)
PASS: lldb-unit :: ObjectFile/Breakpad/./ObjectFileBreakpadTests/PublicRecord.parse (957 of 1807)
PASS: lldb-unit :: Utility/./UtilityTests/CompletionRequest.FakeLastArg (958 of 1807)
PASS: lldb-unit :: Expression/./ExpressionTests/CppModuleConfigurationTest.MissingUsrInclude (959 of 1807)
PASS: lldb-api :: lang/c/tls_globals/TestTlsGlobals.py (960 of 1807)
PASS: lldb-shell :: SymbolFile/DWARF/apple-index-is-used.cpp (961 of 1807)
PASS: lldb-unit :: UnwindAssembly/ARM64/./Arm64InstEmulationTests/TestArm64InstEmulation.TestSimpleDarwinFunction (962 of 1807)
PASS: lldb-unit :: Utility/./UtilityTests/StringListTest.GetMaxStringLengthEmpty (963 of 1807)
PASS: lldb-api :: functionalities/thread/concurrent_events/TestConcurrentDelayedCrashWithBreakpointWatchpoint.py (964 of 1807)
PASS: lldb-shell :: SymbolFile/NativePDB/tag-types.cpp (965 of 1807)
PASS: lldb-api :: functionalities/data-formatter/data-formatter-stl/libcxx/unordered/TestDataFormatterUnordered.py (966 of 1807)
PASS: lldb-shell :: Reproducer/Functionalities/TestStepping.test (967 of 1807)
PASS: lldb-api :: python_api/module_section/TestModuleAndSection.py (968 of 1807)
PASS: lldb-api :: lang/objc/objc-static-method/TestObjCStaticMethod.py (969 of 1807)
PASS: lldb-shell :: SymbolFile/DWARF/find-inline-method.s (970 of 1807)
PASS: lldb-unit :: Host/./HostTests/TaskPoolTest.RunTasks (971 of 1807)
PASS: lldb-api :: lang/cpp/limit-debug-info/TestWithLimitDebugInfo.py (972 of 1807)
PASS: lldb-api :: commands/expression/persist_objc_pointeetype/TestPersistObjCPointeeType.py (973 of 1807)
PASS: lldb-unit :: Utility/./UtilityTests/UriParserTest.Minimal (974 of 1807)
PASS: lldb-api :: tools/lldb-server/TestGdbRemoteSingleStep.py (975 of 1807)
PASS: lldb-api :: functionalities/type_lookup/TestTypeLookup.py (976 of 1807)
PASS: lldb-api :: commands/expression/calculator_mode/TestCalculatorMode.py (977 of 1807)
PASS: lldb-api :: lang/cpp/breakpoint_in_member_func_w_non_primitive_params/TestBreakpointInMemberFuncWNonPrimitiveParams.py (978 of 1807)
PASS: lldb-unit :: ScriptInterpreter/Python/./ScriptInterpreterPythonTests/PythonDataObjectsTest.TestDictionaryResolutionWithDot (979 of 1807)
PASS: lldb-api :: functionalities/breakpoint/breakpoint_set_restart/TestBreakpointSetRestart.py (980 of 1807)
UNSUPPORTED: lldb-shell :: Register/arm-gp-read.test (981 of 1807)
PASS: lldb-api :: functionalities/testid/TestTestId.py (982 of 1807)
UNSUPPORTED: lldb-shell :: Register/x86-64-zmm-read.test (983 of 1807)
PASS: lldb-shell :: ObjectFile/PECOFF/symbol.yaml (984 of 1807)
PASS: lldb-unit :: ScriptInterpreter/Python/./ScriptInterpreterPythonTests/PythonDataObjectsTest.TestPythonCallableInvoke (985 of 1807)
PASS: lldb-shell :: SymbolFile/DWARF/clang-ast-from-dwarf-unamed-and-anon-structs.cpp (986 of 1807)
PASS: lldb-unit :: Utility/./UtilityTests/UriParserTest.LongPath (987 of 1807)
PASS: lldb-unit :: Utility/./UtilityTests/StreamTest.PutHex16ByteOrderBig (988 of 1807)
PASS: lldb-api :: commands/frame/select/TestFrameSelect.py (989 of 1807)
PASS: lldb-unit :: Host/./HostTests/NativeProcessProtocolTest.SetBreakpointFailWrite (990 of 1807)
PASS: lldb-unit :: ScriptInterpreter/Python/./ScriptInterpreterPythonTests/PythonDataObjectsTest.TestPythonTupleToStructuredList (991 of 1807)
UNSUPPORTED: lldb-api :: lang/cpp/static_members/TestCPPStaticMembers.py (992 of 1807)
PASS: lldb-unit :: Process/minidump/./LLDBMinidumpTests/MinidumpParserTest.GetPidWindows (993 of 1807)
PASS: lldb-api :: python_api/exprpath_synthetic/TestExprPathSynthetic.py (994 of 1807)
PASS: lldb-unit :: Interpreter/./InterpreterTests/CompletionTest.DirCompletionUsername (995 of 1807)
PASS: lldb-api :: functionalities/var_path/TestVarPath.py (996 of 1807)
PASS: lldb-api :: functionalities/data-formatter/data-formatter-stl/libcxx/vector/TestDataFormatterLibcxxVector.py (997 of 1807)
PASS: lldb-api :: functionalities/data-formatter/var-in-aggregate-misuse/TestVarInAggregateMisuse.py (998 of 1807)
PASS: lldb-api :: lang/cpp/const_this/TestConstThis.py (999 of 1807)
PASS: lldb-api :: functionalities/postmortem/mach-core/TestMachCore.py (1000 of 1807)
PASS: lldb-api :: commands/register/register/register_command/TestRegisters.py (1001 of 1807)
PASS: lldb-api :: functionalities/tail_call_frames/ambiguous_tail_call_seq1/TestAmbiguousTailCallSeq1.py (1002 of 1807)
PASS: lldb-shell :: ObjectFile/ELF/many-sections.s (1003 of 1807)
PASS: lldb-shell :: Process/TestEnvironment.test (1004 of 1807)
PASS: lldb-unit :: Language/Highlighting/./HighlighterTests/HighlighterTest.DefaultHighlighterWithCursorOutOfBounds (1005 of 1807)
PASS: lldb-api :: python_api/process/TestProcessAPI.py (1006 of 1807)
PASS: lldb-unit :: Process/gdb-remote/./ProcessGdbRemoteTests/GDBRemoteCommunicationClientTest.SendStartTracePacket (1007 of 1807)
PASS: lldb-api :: lang/cpp/wchar_t/TestCxxWCharT.py (1008 of 1807)
PASS: lldb-shell :: Driver/TestCommands.test (1009 of 1807)
PASS: lldb-unit :: ScriptInterpreter/Python/./ScriptInterpreterPythonTests/PythonDataObjectsTest.TestTypeNameResolutionNoDot (1010 of 1807)
PASS: lldb-unit :: Utility/./UtilityTests/StringListTest.RemoveBlankLines (1011 of 1807)
PASS: lldb-api :: commands/frame/diagnose/complicated-expression/TestComplicatedExpression.py (1012 of 1807)
PASS: lldb-unit :: ScriptInterpreter/Python/./ScriptInterpreterPythonTests/PythonDataObjectsTest.TestPythonStringToStructuredString (1013 of 1807)
PASS: lldb-unit :: Utility/./UtilityTests/RangeDataVector.FindEntryThatContains (1014 of 1807)
PASS: lldb-unit :: Utility/./UtilityTests/ScalarTest.GetBytes (1015 of 1807)
PASS: lldb-unit :: Utility/./UtilityTests/ArgsTest.TestTrailingBackslash (1016 of 1807)
PASS: lldb-api :: functionalities/data-formatter/typedef_array/TestTypedefArray.py (1017 of 1807)
UNSUPPORTED: lldb-api :: api/multiple-debuggers/TestMultipleDebuggers.py (1018 of 1807)
UNSUPPORTED: lldb-api :: commands/register/register/intel_xtended_registers/mpx_offset_intersection/TestMPXOffsetIntersection.py (1019 of 1807)
PASS: lldb-api :: functionalities/data-formatter/data-formatter-stl/libcxx/bitset/TestDataFormatterLibcxxBitset.py (1020 of 1807)
UNSUPPORTED: lldb-shell :: Register/aarch64-fp-read.test (1021 of 1807)
PASS: lldb-api :: commands/version/TestVersion.py (1022 of 1807)
PASS: lldb-unit :: UnwindAssembly/x86/./UnwindAssemblyx86Tests/Testx86AssemblyInspectionEngine.TestDisassemblyJunkBytes (1023 of 1807)
PASS: lldb-api :: functionalities/memory/find/TestMemoryFind.py (1024 of 1807)
PASS: lldb-unit :: Expression/./ExpressionTests/CppModuleConfigurationTest.AmbiguousLibCpp (1025 of 1807)
PASS: lldb-unit :: Host/./HostTests/SocketTest.DomainListenConnectAccept (1026 of 1807)
PASS: lldb-unit :: Process/gdb-remote/./ProcessGdbRemoteTests/GDBRemoteCommunicationClientTest.SendGetTraceConfigPacket (1027 of 1807)
PASS: lldb-api :: terminal/TestSTTYBeforeAndAfter.py (1028 of 1807)
PASS: lldb-unit :: Utility/./UtilityTests/ArgsTest.EscapeLLDBCommandArgument (1029 of 1807)
PASS: lldb-api :: commands/expression/cast_int_to_anonymous_enum/TestCastIntToAnonymousEnum.py (1030 of 1807)
PASS: lldb-api :: lang/objc/single-entry-dictionary/TestObjCSingleEntryDictionary.py (1031 of 1807)
PASS: lldb-shell :: ObjectFile/Breakpad/sections-trailing-func.test (1032 of 1807)
PASS: lldb-unit :: UnwindAssembly/x86/./UnwindAssemblyx86Tests/Testx86AssemblyInspectionEngine.TestPopR13 (1033 of 1807)
PASS: lldb-unit :: Utility/./UtilityTests/TimerTest.CategoryTimesStats (1034 of 1807)
PASS: lldb-unit :: Utility/./UtilityTests/CompletionRequest.Constructor (1035 of 1807)
PASS: lldb-unit :: Utility/./UtilityTests/StreamTest.PutBytesAsRawHex8ToBigEndian (1036 of 1807)
PASS: lldb-unit :: ScriptInterpreter/Python/./ScriptInterpreterPythonTests/PythonDataObjectsTest.TestPythonDictionaryManipulation (1037 of 1807)
PASS: lldb-unit :: Utility/./UtilityTests/StringListTest.Join (1038 of 1807)
PASS: lldb-unit :: Expression/./ExpressionTests/CppModuleConfigurationTest.MissingLibCpp (1039 of 1807)
PASS: lldb-api :: python_api/lldbutil/TestSwigVersion.py (1040 of 1807)
PASS: lldb-api :: functionalities/memory/read/TestMemoryRead.py (1041 of 1807)
PASS: lldb-api :: python_api/debugger/TestDebuggerAPI.py (1042 of 1807)
PASS: lldb-unit :: UnwindAssembly/x86/./UnwindAssemblyx86Tests/Testx86AssemblyInspectionEngine.TestPopEBP (1043 of 1807)
PASS: lldb-shell :: BuildScript/script-args.test (1044 of 1807)
PASS: lldb-unit :: Process/minidump/./LLDBMinidumpTests/MinidumpParserTest.GetMemoryRegionInfo (1045 of 1807)
PASS: lldb-unit :: Process/gdb-remote/./ProcessGdbRemoteTests/GDBRemoteClientBaseTest.SendContinueAndAsyncPacket (1046 of 1807)
PASS: lldb-unit :: Utility/./UtilityTests/SerializationRountripTest.SerializeDeserializePodPointers (1047 of 1807)
PASS: lldb-api :: types/TestFloatTypes.py (1048 of 1807)
PASS: lldb-api :: functionalities/load_unload/TestLoadUnload.py (1049 of 1807)
UNSUPPORTED: lldb-api :: functionalities/thread/state/TestThreadStates.py (1050 of 1807)
PASS: lldb-api :: commands/expression/scoped_enums/TestScopedEnumType.py (1051 of 1807)
PASS: lldb-unit :: Utility/./UtilityTests/StringExtractorTest.GetHexBytesAvail_OddPair (1052 of 1807)
PASS: lldb-shell :: ObjectFile/ELF/gnu-debuglink.yaml (1053 of 1807)
UNSUPPORTED: lldb-api :: benchmarks/continue/TestBenchmarkContinue.py (1054 of 1807)
PASS: lldb-api :: lang/objc/conflicting-definition/TestConflictingDefinition.py (1055 of 1807)
PASS: lldb-unit :: Utility/./UtilityTests/StringListTest.AppendList (1056 of 1807)
PASS: lldb-unit :: ScriptInterpreter/Python/./ScriptInterpreterPythonTests/PythonDataObjectsTest.TestPythonByteArray (1057 of 1807)
FAIL: lldb-api :: commands/watchpoints/watchpoint_set_command/TestWatchLocationWithWatchSet.py (1058 of 1807)
******************** TEST 'lldb-api :: commands/watchpoints/watchpoint_set_command/TestWatchLocationWithWatchSet.py' FAILED ********************
lldb version 10.0.99 (http://labmaster3.local/git/llvm-project.git revision 77cc246412ca40082c0902f1300f53d29dd98c02)
  clang revision 4b472139513ba460595804f8113497844b41fbcc
  llvm revision 4b472139513ba460595804f8113497844b41fbcc
LLDB library dir: /Users/buildslave/jenkins/workspace/lldb-cmake/lldb-build/bin
LLDB import library dir: /Users/buildslave/jenkins/workspace/lldb-cmake/lldb-build/bin
libstdcxx tests will not be run because: Don't know how to build with libstdcxx on macosx
Skipping following debug info categories: ['dwo']

Hide Details

Session logs for test failures/errors/unexpected successes will go into directory '/Users/buildslave/jenkins/workspace/lldb-cmake/test/logs' Command invoked: /Users/buildslave/jenkins/workspace/lldb-cmake/llvm-project/lldb/test/API/dotest.py --arch=x86_64 -s /Users/buildslave/jenkins/workspace/lldb-cmake/lldb-build/lldb-test-traces -S nm -u CXXFLAGS -u CFLAGS --executable /Users/buildslave/jenkins/workspace/lldb-cmake/lldb-build/./bin/lldb --compiler /Users/buildslave/jenkins/workspace/lldb-cmake/lldb-build/./bin/clang --dsymutil /Users/buildslave/jenkins/workspace/lldb-cmake/lldb-build/./bin/dsymutil --filecheck /Users/buildslave/jenkins/workspace/lldb-cmake/lldb-build/./bin/FileCheck --codesign-identity lldb_codesign --server /Users/buildslave/jenkins/workspace/lldb-cmake/lldb-build/./bin/debugserver --arch x86_64 --build-dir /Users/buildslave/jenkins/workspace/lldb-cmake/lldb-build/lldb-test-build.noindex -s=/Users/buildslave/jenkins/workspace/lldb-cmake/test/logs -t --env TERM=vt100 --env LLVM_LIBS_DIR=/Users/buildslave/jenkins/workspace/lldb-cmake/lldb-build/./lib --build-dir /Users/buildslave/jenkins/workspace/lldb-cmake/lldb-build/lldb-test-build.noindex --lldb-module-cache-dir /Users/buildslave/jenkins/workspace/lldb-cmake/lldb-build/lldb-test-build.noindex/module-cache-lldb/lldb-api --clang-module-cache-dir /Users/buildslave/jenkins/workspace/lldb-cmake/lldb-build/lldb-test-build.noindex/module-cache-clang/lldb-api /Users/buildslave/jenkins/workspace/lldb-cmake/llvm-project/lldb/packages/Python/lldbsuite/test/commands/watchpoints/watchpoint_set_command -p TestWatchLocationWithWatchSet.py Change dir to: /Users/buildslave/jenkins/workspace/lldb-cmake/llvm-project/lldb/packages/Python/lldbsuite/test/commands/watchpoints/watchpoint_set_command runCmd: settings set symbols.enable-external-lookup false output:

Hide Details

runCmd: settings set plugin.process.gdb-remote.packet-timeout 60 output:

Hide Details

runCmd: settings set symbols.clang-modules-cache-path "/Users/buildslave/jenkins/workspace/lldb-cmake/lldb-build/lldb-test-build.noindex/module-cache-lldb/lldb-api" output:

Hide Details

runCmd: settings set use-color false output:

Hide Details

runCmd: file /Users/buildslave/jenkins/workspace/lldb-cmake/lldb-build/lldb-test-build.noindex/commands/watchpoints/watchpoint_set_command/TestWatchLocationWithWatchSet.test_watchlocation_using_watchpoint_set_dsym/a.out output: Current executable set to '/Users/buildslave/jenkins/workspace/lldb-cmake/lldb-build/lldb-test-build.noindex/commands/watchpoints/watchpoint_set_command/TestWatchLocationWithWatchSet.test_watchlocation_using_watchpoint_set_dsym/a.out' (x86_64).

Hide Details

Hide Details

runCmd: breakpoint set -l 105 output: Breakpoint 1: where = a.out`main + 391 at main.cpp:105:5, address = 0x0000000100001207

Hide Details

Hide Details

Expecting pattern: ^Breakpoint (?P<bpno>[0-9]+): (?P<num_locations>[0-9]+) locations\.$ Not matched

Hide Details

Expecting pattern: ^Breakpoint (?P<bpno>[0-9]+): (?P<num_locations>no) locations \(pending\)\. Not matched

Hide Details

Expecting pattern: ^Breakpoint (?P<bpno>[0-9]+): where = (?P<module>.*)`(?P<symbol>[+\-]{0,1}[^+]+)( \+ (?P<offset>[0-9]+)){0,1}( \[inlined\] (?P<inline_symbol>.*)){0,1} at (?P<file>[^:]+):(?P<line_no>[0-9]+)(?P<column>(:[0-9]+)?), address = (?P<address>0x[0-9a-fA-F]+)$ Matched

Hide Details

runCmd: run output: Process 88378 stopped * thread #1, queue = 'com.apple.main-thread', stop reason = breakpoint 1.1 frame #0: 0x0000000100001207 a.out`main(argc=1, argv=0x00007ffeefbff5b0) at main.cpp:105:5 102 int c; 103 } MyAggregateDataType; 104 -> 105 printf ("Before turning all three threads loose...\n"); // Set break point at this line. ^ 106 barrier_wait(); 107 108 // Join all of our threads

Hide Details

Process 88378 launched: '/Users/buildslave/jenkins/workspace/lldb-cmake/lldb-build/lldb-test-build.noindex/commands/watchpoints/watchpoint_set_command/TestWatchLocationWithWatchSet.test_watchlocation_using_watchpoint_set_dsym/a.out' (x86_64)

Hide Details

Hide Details

runCmd: thread list output: Process 88378 stopped * thread #1: tid = 0x1e6aed1, 0x0000000100001207 a.out`main(argc=1, argv=0x00007ffeefbff5b0) at main.cpp:105:5, queue = 'com.apple.main-thread', stop reason = breakpoint 1.1 thread #2: tid = 0x1e6b057, 0x00007fff5c958832 libsystem_c.dylib`__swhatbuf + 101 thread #3: tid = 0x1e6b058, 0x00007fff5ca09872 libsystem_kernel.dylib`__psynch_mutexwait + 10 thread #4: tid = 0x1e6b059, 0x00007fff5ca09872 libsystem_kernel.dylib`__psynch_mutexwait + 10

Hide Details

Hide Details

Expecting sub string: stopped Matched

Hide Details

Expecting sub string: stop reason = breakpoint Matched

Hide Details

runCmd: watchpoint set expression -w write -s 1 -- g_char_ptr + 7 output: Watchpoint created: Watchpoint 1: addr = 0x100200367 size = 1 state = enabled type = w new value: 0x0000001002000000

Hide Details

Hide Details

Expecting sub string: Watchpoint created Matched

Hide Details

Expecting sub string: size = 1 Matched

Hide Details

Expecting sub string: type = w Matched

Hide Details

runCmd: expr unsigned val = g_char_ptr[7]; val output: (unsigned int) $1 = 0

Hide Details

Hide Details

looking at: (unsigned int) $1 = 0

Hide Details

Expecting end string: = 0 Matched

Hide Details

runCmd: watchpoint list -v output: Number of supported hardware watchpoints: 4 Current watchpoints: Watchpoint 1: addr = 0x100200367 size = 1 state = enabled type = w new value: 0x0000001002000000 hw_index = -1 hit_count = 0 ignore_count = 0

Hide Details

Hide Details

Expecting sub string: hit_count = 0 Matched

Hide Details

runCmd: process continue output: Process 88378 resuming Process 88378 stopped * thread #2, stop reason = watchpoint 1 frame #0: 0x0000000100000d92 a.out`do_bad_thing_with_location(index=7, char_ptr="", new_val='c') at main.cpp:36:1 33 unsigned what = new_val; 34 printf("new value written to array(%p) and index(%u) = %u\n", char_ptr, index, what); 35 char_ptr[index] = new_val; -> 36 } ^ 37 38 uint32_t 39 access_pool (bool flag = false) thread #4, stop reason = watchpoint 1 frame #0: 0x0000000100000d92 a.out`do_bad_thing_with_location(index=7, char_ptr="", new_val='c') at main.cpp:36:1 33 unsigned what = new_val; 34 printf("new value written to array(%p) and index(%u) = %u\n", char_ptr, index, what); 35 char_ptr[index] = new_val; -> 36 } ^ 37 38 uint32_t 39 access_pool (bool flag = false)

Hide Details

Hide Details

Hide Details

runCmd: thread list output: Process 88378 stopped thread #1: tid = 0x1e6aed1, 0x00007fff5ca0936a libsystem_kernel.dylib`__ulock_wait + 10, queue = 'com.apple.main-thread' * thread #2: tid = 0x1e6b057, 0x0000000100000d92 a.out`do_bad_thing_with_location(index=7, char_ptr="", new_val='c') at main.cpp:36:1, stop reason = watchpoint 1 thread #3: tid = 0x1e6b058, 0x00007fff5ca09872 libsystem_kernel.dylib`__psynch_mutexwait + 10 thread #4: tid = 0x1e6b059, 0x0000000100000d92 a.out`do_bad_thing_with_location(index=7, char_ptr="", new_val='c') at main.cpp:36:1, stop reason = watchpoint 1

Hide Details

Hide Details

Expecting sub string: stopped Matched

Hide Details

Expecting sub string: stop reason = watchpoint Matched

Hide Details

Expecting sub string: do_bad_thing_with_location Matched

Hide Details

runCmd: thread list output: Process 88378 stopped thread #1: tid = 0x1e6aed1, 0x00007fff5ca0936a libsystem_kernel.dylib`__ulock_wait + 10, queue = 'com.apple.main-thread' * thread #2: tid = 0x1e6b057, 0x0000000100000d92 a.out`do_bad_thing_with_location(index=7, char_ptr="", new_val='c') at main.cpp:36:1, stop reason = watchpoint 1 thread #3: tid = 0x1e6b058, 0x00007fff5ca09872 libsystem_kernel.dylib`__psynch_mutexwait + 10 thread #4: tid = 0x1e6b059, 0x0000000100000d92 a.out`do_bad_thing_with_location(index=7, char_ptr="", new_val='c') at main.cpp:36:1, stop reason = watchpoint 1

Hide Details

Hide Details

runCmd: thread select 2 output:

Hide Details

runCmd: thread select 4 output:

Hide Details

runCmd: thread backtrace output: * thread #4, stop reason = watchpoint 1 * frame #0: 0x0000000100000d92 a.out`do_bad_thing_with_location(index=7, char_ptr="", new_val='c') at main.cpp:36:1 frame #1: 0x0000000100000e4e a.out`access_pool(flag=true) at main.cpp:53:9 frame #2: 0x0000000100000f35 a.out`thread_func(thread_index=2) at main.cpp:80:19 frame #3: 0x00000001000027c4 a.out`decltype(__f=0x0000000100202bd8, __args=0x0000000100202be0)(unsigned int)>(fp)(std::__1::forward<long>(fp0))) std::__1::__invoke<void (*)(unsigned int), long>(void (*&&)(unsigned int), long&&) at type_traits:3528:1 frame #4: 0x000000010000270e a.out`void std::__1::__thread_execute<std::__1::unique_ptr<std::__1::__thread_struct, std::__1::default_delete<std::__1::__thread_struct> >, void (*)(unsigned int), long, 2ul>(__t=size=3, (null)=__tuple_indices<2> @ 0x000070000c7a1eb8)(unsigned int), long>&, std::__1::__tuple_indices<2ul>) at thread:273:5 frame #5: 0x0000000100001f16 a.out`void* std::__1::__thread_proxy<std::__1::tuple<std::__1::unique_ptr<std::__1::__thread_struct, std::__1::default_delete<std::__1::__thread_struct> >, void (*)(unsigned int), long> >(__vp=0x0000000100202bd0) at thread:283:5 frame #6: 0x00007fff5cac033d libsystem_pthread.dylib`_pthread_body + 126 frame #7: 0x00007fff5cac32a7 libsystem_pthread.dylib`_pthread_start + 70 frame #8: 0x00007fff5cabf425 libsystem_pthread.dylib`thread_start + 13

Hide Details

Hide Details

runCmd: expr unsigned val = g_char_ptr[7]; val output: (unsigned int) $2 = 99

Hide Details

Hide Details

looking at: (unsigned int) $2 = 99

Hide Details

Expecting end string: = 99 Matched

Hide Details

runCmd: watchpoint list -v output: Number of supported hardware watchpoints: 4 Current watchpoints: Watchpoint 1: addr = 0x100200367 size = 1 state = enabled type = w old value: 0x0000001002000063 new value: 0x0000001002000063 hw_index = 0 hit_count = 2 ignore_count = 0

Hide Details

Hide Details

Expecting sub string: hit_count = 2 Matched

Hide Details

runCmd: thread backtrace all output: thread #1, queue = 'com.apple.main-thread' frame #0: 0x00007fff5ca0936a libsystem_kernel.dylib`__ulock_wait + 10 frame #1: 0x00007fff5cac470b libsystem_pthread.dylib`_pthread_join + 356 frame #2: 0x00007fff59fee978 libc++.1.dylib`std::__1::thread::join() + 24 frame #3: 0x000000010000127f a.out`main(argc=1, argv=0x00007ffeefbff5b0) at main.cpp:110:16 frame #4: 0x00007fff5c8ce085 libdyld.dylib`start + 1 thread #2, stop reason = watchpoint 1 frame #0: 0x0000000100000d92 a.out`do_bad_thing_with_location(index=7, char_ptr="", new_val='c') at main.cpp:36:1 frame #1: 0x0000000100000e4e a.out`access_pool(flag=true) at main.cpp:53:9 frame #2: 0x0000000100000f35 a.out`thread_func(thread_index=0) at main.cpp:80:19 frame #3: 0x00000001000027c4 a.out`decltype(__f=0x00000001002023b8, __args=0x00000001002023c0)(unsigned int)>(fp)(std::__1::forward<long>(fp0))) std::__1::__invoke<void (*)(unsigned int), long>(void (*&&)(unsigned int), long&&) at type_traits:3528:1 frame #4: 0x000000010000270e a.out`void std::__1::__thread_execute<std::__1::unique_ptr<std::__1::__thread_struct, std::__1::default_delete<std::__1::__thread_struct> >, void (*)(unsigned int), long, 2ul>(__t=size=3, (null)=__tuple_indices<2> @ 0x000070000c69beb8)(unsigned int), long>&, std::__1::__tuple_indices<2ul>) at thread:273:5 frame #5: 0x0000000100001f16 a.out`void* std::__1::__thread_proxy<std::__1::tuple<std::__1::unique_ptr<std::__1::__thread_struct, std::__1::default_delete<std::__1::__thread_struct> >, void (*)(unsigned int), long> >(__vp=0x00000001002023b0) at thread:283:5 frame #6: 0x00007fff5cac033d libsystem_pthread.dylib`_pthread_body + 126 frame #7: 0x00007fff5cac32a7 libsystem_pthread.dylib`_pthread_start + 70 frame #8: 0x00007fff5cabf425 libsystem_pthread.dylib`thread_start + 13 thread #3 frame #0: 0x00007fff5ca09872 libsystem_kernel.dylib`__psynch_mutexwait + 10 frame #1: 0x00007fff5cac0da0 libsystem_pthread.dylib`_pthread_mutex_firstfit_lock_wait + 96 frame #2: 0x00007fff5cabe4c7 libsystem_pthread.dylib`_pthread_mutex_firstfit_lock_slow + 226 frame #3: 0x00007fff5c954e6c libsystem_c.dylib`flockfile + 31 frame #4: 0x00007fff5c95d868 libsystem_c.dylib`vfprintf_l + 28 frame #5: 0x00007fff5c95b99a libsystem_c.dylib`printf + 174 frame #6: 0x0000000100000d81 a.out`do_bad_thing_with_location(index=7, char_ptr="", new_val='c') at main.cpp:34:5 frame #7: 0x0000000100000e4e a.out`access_pool(flag=true) at main.cpp:53:9 frame #8: 0x0000000100000f35 a.out`thread_func(thread_index=1) at main.cpp:80:19 frame #9: 0x00000001000027c4 a.out`decltype(__f=0x0000000100202b88, __args=0x0000000100202b90)(unsigned int)>(fp)(std::__1::forward<long>(fp0))) std::__1::__invoke<void (*)(unsigned int), long>(void (*&&)(unsigned int), long&&) at type_traits:3528:1 frame #10: 0x000000010000270e a.out`void std::__1::__thread_execute<std::__1::unique_ptr<std::__1::__thread_struct, std::__1::default_delete<std::__1::__thread_struct> >, void (*)(unsigned int), long, 2ul>(__t=size=3, (null)=__tuple_indices<2> @ 0x000070000c71eeb8)(unsigned int), long>&, std::__1::__tuple_indices<2ul>) at thread:273:5 frame #11: 0x0000000100001f16 a.out`void* std::__1::__thread_proxy<std::__1::tuple<std::__1::unique_ptr<std::__1::__thread_struct, std::__1::default_delete<std::__1::__thread_struct> >, void (*)(unsigned int), long> >(__vp=0x0000000100202b80) at thread:283:5 frame #12: 0x00007fff5cac033d libsystem_pthread.dylib`_pthread_body + 126 frame #13: 0x00007fff5cac32a7 libsystem_pthread.dylib`_pthread_start + 70 frame #14: 0x00007fff5cabf425 libsystem_pthread.dylib`thread_start + 13 * thread #4, stop reason = watchpoint 1 * frame #0: 0x0000000100000d92 a.out`do_bad_thing_with_location(index=7, char_ptr="", new_val='c') at main.cpp:36:1 frame #1: 0x0000000100000e4e a.out`access_pool(flag=true) at main.cpp:53:9 frame #2: 0x0000000100000f35 a.out`thread_func(thread_index=2) at main.cpp:80:19 frame #3: 0x00000001000027c4 a.out`decltype(__f=0x0000000100202bd8, __args=0x0000000100202be0)(unsigned int)>(fp)(std::__1::forward<long>(fp0))) std::__1::__invoke<void (*)(unsigned int), long>(void (*&&)(unsigned int), long&&) at type_traits:3528:1 frame #4: 0x000000010000270e a.out`void std::__1::__thread_execute<std::__1::unique_ptr<std::__1::__thread_struct, std::__1::default_delete<std::__1::__thread_struct> >, void (*)(unsigned int), long, 2ul>(__t=size=3, (null)=__tuple_indices<2> @ 0x000070000c7a1eb8)(unsigned int), long>&, std::__1::__tuple_indices<2ul>) at thread:273:5 frame #5: 0x0000000100001f16 a.out`void* std::__1::__thread_proxy<std::__1::tuple<std::__1::unique_ptr<std::__1::__thread_struct, std::__1::default_delete<std::__1::__thread_struct> >, void (*)(unsigned int), long> >(__vp=0x0000000100202bd0) at thread:283:5 frame #6: 0x00007fff5cac033d libsystem_pthread.dylib`_pthread_body + 126 frame #7: 0x00007fff5cac32a7 libsystem_pthread.dylib`_pthread_start + 70 frame #8: 0x00007fff5cabf425 libsystem_pthread.dylib`thread_start + 13

Hide Details

Hide Details

<bound method SBProcess.Kill of <lldb.SBProcess; proxy of <Swig Object of type 'lldb::SBProcess *' at 0x108765a80> >>: success

Hide Details

PASS: LLDB (/Users/buildslave/jenkins/workspace/lldb-cmake/lldb-build/bin/clang-10-x86_64) :: test_watchlocation_using_watchpoint_set_dsym (TestWatchLocationWithWatchSet.WatchLocationUsingWatchpointSetTestCase) runCmd: settings set symbols.enable-external-lookup false output:

Hide Details

runCmd: settings set plugin.process.gdb-remote.packet-timeout 60 output:

Hide Details

runCmd: settings set symbols.clang-modules-cache-path "/Users/buildslave/jenkins/workspace/lldb-cmake/lldb-build/lldb-test-build.noindex/module-cache-lldb/lldb-api" output:

Hide Details

runCmd: settings set use-color false output:

Hide Details

runCmd: file /Users/buildslave/jenkins/workspace/lldb-cmake/lldb-build/lldb-test-build.noindex/commands/watchpoints/watchpoint_set_command/TestWatchLocationWithWatchSet.test_watchlocation_using_watchpoint_set_dwarf/a.out output: Current executable set to '/Users/buildslave/jenkins/workspace/lldb-cmake/lldb-build/lldb-test-build.noindex/commands/watchpoints/watchpoint_set_command/TestWatchLocationWithWatchSet.test_watchlocation_using_watchpoint_set_dwarf/a.out' (x86_64).

Hide Details

Hide Details

runCmd: breakpoint set -l 105 output: Breakpoint 1: where = a.out`main + 391 at main.cpp:105:5, address = 0x0000000100001207

Hide Details

Hide Details

Expecting pattern: ^Breakpoint (?P<bpno>[0-9]+): (?P<num_locations>[0-9]+) locations\.$ Not matched

Hide Details

Expecting pattern: ^Breakpoint (?P<bpno>[0-9]+): (?P<num_locations>no) locations \(pending\)\. Not matched

Hide Details

Expecting pattern: ^Breakpoint (?P<bpno>[0-9]+): where = (?P<module>.*)`(?P<symbol>[+\-]{0,1}[^+]+)( \+ (?P<offset>[0-9]+)){0,1}( \[inlined\] (?P<inline_symbol>.*)){0,1} at (?P<file>[^:]+):(?P<line_no>[0-9]+)(?P<column>(:[0-9]+)?), address = (?P<address>0x[0-9a-fA-F]+)$ Matched

Hide Details

runCmd: run output: Process 94315 stopped * thread #1, queue = 'com.apple.main-thread', stop reason = breakpoint 1.1 frame #0: 0x0000000100001207 a.out`main(argc=1, argv=0x00007ffeefbff5b0) at main.cpp:105:5 102 int c; 103 } MyAggregateDataType; 104 -> 105 printf ("Before turning all three threads loose...\n"); // Set break point at this line. ^ 106 barrier_wait(); 107 108 // Join all of our threads

Hide Details

Process 94315 launched: '/Users/buildslave/jenkins/workspace/lldb-cmake/lldb-build/lldb-test-build.noindex/commands/watchpoints/watchpoint_set_command/TestWatchLocationWithWatchSet.test_watchlocation_using_watchpoint_set_dwarf/a.out' (x86_64)

Hide Details

Hide Details

runCmd: thread list output: Process 94315 stopped * thread #1: tid = 0x1e6d72e, 0x0000000100001207 a.out`main(argc=1, argv=0x00007ffeefbff5b0) at main.cpp:105:5, queue = 'com.apple.main-thread', stop reason = breakpoint 1.1 thread #2: tid = 0x1e6d864, 0x00007fff5c94d0ff libsystem_c.dylib`localeconv_l + 89 thread #3: tid = 0x1e6d865, 0x00007fff5ca09872 libsystem_kernel.dylib`__psynch_mutexwait + 10 thread #4: tid = 0x1e6d866, 0x00007fff5ca09872 libsystem_kernel.dylib`__psynch_mutexwait + 10

Hide Details

Hide Details

Expecting sub string: stopped Matched

Hide Details

Expecting sub string: stop reason = breakpoint Matched

Hide Details

runCmd: watchpoint set expression -w write -s 1 -- g_char_ptr + 7 runCmd failed! error: expression evaluation of address to watch failed expression evaluated: g_char_ptr + 7

Hide Details

Hide Details

FAIL: LLDB (/Users/buildslave/jenkins/workspace/lldb-cmake/lldb-build/bin/clang-10-x86_64) :: test_watchlocation_using_watchpoint_set_dwarf (TestWatchLocationWithWatchSet.WatchLocationUsingWatchpointSetTestCase) <bound method SBProcess.Kill of <lldb.SBProcess; proxy of <Swig Object of type 'lldb::SBProcess *' at 0x108776060> >>: success

Hide Details

UNSUPPORTED: LLDB (/Users/buildslave/jenkins/workspace/lldb-cmake/lldb-build/bin/clang-10-x86_64) :: test_watchlocation_using_watchpoint_set_dwo (TestWatchLocationWithWatchSet.WatchLocationUsingWatchpointSetTestCase) (test case does not fall in any category of interest for this run) runCmd: settings set symbols.enable-external-lookup false output:

Hide Details

runCmd: settings set plugin.process.gdb-remote.packet-timeout 60 output:

Hide Details

runCmd: settings set symbols.clang-modules-cache-path "/Users/buildslave/jenkins/workspace/lldb-cmake/lldb-build/lldb-test-build.noindex/module-cache-lldb/lldb-api" output:

Hide Details

runCmd: settings set use-color false output:

Hide Details

runCmd: file /Users/buildslave/jenkins/workspace/lldb-cmake/lldb-build/lldb-test-build.noindex/commands/watchpoints/watchpoint_set_command/TestWatchLocationWithWatchSet.test_watchlocation_using_watchpoint_set_gmodules/a.out output: Current executable set to '/Users/buildslave/jenkins/workspace/lldb-cmake/lldb-build/lldb-test-build.noindex/commands/watchpoints/watchpoint_set_command/TestWatchLocationWithWatchSet.test_watchlocation_using_watchpoint_set_gmodules/a.out' (x86_64).

Hide Details

Hide Details

runCmd: breakpoint set -l 105 output: Breakpoint 1: where = a.out`main + 391 at main.cpp:105:5, address = 0x0000000100001207

Hide Details

Hide Details

Expecting pattern: ^Breakpoint (?P<bpno>[0-9]+): (?P<num_locations>[0-9]+) locations\.$ Not matched

Hide Details

Expecting pattern: ^Breakpoint (?P<bpno>[0-9]+): (?P<num_locations>no) locations \(pending\)\. Not matched

Hide Details

Expecting pattern: ^Breakpoint (?P<bpno>[0-9]+): where = (?P<module>.*)`(?P<symbol>[+\-]{0,1}[^+]+)( \+ (?P<offset>[0-9]+)){0,1}( \[inlined\] (?P<inline_symbol>.*)){0,1} at (?P<file>[^:]+):(?P<line_no>[0-9]+)(?P<column>(:[0-9]+)?), address = (?P<address>0x[0-9a-fA-F]+)$ Matched

Hide Details

runCmd: run output: Process 13174 stopped * thread #1, queue = 'com.apple.main-thread', stop reason = breakpoint 1.1 frame #0: 0x0000000100001207 a.out`main(argc=1, argv=0x00007ffeefbff5a0) at main.cpp:105:5 102 int c; 103 } MyAggregateDataType; 104 -> 105 printf ("Before turning all three threads loose...\n"); // Set break point at this line. ^ 106 barrier_wait(); 107 108 // Join all of our threads

Hide Details

Process 13174 launched: '/Users/buildslave/jenkins/workspace/lldb-cmake/lldb-build/lldb-test-build.noindex/commands/watchpoints/watchpoint_set_command/TestWatchLocationWithWatchSet.test_watchlocation_using_watchpoint_set_gmodules/a.out' (x86_64)

Hide Details

Hide Details

runCmd: thread list output: Process 13174 stopped * thread #1: tid = 0x1e756dc, 0x0000000100001207 a.out`main(argc=1, argv=0x00007ffeefbff5a0) at main.cpp:105:5, queue = 'com.apple.main-thread', stop reason = breakpoint 1.1 thread #2: tid = 0x1e75865, 0x00007fff5ca06b76 libsystem_kernel.dylib`_kernelrpc_mach_vm_map_trap + 10 thread #3: tid = 0x1e75866, 0x00007fff5ca09872 libsystem_kernel.dylib`__psynch_mutexwait + 10 thread #4: tid = 0x1e75867, 0x00007fff5ca09872 libsystem_kernel.dylib`__psynch_mutexwait + 10

Hide Details

Hide Details

Expecting sub string: stopped Matched

Hide Details

Expecting sub string: stop reason = breakpoint Matched

Hide Details

runCmd: watchpoint set expression -w write -s 1 -- g_char_ptr + 7 output: Watchpoint created: Watchpoint 1: addr = 0x100200367 size = 1 state = enabled type = w new value: 0x0000001002000000

Hide Details

Hide Details

Expecting sub string: Watchpoint created Matched

Hide Details

Expecting sub string: size = 1 Matched

Hide Details

Expecting sub string: type = w Matched

Hide Details

runCmd: expr unsigned val = g_char_ptr[7]; val output: (unsigned int) $1 = 0

Hide Details

Hide Details

looking at: (unsigned int) $1 = 0

Hide Details

Expecting end string: = 0 Matched

Hide Details

runCmd: watchpoint list -v output: Number of supported hardware watchpoints: 4 Current watchpoints: Watchpoint 1: addr = 0x100200367 size = 1 state = enabled type = w new value: 0x0000001002000000 hw_index = -1 hit_count = 0 ignore_count = 0

Hide Details

Hide Details

Expecting sub string: hit_count = 0 Matched

Hide Details

runCmd: process continue output: Process 13174 resuming Process 13174 stopped * thread #4, stop reason = watchpoint 1 frame #0: 0x0000000100000d92 a.out`do_bad_thing_with_location(index=7, char_ptr="", new_val='c') at main.cpp:36:1 33 unsigned what = new_val; 34 printf("new value written to array(%p) and index(%u) = %u\n", char_ptr, index, what); 35 char_ptr[index] = new_val; -> 36 } ^ 37 38 uint32_t 39 access_pool (bool flag = false)

Hide Details

Hide Details

Hide Details

runCmd: thread list output: Process 13174 stopped thread #1: tid = 0x1e756dc, 0x00007fff5ca0936a libsystem_kernel.dylib`__ulock_wait + 10, queue = 'com.apple.main-thread' thread #2: tid = 0x1e75865, 0x00007fff5ca09872 libsystem_kernel.dylib`__psynch_mutexwait + 10 thread #3: tid = 0x1e75866, 0x00007fff5ca0988a libsystem_kernel.dylib`__psynch_mutexdrop + 10 * thread #4: tid = 0x1e75867, 0x0000000100000d92 a.out`do_bad_thing_with_location(index=7, char_ptr="", new_val='c') at main.cpp:36:1, stop reason = watchpoint 1

Hide Details

Hide Details

Expecting sub string: stopped Matched

Hide Details

Expecting sub string: stop reason = watchpoint Matched

Hide Details

Expecting sub string: do_bad_thing_with_location Matched

Hide Details

runCmd: thread list output: Process 13174 stopped thread #1: tid = 0x1e756dc, 0x00007fff5ca0936a libsystem_kernel.dylib`__ulock_wait + 10, queue = 'com.apple.main-thread' thread #2: tid = 0x1e75865, 0x00007fff5ca09872 libsystem_kernel.dylib`__psynch_mutexwait + 10 thread #3: tid = 0x1e75866, 0x00007fff5ca0988a libsystem_kernel.dylib`__psynch_mutexdrop + 10 * thread #4: tid = 0x1e75867, 0x0000000100000d92 a.out`do_bad_thing_with_location(index=7, char_ptr="", new_val='c') at main.cpp:36:1, stop reason = watchpoint 1

Hide Details

Hide Details

runCmd: thread select 4 output:

Hide Details

runCmd: thread backtrace output: * thread #4, stop reason = watchpoint 1 * frame #0: 0x0000000100000d92 a.out`do_bad_thing_with_location(index=7, char_ptr="", new_val='c') at main.cpp:36:1 frame #1: 0x0000000100000e4e a.out`access_pool(flag=true) at main.cpp:53:9 frame #2: 0x0000000100000f35 a.out`thread_func(thread_index=2) at main.cpp:80:19 frame #3: 0x00000001000027c4 a.out`decltype(__f=0x0000000100202508, __args=0x0000000100202510)(unsigned int)>(fp)(std::__1::forward<long>(fp0))) std::__1::__invoke<void (*)(unsigned int), long>(void (*&&)(unsigned int), long&&) at type_traits:3528:1 frame #4: 0x000000010000270e a.out`void std::__1::__thread_execute<std::__1::unique_ptr<std::__1::__thread_struct, std::__1::default_delete<std::__1::__thread_struct> >, void (*)(unsigned int), long, 2ul>(__t=size=3, (null)=__tuple_indices<2> @ 0x000070000b421eb8)(unsigned int), long>&, std::__1::__tuple_indices<2ul>) at thread:273:5 frame #5: 0x0000000100001f16 a.out`void* std::__1::__thread_proxy<std::__1::tuple<std::__1::unique_ptr<std::__1::__thread_struct, std::__1::default_delete<std::__1::__thread_struct> >, void (*)(unsigned int), long> >(__vp=0x0000000100202500) at thread:283:5 frame #6: 0x00007fff5cac033d libsystem_pthread.dylib`_pthread_body + 126 frame #7: 0x00007fff5cac32a7 libsystem_pthread.dylib`_pthread_start + 70 frame #8: 0x00007fff5cabf425 libsystem_pthread.dylib`thread_start + 13

Hide Details

Hide Details

runCmd: expr unsigned val = g_char_ptr[7]; val output: (unsigned int) $2 = 99

Hide Details

Hide Details

looking at: (unsigned int) $2 = 99

Hide Details

Expecting end string: = 99 Matched

Hide Details

runCmd: watchpoint list -v output: Number of supported hardware watchpoints: 4 Current watchpoints: Watchpoint 1: addr = 0x100200367 size = 1 state = enabled type = w old value: 0x0000001002000000 new value: 0x0000001002000063 hw_index = 0 hit_count = 1 ignore_count = 0

Hide Details

Hide Details

Expecting sub string: hit_count = 1 Matched

Hide Details

runCmd: thread backtrace all output: thread #1, queue = 'com.apple.main-thread' frame #0: 0x00007fff5ca0936a libsystem_kernel.dylib`__ulock_wait + 10 frame #1: 0x00007fff5cac470b libsystem_pthread.dylib`_pthread_join + 356 frame #2: 0x00007fff59fee978 libc++.1.dylib`std::__1::thread::join() + 24 frame #3: 0x000000010000127f a.out`main(argc=1, argv=0x00007ffeefbff5a0) at main.cpp:110:16 frame #4: 0x00007fff5c8ce085 libdyld.dylib`start + 1 thread #2 frame #0: 0x00007fff5ca09872 libsystem_kernel.dylib`__psynch_mutexwait + 10 frame #1: 0x00007fff5cac0da0 libsystem_pthread.dylib`_pthread_mutex_firstfit_lock_wait + 96 frame #2: 0x00007fff5cabe4c7 libsystem_pthread.dylib`_pthread_mutex_firstfit_lock_slow + 226 frame #3: 0x00007fff5c954e6c libsystem_c.dylib`flockfile + 31 frame #4: 0x00007fff5c95d868 libsystem_c.dylib`vfprintf_l + 28 frame #5: 0x00007fff5c95b99a libsystem_c.dylib`printf + 174 frame #6: 0x0000000100000d81 a.out`do_bad_thing_with_location(index=7, char_ptr="", new_val='c') at main.cpp:34:5 frame #7: 0x0000000100000e4e a.out`access_pool(flag=true) at main.cpp:53:9 frame #8: 0x0000000100000f35 a.out`thread_func(thread_index=0) at main.cpp:80:19 frame #9: 0x00000001000027c4 a.out`decltype(__f=0x0000000100202388, __args=0x0000000100202390)(unsigned int)>(fp)(std::__1::forward<long>(fp0))) std::__1::__invoke<void (*)(unsigned int), long>(void (*&&)(unsigned int), long&&) at type_traits:3528:1 frame #10: 0x000000010000270e a.out`void std::__1::__thread_execute<std::__1::unique_ptr<std::__1::__thread_struct, std::__1::default_delete<std::__1::__thread_struct> >, void (*)(unsigned int), long, 2ul>(__t=size=3, (null)=__tuple_indices<2> @ 0x000070000b31beb8)(unsigned int), long>&, std::__1::__tuple_indices<2ul>) at thread:273:5 frame #11: 0x0000000100001f16 a.out`void* std::__1::__thread_proxy<std::__1::tuple<std::__1::unique_ptr<std::__1::__thread_struct, std::__1::default_delete<std::__1::__thread_struct> >, void (*)(unsigned int), long> >(__vp=0x0000000100202380) at thread:283:5 frame #12: 0x00007fff5cac033d libsystem_pthread.dylib`_pthread_body + 126 frame #13: 0x00007fff5cac32a7 libsystem_pthread.dylib`_pthread_start + 70 frame #14: 0x00007fff5cabf425 libsystem_pthread.dylib`thread_start + 13 thread #3 frame #0: 0x00007fff5ca0988a libsystem_kernel.dylib`__psynch_mutexdrop + 10 frame #1: 0x00007fff5cac0e18 libsystem_pthread.dylib`_pthread_mutex_firstfit_wake + 22 frame #2: 0x00007fff5cabe6a6 libsystem_pthread.dylib`_pthread_mutex_firstfit_unlock_slow + 256 frame #3: 0x00007fff5c954ed4 libsystem_c.dylib`funlockfile + 31 frame #4: 0x00007fff5c95d88d libsystem_c.dylib`vfprintf_l + 65 frame #5: 0x00007fff5c95b99a libsystem_c.dylib`printf + 174 frame #6: 0x0000000100000d81 a.out`do_bad_thing_with_location(index=7, char_ptr="", new_val='c') at main.cpp:34:5 frame #7: 0x0000000100000e4e a.out`access_pool(flag=true) at main.cpp:53:9 frame #8: 0x0000000100000f35 a.out`thread_func(thread_index=1) at main.cpp:80:19 frame #9: 0x00000001000027c4 a.out`decltype(__f=0x00000001002024b8, __args=0x00000001002024c0)(unsigned int)>(fp)(std::__1::forward<long>(fp0))) std::__1::__invoke<void (*)(unsigned int), long>(void (*&&)(unsigned int), long&&) at type_traits:3528:1 frame #10: 0x000000010000270e a.out`void std::__1::__thread_execute<std::__1::unique_ptr<std::__1::__thread_struct, std::__1::default_delete<std::__1::__thread_struct> >, void (*)(unsigned int), long, 2ul>(__t=size=3, (null)=__tuple_indices<2> @ 0x000070000b39eeb8)(unsigned int), long>&, std::__1::__tuple_indices<2ul>) at thread:273:5 frame #11: 0x0000000100001f16 a.out`void* std::__1::__thread_proxy<std::__1::tuple<std::__1::unique_ptr<std::__1::__thread_struct, std::__1::default_delete<std::__1::__thread_struct> >, void (*)(unsigned int), long> >(__vp=0x00000001002024b0) at thread:283:5 frame #12: 0x00007fff5cac033d libsystem_pthread.dylib`_pthread_body + 126 frame #13: 0x00007fff5cac32a7 libsystem_pthread.dylib`_pthread_start + 70 frame #14: 0x00007fff5cabf425 libsystem_pthread.dylib`thread_start + 13 * thread #4, stop reason = watchpoint 1 * frame #0: 0x0000000100000d92 a.out`do_bad_thing_with_location(index=7, char_ptr="", new_val='c') at main.cpp:36:1 frame #1: 0x0000000100000e4e a.out`access_pool(flag=true) at main.cpp:53:9 frame #2: 0x0000000100000f35 a.out`thread_func(thread_index=2) at main.cpp:80:19 frame #3: 0x00000001000027c4 a.out`decltype(__f=0x0000000100202508, __args=0x0000000100202510)(unsigned int)>(fp)(std::__1::forward<long>(fp0))) std::__1::__invoke<void (*)(unsigned int), long>(void (*&&)(unsigned int), long&&) at type_traits:3528:1 frame #4: 0x000000010000270e a.out`void std::__1::__thread_execute<std::__1::unique_ptr<std::__1::__thread_struct, std::__1::default_delete<std::__1::__thread_struct> >, void (*)(unsigned int), long, 2ul>(__t=size=3, (null)=__tuple_indices<2> @ 0x000070000b421eb8)(unsigned int), long>&, std::__1::__tuple_indices<2ul>) at thread:273:5 frame #5: 0x0000000100001f16 a.out`void* std::__1::__thread_proxy<std::__1::tuple<std::__1::unique_ptr<std::__1::__thread_struct, std::__1::default_delete<std::__1::__thread_struct> >, void (*)(unsigned int), long> >(__vp=0x0000000100202500) at thread:283:5 frame #6: 0x00007fff5cac033d libsystem_pthread.dylib`_pthread_body + 126 frame #7: 0x00007fff5cac32a7 libsystem_pthread.dylib`_pthread_start + 70 frame #8: 0x00007fff5cabf425 libsystem_pthread.dylib`thread_start + 13

Hide Details

Hide Details

<bound method SBProcess.Kill of <lldb.SBProcess; proxy of <Swig Object of type 'lldb::SBProcess *' at 0x10f4f2870> >>: success

Hide Details

PASS: LLDB (/Users/buildslave/jenkins/workspace/lldb-cmake/lldb-build/bin/clang-10-x86_64) :: test_watchlocation_using_watchpoint_set_gmodules (TestWatchLocationWithWatchSet.WatchLocationUsingWatchpointSetTestCase) Restore dir to: /Users/buildslave/jenkins/workspace/lldb-cmake/lldb-build/tools/lldb/test ====================================================================== FAIL: test_watchlocation_using_watchpoint_set_dwarf (TestWatchLocationWithWatchSet.WatchLocationUsingWatchpointSetTestCase) Test watching a location with 'watchpoint set expression -w write -s size' option. ---------------------------------------------------------------------- Traceback (most recent call last): File "/Users/buildslave/jenkins/workspace/lldb-cmake/llvm-project/lldb/packages/Python/lldbsuite/test/lldbtest.py", line 1732, in test_method return attrvalue(self) File "/Users/buildslave/jenkins/workspace/lldb-cmake/llvm-project/lldb/packages/Python/lldbsuite/test/decorators.py", line 111, in wrapper func(*args, **kwargs) File "/Users/buildslave/jenkins/workspace/lldb-cmake/llvm-project/lldb/packages/Python/lldbsuite/test/decorators.py", line 111, in wrapper func(*args, **kwargs) File "/Users/buildslave/jenkins/workspace/lldb-cmake/llvm-project/lldb/packages/Python/lldbsuite/test/commands/watchpoints/watchpoint_set_command/TestWatchLocationWithWatchSet.py", line 69, in test_watchlocation_using_watchpoint_set 'type = w']) File "/Users/buildslave/jenkins/workspace/lldb-cmake/llvm-project/lldb/packages/Python/lldbsuite/test/lldbtest.py", line 2302, in expect inHistory=inHistory) File "/Users/buildslave/jenkins/workspace/lldb-cmake/llvm-project/lldb/packages/Python/lldbsuite/test/lldbtest.py", line 2061, in runCmd msg if (msg) else CMD_MSG(cmd)) AssertionError: False is not True : Watchpoint created successfully Error output: error: expression evaluation of address to watch failed expression evaluated: g_char_ptr + 7

Hide Details

Config=x86_64-/Users/buildslave/jenkins/workspace/lldb-cmake/lldb-build/bin/clang-10 ---------------------------------------------------------------------- Ran 4 tests in 52.137s

Hide Details

RESULT: FAILED (2 passes, 1 failures, 0 errors, 1 skipped, 0 expected failures, 0 unexpected successes)

Hide Details

******************** PASS: lldb-api :: functionalities/breakpoint/cpp_exception/TestCPPExceptionBreakpoint.py (1059 of 1807) PASS: lldb-api :: lang/cpp/symbols/TestSymbols.py (1060 of 1807) PASS: lldb-api :: functionalities/data-formatter/format-propagation/TestFormatPropagation.py (1061 of 1807) PASS: lldb-api :: commands/expression/unicode-in-variable/TestUnicodeInVariable.py (1062 of 1807) PASS: lldb-unit :: Language/Highlighting/./HighlighterTests/HighlighterTest.ClangEmptyInput (1063 of 1807) PASS: lldb-unit :: Utility/./UtilityTests/UriParserTest.MinimalPortPath (1064 of 1807) PASS: lldb-api :: commands/expression/import-std-module/vector-of-vectors/TestVectorOfVectors.py (1065 of 1807) PASS: lldb-api :: functionalities/modern-type-lookup/objc-modules/TestObjModulesModernTypeLookup.py (1066 of 1807) PASS: lldb-unit :: UnwindAssembly/x86/./UnwindAssemblyx86Tests/Testx86AssemblyInspectionEngine.Testi386IgnoredRegisters (1067 of 1807) PASS: lldb-api :: macosx/find-dsym/deep-bundle/TestDeepBundle.py (1068 of 1807) PASS: lldb-api :: functionalities/data-formatter/data-formatter-stl/libcxx/variant/TestDataFormatterLibcxxVariant.py (1069 of 1807) PASS: lldb-shell :: Breakpoint/debug_rnglist_offset_pair.test (1070 of 1807) PASS: lldb-unit :: Process/gdb-remote/./ProcessGdbRemoteTests/GDBRemoteCommunicationClientTest.SendGetMetaDataPacket (1071 of 1807) PASS: lldb-unit :: Language/Highlighting/./HighlighterTests/HighlighterTest.ClangBraces (1072 of 1807) PASS: lldb-api :: functionalities/postmortem/minidump/TestMiniDump.py (1073 of 1807) UNSUPPORTED: lldb-api :: linux/add-symbols/TestTargetSymbolsAddCommand.py (1074 of 1807) PASS: lldb-api :: commands/command/nested_alias/TestNestedAlias.py (1075 of 1807) PASS: lldb-unit :: UnwindAssembly/ARM64/./Arm64InstEmulationTests/TestArm64InstEmulation.TestMediumDarwinFunction (1076 of 1807) PASS: lldb-unit :: Utility/./UtilityTests/StringExtractorTest.GetHexBytes_OddPair2 (1077 of 1807) PASS: lldb-unit :: Process/minidump/./LLDBMinidumpTests/MinidumpParserTest.MinidumpDuplicateModuleMinAddress (1078 of 1807) UNSUPPORTED: lldb-api :: lang/cpp/printf/TestPrintf.py (1079 of 1807) PASS: lldb-api :: commands/expression/import-std-module/forward_list-basic/TestBasicForwardList.py (1080 of 1807) PASS: lldb-unit :: Process/gdb-remote/./ProcessGdbRemoteTests/GDBRemoteCommunicationTest.ReadPacket_checksum (1081 of 1807) PASS: lldb-unit :: Utility/./UtilityTests/StringListTest.ShiftMove (1082 of 1807) PASS: lldb-api :: commands/expression/persistent_types/TestPersistentTypes.py (1083 of 1807) PASS: lldb-unit :: Utility/./UtilityTests/ListenerTest.GetEventWait (1084 of 1807) PASS: lldb-shell :: Minidump/Windows/broken-unwind.test (1085 of 1807) PASS: lldb-unit :: Utility/./UtilityTests/RangeTest.LessThanInvalid (1086 of 1807) PASS: lldb-unit :: Utility/./UtilityTests/NameMatchesTest.EndsWith (1087 of 1807) PASS: lldb-api :: lang/objcxx/cxx-bridged-po/TestObjCXXBridgedPO.py (1088 of 1807) PASS: lldb-unit :: Utility/./UtilityTests/BinaryStreamTest.PutSLEB128ThreeBytes (1089 of 1807) PASS: lldb-api :: python_api/sbvalue_const_addrof/TestSBValueConstAddrOf.py (1090 of 1807) PASS: lldb-api :: lang/c/function_types/TestFunctionTypes.py (1091 of 1807) UNSUPPORTED: lldb-api :: functionalities/thread/concurrent_events/TestConcurrentManySignals.py (1092 of 1807) UNSUPPORTED: lldb-shell :: SymbolFile/PDB/pointers.test (1093 of 1807) PASS: lldb-unit :: Utility/./UtilityTests/UriParserTest.BracketedHostnamePort (1094 of 1807) PASS: lldb-api :: functionalities/data-formatter/data-formatter-synthval/TestDataFormatterSynthVal.py (1095 of 1807) PASS: lldb-unit :: Process/minidump/./LLDBMinidumpTests/MinidumpParserTest.GetThreadContext_x86_64 (1096 of 1807) PASS: lldb-unit :: ScriptInterpreter/Python/./ScriptInterpreterPythonTests/PythonDataObjectsTest.TestPythonListValueEquality (1097 of 1807) PASS: lldb-unit :: Expression/./ExpressionTests/DWARFExpression.DW_OP_convert (1098 of 1807) PASS: lldb-unit :: Utility/./UtilityTests/StreamTeeTest.Assignment (1099 of 1807) PASS: lldb-api :: lang/objc/foundation/TestObjCMethods2.py (1100 of 1807) UNSUPPORTED: lldb-shell :: SymbolFile/PDB/function-level-linking.test (1101 of 1807) PASS: lldb-shell :: SymbolFile/DWARF/parallel-indexing-stress.s (1102 of 1807) PASS: lldb-unit :: Utility/./UtilityTests/StringLexerTest.GetUnlexed (1103 of 1807) PASS: lldb-unit :: Utility/./UtilityTests/StructuredDataTest.ParseJSONFromFile (1104 of 1807) PASS: lldb-api :: tools/lldb-vscode/variables/TestVSCode_variables.py (1105 of 1807) PASS: lldb-api :: functionalities/data-formatter/data-formatter-stl/libcxx/string/TestDataFormatterLibcxxString.py (1106 of 1807) PASS: lldb-unit :: Utility/./UtilityTests/ConstStringTest.NullAndEmptyStates (1107 of 1807) PASS: lldb-unit :: Utility/./UtilityTests/UriParserTest.BadPort (1108 of 1807) PASS: lldb-unit :: Utility/./UtilityTests/ProcessInstanceInfoMatch.Name (1109 of 1807) PASS: lldb-api :: commands/watchpoints/step_over_watchpoint/TestStepOverWatchpoint.py (1110 of 1807) XFAIL: lldb-shell :: Unwind/prefer-debug-over-eh-frame.test (1111 of 1807) PASS: lldb-unit :: Utility/./UtilityTests/GeneratorTest.Get (1112 of 1807) UNSUPPORTED: lldb-api :: arm/breakpoint-thumb-codesection/TestBreakpointThumbCodesection.py (1113 of 1807) PASS: lldb-api :: python_api/interpreter/TestRunCommandInterpreterAPI.py (1114 of 1807) PASS: lldb-shell :: SymbolFile/NativePDB/bitfields.cpp (1115 of 1807) PASS: lldb-unit :: Language/CPlusPlus/./LanguageCPlusPlusTests/CPlusPlusLanguage.MethodNameParsing (1116 of 1807) PASS: lldb-unit :: UnwindAssembly/x86/./UnwindAssemblyx86Tests/Testx86AssemblyInspectionEngine.TestPushECX (1117 of 1807) PASS: lldb-api :: lang/c/shared_lib/TestSharedLib.py (1118 of 1807) PASS: lldb-api :: lang/cpp/dynamic-value/TestCppValueCast.py (1119 of 1807) PASS: lldb-api :: tools/lldb-vscode/stackTrace/TestVSCode_stackTrace.py (1120 of 1807) PASS: lldb-api :: functionalities/inferior-crashing/recursive-inferior/TestRecursiveInferiorStep.py (1121 of 1807) PASS: lldb-shell :: SymbolFile/Breakpad/unwind-via-raSearch.test (1122 of 1807) PASS: lldb-unit :: Utility/./UtilityTests/OptionsWithRawTest.SingleWhitespaceInput (1123 of 1807) PASS: lldb-api :: types/TestIntegerTypes.py (1124 of 1807) PASS: lldb-api :: functionalities/breakpoint/debugbreak/TestDebugBreak.py (1125 of 1807) PASS: lldb-unit :: Host/./HostTests/FileSystemTest.Readable (1126 of 1807) PASS: lldb-unit :: Utility/./UtilityTests/NameMatchesTest.StartsWith (1127 of 1807) PASS: lldb-api :: functionalities/breakpoint/breakpoint_by_line_and_column/TestBreakpointByLineAndColumn.py (1128 of 1807) PASS: lldb-unit :: Host/./HostTests/FileSystemTest.Resolve (1129 of 1807) PASS: lldb-api :: lang/objc/foundation/TestRuntimeTypes.py (1130 of 1807) UNSUPPORTED: lldb-api :: tools/lldb-server/libraries-svr4/TestGdbRemoteLibrariesSvr4Support.py (1131 of 1807) PASS: lldb-shell :: ObjectFile/ELF/duplicate-section.yaml (1132 of 1807) PASS: lldb-api :: lang/cpp/operator-overload/TestOperatorOverload.py (1133 of 1807) PASS: lldb-unit :: Utility/./UtilityTests/FileSpecTest.EqualDotsPosix (1134 of 1807) PASS: lldb-unit :: Utility/./UtilityTests/ArgsTest.TestArgv (1135 of 1807) PASS: lldb-unit :: ScriptInterpreter/Python/./ScriptInterpreterPythonTests/PythonDataObjectsTest.TestCallable (1136 of 1807) PASS: lldb-api :: functionalities/dead-strip/TestDeadStrip.py (1137 of 1807) PASS: lldb-api :: macosx/add-dsym/TestAddDsymMidExecutionCommand.py (1138 of 1807) PASS: lldb-unit :: Process/gdb-remote/./ProcessGdbRemoteTests/GDBRemoteClientBaseTest.SendContinueDelegateStructuredDataReceipt (1139 of 1807) PASS: lldb-unit :: Utility/./UtilityTests/StreamTest.QuotedCString (1140 of 1807) PASS: lldb-api :: driver/batch_mode/TestBatchMode.py (1141 of 1807) UNSUPPORTED: lldb-api :: functionalities/darwin_log/filter/regex/activity-chain/TestDarwinLogFilterRegexActivityChain.py (1142 of 1807) PASS: lldb-api :: lang/cpp/unique-types/TestUniqueTypes.py (1143 of 1807) PASS: lldb-api :: macosx/nslog/TestDarwinNSLogOutput.py (1144 of 1807) PASS: lldb-unit :: UnwindAssembly/x86/./UnwindAssemblyx86Tests/Testx86AssemblyInspectionEngine.Test32bitFramelessSmallStackFrame (1145 of 1807) PASS: lldb-api :: functionalities/pre_run_dylibs/TestPreRunDylibs.py (1146 of 1807) PASS: lldb-api :: python_api/process/read-mem-cstring/TestReadMemCString.py (1147 of 1807) PASS: lldb-api :: lang/cpp/static_methods/TestCPPStaticMethods.py (1148 of 1807) PASS: lldb-api :: lang/objc/modules/TestObjCModules.py (1149 of 1807) PASS: lldb-unit :: Utility/./UtilityTests/ArgsTest.TestMultipleArgs (1150 of 1807) UNSUPPORTED: lldb-api :: functionalities/darwin_log/filter/exact_match/activity/TestDarwinLogFilterMatchActivity.py (1151 of 1807) PASS: lldb-unit :: ScriptInterpreter/Python/./ScriptInterpreterPythonTests/PythonDataObjectsTest.TestBorrowedReferences (1152 of 1807) PASS: lldb-api :: lang/cpp/extern_c/TestExternCSymbols.py (1153 of 1807) PASS: lldb-api :: commands/expression/import-std-module/list-basic/TestBasicList.py (1154 of 1807) PASS: lldb-unit :: Utility/./UtilityTests/StringExtractorTest.GetNameColonValueNoSemicolon (1155 of 1807) PASS: lldb-api :: commands/expression/rdar42038760/TestScalarURem.py (1156 of 1807) PASS: lldb-api :: commands/frame/recognizer/TestFrameRecognizer.py (1157 of 1807) PASS: lldb-api :: functionalities/data-formatter/data-formatter-objc/TestDataFormatterObjCNSError.py (1158 of 1807) PASS: lldb-unit :: Host/./HostTests/TaskPoolTest.AddTask (1159 of 1807) PASS: lldb-unit :: Utility/./UtilityTests/ArgsTest.ReplaceArgumentAtIndexEqual (1160 of 1807) PASS: lldb-unit :: Utility/./UtilityTests/ArgsTest.TestSingleArgWithQuotedSpace (1161 of 1807) PASS: lldb-shell :: Expr/TestMultilineExpr.test (1162 of 1807) PASS: lldb-api :: commands/expression/no-deadlock/TestExprDoesntBlock.py (1163 of 1807) PASS: lldb-unit :: Utility/./UtilityTests/StreamTest.ShiftOperatorStrings (1164 of 1807) UNSUPPORTED: lldb-api :: functionalities/data-formatter/data-formatter-stl/libstdcpp/map/TestDataFormatterStdMap.py (1165 of 1807) PASS: lldb-unit :: Utility/./UtilityTests/RangeTest.DoesIntersect (1166 of 1807) PASS: lldb-api :: commands/expression/context-object/TestContextObject.py (1167 of 1807) PASS: lldb-unit :: Utility/./UtilityTests/BinaryStreamTest.PutULEB128EightBytes (1168 of 1807) PASS: lldb-api :: functionalities/rerun/TestRerun.py (1169 of 1807) PASS: lldb-shell :: Register/x86-64-gp-read.test (1170 of 1807) PASS: lldb-unit :: Utility/./UtilityTests/OptionsWithRawTest.UnterminatedQuote (1171 of 1807) PASS: lldb-api :: python_api/breakpoint/TestBreakpointAPI.py (1172 of 1807) PASS: lldb-api :: functionalities/deleted-executable/TestDeletedExecutable.py (1173 of 1807) PASS: lldb-unit :: Utility/./UtilityTests/AnsiTerminal.Incomplete (1174 of 1807) PASS: lldb-unit :: Expression/./ExpressionTests/ClangHostTest.MacOSX (1175 of 1807) PASS: lldb-shell :: ObjectFile/ELF/compressed-sections.yaml (1176 of 1807) UNSUPPORTED: lldb-api :: functionalities/data-formatter/data-formatter-stl/libstdcpp/smart_ptr/TestDataFormatterStdSmartPtr.py (1177 of 1807) PASS: lldb-api :: commands/expression/call-overridden-method/TestCallOverriddenMethod.py (1178 of 1807) PASS: lldb-api :: functionalities/thread/concurrent_events/TestConcurrentNWatchNBreak.py (1179 of 1807) PASS: lldb-unit :: Symbol/./SymbolTests/SymbolsTest.TerminateLocateExecutableSymbolFileForUnknownExecutableAndUnknownSymbolFile (1180 of 1807) PASS: lldb-unit :: Expression/./ExpressionTests/DiagnosticManagerTest.GetStringMultiline (1181 of 1807) PASS: lldb-unit :: Utility/./UtilityTests/RangeTest.EqualInvalid (1182 of 1807) PASS: lldb-unit :: Symbol/./SymbolTests/TestClangASTContext.TestGetBasicTypeFromEnum (1183 of 1807) PASS: lldb-api :: functionalities/unwind/sigtramp/TestSigtrampUnwind.py (1184 of 1807) PASS: lldb-unit :: Utility/./UtilityTests/ArgsTest.TestSingleQuotedArgWithSpace (1185 of 1807) PASS: lldb-api :: functionalities/postmortem/wow64_minidump/TestWow64MiniDump.py (1186 of 1807) PASS: lldb-unit :: Utility/./UtilityTests/FileSpecTest.IsRelative (1187 of 1807) PASS: lldb-api :: lang/cpp/breakpoint-commands/TestCPPBreakpointCommands.py (1188 of 1807) PASS: lldb-unit :: ScriptInterpreter/Python/./ScriptInterpreterPythonTests/PythonDataObjectsTest.TestResetting (1189 of 1807) PASS: lldb-shell :: ObjectFile/PECOFF/sections.yaml (1190 of 1807) PASS: lldb-shell :: ObjectFile/MachO/subsections.yaml (1191 of 1807) PASS: lldb-api :: functionalities/data-formatter/language_category_updates/TestDataFormatterLanguageCategoryUpdates.py (1192 of 1807) PASS: lldb-shell :: ObjectFile/PECOFF/basic-info.yaml (1193 of 1807) PASS: lldb-unit :: Target/./TargetTests/ExecutionContextTest.GetByteOrderProcess (1194 of 1807) PASS: lldb-unit :: Process/minidump/./LLDBMinidumpTests/MinidumpParserTest.GetArchitecture (1195 of 1807) PASS: lldb-api :: lang/cpp/exceptions/TestCPPExceptionBreakpoints.py (1196 of 1807) PASS: lldb-api :: commands/gui/invalid-args/TestInvalidArgsGui.py (1197 of 1807) UNSUPPORTED: lldb-api :: lang/c/typedef/Testtypedef.py (1198 of 1807) PASS: lldb-api :: functionalities/thread/num_threads/TestNumThreads.py (1199 of 1807) PASS: lldb-unit :: Host/./HostTests/ProcessLaunchInfoTest.Constructor (1200 of 1807) PASS: lldb-unit :: Expression/./ExpressionTests/DiagnosticManagerTest.PutStringSeverities (1201 of 1807) PASS: lldb-api :: commands/expression/diagnostics/TestExprDiagnostics.py (1202 of 1807) PASS: lldb-unit :: Language/Highlighting/./HighlighterTests/HighlighterTest.ClangComments (1203 of 1807) PASS: lldb-api :: lang/objc/objc-builtin-types/TestObjCBuiltinTypes.py (1204 of 1807) PASS: lldb-shell :: Quit/TestQuitExitCode30.test (1205 of 1807) PASS: lldb-api :: functionalities/inferior-crashing/TestInferiorCrashing.py (1206 of 1807) PASS: lldb-api :: functionalities/breakpoint/inlined_breakpoints/TestInlinedBreakpoints.py (1207 of 1807) PASS: lldb-shell :: Settings/TestFrameFormatNoColor.test (1208 of 1807) PASS: lldb-unit :: Process/gdb-remote/./ProcessGdbRemoteTests/GDBRemoteCommunicationClientTest.GetModulesInfoInvalidResponse (1209 of 1807) PASS: lldb-api :: macosx/version_zero/TestGetVersionZeroVersion.py (1210 of 1807) PASS: lldb-api :: lang/cpp/virtual/TestVirtual.py (1211 of 1807) PASS: lldb-unit :: UnwindAssembly/x86/./UnwindAssemblyx86Tests/Testx86AssemblyInspectionEngine.TestCALLNextInsn (1212 of 1807) PASS: lldb-api :: functionalities/ubsan/basic/TestUbsanBasic.py (1213 of 1807) PASS: lldb-unit :: ScriptInterpreter/Python/./ScriptInterpreterPythonTests/PythonDataObjectsTest.TestPythonStringToStr (1214 of 1807) PASS: lldb-unit :: Language/CPlusPlus/./LanguageCPlusPlusTests/CPlusPlusLanguage.ExtractContextAndIdentifier (1215 of 1807) PASS: lldb-api :: commands/expression/radar_9673664/TestExprHelpExamples.py (1216 of 1807) PASS: lldb-shell :: SymbolFile/Breakpad/unwind-via-stack-cfi.test (1217 of 1807) PASS: lldb-api :: lang/objc/objc-struct-argument/TestObjCStructArgument.py (1218 of 1807) UNSUPPORTED: lldb-shell :: SymbolFile/NativePDB/stack_unwinding01.cpp (1219 of 1807) UNSUPPORTED: lldb-api :: commands/expression/completion-crash2/TestCompletionCrash2.py (1220 of 1807) PASS: lldb-api :: tools/lldb-server/TestGdbRemoteThreadsInStopReply.py (1221 of 1807) PASS: lldb-unit :: debugserver/./debugserverTests/RNBSocket.LoopBackListenIPv4 (1222 of 1807) PASS: lldb-unit :: UnwindAssembly/x86/./UnwindAssemblyx86Tests/Testx86AssemblyInspectionEngine.TestStackRealignMSVC_i386 (1223 of 1807) PASS: lldb-api :: functionalities/value_md5_crash/TestValueMD5Crash.py (1224 of 1807) PASS: lldb-unit :: Utility/./UtilityTests/ArgsTest.TestAppendArg (1225 of 1807) PASS: lldb-unit :: Symbol/./SymbolTests/TestClangASTContext.TestRecordHasFields (1226 of 1807) PASS: lldb-unit :: Utility/./UtilityTests/StringExtractorTest.GetHexBytesAvail_FullString (1227 of 1807) PASS: lldb-unit :: UnwindAssembly/x86/./UnwindAssemblyx86Tests/Testx86AssemblyInspectionEngine.TestReturnDetect (1228 of 1807) PASS: lldb-shell :: ObjectFile/ELF/PT_TLS-overlap-PT_LOAD.yaml (1229 of 1807) PASS: lldb-api :: functionalities/thread/concurrent_events/TestConcurrentDelayedCrashWithBreakpointSignal.py (1230 of 1807) PASS: lldb-unit :: Utility/./UtilityTests/BinaryStreamTest.PutSLEB128MaxValue (1231 of 1807) PASS: lldb-unit :: Utility/./UtilityTests/UriParserTest.SchemeHostSeparator (1232 of 1807) PASS: lldb-shell :: SymbolFile/DWARF/debug_ranges.s (1233 of 1807) PASS: lldb-unit :: ObjectFile/Breakpad/./ObjectFileBreakpadTests/StackWinRecord.parse (1234 of 1807) PASS: lldb-api :: tools/lldb-vscode/breakpoint/TestVSCode_setBreakpoints.py (1235 of 1807) PASS: lldb-unit :: Utility/./UtilityTests/StreamTeeTest.Flush (1236 of 1807) PASS: lldb-unit :: Utility/./UtilityTests/ConstStringTest.UpdateMangledCounterpart (1237 of 1807) PASS: lldb-api :: tools/lldb-vscode/attach/TestVSCode_attach.py (1238 of 1807) PASS: lldb-api :: functionalities/data-formatter/pyobjsynthprovider/TestPyObjSynthProvider.py (1239 of 1807) PASS: lldb-unit :: SymbolFile/DWARF/./SymbolFileDWARFTests/SymbolFileDWARFTests.TestAbbrevOrder1Start5 (1240 of 1807) PASS: lldb-api :: lang/objc/foundation/TestSymbolTable.py (1241 of 1807) PASS: lldb-api :: lang/c/const_variables/TestConstVariables.py (1242 of 1807) PASS: lldb-unit :: Utility/./UtilityTests/Predicate.WaitForValueNotEqualTo (1243 of 1807) UNSUPPORTED: lldb-api :: functionalities/data-formatter/data-formatter-stl/libstdcpp/vbool/TestDataFormatterStdVBool.py (1244 of 1807) PASS: lldb-shell :: ObjectFile/ELF/PT_LOAD-overlap-section.yaml (1245 of 1807) PASS: lldb-unit :: SymbolFile/NativePDB/./SymbolFileNativePDBTests/PDBFPOProgramToDWARFExpressionTests.InvalidOpUnary (1246 of 1807) UNSUPPORTED: lldb-api :: functionalities/darwin_log/basic/TestDarwinLogBasic.py (1247 of 1807) PASS: lldb-unit :: Expression/./ExpressionTests/CppModuleConfigurationTest.Linux (1248 of 1807) PASS: lldb-unit :: Utility/./UtilityTests/ProcessInstanceInfo.DumpTable (1249 of 1807) PASS: lldb-api :: commands/expression/anonymous-struct/TestCallUserAnonTypedef.py (1250 of 1807) PASS: lldb-api :: commands/target/basic/TestTargetCommand.py (1251 of 1807) UNSUPPORTED: lldb-shell :: SymbolFile/PDB/typedefs.test (1252 of 1807) PASS: lldb-shell :: Minidump/breakpad-symbols.test (1253 of 1807) PASS: lldb-api :: lang/cpp/class_types/TestClassTypes.py (1254 of 1807) UNSUPPORTED: lldb-shell :: SymbolFile/DWARF/debug-types-expressions.test (1255 of 1807) PASS: lldb-api :: python_api/objc_type/TestObjCType.py (1256 of 1807) PASS: lldb-unit :: Process/gdb-remote/./ProcessGdbRemoteTests/GDBRemoteClientBaseTest.SendContinueDelegateInterface (1257 of 1807) PASS: lldb-unit :: Utility/./UtilityTests/FileSpecTest.EqualDotsWindows (1258 of 1807) PASS: lldb-api :: functionalities/postmortem/elf-core/TestLinuxCore.py (1259 of 1807) UNSUPPORTED: lldb-api :: functionalities/thread/multi_break/TestMultipleBreakpoints.py (1260 of 1807) PASS: lldb-unit :: Symbol/./SymbolTests/DWARFCallFrameInfoTest.Basic_dwarf4 (1261 of 1807) PASS: lldb-unit :: Utility/./UtilityTests/AnsiTerminal.Basic (1262 of 1807) PASS: lldb-api :: commands/expression/fixits/TestFixIts.py (1263 of 1807) PASS: lldb-unit :: Utility/./UtilityTests/DataExtractorTest.GetCStr (1264 of 1807) PASS: lldb-unit :: Utility/./UtilityTests/OptionsWithRawTest.SingleWordSuffix (1265 of 1807) PASS: lldb-api :: functionalities/postmortem/minidump-new/TestMiniDumpNew.py (1266 of 1807) PASS: lldb-api :: functionalities/breakpoint/breakpoint_locations/TestBreakpointLocations.py (1267 of 1807) PASS: lldb-unit :: Core/./LLDBCoreTests/MangledTest.ResultForValidName (1268 of 1807) PASS: lldb-shell :: Driver/TestNoUseColor.test (1269 of 1807) PASS: lldb-api :: tools/lldb-server/TestGdbRemoteRegisterState.py (1270 of 1807) PASS: lldb-api :: functionalities/data-formatter/data-formatter-objc/TestDataFormatterObjCNSData.py (1271 of 1807) UNSUPPORTED: lldb-shell :: Register/x86-64-ymm16-read.test (1272 of 1807) PASS: lldb-unit :: UnwindAssembly/x86/./UnwindAssemblyx86Tests/Testx86AssemblyInspectionEngine.TestPushEAX (1273 of 1807) PASS: lldb-unit :: Process/minidump/./LLDBMinidumpTests/MinidumpParserTest.GetThreadContext_x86_32 (1274 of 1807) PASS: lldb-shell :: SymbolFile/DWARF/childless-compile-unit.s (1275 of 1807) PASS: lldb-api :: functionalities/set-data/TestSetData.py (1276 of 1807) PASS: lldb-api :: commands/expression/import-std-module/conflicts/TestStdModuleWithConflicts.py (1277 of 1807) PASS: lldb-api :: commands/process/attach/TestProcessAttach.py (1278 of 1807) PASS: lldb-api :: functionalities/tsan/global_location/TestTsanGlobalLocation.py (1279 of 1807) PASS: lldb-unit :: Utility/./UtilityTests/ArchSpecTest.TestParseMachCPUDashSubtypeTripleSimple (1280 of 1807) PASS: lldb-api :: functionalities/data-formatter/data-formatter-disabling/TestDataFormatterDisabling.py (1281 of 1807) UNSUPPORTED: lldb-api :: lang/objc/objc-dynamic-value/TestObjCDynamicValue.py (1282 of 1807) PASS: lldb-shell :: Breakpoint/ppc64-localentry.test (1283 of 1807) PASS: lldb-unit :: Utility/./UtilityTests/StringLexerTest.AdvanceIf (1284 of 1807) PASS: lldb-unit :: Utility/./UtilityTests/ArgsTest.ReplaceArgumentAtIndexLonger (1285 of 1807) PASS: lldb-unit :: ObjectFile/ELF/./ObjectFileELFTests/ObjectFileELFTest.SectionsResolveConsistently (1286 of 1807) PASS: lldb-unit :: UnwindAssembly/x86/./UnwindAssemblyx86Tests/Testx86AssemblyInspectionEngine.TestSimple32bitFrameFunction (1287 of 1807) PASS: lldb-unit :: Utility/./UtilityTests/RangeDataVector.FindEntryThatContains_Overlap (1288 of 1807) PASS: lldb-api :: commands/expression/call-function/TestCallStdStringFunction.py (1289 of 1807) PASS: lldb-unit :: Utility/./UtilityTests/TimeoutTest.Construction (1290 of 1807) PASS: lldb-api :: commands/expression/import-std-module/queue/TestQueue.py (1291 of 1807) PASS: lldb-unit :: Utility/./UtilityTests/CompletionRequest.DuplicateFiltering (1292 of 1807) PASS: lldb-unit :: Process/gdb-remote/./ProcessGdbRemoteTests/GDBRemoteCommunicationServerTest.SendErrorResponse_Status (1293 of 1807) PASS: lldb-unit :: Host/./HostTests/NativeProcessProtocolTest.SetBreakpointFailRead (1294 of 1807) PASS: lldb-unit :: Utility/./UtilityTests/TildeExpressionResolver.ResolveFullPath (1295 of 1807) PASS: lldb-api :: commands/expression/import-std-module/basic/TestImportStdModule.py (1296 of 1807) PASS: lldb-shell :: SymbolFile/DWARF/debug_aranges-empty-section.s (1297 of 1807) PASS: lldb-shell :: ObjectFile/ELF/minidebuginfo-find-symbols.yaml (1298 of 1807) PASS: lldb-unit :: Utility/./UtilityTests/ProcessInfoTest.Constructor (1299 of 1807) PASS: lldb-api :: functionalities/modern-type-lookup/basic/TestBasicModernTypeLookup.py (1300 of 1807) PASS: lldb-api :: commands/expression/import-std-module/vector-dbg-info-content/TestDbgInfoContentVector.py (1301 of 1807) PASS: lldb-unit :: Utility/./UtilityTests/DataExtractorTest.GetCStrAtEnd (1302 of 1807) PASS: lldb-unit :: Utility/./UtilityTests/ScalarTest.SetValueFromCString (1303 of 1807) PASS: lldb-shell :: SymbolFile/Breakpad/line-table-mixed-path-styles.test (1304 of 1807) PASS: lldb-api :: python_api/process/io/TestProcessIO.py (1305 of 1807) PASS: lldb-unit :: Utility/./UtilityTests/StreamTeeTest.SetStreamAtIndexOverwrite (1306 of 1807) PASS: lldb-unit :: Utility/./UtilityTests/RangeTest.Clear (1307 of 1807) PASS: lldb-unit :: Utility/./UtilityTests/RangeTest.Union (1308 of 1807) PASS: lldb-api :: source-manager/TestSourceManager.py (1309 of 1807) PASS: lldb-unit :: Utility/./UtilityTests/VMRange.Reset (1310 of 1807) PASS: lldb-api :: lang/c/local_variables/TestLocalVariables.py (1311 of 1807) PASS: lldb-api :: functionalities/breakpoint/consecutive_breakpoints/TestConsecutiveBreakpoints.py (1312 of 1807) PASS: lldb-unit :: Utility/./UtilityTests/ArgsTest.GetArgumentArrayRef (1313 of 1807) PASS: lldb-unit :: UnwindAssembly/ARM64/./Arm64InstEmulationTests/TestArm64InstEmulation.TestFramelessThreeEpilogueFunction (1314 of 1807) PASS: lldb-api :: functionalities/breakpoint/cpp/TestCPPBreakpointLocations.py (1315 of 1807) PASS: lldb-unit :: Utility/./UtilityTests/ArgsTest.TestOverwriteArgs (1316 of 1807) UNSUPPORTED: lldb-shell :: Register/x86-ymm-write.test (1317 of 1807) PASS: lldb-shell :: Expr/TestIRMemoryMap.test (1318 of 1807) PASS: lldb-unit :: Process/gdb-remote/./ProcessGdbRemoteTests/GDBRemoteCommunicationClientTest.SendSignalsToIgnore (1319 of 1807) PASS: lldb-shell :: Commands/CommandScriptImmediateOutput/CommandScriptImmediateOutputFile.test (1320 of 1807) UNSUPPORTED: lldb-shell :: Register/x86-64-gp-write.test (1321 of 1807) PASS: lldb-unit :: Utility/./UtilityTests/OptionsWithRawTest.EmptyInput (1322 of 1807) PASS: lldb-api :: lang/objc/rdar-11355592/TestRdar11355592.py (1323 of 1807) PASS: lldb-unit :: Language/CPlusPlus/./LanguageCPlusPlusTests/CPlusPlusLanguage.CPlusPlusNameParser (1324 of 1807) PASS: lldb-unit :: Utility/./UtilityTests/UriParserTest.MinimalPort (1325 of 1807) PASS: lldb-api :: commands/expression/call-function/TestCallBuiltinFunction.py (1326 of 1807) PASS: lldb-api :: commands/watchpoints/hello_watchpoint/TestMyFirstWatchpoint.py (1327 of 1807) PASS: lldb-shell :: SymbolFile/NativePDB/function-types-classes.cpp (1328 of 1807) PASS: lldb-api :: functionalities/data-formatter/data-formatter-stl/libcxx/forward_list/TestDataFormatterLibcxxForwardList.py (1329 of 1807) PASS: lldb-unit :: Target/./TargetTests/ModuleCacheTest.GetAndPutStrangeHostname (1330 of 1807) PASS: lldb-unit :: UnwindAssembly/x86/./UnwindAssemblyx86Tests/Testx86AssemblyInspectionEngine.TestPopEDI (1331 of 1807) PASS: lldb-api :: lang/c/find_struct_type/TestFindStructTypes.py (1332 of 1807) UNSUPPORTED: lldb-api :: tools/lldb-server/TestGdbRemoteAuxvSupport.py (1333 of 1807) UNSUPPORTED: lldb-api :: benchmarks/expression/TestRepeatedExprs.py (1334 of 1807) PASS: lldb-unit :: Utility/./UtilityTests/RangeTest.DoesAdjoinOrIntersect (1335 of 1807) PASS: lldb-shell :: BuildScript/modes.test (1336 of 1807) PASS: lldb-api :: commands/expression/invalid-args/TestInvalidArgsExpression.py (1337 of 1807) PASS: lldb-api :: commands/expression/dont_allow_jit/TestAllowJIT.py (1338 of 1807) PASS: lldb-api :: functionalities/history/TestHistoryRecall.py (1339 of 1807) PASS: lldb-api :: lang/cpp/global_operators/TestCppGlobalOperators.py (1340 of 1807) PASS: lldb-api :: functionalities/data-formatter/setvaluefromcstring/TestSetValueFromCString.py (1341 of 1807) PASS: lldb-unit :: Expression/./ExpressionTests/DiagnosticManagerTest.PutString (1342 of 1807) PASS: lldb-unit :: Core/./LLDBCoreTests/MangledTest.NameIndexes_FindFunctionSymbols (1343 of 1807) UNSUPPORTED: lldb-api :: functionalities/signal/handle-segv/TestHandleSegv.py (1344 of 1807) UNSUPPORTED: lldb-api :: lang/cpp/function-template-parameter-pack/TestFunctionTemplateParameterPack.py (1345 of 1807) PASS: lldb-unit :: Utility/./UtilityTests/SerializationRountripTest.SerializeDeserializeObjectReference (1346 of 1807) PASS: lldb-unit :: Utility/./UtilityTests/AnsiTerminal.Unknown (1347 of 1807) PASS: lldb-api :: functionalities/inferior-changed/TestInferiorChanged.py (1348 of 1807) PASS: lldb-shell :: SymbolFile/DWARF/dir-separator-posix.s (1349 of 1807) PASS: lldb-shell :: Minidump/disassemble-no-module.yaml (1350 of 1807) PASS: lldb-shell :: ObjectFile/ELF/PT_LOAD-overlap-PT_TLS.yaml (1351 of 1807) PASS: lldb-api :: commands/expression/test/TestExprs.py (1352 of 1807) PASS: lldb-shell :: SymbolFile/DWARF/debug-names-compressed.cpp (1353 of 1807) PASS: lldb-unit :: Utility/./UtilityTests/ArgsTest.TestInsertArg (1354 of 1807) PASS: lldb-unit :: Utility/./UtilityTests/RegularExpression.Invalid (1355 of 1807) UNSUPPORTED: lldb-api :: tools/lldb-server/TestGdbRemoteModuleInfo.py (1356 of 1807) PASS: lldb-api :: lang/objc/rdar-10967107/TestRdar10967107.py (1357 of 1807) UNSUPPORTED: lldb-shell :: SymbolFile/NativePDB/typedefs.cpp (1358 of 1807) PASS: lldb-unit :: Host/./HostTests/MainLoopTest.DetectsEOF (1359 of 1807) PASS: lldb-unit :: Utility/./UtilityTests/StringExtractorTest.DecodeHexU8_InvalidHex (1360 of 1807) PASS: lldb-unit :: Utility/./UtilityTests/StructuredDataTest.StringDump (1361 of 1807) PASS: lldb-api :: lang/objc/objc-static-method-stripped/TestObjCStaticMethodStripped.py (1362 of 1807) PASS: lldb-api :: functionalities/data-formatter/data-formatter-objc/TestDataFormatterObjCNSURL.py (1363 of 1807) PASS: lldb-unit :: Utility/./UtilityTests/StringListTest.ForRangeEmpty (1364 of 1807) PASS: lldb-unit :: Process/minidump/./LLDBMinidumpTests/MinidumpParserTest.GetMemoryRegionInfoLinuxMaps (1365 of 1807) UNSUPPORTED: lldb-api :: functionalities/breakpoint/hardware_breakpoints/hardware_breakpoint_on_multiple_threads/TestHWBreakMultiThread.py (1366 of 1807) PASS: lldb-unit :: Utility/./UtilityTests/ArgsTest.ReplaceArgumentAtIndexShort (1367 of 1807) PASS: lldb-unit :: Utility/./UtilityTests/StringExtractorTest.GetU64BigEndian (1368 of 1807) PASS: lldb-unit :: Language/Highlighting/./HighlighterTests/HighlighterTest.ClangCommas (1369 of 1807) PASS: lldb-shell :: Breakpoint/dummy-target.test (1370 of 1807) UNSUPPORTED: lldb-shell :: BuildScript/toolchain-clang-cl.test (1371 of 1807) PASS: lldb-api :: functionalities/thread/concurrent_events/TestConcurrentTwoBreakpointsOneDelaySignal.py (1372 of 1807) PASS: lldb-unit :: Utility/./UtilityTests/StringListTest.JoinEmpty (1373 of 1807) PASS: lldb-api :: functionalities/float-display/TestFloatDisplay.py (1374 of 1807) PASS: lldb-unit :: Utility/./UtilityTests/StringListTest.LongestCommonPrefixEmpty (1375 of 1807) PASS: lldb-shell :: SymbolFile/DWARF/gnu-style-compression.cpp (1376 of 1807) PASS: lldb-api :: lang/objc/forward-decl/TestForwardDecl.py (1377 of 1807) UNSUPPORTED: lldb-api :: commands/expression/completion-crash1/TestCompletionCrash1.py (1378 of 1807) PASS: lldb-api :: functionalities/breakpoint/require_hw_breakpoints/TestRequireHWBreakpoints.py (1379 of 1807) PASS: lldb-unit :: Symbol/./SymbolTests/TestClangASTContext.TestIsClangType (1380 of 1807) PASS: lldb-unit :: Utility/./UtilityTests/UserIDResolver.GetGroupName (1381 of 1807) PASS: lldb-api :: lang/c/conflicting-symbol/TestConflictingSymbol.py (1382 of 1807) PASS: lldb-api :: functionalities/return-value/TestReturnValue.py (1383 of 1807) PASS: lldb-api :: tools/lldb-server/TestGdbRemote_qThreadStopInfo.py (1384 of 1807) PASS: lldb-api :: functionalities/data-formatter/compactvectors/TestCompactVectors.py (1385 of 1807) PASS: lldb-unit :: Target/./TargetTests/ExecutionContextTest.GetByteOrder (1386 of 1807) PASS: lldb-shell :: Breakpoint/split-dwarf5-debug-stroffsets.test (1387 of 1807) PASS: lldb-api :: commands/help/TestHelp.py (1388 of 1807) PASS: lldb-unit :: Utility/./UtilityTests/StringListTest.DefaultConstructor (1389 of 1807) PASS: lldb-api :: functionalities/thread/concurrent_events/TestConcurrentSignalNWatchNBreak.py (1390 of 1807) UNSUPPORTED: lldb-api :: tools/lldb-server/thread-name/TestGdbRemoteThreadName.py (1391 of 1807) PASS: lldb-unit :: Signals/./SignalsTests/UnixSignalsTest.GetFilteredSignals (1392 of 1807) PASS: lldb-unit :: Host/./HostTests/NativeProcessProtocolTest.SetBreakpointFailVerify (1393 of 1807) PASS: lldb-api :: lang/cpp/enum_types/TestCPP11EnumTypes.py (1394 of 1807) PASS: lldb-shell :: Reproducer/TestGDBRemoteRepro.test (1395 of 1807) PASS: lldb-unit :: Host/./HostTests/SocketAddressTest.Set (1396 of 1807) PASS: lldb-api :: lang/cpp/std-function-step-into-callable/TestStdFunctionStepIntoCallable.py (1397 of 1807) PASS: lldb-api :: functionalities/object-file/TestImageListMultiArchitecture.py (1398 of 1807) PASS: lldb-unit :: Utility/./UtilityTests/ProcessInstanceInfo.DumpTable_invalidUID (1399 of 1807) PASS: lldb-unit :: Utility/./UtilityTests/StringListTest.AppendListCStringArrayEmpty (1400 of 1807) PASS: lldb-api :: tools/lldb-server/inferior-crash/TestGdbRemoteAbort.py (1401 of 1807) PASS: lldb-api :: commands/platform/process/TestProcessList.py (1402 of 1807) PASS: lldb-shell :: ObjectFile/PECOFF/uuid.yaml (1403 of 1807) PASS: lldb-unit :: Utility/./UtilityTests/RegularExpression.Match (1404 of 1807) PASS: lldb-api :: lang/c/forward/TestForwardDeclaration.py (1405 of 1807) PASS: lldb-api :: functionalities/gdb_remote_client/TestArmRegisterDefinition.py (1406 of 1807) PASS: lldb-unit :: Utility/./UtilityTests/BinaryStreamTest.PutULEB128NineBytes (1407 of 1807) PASS: lldb-api :: python_api/lldbutil/iter/TestRegistersIterator.py (1408 of 1807) PASS: lldb-api :: commands/expression/import-std-module/shared_ptr/TestSharedPtr.py (1409 of 1807) PASS: lldb-unit :: Utility/./UtilityTests/DataExtractorTest.GetCStrAtNullOffset (1410 of 1807) PASS: lldb-api :: commands/expression/persistent_variables/TestPersistentVariables.py (1411 of 1807) PASS: lldb-api :: lang/c/set_values/TestSetValues.py (1412 of 1807) PASS: lldb-api :: functionalities/asan/TestReportData.py (1413 of 1807) XFAIL: lldb-shell :: Register/x86-mm-xmm-read.test (1414 of 1807) PASS: lldb-unit :: UnwindAssembly/x86/./UnwindAssemblyx86Tests/Testx86AssemblyInspectionEngine.TestMovRSPtoRBP (1415 of 1807) PASS: lldb-api :: functionalities/tail_call_frames/disambiguate_tail_call_seq/TestDisambiguateTailCallSeq.py (1416 of 1807) PASS: lldb-shell :: ObjectFile/PECOFF/basic-info-arm64.yaml (1417 of 1807) PASS: lldb-api :: lang/c/vla/TestVLA.py (1418 of 1807) XFAIL: lldb-shell :: Register/x86-64-write.test (1419 of 1807) PASS: lldb-api :: functionalities/thread/concurrent_events/TestConcurrentTwoBreakpointsOneSignal.py (1420 of 1807) PASS: lldb-api :: python_api/lldbutil/frame/TestFrameUtils.py (1421 of 1807) UNSUPPORTED: lldb-api :: functionalities/darwin_log/filter/exact_match/subsystem/TestDarwinLogFilterMatchSubsystem.py (1422 of 1807) UNSUPPORTED: lldb-api :: commands/register/register/intel_xtended_registers/TestMPXRegisters.py (1423 of 1807) PASS: lldb-shell :: Minidump/memory-region-from-module.yaml (1424 of 1807) PASS: lldb-unit :: Utility/./UtilityTests/ProcessInstanceInfo.Dump (1425 of 1807) PASS: lldb-unit :: Utility/./UtilityTests/BinaryStreamTest.PutSLEB128EightBytes (1426 of 1807) PASS: lldb-shell :: Unwind/eh-frame-dwarf-unwind.test (1427 of 1807) PASS: lldb-api :: commands/expression/top-level/TestTopLevelExprs.py (1428 of 1807) UNSUPPORTED: lldb-api :: functionalities/darwin_log/filter/exact_match/category/TestDarwinLogFilterMatchCategory.py (1429 of 1807) PASS: lldb-api :: lang/c/shared_lib_stripped_symbols/TestSharedLibStrippedSymbols.py (1430 of 1807) PASS: lldb-api :: commands/expression/call-throws/TestCallThatThrows.py (1431 of 1807) PASS: lldb-shell :: Minidump/Windows/find-module.test (1432 of 1807) PASS: lldb-unit :: Symbol/./SymbolTests/PostfixExpression.ToDWARF (1433 of 1807) PASS: lldb-api :: python_api/watchpoint/TestSetWatchpoint.py (1434 of 1807) PASS: lldb-api :: commands/expression/import-std-module/forward_list-dbg-info-content/TestDbgInfoContentForwardList.py (1435 of 1807) PASS: lldb-unit :: UnwindAssembly/x86/./UnwindAssemblyx86Tests/Testx86AssemblyInspectionEngine.Test32bitFramelessBigStackFrame (1436 of 1807) PASS: lldb-shell :: Commands/command-backtrace.test (1437 of 1807) PASS: lldb-api :: functionalities/data-formatter/data-formatter-skip-summary/TestDataFormatterSkipSummary.py (1438 of 1807) PASS: lldb-unit :: Process/gdb-remote/./ProcessGdbRemoteTests/GDBRemoteClientBaseTest.SendPacketAndReceiveResponseWithOutputSupport (1439 of 1807) PASS: lldb-api :: functionalities/type_completion/TestTypeCompletion.py (1440 of 1807) PASS: lldb-unit :: SymbolFile/NativePDB/./SymbolFileNativePDBTests/PDBFPOProgramToDWARFExpressionTests.MultipleIndependentAssignments (1441 of 1807) PASS: lldb-unit :: Utility/./UtilityTests/NameMatchesTest.RegularExpression (1442 of 1807) PASS: lldb-api :: lang/cpp/template-function/TestTemplateFunctions.py (1443 of 1807) PASS: lldb-api :: functionalities/data-formatter/data-formatter-objc/nsindexpath/TestDataFormatterNSIndexPath.py (1444 of 1807) PASS: lldb-unit :: Utility/./UtilityTests/StateTest.Formatv (1445 of 1807) PASS: lldb-api :: lang/cpp/char1632_t/TestChar1632T.py (1446 of 1807) PASS: lldb-unit :: ObjectFile/ELF/./ObjectFileELFTests/ObjectFileELFTest.GetModuleSpecifications_EarlySectionHeaders (1447 of 1807) PASS: lldb-api :: lang/cpp/signed_types/TestSignedTypes.py (1448 of 1807) PASS: lldb-unit :: debugserver/./debugserverTests/RNBSocket.LoopBackListenIPv6 (1449 of 1807) PASS: lldb-unit :: Process/minidump/./LLDBMinidumpTests/RegisterContextMinidump.ConvertMinidumpContext_x86_32 (1450 of 1807) PASS: lldb-api :: functionalities/thread/concurrent_events/TestConcurrentTwoBreakpointsOneWatchpoint.py (1451 of 1807) PASS: lldb-unit :: Process/minidump/./LLDBMinidumpTests/MinidumpParserTest.FindMemoryRange (1452 of 1807) PASS: lldb-unit :: Utility/./UtilityTests/VMRange.IsValid (1453 of 1807) PASS: lldb-shell :: SymbolFile/Breakpad/unwind-via-stack-win.test (1454 of 1807) PASS: lldb-unit :: Utility/./UtilityTests/RangeTest.SlideZero (1455 of 1807) PASS: lldb-unit :: Utility/./UtilityTests/BinaryStreamTest.PutULEB128MaxValue (1456 of 1807) PASS: lldb-api :: lang/objc/modules-auto-import/TestModulesAutoImport.py (1457 of 1807) PASS: lldb-shell :: Reproducer/Functionalities/TestExpressionEvaluation.test (1458 of 1807) PASS: lldb-api :: functionalities/unwind/noreturn/module-end/TestNoReturnModuleEnd.py (1459 of 1807) PASS: lldb-unit :: Utility/./UtilityTests/AnsiTerminal.AtStart (1460 of 1807) PASS: lldb-unit :: Language/Highlighting/./HighlighterTests/HighlighterTest.ClangCursorOutOfBounds (1461 of 1807) PASS: lldb-api :: functionalities/plugins/python_os_plugin/TestPythonOSPlugin.py (1462 of 1807) PASS: lldb-api :: python_api/target/TestTargetAPI.py (1463 of 1807) PASS: lldb-api :: functionalities/memory-region/TestMemoryRegion.py (1464 of 1807) PASS: lldb-unit :: Utility/./UtilityTests/StringExtractorTest.GetHexBytesAvail_Underflow (1465 of 1807) PASS: lldb-unit :: Utility/./UtilityTests/BinaryStreamTest.PutULEB128ThreeBytes (1466 of 1807) PASS: lldb-unit :: Symbol/./SymbolTests/SymbolsTest.LocateExecutableSymbolFileForUnknownExecutableAndMissingSymbolFile (1467 of 1807) PASS: lldb-shell :: SymbolFile/Breakpad/symtab-macho.test (1468 of 1807) PASS: lldb-unit :: Utility/./UtilityTests/ScalarTest.RightShiftOperator (1469 of 1807) PASS: lldb-shell :: Quit/TestQuitExitCodeNonInt.test (1470 of 1807) PASS: lldb-api :: functionalities/data-formatter/data-formatter-proper-plurals/TestFormattersOneIsSingular.py (1471 of 1807) PASS: lldb-unit :: Host/./HostTests/MainLoopTest.UnmonitoredSignal (1472 of 1807) PASS: lldb-api :: python_api/function_symbol/TestDisasmAPI.py (1473 of 1807) PASS: lldb-api :: functionalities/thread/backtrace_all/TestBacktraceAll.py (1474 of 1807) PASS: lldb-api :: functionalities/data-formatter/data-formatter-stl/libstdcpp/unique_ptr/invalid/TestDataFormatterInvalidStdUniquePtr.py (1475 of 1807) PASS: lldb-api :: functionalities/data-formatter/data-formatter-objc/TestDataFormatterObjCNSDate.py (1476 of 1807) PASS: lldb-api :: lang/cpp/rvalue-references/TestRvalueReferences.py (1477 of 1807) PASS: lldb-shell :: Reproducer/TestDump.test (1478 of 1807) PASS: lldb-api :: macosx/safe-to-func-call/TestSafeFuncCalls.py (1479 of 1807) PASS: lldb-unit :: Utility/./UtilityTests/BroadcasterTest.EventTypeHasListeners (1480 of 1807) PASS: lldb-unit :: Utility/./UtilityTests/StringListTest.AppendStringCString (1481 of 1807) UNSUPPORTED: lldb-api :: linux/sepdebugsymlink/TestTargetSymbolsSepDebugSymlink.py (1482 of 1807) PASS: lldb-api :: commands/frame/diagnose/array/TestArray.py (1483 of 1807) PASS: lldb-unit :: UnwindAssembly/x86/./UnwindAssemblyx86Tests/Testx86AssemblyInspectionEngine.TestPushR12 (1484 of 1807) PASS: lldb-api :: functionalities/data-formatter/data-formatter-stl/libcxx/initializerlist/TestInitializerList.py (1485 of 1807) PASS: lldb-api :: functionalities/gdb_remote_client/TestThreadSelectionBug.py (1486 of 1807) PASS: lldb-unit :: Utility/./UtilityTests/RangeTest.ContainsAddr (1487 of 1807) PASS: lldb-api :: functionalities/data-formatter/data-formatter-globals/TestDataFormatterGlobals.py (1488 of 1807) PASS: lldb-api :: functionalities/data-formatter/data-formatter-stl/libcxx/tuple/TestDataFormatterLibcxxTuple.py (1489 of 1807) PASS: lldb-api :: functionalities/signal/raise/TestRaise.py (1490 of 1807) UNSUPPORTED: lldb-shell :: Register/x86-zmm-write.test (1491 of 1807) PASS: lldb-api :: python_api/sbdata/TestSBData.py (1492 of 1807) PASS: lldb-api :: macosx/duplicate-archive-members/TestDuplicateMembers.py (1493 of 1807) PASS: lldb-api :: functionalities/breakpoint/breakpoint_conditions/TestBreakpointConditions.py (1494 of 1807) PASS: lldb-api :: lang/objc/objc-new-syntax/TestObjCNewSyntaxArray.py (1495 of 1807) PASS: lldb-api :: lang/cpp/namespace/TestNamespace.py (1496 of 1807) PASS: lldb-api :: commands/expression/import-std-module/deque-basic/TestBasicDeque.py (1497 of 1807) PASS: lldb-unit :: Utility/./UtilityTests/StringExtractorTest.GetHexBytes_Underflow (1498 of 1807) PASS: lldb-unit :: Utility/./UtilityTests/BinaryStreamTest.PutULEB128FourBytes (1499 of 1807) PASS: lldb-unit :: Utility/./UtilityTests/DataExtractorTest.GetMaxU64_unchecked (1500 of 1807) PASS: lldb-unit :: Utility/./UtilityTests/StringExtractorTest.GetHexU8_Underflow2_NoEof (1501 of 1807) PASS: lldb-api :: functionalities/tail_call_frames/sbapi_support/TestTailCallFrameSBAPI.py (1502 of 1807) PASS: lldb-api :: commands/watchpoints/watchpoint_on_vectors/TestValueOfVectorVariable.py (1503 of 1807) PASS: lldb-unit :: Symbol/./SymbolTests/TestClangASTContext.TemplateArguments (1504 of 1807) PASS: lldb-unit :: Process/minidump/./LLDBMinidumpTests/MinidumpParserTest.GetThreadContext_x86_32_wow64 (1505 of 1807) PASS: lldb-unit :: Utility/./UtilityTests/FileSpecTest.GetNormalizedPath (1506 of 1807) PASS: lldb-shell :: SymbolFile/DWARF/find-basic-namespace.cpp (1507 of 1807) PASS: lldb-unit :: Utility/./UtilityTests/FileSpecTest.AppendPathComponent (1508 of 1807) PASS: lldb-api :: functionalities/load_using_paths/TestLoadUsingPaths.py (1509 of 1807) PASS: lldb-api :: python_api/lldbutil/process/TestPrintStackTraces.py (1510 of 1807) PASS: lldb-shell :: SymbolFile/DWARF/debug-types-address-ranges.s (1511 of 1807) PASS: lldb-unit :: Utility/./UtilityTests/StringListTest.Assignment (1512 of 1807) PASS: lldb-unit :: UnwindAssembly/x86/./UnwindAssemblyx86Tests/Testx86AssemblyInspectionEngine.TestPushR15 (1513 of 1807) PASS: lldb-shell :: SymbolFile/DWARF/find-basic-variable.cpp (1514 of 1807) PASS: lldb-api :: python_api/frame/get-variables/TestGetVariables.py (1515 of 1807) PASS: lldb-unit :: Utility/./UtilityTests/StringListTest.ShiftCString (1516 of 1807) PASS: lldb-unit :: Utility/./UtilityTests/Flags.AnySet (1517 of 1807) PASS: lldb-api :: lang/c/struct_types/TestStructTypes.py (1518 of 1807) PASS: lldb-unit :: Language/Highlighting/./HighlighterTests/HighlighterTest.ClangUnterminatedString (1519 of 1807) PASS: lldb-unit :: Process/minidump/./LLDBMinidumpTests/MinidumpParserTest.GetPid (1520 of 1807) PASS: lldb-api :: lang/c/anonymous/TestAnonymous.py (1521 of 1807) PASS: lldb-unit :: Host/./HostTests/TaskPoolTest.TaskMap (1522 of 1807) PASS: lldb-api :: lang/objc/hidden-ivars/TestHiddenIvars.py (1523 of 1807) PASS: lldb-unit :: Utility/./UtilityTests/OptionsWithRawTest.EmptySuffix (1524 of 1807) PASS: lldb-api :: tools/lldb-server/inferior-crash/TestGdbRemoteSegFault.py (1525 of 1807) PASS: lldb-unit :: Language/Highlighting/./HighlighterTests/HighlighterTest.DefaultHighlighterWithCursor (1526 of 1807) PASS: lldb-unit :: Utility/./UtilityTests/VMRange.Clear (1527 of 1807) PASS: lldb-api :: functionalities/inferior-crashing/recursive-inferior/TestRecursiveInferior.py (1528 of 1807) PASS: lldb-unit :: Utility/./UtilityTests/LogChannelTest.List (1529 of 1807) PASS: lldb-api :: tools/lldb-server/TestGdbRemoteAttach.py (1530 of 1807) PASS: lldb-api :: lang/objc/foundation/TestObjectDescriptionAPI.py (1531 of 1807) PASS: lldb-unit :: Utility/./UtilityTests/FileSpecTest.CopyByAppendingPathComponent (1532 of 1807) PASS: lldb-unit :: Utility/./UtilityTests/Flags.AnyClear (1533 of 1807) PASS: lldb-unit :: Utility/./UtilityTests/UriParserTest.PortOverflow (1534 of 1807) PASS: lldb-unit :: Utility/./UtilityTests/StreamTeeTest.Constructor2Streams (1535 of 1807) PASS: lldb-api :: functionalities/multiword-commands/TestMultiWordCommands.py (1536 of 1807) PASS: lldb-api :: functionalities/backticks/TestBackticksWithoutATarget.py (1537 of 1807) PASS: lldb-unit :: Utility/./UtilityTests/StringExtractorTest.GetHexBytes (1538 of 1807) PASS: lldb-shell :: ObjectFile/ELF/PT_LOAD-overlap-PT_INTERP.yaml (1539 of 1807) PASS: lldb-api :: tools/lldb-server/TestLldbGdbServer.py (1540 of 1807) PASS: lldb-api :: functionalities/thread/concurrent_events/TestConcurrentCrashWithWatchpoint.py (1541 of 1807) PASS: lldb-api :: commands/expression/expr-in-syscall/TestExpressionInSyscall.py (1542 of 1807) PASS: lldb-shell :: Reproducer/TestWorkingDir.test (1543 of 1807) PASS: lldb-unit :: Utility/./UtilityTests/StreamTest.PutRawBytesToBigEndian (1544 of 1807) PASS: lldb-unit :: Utility/./UtilityTests/FileSpecTest.EqualDotsPosixRoot (1545 of 1807) PASS: lldb-unit :: Utility/./UtilityTests/UriParserTest.BracketedHostname (1546 of 1807) PASS: lldb-unit :: Process/gdb-remote/./ProcessGdbRemoteTests/GDBRemoteCommunicationClientTest.TestPacketSpeedJSON (1547 of 1807) PASS: lldb-api :: functionalities/gdb_remote_client/TestRestartBug.py (1548 of 1807) PASS: lldb-unit :: UnwindAssembly/x86/./UnwindAssemblyx86Tests/Testx86AssemblyInspectionEngine.TestPushEBP (1549 of 1807) PASS: lldb-api :: lang/objc/objc-ivar-stripped/TestObjCIvarStripped.py (1550 of 1807) PASS: lldb-unit :: debugserver/./debugserverTests/RNBSocket.LoopBackConnectIPv6 (1551 of 1807) PASS: lldb-unit :: Process/minidump/./LLDBMinidumpTests/MinidumpParserTest.InvalidMinidump (1552 of 1807) PASS: lldb-unit :: Utility/./UtilityTests/ConstStringTest.CompareConstString (1553 of 1807) PASS: lldb-unit :: Utility/./UtilityTests/StringExtractorTest.GetHexU8_Underflow_NoEof (1554 of 1807) PASS: lldb-api :: commands/platform/basic/TestPlatformCommand.py (1555 of 1807) PASS: lldb-api :: functionalities/breakpoint/breakpoint_command/TestBreakpointCommandsFromPython.py (1556 of 1807) PASS: lldb-shell :: SymbolFile/Breakpad/symtab.test (1557 of 1807) UNSUPPORTED: lldb-api :: android/platform/TestDefaultCacheLineSize.py (1558 of 1807) PASS: lldb-unit :: Utility/./UtilityTests/StreamTest.ShiftOperatorInts (1559 of 1807) PASS: lldb-unit :: Utility/./UtilityTests/StreamTeeTest.CopyConstructor (1560 of 1807) UNSUPPORTED: lldb-shell :: SymbolFile/PDB/variables-locations.test (1561 of 1807) PASS: lldb-unit :: UnwindAssembly/x86/./UnwindAssemblyx86Tests/Testx86AssemblyInspectionEngine.TestPushImm (1562 of 1807) PASS: lldb-unit :: Utility/./UtilityTests/CompletionRequest.TryCompleteCurrentArgBad (1563 of 1807) PASS: lldb-api :: functionalities/thread/concurrent_events/TestConcurrentCrashWithWatchpointBreakpointSignal.py (1564 of 1807) PASS: lldb-unit :: Utility/./UtilityTests/CompletionRequest.ShiftArguments (1565 of 1807) PASS: lldb-api :: lang/cpp/namespace_conflicts/TestNamespaceConflicts.py (1566 of 1807) XFAIL: lldb-shell :: Register/x86-64-ymm-write.test (1567 of 1807) PASS: lldb-unit :: Process/gdb-remote/./ProcessGdbRemoteTests/GDBRemoteCommunicationClientTest.ReadRegister (1568 of 1807) PASS: lldb-unit :: Utility/./UtilityTests/StreamTest.PutHex64ByteOrderLittle (1569 of 1807) PASS: lldb-api :: commands/command/history/TestCommandHistory.py (1570 of 1807) UNSUPPORTED: lldb-shell :: Register/x86-gp-read.test (1571 of 1807) PASS: lldb-api :: functionalities/tail_call_frames/ambiguous_tail_call_seq2/TestAmbiguousTailCallSeq2.py (1572 of 1807) PASS: lldb-unit :: Process/gdb-remote/./ProcessGdbRemoteTests/GDBRemoteCommunicationServerTest.SendErrorResponse_UnimplementedError (1573 of 1807) PASS: lldb-unit :: Utility/./UtilityTests/LogTest.Register (1574 of 1807) PASS: lldb-unit :: UnwindAssembly/x86/./UnwindAssemblyx86Tests/Testx86AssemblyInspectionEngine.TestSimplei386ugmented (1575 of 1807) PASS: lldb-api :: functionalities/breakpoint/breakpoint_names/TestBreakpointNames.py (1576 of 1807) PASS: lldb-api :: functionalities/thread/exit_during_break/TestExitDuringBreak.py (1577 of 1807) PASS: lldb-shell :: ObjectFile/MachO/lc_build_version.yaml (1578 of 1807) PASS: lldb-api :: functionalities/recursion/TestValueObjectRecursion.py (1579 of 1807) PASS: lldb-api :: python_api/watchpoint/watchlocation/TestSetWatchlocation.py (1580 of 1807) PASS: lldb-api :: lang/objc/global_ptrs/TestGlobalObjects.py (1581 of 1807) PASS: lldb-unit :: Host/./HostTests/FileSystemTest.MakeAbsolute (1582 of 1807) PASS: lldb-unit :: Utility/./UtilityTests/OptionsWithRawTest.EmptyArgsOnlySuffix (1583 of 1807) PASS: lldb-api :: arm/emulation/TestEmulations.py (1584 of 1807) PASS: lldb-unit :: Utility/./UtilityTests/StreamTest.PutSLEB128 (1585 of 1807) PASS: lldb-api :: lang/cpp/template/TestTemplateArgs.py (1586 of 1807) PASS: lldb-unit :: Utility/./UtilityTests/BinaryStreamTest.PutSLEB128One (1587 of 1807) PASS: lldb-api :: functionalities/non-overlapping-index-variable-i/TestIndexVariable.py (1588 of 1807) PASS: lldb-api :: lang/cpp/bool/TestCPPBool.py (1589 of 1807) PASS: lldb-unit :: Utility/./UtilityTests/StringExtractorTest.GetHexU8_InvalidHex (1590 of 1807) PASS: lldb-unit :: Utility/./UtilityTests/BinaryStreamTest.PutSLEB128SevenBytes (1591 of 1807) PASS: lldb-api :: functionalities/thread/concurrent_events/TestConcurrentCrashWithSignal.py (1592 of 1807) PASS: lldb-api :: functionalities/thread/thread_specific_break/TestThreadSpecificBreakpoint.py (1593 of 1807) PASS: lldb-unit :: UnwindAssembly/x86/./UnwindAssemblyx86Tests/Testx86AssemblyInspectionEngine.TestPushR14 (1594 of 1807) PASS: lldb-shell :: SymbolFile/DWARF/debug-types-dwo-cross-reference.cpp (1595 of 1807) PASS: lldb-api :: functionalities/breakpoint/auto_continue/TestBreakpointAutoContinue.py (1596 of 1807) PASS: lldb-unit :: Host/./HostTests/FileSystemTest.EnumerateDirectory (1597 of 1807) PASS: lldb-api :: commands/expression/timeout/TestCallWithTimeout.py (1598 of 1807) PASS: lldb-unit :: Utility/./UtilityTests/OptionsWithRawTest.WhitespaceSuffix (1599 of 1807) PASS: lldb-unit :: Utility/./UtilityTests/EventTest.DumpEventDataBytes (1600 of 1807) PASS: lldb-api :: commands/process/attach/attach_denied/TestAttachDenied.py (1601 of 1807) PASS: lldb-unit :: Process/gdb-remote/./ProcessGdbRemoteTests/GDBRemoteClientBaseTest.SendContinueAndAsyncSignal (1602 of 1807) PASS: lldb-api :: commands/expression/char/TestExprsChar.py (1603 of 1807) PASS: lldb-unit :: Utility/./UtilityTests/ArgsTest.ReplaceArgumentAtIndexOutOfRange (1604 of 1807) PASS: lldb-unit :: Utility/./UtilityTests/RegularExpression.Empty (1605 of 1807) PASS: lldb-unit :: Utility/./UtilityTests/ArgsTest.TestUnknownEscape (1606 of 1807) PASS: lldb-api :: commands/watchpoints/watchpoint_disable/TestWatchpointDisable.py (1607 of 1807) PASS: lldb-unit :: ScriptInterpreter/Python/./ScriptInterpreterPythonTests/PythonDataObjectsTest.TestPythonTupleInitializerList2 (1608 of 1807) PASS: lldb-api :: lang/objc/ivar-IMP/TestObjCiVarIMP.py (1609 of 1807) PASS: lldb-unit :: Utility/./UtilityTests/StringListTest.GetSize (1610 of 1807) UNSUPPORTED: lldb-shell :: ObjectFile/ELF/minidebuginfo-no-lzma.yaml (1611 of 1807) XFAIL: lldb-shell :: SymbolFile/DWARF/find-type-in-function.cpp (1612 of 1807) PASS: lldb-api :: types/TestRecursiveTypes.py (1613 of 1807) PASS: lldb-shell :: SymbolFile/DWARF/find-variable-dwo.cpp (1614 of 1807) PASS: lldb-unit :: Core/./LLDBCoreTests/StreamCallbackTest.Callback (1615 of 1807) PASS: lldb-unit :: ObjectFile/Breakpad/./ObjectFileBreakpadTests/StackCFIRecord.parse (1616 of 1807) PASS: lldb-api :: lang/cpp/class_static/TestStaticVariables.py (1617 of 1807) PASS: lldb-api :: functionalities/data-formatter/frameformat_smallstruct/TestFrameFormatSmallStruct.py (1618 of 1807) PASS: lldb-unit :: Utility/./UtilityTests/RangeTest.LessThan (1619 of 1807) PASS: lldb-unit :: Utility/./UtilityTests/ReproducerTest.SetReplay (1620 of 1807) PASS: lldb-unit :: Process/minidump/./LLDBMinidumpTests/MinidumpParserTest.GetLinuxProcStatus (1621 of 1807) PASS: lldb-unit :: UnwindAssembly/x86/./UnwindAssemblyx86Tests/Testx86AssemblyInspectionEngine.TestPushEBX (1622 of 1807) PASS: lldb-unit :: Language/Highlighting/./HighlighterTests/HighlighterTest.Keywords (1623 of 1807) PASS: lldb-api :: lang/cpp/namespace_definitions/TestNamespaceDefinitions.py (1624 of 1807) PASS: lldb-api :: functionalities/data-formatter/data-formatter-synth/TestDataFormatterSynth.py (1625 of 1807) PASS: lldb-unit :: Utility/./UtilityTests/RangeTest.Copy (1626 of 1807) PASS: lldb-api :: functionalities/thread/concurrent_events/TestConcurrentSignalWatch.py (1627 of 1807) PASS: lldb-api :: commands/expression/import-std-module/weak_ptr/TestWeakPtr.py (1628 of 1807) PASS: lldb-api :: functionalities/tsan/multiple/TestTsanMultiple.py (1629 of 1807) PASS: lldb-unit :: Signals/./SignalsTests/UnixSignalsTest.GetInfo (1630 of 1807) PASS: lldb-api :: python_api/thread/TestThreadAPI.py (1631 of 1807) PASS: lldb-api :: lang/objc/objc-baseclass-sbtype/TestObjCBaseClassSBType.py (1632 of 1807) PASS: lldb-unit :: Utility/./UtilityTests/RangeTest.SetRangeBase (1633 of 1807) PASS: lldb-unit :: Target/./TargetTests/ModuleCacheTest.GetAndPutUuidExists (1634 of 1807) PASS: lldb-api :: commands/gui/basic/TestGuiBasic.py (1635 of 1807) PASS: lldb-unit :: Utility/./UtilityTests/ScalarTest.ComparisonFloat (1636 of 1807) UNSUPPORTED: lldb-shell :: SymbolFile/PDB/expressions.test (1637 of 1807) PASS: lldb-unit :: Utility/./UtilityTests/VASprintfTest.NoBufferResize (1638 of 1807) PASS: lldb-api :: lang/objc/objc-ivar-offsets/TestObjCIvarOffsets.py (1639 of 1807) PASS: lldb-unit :: Utility/./UtilityTests/StreamTest.PutCStringWithStringRef (1640 of 1807) PASS: lldb-unit :: Utility/./UtilityTests/Predicate.WaitForValueEqualTo (1641 of 1807) PASS: lldb-api :: lang/cpp/auto/TestCPPAuto.py (1642 of 1807) PASS: lldb-unit :: Utility/./UtilityTests/ArchSpecTest.TripleComponentsWereSpecified (1643 of 1807) PASS: lldb-unit :: Host/./HostTests/FileSystemTest.GetPermissions (1644 of 1807) PASS: lldb-unit :: Host/./HostTests/SocketTest.TCPListen0ConnectAccept (1645 of 1807) PASS: lldb-api :: lang/c/strings/TestCStrings.py (1646 of 1807) PASS: lldb-unit :: Utility/./UtilityTests/StreamTest.PutStringAsRawHex8 (1647 of 1807) PASS: lldb-unit :: Utility/./UtilityTests/OptionsWithRawTest.EmptySuffixSingleWhitespace (1648 of 1807) PASS: lldb-shell :: Commands/command-regex-delete.test (1649 of 1807) PASS: lldb-unit :: ObjectFile/Breakpad/./ObjectFileBreakpadTests/InfoRecord.parse (1650 of 1807) PASS: lldb-unit :: Process/minidump/./LLDBMinidumpTests/MinidumpParserTest.GetPidWow64 (1651 of 1807) PASS: lldb-shell :: SymbolFile/DWARF/debug-line-basic.s (1652 of 1807) PASS: lldb-api :: functionalities/gdb_remote_client/TestGDBRemoteClient.py (1653 of 1807) PASS: lldb-api :: api/listeners/TestListener.py (1654 of 1807) PASS: lldb-unit :: ObjectFile/PECOFF/./ObjectFilePECOFFTests/PECallFrameInfoTest.Chained_eh (1655 of 1807) PASS: lldb-api :: functionalities/gdb_remote_client/TestStopPCs.py (1656 of 1807) PASS: lldb-api :: functionalities/gdb_remote_client/TestGDBRemoteLoad.py (1657 of 1807) PASS: lldb-unit :: Expression/./ExpressionTests/CppModuleConfigurationTest.LinuxLocalLibCpp (1658 of 1807) PASS: lldb-unit :: Expression/./ExpressionTests/DWARFExpression.DW_OP_pick (1659 of 1807) PASS: lldb-api :: api/multiple-targets/TestMultipleTargets.py (1660 of 1807) PASS: lldb-api :: lang/objc/objc-struct-return/TestObjCStructReturn.py (1661 of 1807) PASS: lldb-unit :: Utility/./UtilityTests/StringExtractorTest.GetHexU8_InvalidHex_NoEof (1662 of 1807) PASS: lldb-unit :: Utility/./UtilityTests/StreamTest.PutHex16ByteOrderLittle (1663 of 1807) PASS: lldb-shell :: ObjectFile/PECOFF/sections-names.yaml (1664 of 1807) UNSUPPORTED: lldb-api :: functionalities/darwin_log/filter/regex/subsystem/TestDarwinLogFilterRegexSubsystem.py (1665 of 1807) PASS: lldb-api :: commands/expression/import-std-module/vector-basic/TestBasicVector.py (1666 of 1807) PASS: lldb-unit :: ObjectFile/Breakpad/./ObjectFileBreakpadTests/FileRecord.parse (1667 of 1807) PASS: lldb-unit :: UnwindAssembly/x86/./UnwindAssemblyx86Tests/Testx86AssemblyInspectionEngine.TestPushEDX (1668 of 1807) UNSUPPORTED: lldb-shell :: Register/x86-gp-write.test (1669 of 1807) PASS: lldb-api :: commands/frame/diagnose/bad-reference/TestBadReference.py (1670 of 1807) PASS: lldb-shell :: Breakpoint/debug_addrx.test (1671 of 1807) PASS: lldb-unit :: Host/./HostTests/NativeProcessProtocolTest.ReadCStringFromMemory_CrossPageBoundary (1672 of 1807) PASS: lldb-api :: lang/cpp/char8_t/TestCxxChar8_t.py (1673 of 1807) PASS: lldb-api :: lang/cpp/llvm-style/TestLLVMStyle.py (1674 of 1807) PASS: lldb-api :: functionalities/data-formatter/refpointer-recursion/TestDataFormatterRefPtrRecursion.py (1675 of 1807) PASS: lldb-unit :: Utility/./UtilityTests/StreamTest.PutHex8 (1676 of 1807) PASS: lldb-unit :: Utility/./UtilityTests/RecordReplayTest.InstrumentedBar (1677 of 1807) UNSUPPORTED: lldb-shell :: SymbolFile/PDB/calling-conventions.test (1678 of 1807) PASS: lldb-unit :: UnwindAssembly/x86/./UnwindAssemblyx86Tests/Testx86AssemblyInspectionEngine.TestPushESI (1679 of 1807) PASS: lldb-shell :: SymbolFile/DWARF/split-dwarf-inlining.cpp (1680 of 1807) PASS: lldb-unit :: Language/Highlighting/./HighlighterTests/HighlighterTest.ClangIdentifiers (1681 of 1807) PASS: lldb-api :: lang/cpp/incomplete-types/TestCppIncompleteTypes.py (1682 of 1807) PASS: lldb-api :: functionalities/avoids-fd-leak/TestFdLeak.py (1683 of 1807) PASS: lldb-unit :: Utility/./UtilityTests/StringExtractorTest.DecodeHexU8_Underflow (1684 of 1807) PASS: lldb-api :: functionalities/breakpoint/global_constructor/TestBreakpointInGlobalConstructor.py (1685 of 1807) PASS: lldb-unit :: Utility/./UtilityTests/LogChannelEnabledTest.LogGetLogThread (1686 of 1807) PASS: lldb-unit :: Core/./LLDBCoreTests/MangledTest.EmptyForInvalidName (1687 of 1807) UNSUPPORTED: lldb-shell :: Register/x86-64-ymm16-write.test (1688 of 1807) PASS: lldb-unit :: Utility/./UtilityTests/UUIDTest.SetFromStringRef (1689 of 1807) PASS: lldb-unit :: ObjectFile/Breakpad/./ObjectFileBreakpadTests/LineRecord.parse (1690 of 1807) PASS: lldb-api :: commands/expression/weak_symbols/TestWeakSymbols.py (1691 of 1807) PASS: lldb-unit :: Utility/./UtilityTests/BinaryStreamTest.PutULEB128FiveBytes (1692 of 1807) PASS: lldb-api :: lang/c/register_variables/TestRegisterVariables.py (1693 of 1807) PASS: lldb-api :: python_api/disassemble-raw-data/TestDisassemble_VST1_64.py (1694 of 1807) PASS: lldb-unit :: Utility/./UtilityTests/StringListTest.AppendStringStdString (1695 of 1807) UNSUPPORTED: lldb-shell :: Unwind/eh-frame-small-fde.test (1696 of 1807) PASS: lldb-api :: commands/target/create-deps/TestTargetCreateDeps.py (1697 of 1807) PASS: lldb-api :: lang/objc/exceptions/TestObjCExceptions.py (1698 of 1807) PASS: lldb-api :: lang/objc/objc-foundation-dictionary-empty/TestNSDictionary0.py (1699 of 1807) PASS: lldb-shell :: Watchpoint/SetErrorCases.test (1700 of 1807) PASS: lldb-api :: lang/objc/radar-9691614/TestObjCMethodReturningBOOL.py (1701 of 1807) PASS: lldb-unit :: Utility/./UtilityTests/StringListTest.SplitIntoLinesSingleTrailingCR (1702 of 1807) PASS: lldb-api :: commands/watchpoints/watchpoint_size/TestWatchpointSizes.py (1703 of 1807) PASS: lldb-api :: commands/command/script_alias/TestCommandScriptAlias.py (1704 of 1807) PASS: lldb-api :: functionalities/breakpoint/breakpoint_hit_count/TestBreakpointHitCount.py (1705 of 1807) PASS: lldb-unit :: Utility/./UtilityTests/CompletionRequest.DuplicateFilteringWithComments (1706 of 1807) PASS: lldb-shell :: Minidump/dump-all.test (1707 of 1807) PASS: lldb-api :: functionalities/breakpoint/breakpoint_language/TestBreakpointLanguage.py (1708 of 1807) PASS: lldb-api :: commands/platform/basic/TestPlatformPython.py (1709 of 1807) PASS: lldb-unit :: Utility/./UtilityTests/LogChannelEnabledTest.LLDB_LOG_ERROR (1710 of 1807) PASS: lldb-shell :: Settings/TestFrameFormatColor.test (1711 of 1807) PASS: lldb-unit :: SymbolFile/NativePDB/./SymbolFileNativePDBTests/PDBFPOProgramToDWARFExpressionTests.UnsupportedRASearch (1712 of 1807) PASS: lldb-api :: lang/cpp/class_types/TestClassTypesDisassembly.py (1713 of 1807) PASS: lldb-api :: commands/expression/completion-in-lambda-and-unnnamed-class/TestCompletionInLambdaAndUnnamedClass.py (1714 of 1807) PASS: lldb-unit :: Utility/./UtilityTests/StreamTeeTest.DefaultConstructor (1715 of 1807) PASS: lldb-unit :: SymbolFile/NativePDB/./SymbolFileNativePDBTests/PDBFPOProgramToDWARFExpressionTests.InvalidAssignmentSingle (1716 of 1807) PASS: lldb-unit :: Utility/./UtilityTests/StringLexerTest.NextIfList (1717 of 1807) PASS: lldb-api :: commands/command/delete/TestCommandDelete.py (1718 of 1807) PASS: lldb-unit :: Utility/./UtilityTests/GeneratorTest.GetOrCreate (1719 of 1807) PASS: lldb-shell :: ObjectFile/ELF/section-types-edgecases.yaml (1720 of 1807) PASS: lldb-unit :: Symbol/./SymbolTests/PostfixExpression.ParseOneExpression (1721 of 1807) PASS: lldb-unit :: SymbolFile/DWARF/./SymbolFileDWARFTests/DWARFASTParserClangTests.EnsureAllDIEsInDeclContextHaveBeenParsedParsesOnlyMatchingEntries (1722 of 1807) PASS: lldb-api :: python_api/sbstructureddata/TestStructuredDataAPI.py (1723 of 1807) PASS: lldb-unit :: Host/./HostTests/NativeProcessProtocolTest.ReadCStringFromMemory (1724 of 1807) PASS: lldb-unit :: Signals/./SignalsTests/UnixSignalsTest.Iteration (1725 of 1807) UNSUPPORTED: lldb-api :: benchmarks/stepping/TestSteppingSpeed.py (1726 of 1807) PASS: lldb-api :: functionalities/data-formatter/data-formatter-advanced/TestDataFormatterAdv.py (1727 of 1807) PASS: lldb-unit :: Symbol/./SymbolTests/PostfixExpression.ParseFPOProgram (1728 of 1807) PASS: lldb-unit :: SymbolFile/DWARF/./SymbolFileDWARFTests/SymbolFileDWARFTests.TestAbbrevOrder1Start1 (1729 of 1807) PASS: lldb-unit :: Language/Highlighting/./HighlighterTests/HighlighterTest.ClangSquareBrackets (1730 of 1807) PASS: lldb-shell :: Driver/TestProcessAttach.test (1731 of 1807) PASS: lldb-unit :: Process/gdb-remote/./ProcessGdbRemoteTests/GDBRemoteCommunicationClientTest.SendGetDataPacket (1732 of 1807) PASS: lldb-unit :: UnwindAssembly/x86/./UnwindAssemblyx86Tests/Testx86AssemblyInspectionEngine.TestSubRSP (1733 of 1807) PASS: lldb-api :: functionalities/modern-type-lookup/libcxx/TestLibCxxModernTypeLookup.py (1734 of 1807) PASS: lldb-api :: functionalities/data-formatter/parray/TestPrintArray.py (1735 of 1807) PASS: lldb-api :: commands/expression/namespace_local_var_same_name_obj_c/TestNamespaceLocalVarSameNameObjC.py (1736 of 1807) PASS: lldb-api :: commands/watchpoints/watchpoint_commands/command/TestWatchpointCommandPython.py (1737 of 1807) PASS: lldb-api :: macosx/order/TestOrderFile.py (1738 of 1807) PASS: lldb-unit :: ScriptInterpreter/Python/./ScriptInterpreterPythonTests/PythonDataObjectsTest.TestPythonIntegerToStructuredInteger (1739 of 1807) PASS: lldb-unit :: Utility/./UtilityTests/StringListTest.JoinMultiCharSeparator (1740 of 1807) PASS: lldb-api :: functionalities/data-formatter/data-formatter-stl/libcxx/atomic/TestLibCxxAtomic.py (1741 of 1807) PASS: lldb-unit :: UnwindAssembly/x86/./UnwindAssemblyx86Tests/Testx86AssemblyInspectionEngine.TestLEAVE (1742 of 1807) PASS: lldb-api :: functionalities/postmortem/netbsd-core/TestNetBSDCore.py (1743 of 1807) PASS: lldb-api :: python_api/rdar-12481949/Test-rdar-12481949.py (1744 of 1807) PASS: lldb-unit :: Utility/./UtilityTests/StreamTeeTest.GetStreamAtIndexOutOfBounds (1745 of 1807) PASS: lldb-unit :: Host/./HostTests/SocketTest.UDPConnect (1746 of 1807) PASS: lldb-unit :: Expression/./ExpressionTests/DiagnosticManagerTest.HasFixits (1747 of 1807) PASS: lldb-unit :: UnwindAssembly/x86/./UnwindAssemblyx86Tests/Testx86AssemblyInspectionEngine.TestPopESI (1748 of 1807) PASS: lldb-api :: tools/lldb-vscode/step/TestVSCode_step.py (1749 of 1807) PASS: lldb-shell :: SymbolFile/DWARF/debug-types-missing-signature.test (1750 of 1807) PASS: lldb-unit :: Process/minidump/./LLDBMinidumpTests/MinidumpParserTest.GetExceptionStream (1751 of 1807) PASS: lldb-unit :: Utility/./UtilityTests/RangeTest.NotEqual (1752 of 1807) PASS: lldb-unit :: ScriptInterpreter/Python/./ScriptInterpreterPythonTests/PythonDataObjectsTest.TestPythonDictionaryToStructuredDictionary (1753 of 1807) PASS: lldb-shell :: BuildScript/compiler-full-path.test (1754 of 1807) PASS: lldb-api :: commands/statistics/basic/TestStats.py (1755 of 1807) PASS: lldb-unit :: Utility/./UtilityTests/RecordReplayTest.InstrumentedBarRef (1756 of 1807) UNSUPPORTED: lldb-api :: commands/expression/completion-crash-incomplete-record/TestCompletionCrashIncompleteRecord.py (1757 of 1807) PASS: lldb-api :: commands/expression/rdar44436068/Test128BitsInteger.py (1758 of 1807) PASS: lldb-unit :: Language/Highlighting/./HighlighterTests/HighlighterTest.ClangCursorPosEndOfLine (1759 of 1807) PASS: lldb-unit :: UnwindAssembly/PPC64/./PPC64InstEmulationTests/TestPPC64InstEmulation.TestSimpleFunction (1760 of 1807) PASS: lldb-shell :: ObjectFile/Breakpad/sections.test (1761 of 1807) PASS: lldb-unit :: UnwindAssembly/ARM64/./Arm64InstEmulationTests/TestArm64InstEmulation.TestRegisterDoubleSpills (1762 of 1807) PASS: lldb-unit :: Utility/./UtilityTests/BinaryStreamTest.PutSLEB128OneByte (1763 of 1807) PASS: lldb-unit :: Host/./HostTests/SocketTest.TCPListen0GetPort (1764 of 1807) PASS: lldb-unit :: Utility/./UtilityTests/StatusTest.ErrorConstructor (1765 of 1807) PASS: lldb-api :: functionalities/thread/crash_during_step/TestCrashDuringStep.py (1766 of 1807) UNSUPPORTED: lldb-shell :: Register/x86-64-zmm-write.test (1767 of 1807) PASS: lldb-api :: functionalities/data-formatter/ostypeformatting/TestFormattersOsType.py (1768 of 1807) PASS: lldb-unit :: Utility/./UtilityTests/StringListTest.AppendListCStringArray (1769 of 1807) PASS: lldb-api :: python_api/symbol-context/two-files/TestSymbolContextTwoFiles.py (1770 of 1807) PASS: lldb-api :: lang/c/offsetof/TestOffsetof.py (1771 of 1807) PASS: lldb-unit :: UnwindAssembly/ARM64/./Arm64InstEmulationTests/TestArm64InstEmulation.TestRegisterSavedTwice (1772 of 1807) PASS: lldb-unit :: Utility/./UtilityTests/StringExtractorTest.GetU32LittleEndian (1773 of 1807) PASS: lldb-unit :: Utility/./UtilityTests/StreamTeeTest.SetStreamAtIndexOutOfBounds (1774 of 1807) PASS: lldb-api :: tools/lldb-server/commandline/TestStubSetSID.py (1775 of 1807) PASS: lldb-unit :: Utility/./UtilityTests/StreamTest.PutRawBytesToMixedEndian (1776 of 1807) PASS: lldb-api :: lang/cpp/offsetof/TestOffsetofCpp.py (1777 of 1807) PASS: lldb-api :: macosx/indirect_symbol/TestIndirectSymbols.py (1778 of 1807) PASS: lldb-api :: functionalities/thread/concurrent_events/TestConcurrentWatchBreakDelay.py (1779 of 1807) PASS: lldb-unit :: Process/minidump/./LLDBMinidumpTests/MinidumpParserTest.GetMiscInfo_no_stream (1780 of 1807) PASS: lldb-api :: functionalities/data-formatter/data-formatter-stl/libcxx/function/TestLibCxxFunction.py (1781 of 1807) PASS: lldb-unit :: Process/minidump/./LLDBMinidumpTests/MinidumpParserTest.GetLinuxProcStatus_no_stream (1782 of 1807) PASS: lldb-unit :: Process/minidump/./LLDBMinidumpTests/MinidumpParserTest.GetMemoryRegionInfoFromMemoryList (1783 of 1807) PASS: lldb-shell :: Reproducer/Functionalities/TestImageList.test (1784 of 1807) PASS: lldb-api :: functionalities/thread/concurrent_events/TestConcurrentTwoBreakpointThreads.py (1785 of 1807) PASS: lldb-api :: python_api/value_var_update/TestValueVarUpdate.py (1786 of 1807) PASS: lldb-api :: python_api/sbvalue_persist/TestSBValuePersist.py (1787 of 1807) PASS: lldb-api :: commands/expression/issue_11588/Test11588.py (1788 of 1807) PASS: lldb-api :: tools/lldb-server/TestGdbRemote_vCont.py (1789 of 1807) PASS: lldb-api :: commands/expression/class_template_specialization_empty_pack/TestClassTemplateSpecializationParametersHandling.py (1790 of 1807) PASS: lldb-api :: functionalities/data-formatter/synthcapping/TestSyntheticCapping.py (1791 of 1807) PASS: lldb-api :: api/multithreaded/TestMultithreaded.py (1792 of 1807) PASS: lldb-api :: lang/cpp/this/TestCPPThis.py (1793 of 1807) PASS: lldb-api :: functionalities/thread/concurrent_events/TestConcurrentDelaySignalWatch.py (1794 of 1807) PASS: lldb-api :: lang/c/modules/TestCModules.py (1795 of 1807) PASS: lldb-api :: functionalities/data-formatter/data-formatter-objc/TestDataFormatterObjCCF.py (1796 of 1807) PASS: lldb-api :: lang/objc/variadic_methods/TestVariadicMethods.py (1797 of 1807) PASS: lldb-api :: lang/c/step-target/TestStepTarget.py (1798 of 1807) PASS: lldb-api :: functionalities/data-formatter/data-formatter-objc/TestDataFormatterObjNSException.py (1799 of 1807) PASS: lldb-api :: lang/objc/objc-dyn-sbtype/TestObjCDynamicSBType.py (1800 of 1807) PASS: lldb-api :: tools/lldb-server/TestGdbRemoteProcessInfo.py (1801 of 1807) PASS: lldb-api :: lang/objcxx/class-name-clash/TestNameClash.py (1802 of 1807) PASS: lldb-api :: lang/objc/blocks/TestObjCIvarsInBlocks.py (1803 of 1807) PASS: lldb-api :: lang/objc/objc-new-syntax/TestObjCNewSyntaxDictionary.py (1804 of 1807) PASS: lldb-api :: lang/cpp/namespace/TestNamespaceLookup.py (1805 of 1807) PASS: lldb-api :: lang/objc/foundation/TestFoundationDisassembly.py (1806 of 1807) PASS: lldb-api :: types/TestIntegerTypesExpr.py (1807 of 1807)

Hide Details

Testing Time: 370.51s ******************** Failing Tests (1): lldb-api :: commands/watchpoints/watchpoint_set_command/TestWatchLocationWithWatchSet.py

Hide Details

Hide Details

Slowest Tests: -------------------------------------------------------------------------- 37.36s: lldb-api :: tools/lldb-server/TestGdbRemoteThreadsInStopReply.py 41.85s: lldb-api :: python_api/watchpoint/watchlocation/TestTargetWatchAddress.py 41.95s: lldb-api :: lang/objc/foundation/TestObjCMethodsString.py 45.00s: lldb-api :: lang/objc/foundation/TestObjCMethodsNSError.py 46.66s: lldb-api :: lang/objc/objc-new-syntax/TestObjCNewSyntaxArray.py 48.69s: lldb-api :: functionalities/recursion/TestValueObjectRecursion.py 50.70s: lldb-api :: lang/cpp/namespace/TestNamespaceLookup.py 52.81s: lldb-api :: commands/watchpoints/watchpoint_set_command/TestWatchLocationWithWatchSet.py 53.58s: lldb-api :: lang/objc/real-definition/TestRealDefinition.py 58.38s: lldb-api :: lang/objc/exceptions/TestObjCExceptions.py 63.52s: lldb-api :: lang/objc/objc-new-syntax/TestObjCNewSyntaxLiteral.py 71.95s: lldb-api :: api/multithreaded/TestMultithreaded.py 75.70s: lldb-api :: functionalities/data-formatter/data-formatter-objc/TestDataFormatterObjCNSURL.py 81.27s: lldb-api :: lang/objc/foundation/TestObjCMethods.py 83.72s: lldb-api :: lang/objc/hidden-ivars/TestHiddenIvars.py 84.78s: lldb-api :: lang/cpp/enum_types/TestCPP11EnumTypes.py 97.43s: lldb-api :: types/TestIntegerTypesExpr.py 97.48s: lldb-api :: tools/lldb-server/TestLldbGdbServer.py 114.01s: lldb-api :: types/TestIntegerTypes.py 150.54s: lldb-api :: lang/objc/foundation/TestFoundationDisassembly.py

Hide Details

Tests Times: -------------------------------------------------------------------------- [ Range ] :: [ Percentage ] :: [ Count ] -------------------------------------------------------------------------- [ 0s, 10s) :: [*********************************** ] :: [1589/1807] [ 10s, 20s) :: [*** ] :: [ 149/1807] [ 20s, 30s) :: [ ] :: [ 39/1807] [ 30s, 40s) :: [ ] :: [ 11/1807] [ 40s, 50s) :: [ ] :: [ 4/1807] [ 50s, 60s) :: [ ] :: [ 4/1807] [ 60s, 70s) :: [ ] :: [ 2/1807] [ 70s, 80s) :: [ ] :: [ 1/1807] [ 80s, 90s) :: [ ] :: [ 3/1807] [ 90s,100s) :: [ ] :: [ 1/1807] [100s,110s) :: [ ] :: [ 2/1807] [110s,120s) :: [ ] :: [ 0/1807] [120s,130s) :: [ ] :: [ 1/1807] [130s,140s) :: [ ] :: [ 0/1807] [140s,150s) :: [ ] :: [ 0/1807] [150s,160s) :: [ ] :: [ 1/1807] Expected Passes : 1671 Expected Failures : 6 Unsupported Tests : 129 Unexpected Failures: 1 FAILED: tools/lldb/test/CMakeFiles/check-lldb-lit cd /Users/buildslave/jenkins/workspace/lldb-cmake/lldb-build/tools/lldb/test && /usr/local/bin/python /Users/buildslave/jenkins/workspace/lldb-cmake/lldb-build/./bin/llvm-lit -v --time-tests --shuffle --xunit-xml-output=/Users/buildslave/jenkins/workspace/lldb-cmake/test/results.xml -v /Users/buildslave/jenkins/workspace/lldb-cmake/lldb-build/tools/lldb/test ninja: build stopped: subcommand failed. Command failed: Command '['/usr/bin/env', 'TERM=vt100', '/usr/local/bin/ninja', '-v', 'check-lldb']' returned non-zero exit status 1. Command: ['/usr/bin/env', 'TERM=vt100', '/usr/local/bin/ninja', '-v', 'check-lldb'] [Pipeline] } [Pipeline] // timeout [Pipeline] } [Pipeline] // stage [Pipeline] stage [Pipeline] { (Declarative: Post Actions) [Pipeline] scanForIssues No credentials specified [Clang (LLVM based)] Sleeping for 5 seconds due to JENKINS-32191... [Clang (LLVM based)] Parsing console log (workspace: '/Users/buildslave/jenkins/workspace/lldb-cmake') [Clang (LLVM based)] [-ERROR-] Git blame errors: [Clang (LLVM based)] [-ERROR-] - no blame results for request <llvm-project/lldb/include/lldb/Target/Process.h - [1394, 2375, 523, 717, 1725, 2174]>.

Hide Details

[Clang (LLVM based)] [-ERROR-] Git blame errors: [Clang (LLVM based)] [-ERROR-] - no blame results for request <llvm-project/lldb/include/lldb/Host/common/NativeProcessProtocol.h - [387, 390]>.

Hide Details

[Clang (LLVM based)] [-ERROR-] Git blame errors: [Clang (LLVM based)] [-ERROR-] - no blame results for request <llvm-project/lldb/include/lldb/Utility/ConstString.h - [337, 149, 168, 330, 191]>.

Hide Details

[Clang (LLVM based)] [-ERROR-] Git blame errors: [Clang (LLVM based)] [-ERROR-] - no blame results for request <llvm-project/lldb/include/lldb/Utility/Broadcaster.h - [370, 263, 311, 392, 267, 271, 351]>.

Hide Details

[Clang (LLVM based)] [-ERROR-] Git blame errors: [Clang (LLVM based)] [-ERROR-] - no blame results for request <llvm-project/lldb/include/lldb/Expression/ExpressionParser.h - [32]>.

Hide Details

[Clang (LLVM based)] [-ERROR-] Git blame errors: [Clang (LLVM based)] [-ERROR-] - no blame results for request <llvm-project/lldb/include/lldb/Symbol/Declaration.h - [94]>.

Hide Details

[Clang (LLVM based)] [-ERROR-] Git blame errors: [Clang (LLVM based)] [-ERROR-] - no blame results for request <llvm-project/lldb/include/lldb/Host/PseudoTerminal.h - [64, 68, 168, 107, 139, 172, 143]>.

Hide Details

[Clang (LLVM based)] [-ERROR-] Git blame errors: [Clang (LLVM based)] [-ERROR-] - no blame results for request <llvm-project/lldb/include/lldb/Expression/UtilityFunction.h - [68]>.

Hide Details

[Clang (LLVM based)] [-ERROR-] Git blame errors: [Clang (LLVM based)] [-ERROR-] - no blame results for request <llvm-project/lldb/include/lldb/Target/StackFrame.h - [102, 294, 409, 426, 302]>.

Hide Details

[Clang (LLVM based)] [-ERROR-] Git blame errors: [Clang (LLVM based)] [-ERROR-] - no blame results for request <llvm-project/lldb/include/lldb/Utility/Flags.h - [32]>.

Hide Details

[Clang (LLVM based)] [-ERROR-] Git blame errors: [Clang (LLVM based)] [-ERROR-] - no blame results for request <llvm-project/lldb/include/lldb/Host/HostProcess.h - [15]>.

Hide Details

[Clang (LLVM based)] [-ERROR-] Git blame errors: [Clang (LLVM based)] [-ERROR-] - no blame results for request <llvm-project/lldb/include/lldb/Core/SearchFilter.h - [355, 309, 358, 87, 408, 105, 411]>.

Hide Details

[Clang (LLVM based)] [-ERROR-] Git blame errors: [Clang (LLVM based)] [-ERROR-] - no blame results for request <llvm-project/lldb/include/lldb/Core/ModuleChild.h - [49, 23]>.

Hide Details

[Clang (LLVM based)] [-ERROR-] Git blame errors: [Clang (LLVM based)] [-ERROR-] - no blame results for request <llvm-project/lldb/include/lldb/Breakpoint/BreakpointList.h - [141]>.

Hide Details

[Clang (LLVM based)] [-ERROR-] Git blame errors: [Clang (LLVM based)] [-ERROR-] - no blame results for request <llvm-project/lldb/include/lldb/Breakpoint/BreakpointLocationCollection.h - [34, 115, 69, 30]>.

Hide Details

[Clang (LLVM based)] [-ERROR-] Git blame errors: [Clang (LLVM based)] [-ERROR-] - no blame results for request <llvm-project/lldb/include/lldb/Core/AddressRange.h - [150, 126]>.

Hide Details

[Clang (LLVM based)] [-ERROR-] Git blame errors: [Clang (LLVM based)] [-ERROR-] - no blame results for request <llvm-project/lldb/include/lldb/Breakpoint/BreakpointOptions.h - [298]>.

Hide Details

[Clang (LLVM based)] [-ERROR-] Git blame errors: [Clang (LLVM based)] [-ERROR-] - no blame results for request <llvm-project/lldb/include/lldb/Breakpoint/Breakpoint.h - [208, 196, 376]>.

Hide Details

[Clang (LLVM based)] [-ERROR-] Git blame errors: [Clang (LLVM based)] [-ERROR-] - no blame results for request <llvm-project/lldb/include/lldb/Core/Highlighter.h - [102, 46, 47]>.

Hide Details

[Clang (LLVM based)] [-ERROR-] Git blame errors: [Clang (LLVM based)] [-ERROR-] - no blame results for request <llvm-project/lldb/include/lldb/Host/File.h - [96, 81, 79]>.

Hide Details

[Clang (LLVM based)] [-ERROR-] Git blame errors: [Clang (LLVM based)] [-ERROR-] - no blame results for request <llvm-project/lldb/include/lldb/Symbol/Block.h - [81, 85, 246, 235, 60, 63]>.

Hide Details

[Clang (LLVM based)] [-ERROR-] Git blame errors: [Clang (LLVM based)] [-ERROR-] - no blame results for request <llvm-project/llvm/include/llvm/Analysis/ScalarEvolution.h - [1696]>.

Hide Details

[Clang (LLVM based)] [-ERROR-] Git blame errors: [Clang (LLVM based)] [-ERROR-] - no blame results for request <llvm-project/lldb/include/lldb/Core/Module.h - [320, 450, 419, 294]>.

Hide Details

[Clang (LLVM based)] [-ERROR-] Git blame errors: [Clang (LLVM based)] [-ERROR-] - no blame results for request <llvm-project/lldb/include/lldb/Target/Platform.h - [780, 383]>.

Hide Details

[Clang (LLVM based)] [-ERROR-] Git blame errors: [Clang (LLVM based)] [-ERROR-] - no blame results for request <llvm-project/lldb/include/lldb/Breakpoint/BreakpointID.h - [68]>.

Hide Details

[Clang (LLVM based)] [-ERROR-] Git blame errors: [Clang (LLVM based)] [-ERROR-] - no blame results for request <llvm-project/lldb/include/lldb/Breakpoint/BreakpointResolver.h - [48, 75]>.

Hide Details

[Clang (LLVM based)] [-ERROR-] Git blame errors: [Clang (LLVM based)] [-ERROR-] - no blame results for request <llvm-project/lldb/include/lldb/Expression/DWARFExpression.h - [194, 187, 254]>.

Hide Details

[Clang (LLVM based)] [-ERROR-] Git blame errors: [Clang (LLVM based)] [-ERROR-] - no blame results for request <llvm-project/lldb/include/lldb/Utility/CompletionRequest.h - [181, 151, 138]>.

Hide Details

[Clang (LLVM based)] [-ERROR-] Git blame errors: [Clang (LLVM based)] [-ERROR-] - no blame results for request <llvm-project/lldb/include/lldb/Target/Queue.h - [131]>.

Hide Details

[Clang (LLVM based)] [-ERROR-] Git blame errors: [Clang (LLVM based)] [-ERROR-] - no blame results for request <llvm-project/lldb/include/lldb/Interpreter/CommandObject.h - [229, 264, 238]>.

Hide Details

[Clang (LLVM based)] [-ERROR-] Git blame errors: [Clang (LLVM based)] [-ERROR-] - no blame results for request <llvm-project/lldb/include/lldb/Breakpoint/WatchpointList.h - [183]>.

Hide Details

[Clang (LLVM based)] [-ERROR-] Git blame errors: [Clang (LLVM based)] [-ERROR-] - no blame results for request <llvm-project/lldb/include/lldb/Symbol/Function.h - [70, 185]>.

Hide Details

[Clang (LLVM based)] [-ERROR-] Git blame errors: [Clang (LLVM based)] [-ERROR-] - no blame results for request <llvm-project/lldb/include/lldb/Breakpoint/BreakpointLocationList.h - [171, 79]>.

Hide Details

[Clang (LLVM based)] [-ERROR-] Git blame errors: [Clang (LLVM based)] [-ERROR-] - no blame results for request <llvm-project/lldb/include/lldb/Target/Thread.h - [1154, 131, 133, 184, 809, 762, 814, 1007]>.

Hide Details

[Clang (LLVM based)] [-ERROR-] Git blame errors: [Clang (LLVM based)] [-ERROR-] - no blame results for request <llvm-project/lldb/include/lldb/Symbol/LineEntry.h - [104, 45, 78]>.

Hide Details

[Clang (LLVM based)] [-ERROR-] Git blame errors: [Clang (LLVM based)] [-ERROR-] - no blame results for request <llvm-project/lldb/include/lldb/Interpreter/Options.h - [166, 185]>.

Hide Details

[Clang (LLVM based)] [-ERROR-] Git blame errors: [Clang (LLVM based)] [-ERROR-] - no blame results for request <llvm-project/lldb/include/lldb/Target/Target.h - [909]>.

Hide Details

[Clang (LLVM based)] [-ERROR-] Git blame errors: [Clang (LLVM based)] [-ERROR-] - no blame results for request <llvm-project/lldb/include/lldb/Breakpoint/BreakpointSite.h - [103, 205, 110, 126]>.

Hide Details

[Clang (LLVM based)] [-ERROR-] Git blame errors: [Clang (LLVM based)] [-ERROR-] - no blame results for request <llvm-project/lldb/include/lldb/Symbol/SymbolContext.h - [290, 54, 310, 270]>.

Hide Details

[Clang (LLVM based)] [-ERROR-] Git blame errors: [Clang (LLVM based)] [-ERROR-] - no blame results for request <llvm-project/lldb/include/lldb/Symbol/LineTable.h - [200, 138, 204]>.

Hide Details

[Clang (LLVM based)] [-ERROR-] Git blame errors: [Clang (LLVM based)] [-ERROR-] - no blame results for request <llvm-project/lldb/include/lldb/Expression/FunctionCaller.h - [227, 70, 73, 236, 239]>.

Hide Details

[Clang (LLVM based)] [-ERROR-] Git blame errors: [Clang (LLVM based)] [-ERROR-] - no blame results for request <llvm-project/lldb/include/lldb/Expression/UserExpression.h - [50, 169]>.

Hide Details

[Clang (LLVM based)] [-ERROR-] Git blame errors: [Clang (LLVM based)] [-ERROR-] - no blame results for request <llvm-project/lldb/include/lldb/Core/Mangled.h - [110]>.

Hide Details

[Clang (LLVM based)] [-ERROR-] Git blame errors: [Clang (LLVM based)] [-ERROR-] - no blame results for request <llvm-project/lldb/include/lldb/Breakpoint/BreakpointLocation.h - [96, 227]>.

Hide Details

[Clang (LLVM based)] [-ERROR-] Git blame errors: [Clang (LLVM based)] [-ERROR-] - no blame results for request <llvm-project/lldb/include/lldb/Core/Address.h - [82, 68, 436, 181, 86, 73, 124, 77]>.

Hide Details

[Clang (LLVM based)] [-ERROR-] Git blame errors: [Clang (LLVM based)] [-ERROR-] - no blame results for request <llvm-project/lldb/include/lldb/Expression/IRExecutionUnit.h - [180, 183, 331, 190, 207]>.

Hide Details

[Clang (LLVM based)] [-ERROR-] Git blame errors: [Clang (LLVM based)] [-ERROR-] - no blame results for request <llvm-project/lldb/include/lldb/Symbol/CompileUnit.h - [244, 85, 47]>.

Hide Details

[Clang (LLVM based)] [-ERROR-] Git blame errors: [Clang (LLVM based)] [-ERROR-] - no blame results for request <llvm-project/lldb/include/lldb/Symbol/ObjectFile.h - [656, 161, 133, 360, 364]>.

Hide Details

[Clang (LLVM based)] [-ERROR-] Git blame errors: [Clang (LLVM based)] [-ERROR-] - no blame results for request <llvm-project/lldb/include/lldb/Core/ModuleList.h - [354, 371, 308, 312, 138, 363, 300, 316, 367]>.

Hide Details

[Clang (LLVM based)] [-ERROR-] Git blame errors: [Clang (LLVM based)] [-ERROR-] - no blame results for request <llvm-project/lldb/include/lldb/Interpreter/CommandInterpreter.h - [54]>.

Hide Details

[Clang (LLVM based)] [-ERROR-] Git blame errors: [Clang (LLVM based)] [-ERROR-] - no blame results for request <llvm-project/lldb/include/lldb/Target/TargetList.h - [58, 63]>.

Hide Details

[Clang (LLVM based)] [-ERROR-] Git blame errors: [Clang (LLVM based)] [-ERROR-] - no blame results for request <llvm-project/lldb/include/lldb/Host/HostInfoBase.h - [44]>.

Hide Details

[Clang (LLVM based)] [-ERROR-] Git blame errors: [Clang (LLVM based)] [-ERROR-] - no blame results for request <llvm-project/lldb/source/Plugins/Process/gdb-remote/GDBRemoteCommunicationClient.h - [92, 158]>.

Hide Details

[Clang (LLVM based)] [-ERROR-] Git blame errors: [Clang (LLVM based)] [-ERROR-] - no blame results for request <llvm-project/lldb/include/lldb/Breakpoint/Watchpoint.h - [117]>.

Hide Details

[Clang (LLVM based)] Post processing issues on 'green-dragon-24' with source code encoding 'UTF-8' [Clang (LLVM based)] Resolving absolute file names for all issues in workspace '/Users/buildslave/jenkins/workspace/lldb-cmake' [Clang (LLVM based)] -> 0 resolved, 0 unresolved, 54 already resolved [Clang (LLVM based)] Copying affected files to Jenkins' build folder '/Users/Shared/Jenkins/Home/jobs/lldb-cmake/builds/3704/files-with-issues' [Clang (LLVM based)] -> 54 copied, 0 not in workspace, 0 not-found, 0 with I/O error [Clang (LLVM based)] Resolving module names from module definitions (build.xml, pom.xml, or Manifest.mf files) [Clang (LLVM based)] -> resolved module names for 166 issues [Clang (LLVM based)] Resolving package names (or namespaces) by parsing the affected files [Clang (LLVM based)] -> resolved package names of 54 affected files [Clang (LLVM based)] No filter has been set, publishing all 166 issues [Clang (LLVM based)] Creating fingerprints for all affected code blocks to track issues over different builds [Clang (LLVM based)] -> created fingerprints for 166 issues [Clang (LLVM based)] Invoking Git blamer to create author and commit information for all affected files [Clang (LLVM based)] GIT_COMMIT env = 'HEAD' [Clang (LLVM based)] Git working tree = '/Users/buildslave/jenkins/workspace/lldb-cmake' [Clang (LLVM based)] Git commit ID = '363234d186175c693377af5355d6f7d0d317f3f6' [Clang (LLVM based)] Job workspace = '/Users/buildslave/jenkins/workspace/lldb-cmake' [Clang (LLVM based)] Created blame requests for 54 files - invoking Git blame on agent for each of the requests [Clang (LLVM based)] -> blamed authors of issues in 54 files
[Pipeline] junit Recording test results [BFA] Scanning build for known causes... [Pipeline] emailext [BFA] Found failure cause(s): [BFA] Regression test failed from category Test [BFA] Ninja target failed from category Compile [BFA] Done. 0s Not sending mail to unregistered user arsenm2@gmail.com because your SCM claimed this was associated with a user ID ‘arsenm2' which your security realm does not recognize; you may need changes in your SCM plugin Not sending mail to unregistered user arsenm2@gmail.com because your SCM claimed this was associated with a user ID ‘arsenm2' which your security realm does not recognize; you may need changes in your SCM plugin

Hide Details

Begin Pre-Send Script... Sending email to: mschifer@apple.com Volodymyr Sapsai <vsapsai@apple.com> Azhar Mohammed <azhar@apple.com>
> git rev-parse HEAD^{commit} # timeout=10 [Pipeline] } [Pipeline] // stage [Pipeline] } [Pipeline] // withEnv [Pipeline] } [Pipeline] // node [Pipeline] End of Pipeline ERROR: script returned exit code 1 Finished: FAILURE