FailedConsole Output

Skipping 3,330 KB.. Full Log
rono.cpp.o.d -o projects/libcxx/src/CMakeFiles/cxx_static.dir/chrono.cpp.o -c /Users/buildslave/jenkins/workspace/mr-clang-stage1-cmake-RA-expensive/llvm-project/libcxx/src/chrono.cpp
[2502/4432] /Applications/Xcode.app/Contents/Developer/Toolchains/XcodeDefault.xctoolchain/usr/bin/c++  -DEXPENSIVE_CHECKS -DNDEBUG -D_GLIBCXX_DEBUG -D_LIBCPP_BUILDING_LIBRARY -D_LIBCPP_HAS_NO_PRAGMA_SYSTEM_HEADER -D__STDC_CONSTANT_MACROS -D__STDC_FORMAT_MACROS -D__STDC_LIMIT_MACROS -Iprojects/libcxx/src -I/Users/buildslave/jenkins/workspace/mr-clang-stage1-cmake-RA-expensive/llvm-project/libcxx/src -I/Applications/Xcode.app/Contents/Developer/Platforms/MacOSX.platform/Developer/SDKs/MacOSX10.14.sdk/usr/include/libxml2 -Iinclude -I/Users/buildslave/jenkins/workspace/mr-clang-stage1-cmake-RA-expensive/llvm-project/llvm/include -Iprojects/libcxx/include/c++build -I/Users/buildslave/jenkins/workspace/mr-clang-stage1-cmake-RA-expensive/llvm-project/libcxx/include -fPIC -fvisibility-inlines-hidden -Werror=date-time -Werror=unguarded-availability-new -std=c++11 -Wall -Wextra -Wno-unused-parameter -Wwrite-strings -Wcast-qual -Wmissing-field-initializers  -Wno-long-long -Wimplicit-fallthrough -Wcovered-switch-default -Wno-noexcept-type -Wnon-virtual-dtor -Wdelete-non-virtual-dtor -Wstring-conversion -fdiagnostics-color -O3  -isysroot /Applications/Xcode.app/Contents/Developer/Platforms/MacOSX.platform/Developer/SDKs/MacOSX10.14.sdk    -DLIBCXX_BUILDING_LIBCXXABI -std=c++11 -nostdinc++ -fvisibility-inlines-hidden -Wall -Wextra -W -Wwrite-strings -Wno-unused-parameter -Wno-long-long -Werror=return-type -Wextra-semi -Wno-user-defined-literals -Wno-covered-switch-default -Wno-ignored-attributes -Wno-error -MD -MT projects/libcxx/src/CMakeFiles/cxx_static.dir/condition_variable.cpp.o -MF projects/libcxx/src/CMakeFiles/cxx_static.dir/condition_variable.cpp.o.d -o projects/libcxx/src/CMakeFiles/cxx_static.dir/condition_variable.cpp.o -c /Users/buildslave/jenkins/workspace/mr-clang-stage1-cmake-RA-expensive/llvm-project/libcxx/src/condition_variable.cpp
[2503/4432] /Applications/Xcode.app/Contents/Developer/Toolchains/XcodeDefault.xctoolchain/usr/bin/c++  -DEXPENSIVE_CHECKS -DNDEBUG -D_GLIBCXX_DEBUG -D_LIBCPP_BUILDING_LIBRARY -D_LIBCPP_HAS_NO_PRAGMA_SYSTEM_HEADER -D__STDC_CONSTANT_MACROS -D__STDC_FORMAT_MACROS -D__STDC_LIMIT_MACROS -Iprojects/libcxx/src -I/Users/buildslave/jenkins/workspace/mr-clang-stage1-cmake-RA-expensive/llvm-project/libcxx/src -I/Applications/Xcode.app/Contents/Developer/Platforms/MacOSX.platform/Developer/SDKs/MacOSX10.14.sdk/usr/include/libxml2 -Iinclude -I/Users/buildslave/jenkins/workspace/mr-clang-stage1-cmake-RA-expensive/llvm-project/llvm/include -Iprojects/libcxx/include/c++build -I/Users/buildslave/jenkins/workspace/mr-clang-stage1-cmake-RA-expensive/llvm-project/libcxx/include -fPIC -fvisibility-inlines-hidden -Werror=date-time -Werror=unguarded-availability-new -std=c++11 -Wall -Wextra -Wno-unused-parameter -Wwrite-strings -Wcast-qual -Wmissing-field-initializers  -Wno-long-long -Wimplicit-fallthrough -Wcovered-switch-default -Wno-noexcept-type -Wnon-virtual-dtor -Wdelete-non-virtual-dtor -Wstring-conversion -fdiagnostics-color -O3  -isysroot /Applications/Xcode.app/Contents/Developer/Platforms/MacOSX.platform/Developer/SDKs/MacOSX10.14.sdk    -DLIBCXX_BUILDING_LIBCXXABI -std=c++11 -nostdinc++ -fvisibility-inlines-hidden -Wall -Wextra -W -Wwrite-strings -Wno-unused-parameter -Wno-long-long -Werror=return-type -Wextra-semi -Wno-user-defined-literals -Wno-covered-switch-default -Wno-ignored-attributes -Wno-error -MD -MT projects/libcxx/src/CMakeFiles/cxx_static.dir/hash.cpp.o -MF projects/libcxx/src/CMakeFiles/cxx_static.dir/hash.cpp.o.d -o projects/libcxx/src/CMakeFiles/cxx_static.dir/hash.cpp.o -c /Users/buildslave/jenkins/workspace/mr-clang-stage1-cmake-RA-expensive/llvm-project/libcxx/src/hash.cpp
[2504/4432] /Applications/Xcode.app/Contents/Developer/Toolchains/XcodeDefault.xctoolchain/usr/bin/c++  -DEXPENSIVE_CHECKS -DNDEBUG -D_GLIBCXX_DEBUG -D_LIBCPP_BUILDING_LIBRARY -D_LIBCPP_HAS_NO_PRAGMA_SYSTEM_HEADER -D__STDC_CONSTANT_MACROS -D__STDC_FORMAT_MACROS -D__STDC_LIMIT_MACROS -Iprojects/libcxx/src -I/Users/buildslave/jenkins/workspace/mr-clang-stage1-cmake-RA-expensive/llvm-project/libcxx/src -I/Applications/Xcode.app/Contents/Developer/Platforms/MacOSX.platform/Developer/SDKs/MacOSX10.14.sdk/usr/include/libxml2 -Iinclude -I/Users/buildslave/jenkins/workspace/mr-clang-stage1-cmake-RA-expensive/llvm-project/llvm/include -Iprojects/libcxx/include/c++build -I/Users/buildslave/jenkins/workspace/mr-clang-stage1-cmake-RA-expensive/llvm-project/libcxx/include -fPIC -fvisibility-inlines-hidden -Werror=date-time -Werror=unguarded-availability-new -std=c++11 -Wall -Wextra -Wno-unused-parameter -Wwrite-strings -Wcast-qual -Wmissing-field-initializers  -Wno-long-long -Wimplicit-fallthrough -Wcovered-switch-default -Wno-noexcept-type -Wnon-virtual-dtor -Wdelete-non-virtual-dtor -Wstring-conversion -fdiagnostics-color -O3  -isysroot /Applications/Xcode.app/Contents/Developer/Platforms/MacOSX.platform/Developer/SDKs/MacOSX10.14.sdk    -DLIBCXX_BUILDING_LIBCXXABI -std=c++11 -nostdinc++ -fvisibility-inlines-hidden -Wall -Wextra -W -Wwrite-strings -Wno-unused-parameter -Wno-long-long -Werror=return-type -Wextra-semi -Wno-user-defined-literals -Wno-covered-switch-default -Wno-ignored-attributes -Wno-error -MD -MT projects/libcxx/src/CMakeFiles/cxx_static.dir/mutex_destructor.cpp.o -MF projects/libcxx/src/CMakeFiles/cxx_static.dir/mutex_destructor.cpp.o.d -o projects/libcxx/src/CMakeFiles/cxx_static.dir/mutex_destructor.cpp.o -c /Users/buildslave/jenkins/workspace/mr-clang-stage1-cmake-RA-expensive/llvm-project/libcxx/src/mutex_destructor.cpp
[2505/4432] /Applications/Xcode.app/Contents/Developer/Toolchains/XcodeDefault.xctoolchain/usr/bin/c++  -DEXPENSIVE_CHECKS -DGTEST_HAS_RTTI=0 -D_DEBUG -D_GLIBCXX_DEBUG -D__STDC_CONSTANT_MACROS -D__STDC_FORMAT_MACROS -D__STDC_LIMIT_MACROS -Ilib/XRay -I/Users/buildslave/jenkins/workspace/mr-clang-stage1-cmake-RA-expensive/llvm-project/llvm/lib/XRay -I/Applications/Xcode.app/Contents/Developer/Platforms/MacOSX.platform/Developer/SDKs/MacOSX10.14.sdk/usr/include/libxml2 -Iinclude -I/Users/buildslave/jenkins/workspace/mr-clang-stage1-cmake-RA-expensive/llvm-project/llvm/include -fPIC -fvisibility-inlines-hidden -Werror=date-time -Werror=unguarded-availability-new -std=c++11 -Wall -Wextra -Wno-unused-parameter -Wwrite-strings -Wcast-qual -Wmissing-field-initializers -pedantic -Wno-long-long -Wimplicit-fallthrough -Wcovered-switch-default -Wno-noexcept-type -Wnon-virtual-dtor -Wdelete-non-virtual-dtor -Wstring-conversion -fdiagnostics-color -O3  -isysroot /Applications/Xcode.app/Contents/Developer/Platforms/MacOSX.platform/Developer/SDKs/MacOSX10.14.sdk   -UNDEBUG  -fno-exceptions -fno-rtti -MD -MT lib/XRay/CMakeFiles/LLVMXRay.dir/Trace.cpp.o -MF lib/XRay/CMakeFiles/LLVMXRay.dir/Trace.cpp.o.d -o lib/XRay/CMakeFiles/LLVMXRay.dir/Trace.cpp.o -c /Users/buildslave/jenkins/workspace/mr-clang-stage1-cmake-RA-expensive/llvm-project/llvm/lib/XRay/Trace.cpp
[2506/4432] : && "/Applications/Xcode.app/Contents/Developer/Toolchains/XcodeDefault.xctoolchain/usr/bin/libtool" -static -no_warning_for_no_symbols -o lib/libLLVMXRay.a  lib/XRay/CMakeFiles/LLVMXRay.dir/BlockIndexer.cpp.o lib/XRay/CMakeFiles/LLVMXRay.dir/BlockPrinter.cpp.o lib/XRay/CMakeFiles/LLVMXRay.dir/BlockVerifier.cpp.o lib/XRay/CMakeFiles/LLVMXRay.dir/FDRRecordProducer.cpp.o lib/XRay/CMakeFiles/LLVMXRay.dir/FDRRecords.cpp.o lib/XRay/CMakeFiles/LLVMXRay.dir/FDRTraceExpander.cpp.o lib/XRay/CMakeFiles/LLVMXRay.dir/FDRTraceWriter.cpp.o lib/XRay/CMakeFiles/LLVMXRay.dir/FileHeaderReader.cpp.o lib/XRay/CMakeFiles/LLVMXRay.dir/InstrumentationMap.cpp.o lib/XRay/CMakeFiles/LLVMXRay.dir/LogBuilderConsumer.cpp.o lib/XRay/CMakeFiles/LLVMXRay.dir/Profile.cpp.o lib/XRay/CMakeFiles/LLVMXRay.dir/RecordInitializer.cpp.o lib/XRay/CMakeFiles/LLVMXRay.dir/RecordPrinter.cpp.o lib/XRay/CMakeFiles/LLVMXRay.dir/Trace.cpp.o && :
[2507/4432] /Applications/Xcode.app/Contents/Developer/Toolchains/XcodeDefault.xctoolchain/usr/bin/c++  -DEXPENSIVE_CHECKS -DNDEBUG -D_GLIBCXX_DEBUG -D_LIBCPP_BUILDING_LIBRARY -D_LIBCPP_HAS_NO_PRAGMA_SYSTEM_HEADER -D__STDC_CONSTANT_MACROS -D__STDC_FORMAT_MACROS -D__STDC_LIMIT_MACROS -Iprojects/libcxx/src -I/Users/buildslave/jenkins/workspace/mr-clang-stage1-cmake-RA-expensive/llvm-project/libcxx/src -I/Applications/Xcode.app/Contents/Developer/Platforms/MacOSX.platform/Developer/SDKs/MacOSX10.14.sdk/usr/include/libxml2 -Iinclude -I/Users/buildslave/jenkins/workspace/mr-clang-stage1-cmake-RA-expensive/llvm-project/llvm/include -Iprojects/libcxx/include/c++build -I/Users/buildslave/jenkins/workspace/mr-clang-stage1-cmake-RA-expensive/llvm-project/libcxx/include -fPIC -fvisibility-inlines-hidden -Werror=date-time -Werror=unguarded-availability-new -std=c++11 -Wall -Wextra -Wno-unused-parameter -Wwrite-strings -Wcast-qual -Wmissing-field-initializers  -Wno-long-long -Wimplicit-fallthrough -Wcovered-switch-default -Wno-noexcept-type -Wnon-virtual-dtor -Wdelete-non-virtual-dtor -Wstring-conversion -fdiagnostics-color -O3  -isysroot /Applications/Xcode.app/Contents/Developer/Platforms/MacOSX.platform/Developer/SDKs/MacOSX10.14.sdk    -DLIBCXX_BUILDING_LIBCXXABI -std=c++11 -nostdinc++ -fvisibility-inlines-hidden -Wall -Wextra -W -Wwrite-strings -Wno-unused-parameter -Wno-long-long -Werror=return-type -Wextra-semi -Wno-user-defined-literals -Wno-covered-switch-default -Wno-ignored-attributes -Wno-error -MD -MT projects/libcxx/src/CMakeFiles/cxx_static.dir/debug.cpp.o -MF projects/libcxx/src/CMakeFiles/cxx_static.dir/debug.cpp.o.d -o projects/libcxx/src/CMakeFiles/cxx_static.dir/debug.cpp.o -c /Users/buildslave/jenkins/workspace/mr-clang-stage1-cmake-RA-expensive/llvm-project/libcxx/src/debug.cpp
[2508/4432] /Applications/Xcode.app/Contents/Developer/Toolchains/XcodeDefault.xctoolchain/usr/bin/c++  -DEXPENSIVE_CHECKS -DNDEBUG -D_GLIBCXX_DEBUG -D_LIBCPP_BUILDING_LIBRARY -D_LIBCPP_HAS_NO_PRAGMA_SYSTEM_HEADER -D__STDC_CONSTANT_MACROS -D__STDC_FORMAT_MACROS -D__STDC_LIMIT_MACROS -Iprojects/libcxx/src -I/Users/buildslave/jenkins/workspace/mr-clang-stage1-cmake-RA-expensive/llvm-project/libcxx/src -I/Applications/Xcode.app/Contents/Developer/Platforms/MacOSX.platform/Developer/SDKs/MacOSX10.14.sdk/usr/include/libxml2 -Iinclude -I/Users/buildslave/jenkins/workspace/mr-clang-stage1-cmake-RA-expensive/llvm-project/llvm/include -Iprojects/libcxx/include/c++build -I/Users/buildslave/jenkins/workspace/mr-clang-stage1-cmake-RA-expensive/llvm-project/libcxx/include -fPIC -fvisibility-inlines-hidden -Werror=date-time -Werror=unguarded-availability-new -std=c++11 -Wall -Wextra -Wno-unused-parameter -Wwrite-strings -Wcast-qual -Wmissing-field-initializers  -Wno-long-long -Wimplicit-fallthrough -Wcovered-switch-default -Wno-noexcept-type -Wnon-virtual-dtor -Wdelete-non-virtual-dtor -Wstring-conversion -fdiagnostics-color -O3  -isysroot /Applications/Xcode.app/Contents/Developer/Platforms/MacOSX.platform/Developer/SDKs/MacOSX10.14.sdk    -DLIBCXX_BUILDING_LIBCXXABI -std=c++11 -nostdinc++ -fvisibility-inlines-hidden -Wall -Wextra -W -Wwrite-strings -Wno-unused-parameter -Wno-long-long -Werror=return-type -Wextra-semi -Wno-user-defined-literals -Wno-covered-switch-default -Wno-ignored-attributes -Wno-error -MD -MT projects/libcxx/src/CMakeFiles/cxx_static.dir/future.cpp.o -MF projects/libcxx/src/CMakeFiles/cxx_static.dir/future.cpp.o.d -o projects/libcxx/src/CMakeFiles/cxx_static.dir/future.cpp.o -c /Users/buildslave/jenkins/workspace/mr-clang-stage1-cmake-RA-expensive/llvm-project/libcxx/src/future.cpp
[2509/4432] /Applications/Xcode.app/Contents/Developer/Toolchains/XcodeDefault.xctoolchain/usr/bin/c++  -DEXPENSIVE_CHECKS -DNDEBUG -D_GLIBCXX_DEBUG -D_LIBCPP_BUILDING_LIBRARY -D_LIBCPP_HAS_NO_PRAGMA_SYSTEM_HEADER -D__STDC_CONSTANT_MACROS -D__STDC_FORMAT_MACROS -D__STDC_LIMIT_MACROS -Iprojects/libcxx/src -I/Users/buildslave/jenkins/workspace/mr-clang-stage1-cmake-RA-expensive/llvm-project/libcxx/src -I/Applications/Xcode.app/Contents/Developer/Platforms/MacOSX.platform/Developer/SDKs/MacOSX10.14.sdk/usr/include/libxml2 -Iinclude -I/Users/buildslave/jenkins/workspace/mr-clang-stage1-cmake-RA-expensive/llvm-project/llvm/include -Iprojects/libcxx/include/c++build -I/Users/buildslave/jenkins/workspace/mr-clang-stage1-cmake-RA-expensive/llvm-project/libcxx/include -fPIC -fvisibility-inlines-hidden -Werror=date-time -Werror=unguarded-availability-new -std=c++11 -Wall -Wextra -Wno-unused-parameter -Wwrite-strings -Wcast-qual -Wmissing-field-initializers  -Wno-long-long -Wimplicit-fallthrough -Wcovered-switch-default -Wno-noexcept-type -Wnon-virtual-dtor -Wdelete-non-virtual-dtor -Wstring-conversion -fdiagnostics-color -O3  -isysroot /Applications/Xcode.app/Contents/Developer/Platforms/MacOSX.platform/Developer/SDKs/MacOSX10.14.sdk    -DLIBCXX_BUILDING_LIBCXXABI -std=c++11 -nostdinc++ -fvisibility-inlines-hidden -Wall -Wextra -W -Wwrite-strings -Wno-unused-parameter -Wno-long-long -Werror=return-type -Wextra-semi -Wno-user-defined-literals -Wno-covered-switch-default -Wno-ignored-attributes -Wno-error -MD -MT projects/libcxx/src/CMakeFiles/cxx_static.dir/mutex.cpp.o -MF projects/libcxx/src/CMakeFiles/cxx_static.dir/mutex.cpp.o.d -o projects/libcxx/src/CMakeFiles/cxx_static.dir/mutex.cpp.o -c /Users/buildslave/jenkins/workspace/mr-clang-stage1-cmake-RA-expensive/llvm-project/libcxx/src/mutex.cpp
[2510/4432] /Applications/Xcode.app/Contents/Developer/Toolchains/XcodeDefault.xctoolchain/usr/bin/c++  -DEXPENSIVE_CHECKS -DNDEBUG -D_GLIBCXX_DEBUG -D_LIBCPP_BUILDING_LIBRARY -D_LIBCPP_HAS_NO_PRAGMA_SYSTEM_HEADER -D__STDC_CONSTANT_MACROS -D__STDC_FORMAT_MACROS -D__STDC_LIMIT_MACROS -Iprojects/libcxx/src -I/Users/buildslave/jenkins/workspace/mr-clang-stage1-cmake-RA-expensive/llvm-project/libcxx/src -I/Applications/Xcode.app/Contents/Developer/Platforms/MacOSX.platform/Developer/SDKs/MacOSX10.14.sdk/usr/include/libxml2 -Iinclude -I/Users/buildslave/jenkins/workspace/mr-clang-stage1-cmake-RA-expensive/llvm-project/llvm/include -Iprojects/libcxx/include/c++build -I/Users/buildslave/jenkins/workspace/mr-clang-stage1-cmake-RA-expensive/llvm-project/libcxx/include -fPIC -fvisibility-inlines-hidden -Werror=date-time -Werror=unguarded-availability-new -std=c++11 -Wall -Wextra -Wno-unused-parameter -Wwrite-strings -Wcast-qual -Wmissing-field-initializers  -Wno-long-long -Wimplicit-fallthrough -Wcovered-switch-default -Wno-noexcept-type -Wnon-virtual-dtor -Wdelete-non-virtual-dtor -Wstring-conversion -fdiagnostics-color -O3  -isysroot /Applications/Xcode.app/Contents/Developer/Platforms/MacOSX.platform/Developer/SDKs/MacOSX10.14.sdk    -DLIBCXX_BUILDING_LIBCXXABI -std=c++11 -nostdinc++ -fvisibility-inlines-hidden -Wall -Wextra -W -Wwrite-strings -Wno-unused-parameter -Wno-long-long -Werror=return-type -Wextra-semi -Wno-user-defined-literals -Wno-covered-switch-default -Wno-ignored-attributes -Wno-error -MD -MT projects/libcxx/src/CMakeFiles/cxx_static.dir/new.cpp.o -MF projects/libcxx/src/CMakeFiles/cxx_static.dir/new.cpp.o.d -o projects/libcxx/src/CMakeFiles/cxx_static.dir/new.cpp.o -c /Users/buildslave/jenkins/workspace/mr-clang-stage1-cmake-RA-expensive/llvm-project/libcxx/src/new.cpp
[2511/4432] /Applications/Xcode.app/Contents/Developer/Toolchains/XcodeDefault.xctoolchain/usr/bin/c++  -DEXPENSIVE_CHECKS -DNDEBUG -D_GLIBCXX_DEBUG -D_LIBCPP_BUILDING_LIBRARY -D_LIBCPP_HAS_NO_PRAGMA_SYSTEM_HEADER -D__STDC_CONSTANT_MACROS -D__STDC_FORMAT_MACROS -D__STDC_LIMIT_MACROS -Iprojects/libcxx/src -I/Users/buildslave/jenkins/workspace/mr-clang-stage1-cmake-RA-expensive/llvm-project/libcxx/src -I/Applications/Xcode.app/Contents/Developer/Platforms/MacOSX.platform/Developer/SDKs/MacOSX10.14.sdk/usr/include/libxml2 -Iinclude -I/Users/buildslave/jenkins/workspace/mr-clang-stage1-cmake-RA-expensive/llvm-project/llvm/include -Iprojects/libcxx/include/c++build -I/Users/buildslave/jenkins/workspace/mr-clang-stage1-cmake-RA-expensive/llvm-project/libcxx/include -fPIC -fvisibility-inlines-hidden -Werror=date-time -Werror=unguarded-availability-new -std=c++11 -Wall -Wextra -Wno-unused-parameter -Wwrite-strings -Wcast-qual -Wmissing-field-initializers  -Wno-long-long -Wimplicit-fallthrough -Wcovered-switch-default -Wno-noexcept-type -Wnon-virtual-dtor -Wdelete-non-virtual-dtor -Wstring-conversion -fdiagnostics-color -O3  -isysroot /Applications/Xcode.app/Contents/Developer/Platforms/MacOSX.platform/Developer/SDKs/MacOSX10.14.sdk    -DLIBCXX_BUILDING_LIBCXXABI -std=c++11 -nostdinc++ -fvisibility-inlines-hidden -Wall -Wextra -W -Wwrite-strings -Wno-unused-parameter -Wno-long-long -Werror=return-type -Wextra-semi -Wno-user-defined-literals -Wno-covered-switch-default -Wno-ignored-attributes -Wno-error -MD -MT projects/libcxx/src/CMakeFiles/cxx_static.dir/memory.cpp.o -MF projects/libcxx/src/CMakeFiles/cxx_static.dir/memory.cpp.o.d -o projects/libcxx/src/CMakeFiles/cxx_static.dir/memory.cpp.o -c /Users/buildslave/jenkins/workspace/mr-clang-stage1-cmake-RA-expensive/llvm-project/libcxx/src/memory.cpp
[2512/4432] /Applications/Xcode.app/Contents/Developer/Toolchains/XcodeDefault.xctoolchain/usr/bin/c++  -DEXPENSIVE_CHECKS -DNDEBUG -D_GLIBCXX_DEBUG -D_LIBCPP_BUILDING_LIBRARY -D_LIBCPP_HAS_NO_PRAGMA_SYSTEM_HEADER -D__STDC_CONSTANT_MACROS -D__STDC_FORMAT_MACROS -D__STDC_LIMIT_MACROS -Iprojects/libcxx/src -I/Users/buildslave/jenkins/workspace/mr-clang-stage1-cmake-RA-expensive/llvm-project/libcxx/src -I/Applications/Xcode.app/Contents/Developer/Platforms/MacOSX.platform/Developer/SDKs/MacOSX10.14.sdk/usr/include/libxml2 -Iinclude -I/Users/buildslave/jenkins/workspace/mr-clang-stage1-cmake-RA-expensive/llvm-project/llvm/include -Iprojects/libcxx/include/c++build -I/Users/buildslave/jenkins/workspace/mr-clang-stage1-cmake-RA-expensive/llvm-project/libcxx/include -fPIC -fvisibility-inlines-hidden -Werror=date-time -Werror=unguarded-availability-new -std=c++11 -Wall -Wextra -Wno-unused-parameter -Wwrite-strings -Wcast-qual -Wmissing-field-initializers  -Wno-long-long -Wimplicit-fallthrough -Wcovered-switch-default -Wno-noexcept-type -Wnon-virtual-dtor -Wdelete-non-virtual-dtor -Wstring-conversion -fdiagnostics-color -O3  -isysroot /Applications/Xcode.app/Contents/Developer/Platforms/MacOSX.platform/Developer/SDKs/MacOSX10.14.sdk    -DLIBCXX_BUILDING_LIBCXXABI -std=c++11 -nostdinc++ -fvisibility-inlines-hidden -Wall -Wextra -W -Wwrite-strings -Wno-unused-parameter -Wno-long-long -Werror=return-type -Wextra-semi -Wno-user-defined-literals -Wno-covered-switch-default -Wno-ignored-attributes -Wno-error -MD -MT projects/libcxx/src/CMakeFiles/cxx_static.dir/optional.cpp.o -MF projects/libcxx/src/CMakeFiles/cxx_static.dir/optional.cpp.o.d -o projects/libcxx/src/CMakeFiles/cxx_static.dir/optional.cpp.o -c /Users/buildslave/jenkins/workspace/mr-clang-stage1-cmake-RA-expensive/llvm-project/libcxx/src/optional.cpp
[2513/4432] /Applications/Xcode.app/Contents/Developer/Toolchains/XcodeDefault.xctoolchain/usr/bin/c++  -DEXPENSIVE_CHECKS -DGTEST_HAS_RTTI=0 -D_DEBUG -D_GLIBCXX_DEBUG -D__STDC_CONSTANT_MACROS -D__STDC_FORMAT_MACROS -D__STDC_LIMIT_MACROS -Iutils/FileCheck -I/Users/buildslave/jenkins/workspace/mr-clang-stage1-cmake-RA-expensive/llvm-project/llvm/utils/FileCheck -I/Applications/Xcode.app/Contents/Developer/Platforms/MacOSX.platform/Developer/SDKs/MacOSX10.14.sdk/usr/include/libxml2 -Iinclude -I/Users/buildslave/jenkins/workspace/mr-clang-stage1-cmake-RA-expensive/llvm-project/llvm/include -fPIC -fvisibility-inlines-hidden -Werror=date-time -Werror=unguarded-availability-new -std=c++11 -Wall -Wextra -Wno-unused-parameter -Wwrite-strings -Wcast-qual -Wmissing-field-initializers -pedantic -Wno-long-long -Wimplicit-fallthrough -Wcovered-switch-default -Wno-noexcept-type -Wnon-virtual-dtor -Wdelete-non-virtual-dtor -Wstring-conversion -fdiagnostics-color -O3  -isysroot /Applications/Xcode.app/Contents/Developer/Platforms/MacOSX.platform/Developer/SDKs/MacOSX10.14.sdk   -UNDEBUG  -fno-exceptions -fno-rtti -MD -MT utils/FileCheck/CMakeFiles/FileCheck.dir/FileCheck.cpp.o -MF utils/FileCheck/CMakeFiles/FileCheck.dir/FileCheck.cpp.o.d -o utils/FileCheck/CMakeFiles/FileCheck.dir/FileCheck.cpp.o -c /Users/buildslave/jenkins/workspace/mr-clang-stage1-cmake-RA-expensive/llvm-project/llvm/utils/FileCheck/FileCheck.cpp
[2514/4432] /Applications/Xcode.app/Contents/Developer/Toolchains/XcodeDefault.xctoolchain/usr/bin/c++  -DEXPENSIVE_CHECKS -DNDEBUG -D_GLIBCXX_DEBUG -D_LIBCPP_BUILDING_LIBRARY -D_LIBCPP_HAS_NO_PRAGMA_SYSTEM_HEADER -D__STDC_CONSTANT_MACROS -D__STDC_FORMAT_MACROS -D__STDC_LIMIT_MACROS -Iprojects/libcxx/src -I/Users/buildslave/jenkins/workspace/mr-clang-stage1-cmake-RA-expensive/llvm-project/libcxx/src -I/Applications/Xcode.app/Contents/Developer/Platforms/MacOSX.platform/Developer/SDKs/MacOSX10.14.sdk/usr/include/libxml2 -Iinclude -I/Users/buildslave/jenkins/workspace/mr-clang-stage1-cmake-RA-expensive/llvm-project/llvm/include -Iprojects/libcxx/include/c++build -I/Users/buildslave/jenkins/workspace/mr-clang-stage1-cmake-RA-expensive/llvm-project/libcxx/include -fPIC -fvisibility-inlines-hidden -Werror=date-time -Werror=unguarded-availability-new -std=c++11 -Wall -Wextra -Wno-unused-parameter -Wwrite-strings -Wcast-qual -Wmissing-field-initializers  -Wno-long-long -Wimplicit-fallthrough -Wcovered-switch-default -Wno-noexcept-type -Wnon-virtual-dtor -Wdelete-non-virtual-dtor -Wstring-conversion -fdiagnostics-color -O3  -isysroot /Applications/Xcode.app/Contents/Developer/Platforms/MacOSX.platform/Developer/SDKs/MacOSX10.14.sdk    -DLIBCXX_BUILDING_LIBCXXABI -std=c++11 -nostdinc++ -fvisibility-inlines-hidden -Wall -Wextra -W -Wwrite-strings -Wno-unused-parameter -Wno-long-long -Werror=return-type -Wextra-semi -Wno-user-defined-literals -Wno-covered-switch-default -Wno-ignored-attributes -Wno-error -MD -MT projects/libcxx/src/CMakeFiles/cxx_static.dir/iostream.cpp.o -MF projects/libcxx/src/CMakeFiles/cxx_static.dir/iostream.cpp.o.d -o projects/libcxx/src/CMakeFiles/cxx_static.dir/iostream.cpp.o -c /Users/buildslave/jenkins/workspace/mr-clang-stage1-cmake-RA-expensive/llvm-project/libcxx/src/iostream.cpp
[2515/4432] : && /Applications/Xcode.app/Contents/Developer/Toolchains/XcodeDefault.xctoolchain/usr/bin/c++  -fPIC -fvisibility-inlines-hidden -Werror=date-time -Werror=unguarded-availability-new -std=c++11 -Wall -Wextra -Wno-unused-parameter -Wwrite-strings -Wcast-qual -Wmissing-field-initializers -pedantic -Wno-long-long -Wimplicit-fallthrough -Wcovered-switch-default -Wno-noexcept-type -Wnon-virtual-dtor -Wdelete-non-virtual-dtor -Wstring-conversion -fdiagnostics-color -O3  -isysroot /Applications/Xcode.app/Contents/Developer/Platforms/MacOSX.platform/Developer/SDKs/MacOSX10.14.sdk -Wl,-search_paths_first -Wl,-headerpad_max_install_names -Wl,-dead_strip utils/FileCheck/CMakeFiles/FileCheck.dir/FileCheck.cpp.o  -o bin/FileCheck  -Wl,-rpath,@loader_path/../lib lib/libLLVMSupport.a -lz -lcurses -lm lib/libLLVMDemangle.a && :
[2516/4432] /Applications/Xcode.app/Contents/Developer/Toolchains/XcodeDefault.xctoolchain/usr/bin/c++  -DEXPENSIVE_CHECKS -DNDEBUG -D_GLIBCXX_DEBUG -D_LIBCPP_BUILDING_LIBRARY -D_LIBCPP_HAS_NO_PRAGMA_SYSTEM_HEADER -D__STDC_CONSTANT_MACROS -D__STDC_FORMAT_MACROS -D__STDC_LIMIT_MACROS -Iprojects/libcxx/src -I/Users/buildslave/jenkins/workspace/mr-clang-stage1-cmake-RA-expensive/llvm-project/libcxx/src -I/Applications/Xcode.app/Contents/Developer/Platforms/MacOSX.platform/Developer/SDKs/MacOSX10.14.sdk/usr/include/libxml2 -Iinclude -I/Users/buildslave/jenkins/workspace/mr-clang-stage1-cmake-RA-expensive/llvm-project/llvm/include -Iprojects/libcxx/include/c++build -I/Users/buildslave/jenkins/workspace/mr-clang-stage1-cmake-RA-expensive/llvm-project/libcxx/include -fPIC -fvisibility-inlines-hidden -Werror=date-time -Werror=unguarded-availability-new -std=c++11 -Wall -Wextra -Wno-unused-parameter -Wwrite-strings -Wcast-qual -Wmissing-field-initializers  -Wno-long-long -Wimplicit-fallthrough -Wcovered-switch-default -Wno-noexcept-type -Wnon-virtual-dtor -Wdelete-non-virtual-dtor -Wstring-conversion -fdiagnostics-color -O3  -isysroot /Applications/Xcode.app/Contents/Developer/Platforms/MacOSX.platform/Developer/SDKs/MacOSX10.14.sdk    -DLIBCXX_BUILDING_LIBCXXABI -std=c++11 -nostdinc++ -fvisibility-inlines-hidden -Wall -Wextra -W -Wwrite-strings -Wno-unused-parameter -Wno-long-long -Werror=return-type -Wextra-semi -Wno-user-defined-literals -Wno-covered-switch-default -Wno-ignored-attributes -Wno-error -MD -MT projects/libcxx/src/CMakeFiles/cxx_static.dir/typeinfo.cpp.o -MF projects/libcxx/src/CMakeFiles/cxx_static.dir/typeinfo.cpp.o.d -o projects/libcxx/src/CMakeFiles/cxx_static.dir/typeinfo.cpp.o -c /Users/buildslave/jenkins/workspace/mr-clang-stage1-cmake-RA-expensive/llvm-project/libcxx/src/typeinfo.cpp
[2517/4432] /Applications/Xcode.app/Contents/Developer/Toolchains/XcodeDefault.xctoolchain/usr/bin/c++  -DEXPENSIVE_CHECKS -DNDEBUG -D_GLIBCXX_DEBUG -D_LIBCPP_BUILDING_LIBRARY -D_LIBCPP_HAS_NO_PRAGMA_SYSTEM_HEADER -D__STDC_CONSTANT_MACROS -D__STDC_FORMAT_MACROS -D__STDC_LIMIT_MACROS -Iprojects/libcxx/src -I/Users/buildslave/jenkins/workspace/mr-clang-stage1-cmake-RA-expensive/llvm-project/libcxx/src -I/Applications/Xcode.app/Contents/Developer/Platforms/MacOSX.platform/Developer/SDKs/MacOSX10.14.sdk/usr/include/libxml2 -Iinclude -I/Users/buildslave/jenkins/workspace/mr-clang-stage1-cmake-RA-expensive/llvm-project/llvm/include -Iprojects/libcxx/include/c++build -I/Users/buildslave/jenkins/workspace/mr-clang-stage1-cmake-RA-expensive/llvm-project/libcxx/include -fPIC -fvisibility-inlines-hidden -Werror=date-time -Werror=unguarded-availability-new -std=c++11 -Wall -Wextra -Wno-unused-parameter -Wwrite-strings -Wcast-qual -Wmissing-field-initializers  -Wno-long-long -Wimplicit-fallthrough -Wcovered-switch-default -Wno-noexcept-type -Wnon-virtual-dtor -Wdelete-non-virtual-dtor -Wstring-conversion -fdiagnostics-color -O3  -isysroot /Applications/Xcode.app/Contents/Developer/Platforms/MacOSX.platform/Developer/SDKs/MacOSX10.14.sdk    -DLIBCXX_BUILDING_LIBCXXABI -std=c++11 -nostdinc++ -fvisibility-inlines-hidden -Wall -Wextra -W -Wwrite-strings -Wno-unused-parameter -Wno-long-long -Werror=return-type -Wextra-semi -Wno-user-defined-literals -Wno-covered-switch-default -Wno-ignored-attributes -Wno-error -MD -MT projects/libcxx/src/CMakeFiles/cxx_static.dir/utility.cpp.o -MF projects/libcxx/src/CMakeFiles/cxx_static.dir/utility.cpp.o.d -o projects/libcxx/src/CMakeFiles/cxx_static.dir/utility.cpp.o -c /Users/buildslave/jenkins/workspace/mr-clang-stage1-cmake-RA-expensive/llvm-project/libcxx/src/utility.cpp
[2518/4432] /Applications/Xcode.app/Contents/Developer/Toolchains/XcodeDefault.xctoolchain/usr/bin/c++  -DEXPENSIVE_CHECKS -DNDEBUG -D_GLIBCXX_DEBUG -D_LIBCPP_BUILDING_LIBRARY -D_LIBCPP_HAS_NO_PRAGMA_SYSTEM_HEADER -D__STDC_CONSTANT_MACROS -D__STDC_FORMAT_MACROS -D__STDC_LIMIT_MACROS -Iprojects/libcxx/src -I/Users/buildslave/jenkins/workspace/mr-clang-stage1-cmake-RA-expensive/llvm-project/libcxx/src -I/Applications/Xcode.app/Contents/Developer/Platforms/MacOSX.platform/Developer/SDKs/MacOSX10.14.sdk/usr/include/libxml2 -Iinclude -I/Users/buildslave/jenkins/workspace/mr-clang-stage1-cmake-RA-expensive/llvm-project/llvm/include -Iprojects/libcxx/include/c++build -I/Users/buildslave/jenkins/workspace/mr-clang-stage1-cmake-RA-expensive/llvm-project/libcxx/include -fPIC -fvisibility-inlines-hidden -Werror=date-time -Werror=unguarded-availability-new -std=c++11 -Wall -Wextra -Wno-unused-parameter -Wwrite-strings -Wcast-qual -Wmissing-field-initializers  -Wno-long-long -Wimplicit-fallthrough -Wcovered-switch-default -Wno-noexcept-type -Wnon-virtual-dtor -Wdelete-non-virtual-dtor -Wstring-conversion -fdiagnostics-color -O3  -isysroot /Applications/Xcode.app/Contents/Developer/Platforms/MacOSX.platform/Developer/SDKs/MacOSX10.14.sdk    -DLIBCXX_BUILDING_LIBCXXABI -std=c++11 -nostdinc++ -fvisibility-inlines-hidden -Wall -Wextra -W -Wwrite-strings -Wno-unused-parameter -Wno-long-long -Werror=return-type -Wextra-semi -Wno-user-defined-literals -Wno-covered-switch-default -Wno-ignored-attributes -Wno-error -MD -MT projects/libcxx/src/CMakeFiles/cxx_static.dir/stdexcept.cpp.o -MF projects/libcxx/src/CMakeFiles/cxx_static.dir/stdexcept.cpp.o.d -o projects/libcxx/src/CMakeFiles/cxx_static.dir/stdexcept.cpp.o -c /Users/buildslave/jenkins/workspace/mr-clang-stage1-cmake-RA-expensive/llvm-project/libcxx/src/stdexcept.cpp
[2519/4432] /Applications/Xcode.app/Contents/Developer/Toolchains/XcodeDefault.xctoolchain/usr/bin/c++  -DEXPENSIVE_CHECKS -DNDEBUG -D_GLIBCXX_DEBUG -D_LIBCPP_BUILDING_LIBRARY -D_LIBCPP_HAS_NO_PRAGMA_SYSTEM_HEADER -D__STDC_CONSTANT_MACROS -D__STDC_FORMAT_MACROS -D__STDC_LIMIT_MACROS -Iprojects/libcxx/src -I/Users/buildslave/jenkins/workspace/mr-clang-stage1-cmake-RA-expensive/llvm-project/libcxx/src -I/Applications/Xcode.app/Contents/Developer/Platforms/MacOSX.platform/Developer/SDKs/MacOSX10.14.sdk/usr/include/libxml2 -Iinclude -I/Users/buildslave/jenkins/workspace/mr-clang-stage1-cmake-RA-expensive/llvm-project/llvm/include -Iprojects/libcxx/include/c++build -I/Users/buildslave/jenkins/workspace/mr-clang-stage1-cmake-RA-expensive/llvm-project/libcxx/include -fPIC -fvisibility-inlines-hidden -Werror=date-time -Werror=unguarded-availability-new -std=c++11 -Wall -Wextra -Wno-unused-parameter -Wwrite-strings -Wcast-qual -Wmissing-field-initializers  -Wno-long-long -Wimplicit-fallthrough -Wcovered-switch-default -Wno-noexcept-type -Wnon-virtual-dtor -Wdelete-non-virtual-dtor -Wstring-conversion -fdiagnostics-color -O3  -isysroot /Applications/Xcode.app/Contents/Developer/Platforms/MacOSX.platform/Developer/SDKs/MacOSX10.14.sdk    -DLIBCXX_BUILDING_LIBCXXABI -std=c++11 -nostdinc++ -fvisibility-inlines-hidden -Wall -Wextra -W -Wwrite-strings -Wno-unused-parameter -Wno-long-long -Werror=return-type -Wextra-semi -Wno-user-defined-literals -Wno-covered-switch-default -Wno-ignored-attributes -Wno-error -MD -MT projects/libcxx/src/CMakeFiles/cxx_static.dir/shared_mutex.cpp.o -MF projects/libcxx/src/CMakeFiles/cxx_static.dir/shared_mutex.cpp.o.d -o projects/libcxx/src/CMakeFiles/cxx_static.dir/shared_mutex.cpp.o -c /Users/buildslave/jenkins/workspace/mr-clang-stage1-cmake-RA-expensive/llvm-project/libcxx/src/shared_mutex.cpp
[2520/4432] /Applications/Xcode.app/Contents/Developer/Toolchains/XcodeDefault.xctoolchain/usr/bin/c++  -DEXPENSIVE_CHECKS -DNDEBUG -D_GLIBCXX_DEBUG -D_LIBCPP_BUILDING_LIBRARY -D_LIBCPP_HAS_NO_PRAGMA_SYSTEM_HEADER -D__STDC_CONSTANT_MACROS -D__STDC_FORMAT_MACROS -D__STDC_LIMIT_MACROS -Iprojects/libcxx/src -I/Users/buildslave/jenkins/workspace/mr-clang-stage1-cmake-RA-expensive/llvm-project/libcxx/src -I/Applications/Xcode.app/Contents/Developer/Platforms/MacOSX.platform/Developer/SDKs/MacOSX10.14.sdk/usr/include/libxml2 -Iinclude -I/Users/buildslave/jenkins/workspace/mr-clang-stage1-cmake-RA-expensive/llvm-project/llvm/include -Iprojects/libcxx/include/c++build -I/Users/buildslave/jenkins/workspace/mr-clang-stage1-cmake-RA-expensive/llvm-project/libcxx/include -fPIC -fvisibility-inlines-hidden -Werror=date-time -Werror=unguarded-availability-new -std=c++11 -Wall -Wextra -Wno-unused-parameter -Wwrite-strings -Wcast-qual -Wmissing-field-initializers  -Wno-long-long -Wimplicit-fallthrough -Wcovered-switch-default -Wno-noexcept-type -Wnon-virtual-dtor -Wdelete-non-virtual-dtor -Wstring-conversion -fdiagnostics-color -O3  -isysroot /Applications/Xcode.app/Contents/Developer/Platforms/MacOSX.platform/Developer/SDKs/MacOSX10.14.sdk    -DLIBCXX_BUILDING_LIBCXXABI -std=c++11 -nostdinc++ -fvisibility-inlines-hidden -Wall -Wextra -W -Wwrite-strings -Wno-unused-parameter -Wno-long-long -Werror=return-type -Wextra-semi -Wno-user-defined-literals -Wno-covered-switch-default -Wno-ignored-attributes -Wno-error -MD -MT projects/libcxx/src/CMakeFiles/cxx_static.dir/system_error.cpp.o -MF projects/libcxx/src/CMakeFiles/cxx_static.dir/system_error.cpp.o.d -o projects/libcxx/src/CMakeFiles/cxx_static.dir/system_error.cpp.o -c /Users/buildslave/jenkins/workspace/mr-clang-stage1-cmake-RA-expensive/llvm-project/libcxx/src/system_error.cpp
[2521/4432] /Applications/Xcode.app/Contents/Developer/Toolchains/XcodeDefault.xctoolchain/usr/bin/c++  -DEXPENSIVE_CHECKS -DNDEBUG -D_GLIBCXX_DEBUG -D_LIBCPP_BUILDING_LIBRARY -D_LIBCPP_HAS_NO_PRAGMA_SYSTEM_HEADER -D__STDC_CONSTANT_MACROS -D__STDC_FORMAT_MACROS -D__STDC_LIMIT_MACROS -Iprojects/libcxx/src -I/Users/buildslave/jenkins/workspace/mr-clang-stage1-cmake-RA-expensive/llvm-project/libcxx/src -I/Applications/Xcode.app/Contents/Developer/Platforms/MacOSX.platform/Developer/SDKs/MacOSX10.14.sdk/usr/include/libxml2 -Iinclude -I/Users/buildslave/jenkins/workspace/mr-clang-stage1-cmake-RA-expensive/llvm-project/llvm/include -Iprojects/libcxx/include/c++build -I/Users/buildslave/jenkins/workspace/mr-clang-stage1-cmake-RA-expensive/llvm-project/libcxx/include -fPIC -fvisibility-inlines-hidden -Werror=date-time -Werror=unguarded-availability-new -std=c++11 -Wall -Wextra -Wno-unused-parameter -Wwrite-strings -Wcast-qual -Wmissing-field-initializers  -Wno-long-long -Wimplicit-fallthrough -Wcovered-switch-default -Wno-noexcept-type -Wnon-virtual-dtor -Wdelete-non-virtual-dtor -Wstring-conversion -fdiagnostics-color -O3  -isysroot /Applications/Xcode.app/Contents/Developer/Platforms/MacOSX.platform/Developer/SDKs/MacOSX10.14.sdk    -DLIBCXX_BUILDING_LIBCXXABI -std=c++11 -nostdinc++ -fvisibility-inlines-hidden -Wall -Wextra -W -Wwrite-strings -Wno-unused-parameter -Wno-long-long -Werror=return-type -Wextra-semi -Wno-user-defined-literals -Wno-covered-switch-default -Wno-ignored-attributes -Wno-error -MD -MT projects/libcxx/src/CMakeFiles/cxx_static.dir/regex.cpp.o -MF projects/libcxx/src/CMakeFiles/cxx_static.dir/regex.cpp.o.d -o projects/libcxx/src/CMakeFiles/cxx_static.dir/regex.cpp.o -c /Users/buildslave/jenkins/workspace/mr-clang-stage1-cmake-RA-expensive/llvm-project/libcxx/src/regex.cpp
[2522/4432] /Applications/Xcode.app/Contents/Developer/Toolchains/XcodeDefault.xctoolchain/usr/bin/c++  -DEXPENSIVE_CHECKS -DNDEBUG -D_GLIBCXX_DEBUG -D_LIBCPP_BUILDING_LIBRARY -D_LIBCPP_HAS_NO_PRAGMA_SYSTEM_HEADER -D__STDC_CONSTANT_MACROS -D__STDC_FORMAT_MACROS -D__STDC_LIMIT_MACROS -Iprojects/libcxx/src -I/Users/buildslave/jenkins/workspace/mr-clang-stage1-cmake-RA-expensive/llvm-project/libcxx/src -I/Applications/Xcode.app/Contents/Developer/Platforms/MacOSX.platform/Developer/SDKs/MacOSX10.14.sdk/usr/include/libxml2 -Iinclude -I/Users/buildslave/jenkins/workspace/mr-clang-stage1-cmake-RA-expensive/llvm-project/llvm/include -Iprojects/libcxx/include/c++build -I/Users/buildslave/jenkins/workspace/mr-clang-stage1-cmake-RA-expensive/llvm-project/libcxx/include -fPIC -fvisibility-inlines-hidden -Werror=date-time -Werror=unguarded-availability-new -std=c++11 -Wall -Wextra -Wno-unused-parameter -Wwrite-strings -Wcast-qual -Wmissing-field-initializers  -Wno-long-long -Wimplicit-fallthrough -Wcovered-switch-default -Wno-noexcept-type -Wnon-virtual-dtor -Wdelete-non-virtual-dtor -Wstring-conversion -fdiagnostics-color -O3  -isysroot /Applications/Xcode.app/Contents/Developer/Platforms/MacOSX.platform/Developer/SDKs/MacOSX10.14.sdk    -DLIBCXX_BUILDING_LIBCXXABI -std=c++11 -nostdinc++ -fvisibility-inlines-hidden -Wall -Wextra -W -Wwrite-strings -Wno-unused-parameter -Wno-long-long -Werror=return-type -Wextra-semi -Wno-user-defined-literals -Wno-covered-switch-default -Wno-ignored-attributes -Wno-error -MD -MT projects/libcxx/src/CMakeFiles/cxx_static.dir/random.cpp.o -MF projects/libcxx/src/CMakeFiles/cxx_static.dir/random.cpp.o.d -o projects/libcxx/src/CMakeFiles/cxx_static.dir/random.cpp.o -c /Users/buildslave/jenkins/workspace/mr-clang-stage1-cmake-RA-expensive/llvm-project/libcxx/src/random.cpp
[2523/4432] /Applications/Xcode.app/Contents/Developer/Toolchains/XcodeDefault.xctoolchain/usr/bin/c++  -DEXPENSIVE_CHECKS -DNDEBUG -D_GLIBCXX_DEBUG -D_LIBCPP_BUILDING_LIBRARY -D_LIBCPP_HAS_NO_PRAGMA_SYSTEM_HEADER -D__STDC_CONSTANT_MACROS -D__STDC_FORMAT_MACROS -D__STDC_LIMIT_MACROS -Iprojects/libcxx/src -I/Users/buildslave/jenkins/workspace/mr-clang-stage1-cmake-RA-expensive/llvm-project/libcxx/src -I/Applications/Xcode.app/Contents/Developer/Platforms/MacOSX.platform/Developer/SDKs/MacOSX10.14.sdk/usr/include/libxml2 -Iinclude -I/Users/buildslave/jenkins/workspace/mr-clang-stage1-cmake-RA-expensive/llvm-project/llvm/include -Iprojects/libcxx/include/c++build -I/Users/buildslave/jenkins/workspace/mr-clang-stage1-cmake-RA-expensive/llvm-project/libcxx/include -fPIC -fvisibility-inlines-hidden -Werror=date-time -Werror=unguarded-availability-new -std=c++11 -Wall -Wextra -Wno-unused-parameter -Wwrite-strings -Wcast-qual -Wmissing-field-initializers  -Wno-long-long -Wimplicit-fallthrough -Wcovered-switch-default -Wno-noexcept-type -Wnon-virtual-dtor -Wdelete-non-virtual-dtor -Wstring-conversion -fdiagnostics-color -O3  -isysroot /Applications/Xcode.app/Contents/Developer/Platforms/MacOSX.platform/Developer/SDKs/MacOSX10.14.sdk    -DLIBCXX_BUILDING_LIBCXXABI -std=c++11 -nostdinc++ -fvisibility-inlines-hidden -Wall -Wextra -W -Wwrite-strings -Wno-unused-parameter -Wno-long-long -Werror=return-type -Wextra-semi -Wno-user-defined-literals -Wno-covered-switch-default -Wno-ignored-attributes -Wno-error -MD -MT projects/libcxx/src/CMakeFiles/cxx_static.dir/filesystem/int128_builtins.cpp.o -MF projects/libcxx/src/CMakeFiles/cxx_static.dir/filesystem/int128_builtins.cpp.o.d -o projects/libcxx/src/CMakeFiles/cxx_static.dir/filesystem/int128_builtins.cpp.o -c /Users/buildslave/jenkins/workspace/mr-clang-stage1-cmake-RA-expensive/llvm-project/libcxx/src/filesystem/int128_builtins.cpp
[2524/4432] /Applications/Xcode.app/Contents/Developer/Toolchains/XcodeDefault.xctoolchain/usr/bin/c++  -DEXPENSIVE_CHECKS -DNDEBUG -D_GLIBCXX_DEBUG -D_LIBCPP_BUILDING_LIBRARY -D_LIBCPP_HAS_NO_PRAGMA_SYSTEM_HEADER -D__STDC_CONSTANT_MACROS -D__STDC_FORMAT_MACROS -D__STDC_LIMIT_MACROS -Iprojects/libcxx/src -I/Users/buildslave/jenkins/workspace/mr-clang-stage1-cmake-RA-expensive/llvm-project/libcxx/src -I/Applications/Xcode.app/Contents/Developer/Platforms/MacOSX.platform/Developer/SDKs/MacOSX10.14.sdk/usr/include/libxml2 -Iinclude -I/Users/buildslave/jenkins/workspace/mr-clang-stage1-cmake-RA-expensive/llvm-project/llvm/include -Iprojects/libcxx/include/c++build -I/Users/buildslave/jenkins/workspace/mr-clang-stage1-cmake-RA-expensive/llvm-project/libcxx/include -fPIC -fvisibility-inlines-hidden -Werror=date-time -Werror=unguarded-availability-new -std=c++11 -Wall -Wextra -Wno-unused-parameter -Wwrite-strings -Wcast-qual -Wmissing-field-initializers  -Wno-long-long -Wimplicit-fallthrough -Wcovered-switch-default -Wno-noexcept-type -Wnon-virtual-dtor -Wdelete-non-virtual-dtor -Wstring-conversion -fdiagnostics-color -O3  -isysroot /Applications/Xcode.app/Contents/Developer/Platforms/MacOSX.platform/Developer/SDKs/MacOSX10.14.sdk    -DLIBCXX_BUILDING_LIBCXXABI -std=c++11 -nostdinc++ -fvisibility-inlines-hidden -Wall -Wextra -W -Wwrite-strings -Wno-unused-parameter -Wno-long-long -Werror=return-type -Wextra-semi -Wno-user-defined-literals -Wno-covered-switch-default -Wno-ignored-attributes -Wno-error -MD -MT projects/libcxx/src/CMakeFiles/cxx_static.dir/strstream.cpp.o -MF projects/libcxx/src/CMakeFiles/cxx_static.dir/strstream.cpp.o.d -o projects/libcxx/src/CMakeFiles/cxx_static.dir/strstream.cpp.o -c /Users/buildslave/jenkins/workspace/mr-clang-stage1-cmake-RA-expensive/llvm-project/libcxx/src/strstream.cpp
[2525/4432] /Applications/Xcode.app/Contents/Developer/Toolchains/XcodeDefault.xctoolchain/usr/bin/c++  -DEXPENSIVE_CHECKS -DNDEBUG -D_GLIBCXX_DEBUG -D_LIBCPP_BUILDING_LIBRARY -D_LIBCPP_HAS_NO_PRAGMA_SYSTEM_HEADER -D__STDC_CONSTANT_MACROS -D__STDC_FORMAT_MACROS -D__STDC_LIMIT_MACROS -Iprojects/libcxx/src -I/Users/buildslave/jenkins/workspace/mr-clang-stage1-cmake-RA-expensive/llvm-project/libcxx/src -I/Applications/Xcode.app/Contents/Developer/Platforms/MacOSX.platform/Developer/SDKs/MacOSX10.14.sdk/usr/include/libxml2 -Iinclude -I/Users/buildslave/jenkins/workspace/mr-clang-stage1-cmake-RA-expensive/llvm-project/llvm/include -Iprojects/libcxx/include/c++build -I/Users/buildslave/jenkins/workspace/mr-clang-stage1-cmake-RA-expensive/llvm-project/libcxx/include -fPIC -fvisibility-inlines-hidden -Werror=date-time -Werror=unguarded-availability-new -std=c++11 -Wall -Wextra -Wno-unused-parameter -Wwrite-strings -Wcast-qual -Wmissing-field-initializers  -Wno-long-long -Wimplicit-fallthrough -Wcovered-switch-default -Wno-noexcept-type -Wnon-virtual-dtor -Wdelete-non-virtual-dtor -Wstring-conversion -fdiagnostics-color -O3  -isysroot /Applications/Xcode.app/Contents/Developer/Platforms/MacOSX.platform/Developer/SDKs/MacOSX10.14.sdk    -DLIBCXX_BUILDING_LIBCXXABI -std=c++11 -nostdinc++ -fvisibility-inlines-hidden -Wall -Wextra -W -Wwrite-strings -Wno-unused-parameter -Wno-long-long -Werror=return-type -Wextra-semi -Wno-user-defined-literals -Wno-covered-switch-default -Wno-ignored-attributes -Wno-error -MD -MT projects/libcxx/src/CMakeFiles/cxx_static.dir/variant.cpp.o -MF projects/libcxx/src/CMakeFiles/cxx_static.dir/variant.cpp.o.d -o projects/libcxx/src/CMakeFiles/cxx_static.dir/variant.cpp.o -c /Users/buildslave/jenkins/workspace/mr-clang-stage1-cmake-RA-expensive/llvm-project/libcxx/src/variant.cpp
[2526/4432] /Applications/Xcode.app/Contents/Developer/Toolchains/XcodeDefault.xctoolchain/usr/bin/c++  -DEXPENSIVE_CHECKS -DNDEBUG -D_GLIBCXX_DEBUG -D_LIBCPP_BUILDING_LIBRARY -D_LIBCPP_HAS_NO_PRAGMA_SYSTEM_HEADER -D__STDC_CONSTANT_MACROS -D__STDC_FORMAT_MACROS -D__STDC_LIMIT_MACROS -Iprojects/libcxx/src -I/Users/buildslave/jenkins/workspace/mr-clang-stage1-cmake-RA-expensive/llvm-project/libcxx/src -I/Applications/Xcode.app/Contents/Developer/Platforms/MacOSX.platform/Developer/SDKs/MacOSX10.14.sdk/usr/include/libxml2 -Iinclude -I/Users/buildslave/jenkins/workspace/mr-clang-stage1-cmake-RA-expensive/llvm-project/llvm/include -Iprojects/libcxx/include/c++build -I/Users/buildslave/jenkins/workspace/mr-clang-stage1-cmake-RA-expensive/llvm-project/libcxx/include -fPIC -fvisibility-inlines-hidden -Werror=date-time -Werror=unguarded-availability-new -std=c++11 -Wall -Wextra -Wno-unused-parameter -Wwrite-strings -Wcast-qual -Wmissing-field-initializers  -Wno-long-long -Wimplicit-fallthrough -Wcovered-switch-default -Wno-noexcept-type -Wnon-virtual-dtor -Wdelete-non-virtual-dtor -Wstring-conversion -fdiagnostics-color -O3  -isysroot /Applications/Xcode.app/Contents/Developer/Platforms/MacOSX.platform/Developer/SDKs/MacOSX10.14.sdk    -DLIBCXX_BUILDING_LIBCXXABI -std=c++11 -nostdinc++ -fvisibility-inlines-hidden -Wall -Wextra -W -Wwrite-strings -Wno-unused-parameter -Wno-long-long -Werror=return-type -Wextra-semi -Wno-user-defined-literals -Wno-covered-switch-default -Wno-ignored-attributes -Wno-error -MD -MT projects/libcxx/src/CMakeFiles/cxx_static.dir/valarray.cpp.o -MF projects/libcxx/src/CMakeFiles/cxx_static.dir/valarray.cpp.o.d -o projects/libcxx/src/CMakeFiles/cxx_static.dir/valarray.cpp.o -c /Users/buildslave/jenkins/workspace/mr-clang-stage1-cmake-RA-expensive/llvm-project/libcxx/src/valarray.cpp
[2527/4432] /Applications/Xcode.app/Contents/Developer/Toolchains/XcodeDefault.xctoolchain/usr/bin/c++  -DEXPENSIVE_CHECKS -DNDEBUG -D_GLIBCXX_DEBUG -D_LIBCPP_BUILDING_LIBRARY -D_LIBCPP_HAS_NO_PRAGMA_SYSTEM_HEADER -D__STDC_CONSTANT_MACROS -D__STDC_FORMAT_MACROS -D__STDC_LIMIT_MACROS -Iprojects/libcxx/src -I/Users/buildslave/jenkins/workspace/mr-clang-stage1-cmake-RA-expensive/llvm-project/libcxx/src -I/Applications/Xcode.app/Contents/Developer/Platforms/MacOSX.platform/Developer/SDKs/MacOSX10.14.sdk/usr/include/libxml2 -Iinclude -I/Users/buildslave/jenkins/workspace/mr-clang-stage1-cmake-RA-expensive/llvm-project/llvm/include -Iprojects/libcxx/include/c++build -I/Users/buildslave/jenkins/workspace/mr-clang-stage1-cmake-RA-expensive/llvm-project/libcxx/include -fPIC -fvisibility-inlines-hidden -Werror=date-time -Werror=unguarded-availability-new -std=c++11 -Wall -Wextra -Wno-unused-parameter -Wwrite-strings -Wcast-qual -Wmissing-field-initializers  -Wno-long-long -Wimplicit-fallthrough -Wcovered-switch-default -Wno-noexcept-type -Wnon-virtual-dtor -Wdelete-non-virtual-dtor -Wstring-conversion -fdiagnostics-color -O3  -isysroot /Applications/Xcode.app/Contents/Developer/Platforms/MacOSX.platform/Developer/SDKs/MacOSX10.14.sdk    -DLIBCXX_BUILDING_LIBCXXABI -std=c++11 -nostdinc++ -fvisibility-inlines-hidden -Wall -Wextra -W -Wwrite-strings -Wno-unused-parameter -Wno-long-long -Werror=return-type -Wextra-semi -Wno-user-defined-literals -Wno-covered-switch-default -Wno-ignored-attributes -Wno-error -MD -MT projects/libcxx/src/CMakeFiles/cxx_static.dir/vector.cpp.o -MF projects/libcxx/src/CMakeFiles/cxx_static.dir/vector.cpp.o.d -o projects/libcxx/src/CMakeFiles/cxx_static.dir/vector.cpp.o -c /Users/buildslave/jenkins/workspace/mr-clang-stage1-cmake-RA-expensive/llvm-project/libcxx/src/vector.cpp
[2528/4432] /Applications/Xcode.app/Contents/Developer/Toolchains/XcodeDefault.xctoolchain/usr/bin/c++  -DEXPENSIVE_CHECKS -DNDEBUG -D_GLIBCXX_DEBUG -D_LIBCPP_BUILDING_LIBRARY -D_LIBCPP_HAS_NO_PRAGMA_SYSTEM_HEADER -D__STDC_CONSTANT_MACROS -D__STDC_FORMAT_MACROS -D__STDC_LIMIT_MACROS -Iprojects/libcxx/src -I/Users/buildslave/jenkins/workspace/mr-clang-stage1-cmake-RA-expensive/llvm-project/libcxx/src -I/Applications/Xcode.app/Contents/Developer/Platforms/MacOSX.platform/Developer/SDKs/MacOSX10.14.sdk/usr/include/libxml2 -Iinclude -I/Users/buildslave/jenkins/workspace/mr-clang-stage1-cmake-RA-expensive/llvm-project/llvm/include -Iprojects/libcxx/include/c++build -I/Users/buildslave/jenkins/workspace/mr-clang-stage1-cmake-RA-expensive/llvm-project/libcxx/include -fPIC -fvisibility-inlines-hidden -Werror=date-time -Werror=unguarded-availability-new -std=c++11 -Wall -Wextra -Wno-unused-parameter -Wwrite-strings -Wcast-qual -Wmissing-field-initializers  -Wno-long-long -Wimplicit-fallthrough -Wcovered-switch-default -Wno-noexcept-type -Wnon-virtual-dtor -Wdelete-non-virtual-dtor -Wstring-conversion -fdiagnostics-color -O3  -isysroot /Applications/Xcode.app/Contents/Developer/Platforms/MacOSX.platform/Developer/SDKs/MacOSX10.14.sdk    -DLIBCXX_BUILDING_LIBCXXABI -std=c++14 -nostdinc++ -fvisibility-inlines-hidden -Wall -Wextra -W -Wwrite-strings -Wno-unused-parameter -Wno-long-long -Werror=return-type -Wextra-semi -Wno-user-defined-literals -Wno-covered-switch-default -Wno-ignored-attributes -Wno-error -MD -MT projects/libcxx/src/CMakeFiles/cxx_experimental.dir/experimental/memory_resource.cpp.o -MF projects/libcxx/src/CMakeFiles/cxx_experimental.dir/experimental/memory_resource.cpp.o.d -o projects/libcxx/src/CMakeFiles/cxx_experimental.dir/experimental/memory_resource.cpp.o -c /Users/buildslave/jenkins/workspace/mr-clang-stage1-cmake-RA-expensive/llvm-project/libcxx/src/experimental/memory_resource.cpp
[2529/4432] /Applications/Xcode.app/Contents/Developer/Toolchains/XcodeDefault.xctoolchain/usr/bin/c++  -DEXPENSIVE_CHECKS -DNDEBUG -D_GLIBCXX_DEBUG -D_LIBCPP_BUILDING_LIBRARY -D_LIBCPP_HAS_NO_PRAGMA_SYSTEM_HEADER -D__STDC_CONSTANT_MACROS -D__STDC_FORMAT_MACROS -D__STDC_LIMIT_MACROS -Iprojects/libcxx/src -I/Users/buildslave/jenkins/workspace/mr-clang-stage1-cmake-RA-expensive/llvm-project/libcxx/src -I/Applications/Xcode.app/Contents/Developer/Platforms/MacOSX.platform/Developer/SDKs/MacOSX10.14.sdk/usr/include/libxml2 -Iinclude -I/Users/buildslave/jenkins/workspace/mr-clang-stage1-cmake-RA-expensive/llvm-project/llvm/include -Iprojects/libcxx/include/c++build -I/Users/buildslave/jenkins/workspace/mr-clang-stage1-cmake-RA-expensive/llvm-project/libcxx/include -fPIC -fvisibility-inlines-hidden -Werror=date-time -Werror=unguarded-availability-new -std=c++11 -Wall -Wextra -Wno-unused-parameter -Wwrite-strings -Wcast-qual -Wmissing-field-initializers  -Wno-long-long -Wimplicit-fallthrough -Wcovered-switch-default -Wno-noexcept-type -Wnon-virtual-dtor -Wdelete-non-virtual-dtor -Wstring-conversion -fdiagnostics-color -O3  -isysroot /Applications/Xcode.app/Contents/Developer/Platforms/MacOSX.platform/Developer/SDKs/MacOSX10.14.sdk -fPIC    -DLIBCXX_BUILDING_LIBCXXABI -std=c++11 -nostdinc++ -fvisibility-inlines-hidden -Wall -Wextra -W -Wwrite-strings -Wno-unused-parameter -Wno-long-long -Werror=return-type -Wextra-semi -Wno-user-defined-literals -Wno-covered-switch-default -Wno-ignored-attributes -Wno-error -MD -MT projects/libcxx/src/CMakeFiles/cxx_shared.dir/charconv.cpp.o -MF projects/libcxx/src/CMakeFiles/cxx_shared.dir/charconv.cpp.o.d -o projects/libcxx/src/CMakeFiles/cxx_shared.dir/charconv.cpp.o -c /Users/buildslave/jenkins/workspace/mr-clang-stage1-cmake-RA-expensive/llvm-project/libcxx/src/charconv.cpp
[2530/4432] /Applications/Xcode.app/Contents/Developer/Toolchains/XcodeDefault.xctoolchain/usr/bin/c++  -DEXPENSIVE_CHECKS -DNDEBUG -D_GLIBCXX_DEBUG -D_LIBCPP_BUILDING_LIBRARY -D_LIBCPP_HAS_NO_PRAGMA_SYSTEM_HEADER -D__STDC_CONSTANT_MACROS -D__STDC_FORMAT_MACROS -D__STDC_LIMIT_MACROS -Iprojects/libcxx/src -I/Users/buildslave/jenkins/workspace/mr-clang-stage1-cmake-RA-expensive/llvm-project/libcxx/src -I/Applications/Xcode.app/Contents/Developer/Platforms/MacOSX.platform/Developer/SDKs/MacOSX10.14.sdk/usr/include/libxml2 -Iinclude -I/Users/buildslave/jenkins/workspace/mr-clang-stage1-cmake-RA-expensive/llvm-project/llvm/include -Iprojects/libcxx/include/c++build -I/Users/buildslave/jenkins/workspace/mr-clang-stage1-cmake-RA-expensive/llvm-project/libcxx/include -fPIC -fvisibility-inlines-hidden -Werror=date-time -Werror=unguarded-availability-new -std=c++11 -Wall -Wextra -Wno-unused-parameter -Wwrite-strings -Wcast-qual -Wmissing-field-initializers  -Wno-long-long -Wimplicit-fallthrough -Wcovered-switch-default -Wno-noexcept-type -Wnon-virtual-dtor -Wdelete-non-virtual-dtor -Wstring-conversion -fdiagnostics-color -O3  -isysroot /Applications/Xcode.app/Contents/Developer/Platforms/MacOSX.platform/Developer/SDKs/MacOSX10.14.sdk    -DLIBCXX_BUILDING_LIBCXXABI -std=c++11 -nostdinc++ -fvisibility-inlines-hidden -Wall -Wextra -W -Wwrite-strings -Wno-unused-parameter -Wno-long-long -Werror=return-type -Wextra-semi -Wno-user-defined-literals -Wno-covered-switch-default -Wno-ignored-attributes -Wno-error -MD -MT projects/libcxx/src/CMakeFiles/cxx_static.dir/thread.cpp.o -MF projects/libcxx/src/CMakeFiles/cxx_static.dir/thread.cpp.o.d -o projects/libcxx/src/CMakeFiles/cxx_static.dir/thread.cpp.o -c /Users/buildslave/jenkins/workspace/mr-clang-stage1-cmake-RA-expensive/llvm-project/libcxx/src/thread.cpp
[2531/4432] /Applications/Xcode.app/Contents/Developer/Toolchains/XcodeDefault.xctoolchain/usr/bin/c++  -DEXPENSIVE_CHECKS -DNDEBUG -D_GLIBCXX_DEBUG -D_LIBCPP_BUILDING_LIBRARY -D_LIBCPP_HAS_NO_PRAGMA_SYSTEM_HEADER -D__STDC_CONSTANT_MACROS -D__STDC_FORMAT_MACROS -D__STDC_LIMIT_MACROS -Iprojects/libcxx/src -I/Users/buildslave/jenkins/workspace/mr-clang-stage1-cmake-RA-expensive/llvm-project/libcxx/src -I/Applications/Xcode.app/Contents/Developer/Platforms/MacOSX.platform/Developer/SDKs/MacOSX10.14.sdk/usr/include/libxml2 -Iinclude -I/Users/buildslave/jenkins/workspace/mr-clang-stage1-cmake-RA-expensive/llvm-project/llvm/include -Iprojects/libcxx/include/c++build -I/Users/buildslave/jenkins/workspace/mr-clang-stage1-cmake-RA-expensive/llvm-project/libcxx/include -fPIC -fvisibility-inlines-hidden -Werror=date-time -Werror=unguarded-availability-new -std=c++11 -Wall -Wextra -Wno-unused-parameter -Wwrite-strings -Wcast-qual -Wmissing-field-initializers  -Wno-long-long -Wimplicit-fallthrough -Wcovered-switch-default -Wno-noexcept-type -Wnon-virtual-dtor -Wdelete-non-virtual-dtor -Wstring-conversion -fdiagnostics-color -O3  -isysroot /Applications/Xcode.app/Contents/Developer/Platforms/MacOSX.platform/Developer/SDKs/MacOSX10.14.sdk    -DLIBCXX_BUILDING_LIBCXXABI -std=c++11 -nostdinc++ -fvisibility-inlines-hidden -Wall -Wextra -W -Wwrite-strings -Wno-unused-parameter -Wno-long-long -Werror=return-type -Wextra-semi -Wno-user-defined-literals -Wno-covered-switch-default -Wno-ignored-attributes -Wno-error -MD -MT projects/libcxx/src/CMakeFiles/cxx_static.dir/algorithm.cpp.o -MF projects/libcxx/src/CMakeFiles/cxx_static.dir/algorithm.cpp.o.d -o projects/libcxx/src/CMakeFiles/cxx_static.dir/algorithm.cpp.o -c /Users/buildslave/jenkins/workspace/mr-clang-stage1-cmake-RA-expensive/llvm-project/libcxx/src/algorithm.cpp
[2532/4432] /Applications/Xcode.app/Contents/Developer/Toolchains/XcodeDefault.xctoolchain/usr/bin/c++  -DEXPENSIVE_CHECKS -DNDEBUG -D_GLIBCXX_DEBUG -D_LIBCPP_BUILDING_LIBRARY -D_LIBCPP_HAS_NO_PRAGMA_SYSTEM_HEADER -D__STDC_CONSTANT_MACROS -D__STDC_FORMAT_MACROS -D__STDC_LIMIT_MACROS -Iprojects/libcxx/src -I/Users/buildslave/jenkins/workspace/mr-clang-stage1-cmake-RA-expensive/llvm-project/libcxx/src -I/Applications/Xcode.app/Contents/Developer/Platforms/MacOSX.platform/Developer/SDKs/MacOSX10.14.sdk/usr/include/libxml2 -Iinclude -I/Users/buildslave/jenkins/workspace/mr-clang-stage1-cmake-RA-expensive/llvm-project/llvm/include -Iprojects/libcxx/include/c++build -I/Users/buildslave/jenkins/workspace/mr-clang-stage1-cmake-RA-expensive/llvm-project/libcxx/include -fPIC -fvisibility-inlines-hidden -Werror=date-time -Werror=unguarded-availability-new -std=c++11 -Wall -Wextra -Wno-unused-parameter -Wwrite-strings -Wcast-qual -Wmissing-field-initializers  -Wno-long-long -Wimplicit-fallthrough -Wcovered-switch-default -Wno-noexcept-type -Wnon-virtual-dtor -Wdelete-non-virtual-dtor -Wstring-conversion -fdiagnostics-color -O3  -isysroot /Applications/Xcode.app/Contents/Developer/Platforms/MacOSX.platform/Developer/SDKs/MacOSX10.14.sdk -fPIC    -DLIBCXX_BUILDING_LIBCXXABI -std=c++11 -nostdinc++ -fvisibility-inlines-hidden -Wall -Wextra -W -Wwrite-strings -Wno-unused-parameter -Wno-long-long -Werror=return-type -Wextra-semi -Wno-user-defined-literals -Wno-covered-switch-default -Wno-ignored-attributes -Wno-error -MD -MT projects/libcxx/src/CMakeFiles/cxx_shared.dir/any.cpp.o -MF projects/libcxx/src/CMakeFiles/cxx_shared.dir/any.cpp.o.d -o projects/libcxx/src/CMakeFiles/cxx_shared.dir/any.cpp.o -c /Users/buildslave/jenkins/workspace/mr-clang-stage1-cmake-RA-expensive/llvm-project/libcxx/src/any.cpp
[2533/4432] /Applications/Xcode.app/Contents/Developer/Toolchains/XcodeDefault.xctoolchain/usr/bin/c++  -DEXPENSIVE_CHECKS -DNDEBUG -D_GLIBCXX_DEBUG -D_LIBCPP_BUILDING_LIBRARY -D_LIBCPP_HAS_NO_PRAGMA_SYSTEM_HEADER -D__STDC_CONSTANT_MACROS -D__STDC_FORMAT_MACROS -D__STDC_LIMIT_MACROS -Iprojects/libcxx/src -I/Users/buildslave/jenkins/workspace/mr-clang-stage1-cmake-RA-expensive/llvm-project/libcxx/src -I/Applications/Xcode.app/Contents/Developer/Platforms/MacOSX.platform/Developer/SDKs/MacOSX10.14.sdk/usr/include/libxml2 -Iinclude -I/Users/buildslave/jenkins/workspace/mr-clang-stage1-cmake-RA-expensive/llvm-project/llvm/include -Iprojects/libcxx/include/c++build -I/Users/buildslave/jenkins/workspace/mr-clang-stage1-cmake-RA-expensive/llvm-project/libcxx/include -fPIC -fvisibility-inlines-hidden -Werror=date-time -Werror=unguarded-availability-new -std=c++11 -Wall -Wextra -Wno-unused-parameter -Wwrite-strings -Wcast-qual -Wmissing-field-initializers  -Wno-long-long -Wimplicit-fallthrough -Wcovered-switch-default -Wno-noexcept-type -Wnon-virtual-dtor -Wdelete-non-virtual-dtor -Wstring-conversion -fdiagnostics-color -O3  -isysroot /Applications/Xcode.app/Contents/Developer/Platforms/MacOSX.platform/Developer/SDKs/MacOSX10.14.sdk -fPIC    -DLIBCXX_BUILDING_LIBCXXABI -std=c++11 -nostdinc++ -fvisibility-inlines-hidden -Wall -Wextra -W -Wwrite-strings -Wno-unused-parameter -Wno-long-long -Werror=return-type -Wextra-semi -Wno-user-defined-literals -Wno-covered-switch-default -Wno-ignored-attributes -Wno-error -MD -MT projects/libcxx/src/CMakeFiles/cxx_shared.dir/bind.cpp.o -MF projects/libcxx/src/CMakeFiles/cxx_shared.dir/bind.cpp.o.d -o projects/libcxx/src/CMakeFiles/cxx_shared.dir/bind.cpp.o -c /Users/buildslave/jenkins/workspace/mr-clang-stage1-cmake-RA-expensive/llvm-project/libcxx/src/bind.cpp
[2534/4432] /Applications/Xcode.app/Contents/Developer/Toolchains/XcodeDefault.xctoolchain/usr/bin/c++  -DEXPENSIVE_CHECKS -DNDEBUG -D_GLIBCXX_DEBUG -D_LIBCPP_BUILDING_LIBRARY -D_LIBCPP_HAS_NO_PRAGMA_SYSTEM_HEADER -D__STDC_CONSTANT_MACROS -D__STDC_FORMAT_MACROS -D__STDC_LIMIT_MACROS -Iprojects/libcxx/src -I/Users/buildslave/jenkins/workspace/mr-clang-stage1-cmake-RA-expensive/llvm-project/libcxx/src -I/Applications/Xcode.app/Contents/Developer/Platforms/MacOSX.platform/Developer/SDKs/MacOSX10.14.sdk/usr/include/libxml2 -Iinclude -I/Users/buildslave/jenkins/workspace/mr-clang-stage1-cmake-RA-expensive/llvm-project/llvm/include -Iprojects/libcxx/include/c++build -I/Users/buildslave/jenkins/workspace/mr-clang-stage1-cmake-RA-expensive/llvm-project/libcxx/include -fPIC -fvisibility-inlines-hidden -Werror=date-time -Werror=unguarded-availability-new -std=c++11 -Wall -Wextra -Wno-unused-parameter -Wwrite-strings -Wcast-qual -Wmissing-field-initializers  -Wno-long-long -Wimplicit-fallthrough -Wcovered-switch-default -Wno-noexcept-type -Wnon-virtual-dtor -Wdelete-non-virtual-dtor -Wstring-conversion -fdiagnostics-color -O3  -isysroot /Applications/Xcode.app/Contents/Developer/Platforms/MacOSX.platform/Developer/SDKs/MacOSX10.14.sdk -fPIC    -DLIBCXX_BUILDING_LIBCXXABI -std=c++11 -nostdinc++ -fvisibility-inlines-hidden -Wall -Wextra -W -Wwrite-strings -Wno-unused-parameter -Wno-long-long -Werror=return-type -Wextra-semi -Wno-user-defined-literals -Wno-covered-switch-default -Wno-ignored-attributes -Wno-error -MD -MT projects/libcxx/src/CMakeFiles/cxx_shared.dir/condition_variable_destructor.cpp.o -MF projects/libcxx/src/CMakeFiles/cxx_shared.dir/condition_variable_destructor.cpp.o.d -o projects/libcxx/src/CMakeFiles/cxx_shared.dir/condition_variable_destructor.cpp.o -c /Users/buildslave/jenkins/workspace/mr-clang-stage1-cmake-RA-expensive/llvm-project/libcxx/src/condition_variable_destructor.cpp
[2535/4432] /Applications/Xcode.app/Contents/Developer/Toolchains/XcodeDefault.xctoolchain/usr/bin/c++  -DEXPENSIVE_CHECKS -DNDEBUG -D_GLIBCXX_DEBUG -D_LIBCPP_BUILDING_LIBRARY -D_LIBCPP_HAS_NO_PRAGMA_SYSTEM_HEADER -D__STDC_CONSTANT_MACROS -D__STDC_FORMAT_MACROS -D__STDC_LIMIT_MACROS -Iprojects/libcxx/src -I/Users/buildslave/jenkins/workspace/mr-clang-stage1-cmake-RA-expensive/llvm-project/libcxx/src -I/Applications/Xcode.app/Contents/Developer/Platforms/MacOSX.platform/Developer/SDKs/MacOSX10.14.sdk/usr/include/libxml2 -Iinclude -I/Users/buildslave/jenkins/workspace/mr-clang-stage1-cmake-RA-expensive/llvm-project/llvm/include -Iprojects/libcxx/include/c++build -I/Users/buildslave/jenkins/workspace/mr-clang-stage1-cmake-RA-expensive/llvm-project/libcxx/include -fPIC -fvisibility-inlines-hidden -Werror=date-time -Werror=unguarded-availability-new -std=c++11 -Wall -Wextra -Wno-unused-parameter -Wwrite-strings -Wcast-qual -Wmissing-field-initializers  -Wno-long-long -Wimplicit-fallthrough -Wcovered-switch-default -Wno-noexcept-type -Wnon-virtual-dtor -Wdelete-non-virtual-dtor -Wstring-conversion -fdiagnostics-color -O3  -isysroot /Applications/Xcode.app/Contents/Developer/Platforms/MacOSX.platform/Developer/SDKs/MacOSX10.14.sdk -fPIC    -DLIBCXX_BUILDING_LIBCXXABI -std=c++11 -nostdinc++ -fvisibility-inlines-hidden -Wall -Wextra -W -Wwrite-strings -Wno-unused-parameter -Wno-long-long -Werror=return-type -Wextra-semi -Wno-user-defined-literals -Wno-covered-switch-default -Wno-ignored-attributes -Wno-error -MD -MT projects/libcxx/src/CMakeFiles/cxx_shared.dir/exception.cpp.o -MF projects/libcxx/src/CMakeFiles/cxx_shared.dir/exception.cpp.o.d -o projects/libcxx/src/CMakeFiles/cxx_shared.dir/exception.cpp.o -c /Users/buildslave/jenkins/workspace/mr-clang-stage1-cmake-RA-expensive/llvm-project/libcxx/src/exception.cpp
[2536/4432] /Applications/Xcode.app/Contents/Developer/Toolchains/XcodeDefault.xctoolchain/usr/bin/c++  -DEXPENSIVE_CHECKS -DNDEBUG -D_GLIBCXX_DEBUG -D_LIBCPP_BUILDING_LIBRARY -D_LIBCPP_HAS_NO_PRAGMA_SYSTEM_HEADER -D__STDC_CONSTANT_MACROS -D__STDC_FORMAT_MACROS -D__STDC_LIMIT_MACROS -Iprojects/libcxx/src -I/Users/buildslave/jenkins/workspace/mr-clang-stage1-cmake-RA-expensive/llvm-project/libcxx/src -I/Applications/Xcode.app/Contents/Developer/Platforms/MacOSX.platform/Developer/SDKs/MacOSX10.14.sdk/usr/include/libxml2 -Iinclude -I/Users/buildslave/jenkins/workspace/mr-clang-stage1-cmake-RA-expensive/llvm-project/llvm/include -Iprojects/libcxx/include/c++build -I/Users/buildslave/jenkins/workspace/mr-clang-stage1-cmake-RA-expensive/llvm-project/libcxx/include -fPIC -fvisibility-inlines-hidden -Werror=date-time -Werror=unguarded-availability-new -std=c++11 -Wall -Wextra -Wno-unused-parameter -Wwrite-strings -Wcast-qual -Wmissing-field-initializers  -Wno-long-long -Wimplicit-fallthrough -Wcovered-switch-default -Wno-noexcept-type -Wnon-virtual-dtor -Wdelete-non-virtual-dtor -Wstring-conversion -fdiagnostics-color -O3  -isysroot /Applications/Xcode.app/Contents/Developer/Platforms/MacOSX.platform/Developer/SDKs/MacOSX10.14.sdk -fPIC    -DLIBCXX_BUILDING_LIBCXXABI -std=c++11 -nostdinc++ -fvisibility-inlines-hidden -Wall -Wextra -W -Wwrite-strings -Wno-unused-parameter -Wno-long-long -Werror=return-type -Wextra-semi -Wno-user-defined-literals -Wno-covered-switch-default -Wno-ignored-attributes -Wno-error -MD -MT projects/libcxx/src/CMakeFiles/cxx_shared.dir/functional.cpp.o -MF projects/libcxx/src/CMakeFiles/cxx_shared.dir/functional.cpp.o.d -o projects/libcxx/src/CMakeFiles/cxx_shared.dir/functional.cpp.o -c /Users/buildslave/jenkins/workspace/mr-clang-stage1-cmake-RA-expensive/llvm-project/libcxx/src/functional.cpp
[2537/4432] /Applications/Xcode.app/Contents/Developer/Toolchains/XcodeDefault.xctoolchain/usr/bin/c++  -DEXPENSIVE_CHECKS -DNDEBUG -D_GLIBCXX_DEBUG -D_LIBCPP_BUILDING_LIBRARY -D_LIBCPP_HAS_NO_PRAGMA_SYSTEM_HEADER -D__STDC_CONSTANT_MACROS -D__STDC_FORMAT_MACROS -D__STDC_LIMIT_MACROS -Iprojects/libcxx/src -I/Users/buildslave/jenkins/workspace/mr-clang-stage1-cmake-RA-expensive/llvm-project/libcxx/src -I/Applications/Xcode.app/Contents/Developer/Platforms/MacOSX.platform/Developer/SDKs/MacOSX10.14.sdk/usr/include/libxml2 -Iinclude -I/Users/buildslave/jenkins/workspace/mr-clang-stage1-cmake-RA-expensive/llvm-project/llvm/include -Iprojects/libcxx/include/c++build -I/Users/buildslave/jenkins/workspace/mr-clang-stage1-cmake-RA-expensive/llvm-project/libcxx/include -fPIC -fvisibility-inlines-hidden -Werror=date-time -Werror=unguarded-availability-new -std=c++11 -Wall -Wextra -Wno-unused-parameter -Wwrite-strings -Wcast-qual -Wmissing-field-initializers  -Wno-long-long -Wimplicit-fallthrough -Wcovered-switch-default -Wno-noexcept-type -Wnon-virtual-dtor -Wdelete-non-virtual-dtor -Wstring-conversion -fdiagnostics-color -O3  -isysroot /Applications/Xcode.app/Contents/Developer/Platforms/MacOSX.platform/Developer/SDKs/MacOSX10.14.sdk -fPIC    -DLIBCXX_BUILDING_LIBCXXABI -std=c++11 -nostdinc++ -fvisibility-inlines-hidden -Wall -Wextra -W -Wwrite-strings -Wno-unused-parameter -Wno-long-long -Werror=return-type -Wextra-semi -Wno-user-defined-literals -Wno-covered-switch-default -Wno-ignored-attributes -Wno-error -MD -MT projects/libcxx/src/CMakeFiles/cxx_shared.dir/chrono.cpp.o -MF projects/libcxx/src/CMakeFiles/cxx_shared.dir/chrono.cpp.o.d -o projects/libcxx/src/CMakeFiles/cxx_shared.dir/chrono.cpp.o -c /Users/buildslave/jenkins/workspace/mr-clang-stage1-cmake-RA-expensive/llvm-project/libcxx/src/chrono.cpp
[2538/4432] /Applications/Xcode.app/Contents/Developer/Toolchains/XcodeDefault.xctoolchain/usr/bin/c++  -DEXPENSIVE_CHECKS -DNDEBUG -D_GLIBCXX_DEBUG -D_LIBCPP_BUILDING_LIBRARY -D_LIBCPP_HAS_NO_PRAGMA_SYSTEM_HEADER -D__STDC_CONSTANT_MACROS -D__STDC_FORMAT_MACROS -D__STDC_LIMIT_MACROS -Iprojects/libcxx/src -I/Users/buildslave/jenkins/workspace/mr-clang-stage1-cmake-RA-expensive/llvm-project/libcxx/src -I/Applications/Xcode.app/Contents/Developer/Platforms/MacOSX.platform/Developer/SDKs/MacOSX10.14.sdk/usr/include/libxml2 -Iinclude -I/Users/buildslave/jenkins/workspace/mr-clang-stage1-cmake-RA-expensive/llvm-project/llvm/include -Iprojects/libcxx/include/c++build -I/Users/buildslave/jenkins/workspace/mr-clang-stage1-cmake-RA-expensive/llvm-project/libcxx/include -fPIC -fvisibility-inlines-hidden -Werror=date-time -Werror=unguarded-availability-new -std=c++11 -Wall -Wextra -Wno-unused-parameter -Wwrite-strings -Wcast-qual -Wmissing-field-initializers  -Wno-long-long -Wimplicit-fallthrough -Wcovered-switch-default -Wno-noexcept-type -Wnon-virtual-dtor -Wdelete-non-virtual-dtor -Wstring-conversion -fdiagnostics-color -O3  -isysroot /Applications/Xcode.app/Contents/Developer/Platforms/MacOSX.platform/Developer/SDKs/MacOSX10.14.sdk -fPIC    -DLIBCXX_BUILDING_LIBCXXABI -std=c++11 -nostdinc++ -fvisibility-inlines-hidden -Wall -Wextra -W -Wwrite-strings -Wno-unused-parameter -Wno-long-long -Werror=return-type -Wextra-semi -Wno-user-defined-literals -Wno-covered-switch-default -Wno-ignored-attributes -Wno-error -MD -MT projects/libcxx/src/CMakeFiles/cxx_shared.dir/condition_variable.cpp.o -MF projects/libcxx/src/CMakeFiles/cxx_shared.dir/condition_variable.cpp.o.d -o projects/libcxx/src/CMakeFiles/cxx_shared.dir/condition_variable.cpp.o -c /Users/buildslave/jenkins/workspace/mr-clang-stage1-cmake-RA-expensive/llvm-project/libcxx/src/condition_variable.cpp
[2539/4432] /Applications/Xcode.app/Contents/Developer/Toolchains/XcodeDefault.xctoolchain/usr/bin/c++  -DEXPENSIVE_CHECKS -DNDEBUG -D_GLIBCXX_DEBUG -D_LIBCPP_BUILDING_LIBRARY -D_LIBCPP_HAS_NO_PRAGMA_SYSTEM_HEADER -D__STDC_CONSTANT_MACROS -D__STDC_FORMAT_MACROS -D__STDC_LIMIT_MACROS -Iprojects/libcxx/src -I/Users/buildslave/jenkins/workspace/mr-clang-stage1-cmake-RA-expensive/llvm-project/libcxx/src -I/Applications/Xcode.app/Contents/Developer/Platforms/MacOSX.platform/Developer/SDKs/MacOSX10.14.sdk/usr/include/libxml2 -Iinclude -I/Users/buildslave/jenkins/workspace/mr-clang-stage1-cmake-RA-expensive/llvm-project/llvm/include -Iprojects/libcxx/include/c++build -I/Users/buildslave/jenkins/workspace/mr-clang-stage1-cmake-RA-expensive/llvm-project/libcxx/include -fPIC -fvisibility-inlines-hidden -Werror=date-time -Werror=unguarded-availability-new -std=c++11 -Wall -Wextra -Wno-unused-parameter -Wwrite-strings -Wcast-qual -Wmissing-field-initializers  -Wno-long-long -Wimplicit-fallthrough -Wcovered-switch-default -Wno-noexcept-type -Wnon-virtual-dtor -Wdelete-non-virtual-dtor -Wstring-conversion -fdiagnostics-color -O3  -isysroot /Applications/Xcode.app/Contents/Developer/Platforms/MacOSX.platform/Developer/SDKs/MacOSX10.14.sdk -fPIC    -DLIBCXX_BUILDING_LIBCXXABI -std=c++11 -nostdinc++ -fvisibility-inlines-hidden -Wall -Wextra -W -Wwrite-strings -Wno-unused-parameter -Wno-long-long -Werror=return-type -Wextra-semi -Wno-user-defined-literals -Wno-covered-switch-default -Wno-ignored-attributes -Wno-error -MD -MT projects/libcxx/src/CMakeFiles/cxx_shared.dir/hash.cpp.o -MF projects/libcxx/src/CMakeFiles/cxx_shared.dir/hash.cpp.o.d -o projects/libcxx/src/CMakeFiles/cxx_shared.dir/hash.cpp.o -c /Users/buildslave/jenkins/workspace/mr-clang-stage1-cmake-RA-expensive/llvm-project/libcxx/src/hash.cpp
[2540/4432] /Applications/Xcode.app/Contents/Developer/Toolchains/XcodeDefault.xctoolchain/usr/bin/c++  -DEXPENSIVE_CHECKS -DNDEBUG -D_GLIBCXX_DEBUG -D_LIBCPP_BUILDING_LIBRARY -D_LIBCPP_HAS_NO_PRAGMA_SYSTEM_HEADER -D__STDC_CONSTANT_MACROS -D__STDC_FORMAT_MACROS -D__STDC_LIMIT_MACROS -Iprojects/libcxx/src -I/Users/buildslave/jenkins/workspace/mr-clang-stage1-cmake-RA-expensive/llvm-project/libcxx/src -I/Applications/Xcode.app/Contents/Developer/Platforms/MacOSX.platform/Developer/SDKs/MacOSX10.14.sdk/usr/include/libxml2 -Iinclude -I/Users/buildslave/jenkins/workspace/mr-clang-stage1-cmake-RA-expensive/llvm-project/llvm/include -Iprojects/libcxx/include/c++build -I/Users/buildslave/jenkins/workspace/mr-clang-stage1-cmake-RA-expensive/llvm-project/libcxx/include -fPIC -fvisibility-inlines-hidden -Werror=date-time -Werror=unguarded-availability-new -std=c++11 -Wall -Wextra -Wno-unused-parameter -Wwrite-strings -Wcast-qual -Wmissing-field-initializers  -Wno-long-long -Wimplicit-fallthrough -Wcovered-switch-default -Wno-noexcept-type -Wnon-virtual-dtor -Wdelete-non-virtual-dtor -Wstring-conversion -fdiagnostics-color -O3  -isysroot /Applications/Xcode.app/Contents/Developer/Platforms/MacOSX.platform/Developer/SDKs/MacOSX10.14.sdk    -DLIBCXX_BUILDING_LIBCXXABI -std=c++11 -nostdinc++ -fvisibility-inlines-hidden -Wall -Wextra -W -Wwrite-strings -Wno-unused-parameter -Wno-long-long -Werror=return-type -Wextra-semi -Wno-user-defined-literals -Wno-covered-switch-default -Wno-ignored-attributes -Wno-error -MD -MT projects/libcxx/src/CMakeFiles/cxx_static.dir/ios.cpp.o -MF projects/libcxx/src/CMakeFiles/cxx_static.dir/ios.cpp.o.d -o projects/libcxx/src/CMakeFiles/cxx_static.dir/ios.cpp.o -c /Users/buildslave/jenkins/workspace/mr-clang-stage1-cmake-RA-expensive/llvm-project/libcxx/src/ios.cpp
[2541/4432] /Applications/Xcode.app/Contents/Developer/Toolchains/XcodeDefault.xctoolchain/usr/bin/c++  -DEXPENSIVE_CHECKS -DNDEBUG -D_GLIBCXX_DEBUG -D_LIBCPP_BUILDING_LIBRARY -D_LIBCPP_HAS_NO_PRAGMA_SYSTEM_HEADER -D__STDC_CONSTANT_MACROS -D__STDC_FORMAT_MACROS -D__STDC_LIMIT_MACROS -Iprojects/libcxx/src -I/Users/buildslave/jenkins/workspace/mr-clang-stage1-cmake-RA-expensive/llvm-project/libcxx/src -I/Applications/Xcode.app/Contents/Developer/Platforms/MacOSX.platform/Developer/SDKs/MacOSX10.14.sdk/usr/include/libxml2 -Iinclude -I/Users/buildslave/jenkins/workspace/mr-clang-stage1-cmake-RA-expensive/llvm-project/llvm/include -Iprojects/libcxx/include/c++build -I/Users/buildslave/jenkins/workspace/mr-clang-stage1-cmake-RA-expensive/llvm-project/libcxx/include -fPIC -fvisibility-inlines-hidden -Werror=date-time -Werror=unguarded-availability-new -std=c++11 -Wall -Wextra -Wno-unused-parameter -Wwrite-strings -Wcast-qual -Wmissing-field-initializers  -Wno-long-long -Wimplicit-fallthrough -Wcovered-switch-default -Wno-noexcept-type -Wnon-virtual-dtor -Wdelete-non-virtual-dtor -Wstring-conversion -fdiagnostics-color -O3  -isysroot /Applications/Xcode.app/Contents/Developer/Platforms/MacOSX.platform/Developer/SDKs/MacOSX10.14.sdk -fPIC    -DLIBCXX_BUILDING_LIBCXXABI -std=c++11 -nostdinc++ -fvisibility-inlines-hidden -Wall -Wextra -W -Wwrite-strings -Wno-unused-parameter -Wno-long-long -Werror=return-type -Wextra-semi -Wno-user-defined-literals -Wno-covered-switch-default -Wno-ignored-attributes -Wno-error -MD -MT projects/libcxx/src/CMakeFiles/cxx_shared.dir/future.cpp.o -MF projects/libcxx/src/CMakeFiles/cxx_shared.dir/future.cpp.o.d -o projects/libcxx/src/CMakeFiles/cxx_shared.dir/future.cpp.o -c /Users/buildslave/jenkins/workspace/mr-clang-stage1-cmake-RA-expensive/llvm-project/libcxx/src/future.cpp
[2542/4432] /Applications/Xcode.app/Contents/Developer/Toolchains/XcodeDefault.xctoolchain/usr/bin/c++  -DEXPENSIVE_CHECKS -DNDEBUG -D_GLIBCXX_DEBUG -D_LIBCPP_BUILDING_LIBRARY -D_LIBCPP_HAS_NO_PRAGMA_SYSTEM_HEADER -D__STDC_CONSTANT_MACROS -D__STDC_FORMAT_MACROS -D__STDC_LIMIT_MACROS -Iprojects/libcxx/src -I/Users/buildslave/jenkins/workspace/mr-clang-stage1-cmake-RA-expensive/llvm-project/libcxx/src -I/Applications/Xcode.app/Contents/Developer/Platforms/MacOSX.platform/Developer/SDKs/MacOSX10.14.sdk/usr/include/libxml2 -Iinclude -I/Users/buildslave/jenkins/workspace/mr-clang-stage1-cmake-RA-expensive/llvm-project/llvm/include -Iprojects/libcxx/include/c++build -I/Users/buildslave/jenkins/workspace/mr-clang-stage1-cmake-RA-expensive/llvm-project/libcxx/include -fPIC -fvisibility-inlines-hidden -Werror=date-time -Werror=unguarded-availability-new -std=c++11 -Wall -Wextra -Wno-unused-parameter -Wwrite-strings -Wcast-qual -Wmissing-field-initializers  -Wno-long-long -Wimplicit-fallthrough -Wcovered-switch-default -Wno-noexcept-type -Wnon-virtual-dtor -Wdelete-non-virtual-dtor -Wstring-conversion -fdiagnostics-color -O3  -isysroot /Applications/Xcode.app/Contents/Developer/Platforms/MacOSX.platform/Developer/SDKs/MacOSX10.14.sdk -fPIC    -DLIBCXX_BUILDING_LIBCXXABI -std=c++11 -nostdinc++ -fvisibility-inlines-hidden -Wall -Wextra -W -Wwrite-strings -Wno-unused-parameter -Wno-long-long -Werror=return-type -Wextra-semi -Wno-user-defined-literals -Wno-covered-switch-default -Wno-ignored-attributes -Wno-error -MD -MT projects/libcxx/src/CMakeFiles/cxx_shared.dir/debug.cpp.o -MF projects/libcxx/src/CMakeFiles/cxx_shared.dir/debug.cpp.o.d -o projects/libcxx/src/CMakeFiles/cxx_shared.dir/debug.cpp.o -c /Users/buildslave/jenkins/workspace/mr-clang-stage1-cmake-RA-expensive/llvm-project/libcxx/src/debug.cpp
[2543/4432] /Applications/Xcode.app/Contents/Developer/Toolchains/XcodeDefault.xctoolchain/usr/bin/c++  -DEXPENSIVE_CHECKS -DNDEBUG -D_GLIBCXX_DEBUG -D_LIBCPP_BUILDING_LIBRARY -D_LIBCPP_HAS_NO_PRAGMA_SYSTEM_HEADER -D__STDC_CONSTANT_MACROS -D__STDC_FORMAT_MACROS -D__STDC_LIMIT_MACROS -Iprojects/libcxx/src -I/Users/buildslave/jenkins/workspace/mr-clang-stage1-cmake-RA-expensive/llvm-project/libcxx/src -I/Applications/Xcode.app/Contents/Developer/Platforms/MacOSX.platform/Developer/SDKs/MacOSX10.14.sdk/usr/include/libxml2 -Iinclude -I/Users/buildslave/jenkins/workspace/mr-clang-stage1-cmake-RA-expensive/llvm-project/llvm/include -Iprojects/libcxx/include/c++build -I/Users/buildslave/jenkins/workspace/mr-clang-stage1-cmake-RA-expensive/llvm-project/libcxx/include -fPIC -fvisibility-inlines-hidden -Werror=date-time -Werror=unguarded-availability-new -std=c++11 -Wall -Wextra -Wno-unused-parameter -Wwrite-strings -Wcast-qual -Wmissing-field-initializers  -Wno-long-long -Wimplicit-fallthrough -Wcovered-switch-default -Wno-noexcept-type -Wnon-virtual-dtor -Wdelete-non-virtual-dtor -Wstring-conversion -fdiagnostics-color -O3  -isysroot /Applications/Xcode.app/Contents/Developer/Platforms/MacOSX.platform/Developer/SDKs/MacOSX10.14.sdk -fPIC    -DLIBCXX_BUILDING_LIBCXXABI -std=c++11 -nostdinc++ -fvisibility-inlines-hidden -Wall -Wextra -W -Wwrite-strings -Wno-unused-parameter -Wno-long-long -Werror=return-type -Wextra-semi -Wno-user-defined-literals -Wno-covered-switch-default -Wno-ignored-attributes -Wno-error -MD -MT projects/libcxx/src/CMakeFiles/cxx_shared.dir/mutex_destructor.cpp.o -MF projects/libcxx/src/CMakeFiles/cxx_shared.dir/mutex_destructor.cpp.o.d -o projects/libcxx/src/CMakeFiles/cxx_shared.dir/mutex_destructor.cpp.o -c /Users/buildslave/jenkins/workspace/mr-clang-stage1-cmake-RA-expensive/llvm-project/libcxx/src/mutex_destructor.cpp
[2544/4432] /Applications/Xcode.app/Contents/Developer/Toolchains/XcodeDefault.xctoolchain/usr/bin/c++  -DEXPENSIVE_CHECKS -DNDEBUG -D_GLIBCXX_DEBUG -D_LIBCPP_BUILDING_LIBRARY -D_LIBCPP_HAS_NO_PRAGMA_SYSTEM_HEADER -D__STDC_CONSTANT_MACROS -D__STDC_FORMAT_MACROS -D__STDC_LIMIT_MACROS -Iprojects/libcxx/src -I/Users/buildslave/jenkins/workspace/mr-clang-stage1-cmake-RA-expensive/llvm-project/libcxx/src -I/Applications/Xcode.app/Contents/Developer/Platforms/MacOSX.platform/Developer/SDKs/MacOSX10.14.sdk/usr/include/libxml2 -Iinclude -I/Users/buildslave/jenkins/workspace/mr-clang-stage1-cmake-RA-expensive/llvm-project/llvm/include -Iprojects/libcxx/include/c++build -I/Users/buildslave/jenkins/workspace/mr-clang-stage1-cmake-RA-expensive/llvm-project/libcxx/include -fPIC -fvisibility-inlines-hidden -Werror=date-time -Werror=unguarded-availability-new -std=c++11 -Wall -Wextra -Wno-unused-parameter -Wwrite-strings -Wcast-qual -Wmissing-field-initializers  -Wno-long-long -Wimplicit-fallthrough -Wcovered-switch-default -Wno-noexcept-type -Wnon-virtual-dtor -Wdelete-non-virtual-dtor -Wstring-conversion -fdiagnostics-color -O3  -isysroot /Applications/Xcode.app/Contents/Developer/Platforms/MacOSX.platform/Developer/SDKs/MacOSX10.14.sdk -fPIC    -DLIBCXX_BUILDING_LIBCXXABI -std=c++11 -nostdinc++ -fvisibility-inlines-hidden -Wall -Wextra -W -Wwrite-strings -Wno-unused-parameter -Wno-long-long -Werror=return-type -Wextra-semi -Wno-user-defined-literals -Wno-covered-switch-default -Wno-ignored-attributes -Wno-error -MD -MT projects/libcxx/src/CMakeFiles/cxx_shared.dir/memory.cpp.o -MF projects/libcxx/src/CMakeFiles/cxx_shared.dir/memory.cpp.o.d -o projects/libcxx/src/CMakeFiles/cxx_shared.dir/memory.cpp.o -c /Users/buildslave/jenkins/workspace/mr-clang-stage1-cmake-RA-expensive/llvm-project/libcxx/src/memory.cpp
[2545/4432] /Applications/Xcode.app/Contents/Developer/Toolchains/XcodeDefault.xctoolchain/usr/bin/c++  -DEXPENSIVE_CHECKS -DNDEBUG -D_GLIBCXX_DEBUG -D_LIBCPP_BUILDING_LIBRARY -D_LIBCPP_HAS_NO_PRAGMA_SYSTEM_HEADER -D__STDC_CONSTANT_MACROS -D__STDC_FORMAT_MACROS -D__STDC_LIMIT_MACROS -Iprojects/libcxx/src -I/Users/buildslave/jenkins/workspace/mr-clang-stage1-cmake-RA-expensive/llvm-project/libcxx/src -I/Applications/Xcode.app/Contents/Developer/Platforms/MacOSX.platform/Developer/SDKs/MacOSX10.14.sdk/usr/include/libxml2 -Iinclude -I/Users/buildslave/jenkins/workspace/mr-clang-stage1-cmake-RA-expensive/llvm-project/llvm/include -Iprojects/libcxx/include/c++build -I/Users/buildslave/jenkins/workspace/mr-clang-stage1-cmake-RA-expensive/llvm-project/libcxx/include -fPIC -fvisibility-inlines-hidden -Werror=date-time -Werror=unguarded-availability-new -std=c++11 -Wall -Wextra -Wno-unused-parameter -Wwrite-strings -Wcast-qual -Wmissing-field-initializers  -Wno-long-long -Wimplicit-fallthrough -Wcovered-switch-default -Wno-noexcept-type -Wnon-virtual-dtor -Wdelete-non-virtual-dtor -Wstring-conversion -fdiagnostics-color -O3  -isysroot /Applications/Xcode.app/Contents/Developer/Platforms/MacOSX.platform/Developer/SDKs/MacOSX10.14.sdk -fPIC    -DLIBCXX_BUILDING_LIBCXXABI -std=c++11 -nostdinc++ -fvisibility-inlines-hidden -Wall -Wextra -W -Wwrite-strings -Wno-unused-parameter -Wno-long-long -Werror=return-type -Wextra-semi -Wno-user-defined-literals -Wno-covered-switch-default -Wno-ignored-attributes -Wno-error -MD -MT projects/libcxx/src/CMakeFiles/cxx_shared.dir/new.cpp.o -MF projects/libcxx/src/CMakeFiles/cxx_shared.dir/new.cpp.o.d -o projects/libcxx/src/CMakeFiles/cxx_shared.dir/new.cpp.o -c /Users/buildslave/jenkins/workspace/mr-clang-stage1-cmake-RA-expensive/llvm-project/libcxx/src/new.cpp
[2546/4432] /Applications/Xcode.app/Contents/Developer/Toolchains/XcodeDefault.xctoolchain/usr/bin/c++  -DEXPENSIVE_CHECKS -DNDEBUG -D_GLIBCXX_DEBUG -D_LIBCPP_BUILDING_LIBRARY -D_LIBCPP_HAS_NO_PRAGMA_SYSTEM_HEADER -D__STDC_CONSTANT_MACROS -D__STDC_FORMAT_MACROS -D__STDC_LIMIT_MACROS -Iprojects/libcxx/src -I/Users/buildslave/jenkins/workspace/mr-clang-stage1-cmake-RA-expensive/llvm-project/libcxx/src -I/Applications/Xcode.app/Contents/Developer/Platforms/MacOSX.platform/Developer/SDKs/MacOSX10.14.sdk/usr/include/libxml2 -Iinclude -I/Users/buildslave/jenkins/workspace/mr-clang-stage1-cmake-RA-expensive/llvm-project/llvm/include -Iprojects/libcxx/include/c++build -I/Users/buildslave/jenkins/workspace/mr-clang-stage1-cmake-RA-expensive/llvm-project/libcxx/include -fPIC -fvisibility-inlines-hidden -Werror=date-time -Werror=unguarded-availability-new -std=c++11 -Wall -Wextra -Wno-unused-parameter -Wwrite-strings -Wcast-qual -Wmissing-field-initializers  -Wno-long-long -Wimplicit-fallthrough -Wcovered-switch-default -Wno-noexcept-type -Wnon-virtual-dtor -Wdelete-non-virtual-dtor -Wstring-conversion -fdiagnostics-color -O3  -isysroot /Applications/Xcode.app/Contents/Developer/Platforms/MacOSX.platform/Developer/SDKs/MacOSX10.14.sdk -fPIC    -DLIBCXX_BUILDING_LIBCXXABI -std=c++11 -nostdinc++ -fvisibility-inlines-hidden -Wall -Wextra -W -Wwrite-strings -Wno-unused-parameter -Wno-long-long -Werror=return-type -Wextra-semi -Wno-user-defined-literals -Wno-covered-switch-default -Wno-ignored-attributes -Wno-error -MD -MT projects/libcxx/src/CMakeFiles/cxx_shared.dir/optional.cpp.o -MF projects/libcxx/src/CMakeFiles/cxx_shared.dir/optional.cpp.o.d -o projects/libcxx/src/CMakeFiles/cxx_shared.dir/optional.cpp.o -c /Users/buildslave/jenkins/workspace/mr-clang-stage1-cmake-RA-expensive/llvm-project/libcxx/src/optional.cpp
[2547/4432] /Applications/Xcode.app/Contents/Developer/Toolchains/XcodeDefault.xctoolchain/usr/bin/c++  -DEXPENSIVE_CHECKS -DNDEBUG -D_GLIBCXX_DEBUG -D_LIBCPP_BUILDING_LIBRARY -D_LIBCPP_HAS_NO_PRAGMA_SYSTEM_HEADER -D__STDC_CONSTANT_MACROS -D__STDC_FORMAT_MACROS -D__STDC_LIMIT_MACROS -Iprojects/libcxx/src -I/Users/buildslave/jenkins/workspace/mr-clang-stage1-cmake-RA-expensive/llvm-project/libcxx/src -I/Applications/Xcode.app/Contents/Developer/Platforms/MacOSX.platform/Developer/SDKs/MacOSX10.14.sdk/usr/include/libxml2 -Iinclude -I/Users/buildslave/jenkins/workspace/mr-clang-stage1-cmake-RA-expensive/llvm-project/llvm/include -Iprojects/libcxx/include/c++build -I/Users/buildslave/jenkins/workspace/mr-clang-stage1-cmake-RA-expensive/llvm-project/libcxx/include -fPIC -fvisibility-inlines-hidden -Werror=date-time -Werror=unguarded-availability-new -std=c++11 -Wall -Wextra -Wno-unused-parameter -Wwrite-strings -Wcast-qual -Wmissing-field-initializers  -Wno-long-long -Wimplicit-fallthrough -Wcovered-switch-default -Wno-noexcept-type -Wnon-virtual-dtor -Wdelete-non-virtual-dtor -Wstring-conversion -fdiagnostics-color -O3  -isysroot /Applications/Xcode.app/Contents/Developer/Platforms/MacOSX.platform/Developer/SDKs/MacOSX10.14.sdk -fPIC    -DLIBCXX_BUILDING_LIBCXXABI -std=c++11 -nostdinc++ -fvisibility-inlines-hidden -Wall -Wextra -W -Wwrite-strings -Wno-unused-parameter -Wno-long-long -Werror=return-type -Wextra-semi -Wno-user-defined-literals -Wno-covered-switch-default -Wno-ignored-attributes -Wno-error -MD -MT projects/libcxx/src/CMakeFiles/cxx_shared.dir/mutex.cpp.o -MF projects/libcxx/src/CMakeFiles/cxx_shared.dir/mutex.cpp.o.d -o projects/libcxx/src/CMakeFiles/cxx_shared.dir/mutex.cpp.o -c /Users/buildslave/jenkins/workspace/mr-clang-stage1-cmake-RA-expensive/llvm-project/libcxx/src/mutex.cpp
[2548/4432] /Applications/Xcode.app/Contents/Developer/Toolchains/XcodeDefault.xctoolchain/usr/bin/c++  -DEXPENSIVE_CHECKS -DNDEBUG -D_GLIBCXX_DEBUG -D_LIBCPP_BUILDING_LIBRARY -D_LIBCPP_HAS_NO_PRAGMA_SYSTEM_HEADER -D__STDC_CONSTANT_MACROS -D__STDC_FORMAT_MACROS -D__STDC_LIMIT_MACROS -Iprojects/libcxx/src -I/Users/buildslave/jenkins/workspace/mr-clang-stage1-cmake-RA-expensive/llvm-project/libcxx/src -I/Applications/Xcode.app/Contents/Developer/Platforms/MacOSX.platform/Developer/SDKs/MacOSX10.14.sdk/usr/include/libxml2 -Iinclude -I/Users/buildslave/jenkins/workspace/mr-clang-stage1-cmake-RA-expensive/llvm-project/llvm/include -Iprojects/libcxx/include/c++build -I/Users/buildslave/jenkins/workspace/mr-clang-stage1-cmake-RA-expensive/llvm-project/libcxx/include -fPIC -fvisibility-inlines-hidden -Werror=date-time -Werror=unguarded-availability-new -std=c++11 -Wall -Wextra -Wno-unused-parameter -Wwrite-strings -Wcast-qual -Wmissing-field-initializers  -Wno-long-long -Wimplicit-fallthrough -Wcovered-switch-default -Wno-noexcept-type -Wnon-virtual-dtor -Wdelete-non-virtual-dtor -Wstring-conversion -fdiagnostics-color -O3  -isysroot /Applications/Xcode.app/Contents/Developer/Platforms/MacOSX.platform/Developer/SDKs/MacOSX10.14.sdk -fPIC    -DLIBCXX_BUILDING_LIBCXXABI -std=c++11 -nostdinc++ -fvisibility-inlines-hidden -Wall -Wextra -W -Wwrite-strings -Wno-unused-parameter -Wno-long-long -Werror=return-type -Wextra-semi -Wno-user-defined-literals -Wno-covered-switch-default -Wno-ignored-attributes -Wno-error -MD -MT projects/libcxx/src/CMakeFiles/cxx_shared.dir/iostream.cpp.o -MF projects/libcxx/src/CMakeFiles/cxx_shared.dir/iostream.cpp.o.d -o projects/libcxx/src/CMakeFiles/cxx_shared.dir/iostream.cpp.o -c /Users/buildslave/jenkins/workspace/mr-clang-stage1-cmake-RA-expensive/llvm-project/libcxx/src/iostream.cpp
[2549/4432] /Applications/Xcode.app/Contents/Developer/Toolchains/XcodeDefault.xctoolchain/usr/bin/c++  -DEXPENSIVE_CHECKS -DNDEBUG -D_GLIBCXX_DEBUG -D_LIBCPP_BUILDING_LIBRARY -D_LIBCPP_HAS_NO_PRAGMA_SYSTEM_HEADER -D__STDC_CONSTANT_MACROS -D__STDC_FORMAT_MACROS -D__STDC_LIMIT_MACROS -Iprojects/libcxx/src -I/Users/buildslave/jenkins/workspace/mr-clang-stage1-cmake-RA-expensive/llvm-project/libcxx/src -I/Applications/Xcode.app/Contents/Developer/Platforms/MacOSX.platform/Developer/SDKs/MacOSX10.14.sdk/usr/include/libxml2 -Iinclude -I/Users/buildslave/jenkins/workspace/mr-clang-stage1-cmake-RA-expensive/llvm-project/llvm/include -Iprojects/libcxx/include/c++build -I/Users/buildslave/jenkins/workspace/mr-clang-stage1-cmake-RA-expensive/llvm-project/libcxx/include -fPIC -fvisibility-inlines-hidden -Werror=date-time -Werror=unguarded-availability-new -std=c++11 -Wall -Wextra -Wno-unused-parameter -Wwrite-strings -Wcast-qual -Wmissing-field-initializers  -Wno-long-long -Wimplicit-fallthrough -Wcovered-switch-default -Wno-noexcept-type -Wnon-virtual-dtor -Wdelete-non-virtual-dtor -Wstring-conversion -fdiagnostics-color -O3  -isysroot /Applications/Xcode.app/Contents/Developer/Platforms/MacOSX.platform/Developer/SDKs/MacOSX10.14.sdk    -DLIBCXX_BUILDING_LIBCXXABI -std=c++11 -nostdinc++ -fvisibility-inlines-hidden -Wall -Wextra -W -Wwrite-strings -Wno-unused-parameter -Wno-long-long -Werror=return-type -Wextra-semi -Wno-user-defined-literals -Wno-covered-switch-default -Wno-ignored-attributes -Wno-error -MD -MT projects/libcxx/src/CMakeFiles/cxx_static.dir/filesystem/directory_iterator.cpp.o -MF projects/libcxx/src/CMakeFiles/cxx_static.dir/filesystem/directory_iterator.cpp.o.d -o projects/libcxx/src/CMakeFiles/cxx_static.dir/filesystem/directory_iterator.cpp.o -c /Users/buildslave/jenkins/workspace/mr-clang-stage1-cmake-RA-expensive/llvm-project/libcxx/src/filesystem/directory_iterator.cpp
[2550/4432] /Applications/Xcode.app/Contents/Developer/Toolchains/XcodeDefault.xctoolchain/usr/bin/c++  -DEXPENSIVE_CHECKS -DNDEBUG -D_GLIBCXX_DEBUG -D_LIBCPP_BUILDING_LIBRARY -D_LIBCPP_HAS_NO_PRAGMA_SYSTEM_HEADER -D__STDC_CONSTANT_MACROS -D__STDC_FORMAT_MACROS -D__STDC_LIMIT_MACROS -Iprojects/libcxx/src -I/Users/buildslave/jenkins/workspace/mr-clang-stage1-cmake-RA-expensive/llvm-project/libcxx/src -I/Applications/Xcode.app/Contents/Developer/Platforms/MacOSX.platform/Developer/SDKs/MacOSX10.14.sdk/usr/include/libxml2 -Iinclude -I/Users/buildslave/jenkins/workspace/mr-clang-stage1-cmake-RA-expensive/llvm-project/llvm/include -Iprojects/libcxx/include/c++build -I/Users/buildslave/jenkins/workspace/mr-clang-stage1-cmake-RA-expensive/llvm-project/libcxx/include -fPIC -fvisibility-inlines-hidden -Werror=date-time -Werror=unguarded-availability-new -std=c++11 -Wall -Wextra -Wno-unused-parameter -Wwrite-strings -Wcast-qual -Wmissing-field-initializers  -Wno-long-long -Wimplicit-fallthrough -Wcovered-switch-default -Wno-noexcept-type -Wnon-virtual-dtor -Wdelete-non-virtual-dtor -Wstring-conversion -fdiagnostics-color -O3  -isysroot /Applications/Xcode.app/Contents/Developer/Platforms/MacOSX.platform/Developer/SDKs/MacOSX10.14.sdk    -DLIBCXX_BUILDING_LIBCXXABI -std=c++11 -nostdinc++ -fvisibility-inlines-hidden -Wall -Wextra -W -Wwrite-strings -Wno-unused-parameter -Wno-long-long -Werror=return-type -Wextra-semi -Wno-user-defined-literals -Wno-covered-switch-default -Wno-ignored-attributes -Wno-error -MD -MT projects/libcxx/src/CMakeFiles/cxx_static.dir/string.cpp.o -MF projects/libcxx/src/CMakeFiles/cxx_static.dir/string.cpp.o.d -o projects/libcxx/src/CMakeFiles/cxx_static.dir/string.cpp.o -c /Users/buildslave/jenkins/workspace/mr-clang-stage1-cmake-RA-expensive/llvm-project/libcxx/src/string.cpp
[2551/4432] /Applications/Xcode.app/Contents/Developer/Toolchains/XcodeDefault.xctoolchain/usr/bin/c++  -DEXPENSIVE_CHECKS -DNDEBUG -D_GLIBCXX_DEBUG -D_LIBCPP_BUILDING_LIBRARY -D_LIBCPP_HAS_NO_PRAGMA_SYSTEM_HEADER -D__STDC_CONSTANT_MACROS -D__STDC_FORMAT_MACROS -D__STDC_LIMIT_MACROS -Iprojects/libcxx/src -I/Users/buildslave/jenkins/workspace/mr-clang-stage1-cmake-RA-expensive/llvm-project/libcxx/src -I/Applications/Xcode.app/Contents/Developer/Platforms/MacOSX.platform/Developer/SDKs/MacOSX10.14.sdk/usr/include/libxml2 -Iinclude -I/Users/buildslave/jenkins/workspace/mr-clang-stage1-cmake-RA-expensive/llvm-project/llvm/include -Iprojects/libcxx/include/c++build -I/Users/buildslave/jenkins/workspace/mr-clang-stage1-cmake-RA-expensive/llvm-project/libcxx/include -fPIC -fvisibility-inlines-hidden -Werror=date-time -Werror=unguarded-availability-new -std=c++11 -Wall -Wextra -Wno-unused-parameter -Wwrite-strings -Wcast-qual -Wmissing-field-initializers  -Wno-long-long -Wimplicit-fallthrough -Wcovered-switch-default -Wno-noexcept-type -Wnon-virtual-dtor -Wdelete-non-virtual-dtor -Wstring-conversion -fdiagnostics-color -O3  -isysroot /Applications/Xcode.app/Contents/Developer/Platforms/MacOSX.platform/Developer/SDKs/MacOSX10.14.sdk -fPIC    -DLIBCXX_BUILDING_LIBCXXABI -std=c++11 -nostdinc++ -fvisibility-inlines-hidden -Wall -Wextra -W -Wwrite-strings -Wno-unused-parameter -Wno-long-long -Werror=return-type -Wextra-semi -Wno-user-defined-literals -Wno-covered-switch-default -Wno-ignored-attributes -Wno-error -MD -MT projects/libcxx/src/CMakeFiles/cxx_shared.dir/algorithm.cpp.o -MF projects/libcxx/src/CMakeFiles/cxx_shared.dir/algorithm.cpp.o.d -o projects/libcxx/src/CMakeFiles/cxx_shared.dir/algorithm.cpp.o -c /Users/buildslave/jenkins/workspace/mr-clang-stage1-cmake-RA-expensive/llvm-project/libcxx/src/algorithm.cpp
[2552/4432] /Applications/Xcode.app/Contents/Developer/Toolchains/XcodeDefault.xctoolchain/usr/bin/c++  -DEXPENSIVE_CHECKS -DNDEBUG -D_GLIBCXX_DEBUG -D_LIBCPP_BUILDING_LIBRARY -D_LIBCPP_HAS_NO_PRAGMA_SYSTEM_HEADER -D__STDC_CONSTANT_MACROS -D__STDC_FORMAT_MACROS -D__STDC_LIMIT_MACROS -Iprojects/libcxx/src -I/Users/buildslave/jenkins/workspace/mr-clang-stage1-cmake-RA-expensive/llvm-project/libcxx/src -I/Applications/Xcode.app/Contents/Developer/Platforms/MacOSX.platform/Developer/SDKs/MacOSX10.14.sdk/usr/include/libxml2 -Iinclude -I/Users/buildslave/jenkins/workspace/mr-clang-stage1-cmake-RA-expensive/llvm-project/llvm/include -Iprojects/libcxx/include/c++build -I/Users/buildslave/jenkins/workspace/mr-clang-stage1-cmake-RA-expensive/llvm-project/libcxx/include -fPIC -fvisibility-inlines-hidden -Werror=date-time -Werror=unguarded-availability-new -std=c++11 -Wall -Wextra -Wno-unused-parameter -Wwrite-strings -Wcast-qual -Wmissing-field-initializers  -Wno-long-long -Wimplicit-fallthrough -Wcovered-switch-default -Wno-noexcept-type -Wnon-virtual-dtor -Wdelete-non-virtual-dtor -Wstring-conversion -fdiagnostics-color -O3  -isysroot /Applications/Xcode.app/Contents/Developer/Platforms/MacOSX.platform/Developer/SDKs/MacOSX10.14.sdk -fPIC    -DLIBCXX_BUILDING_LIBCXXABI -std=c++11 -nostdinc++ -fvisibility-inlines-hidden -Wall -Wextra -W -Wwrite-strings -Wno-unused-parameter -Wno-long-long -Werror=return-type -Wextra-semi -Wno-user-defined-literals -Wno-covered-switch-default -Wno-ignored-attributes -Wno-error -MD -MT projects/libcxx/src/CMakeFiles/cxx_shared.dir/shared_mutex.cpp.o -MF projects/libcxx/src/CMakeFiles/cxx_shared.dir/shared_mutex.cpp.o.d -o projects/libcxx/src/CMakeFiles/cxx_shared.dir/shared_mutex.cpp.o -c /Users/buildslave/jenkins/workspace/mr-clang-stage1-cmake-RA-expensive/llvm-project/libcxx/src/shared_mutex.cpp
[2553/4432] /Applications/Xcode.app/Contents/Developer/Toolchains/XcodeDefault.xctoolchain/usr/bin/c++  -DEXPENSIVE_CHECKS -DNDEBUG -D_GLIBCXX_DEBUG -D_LIBCPP_BUILDING_LIBRARY -D_LIBCPP_HAS_NO_PRAGMA_SYSTEM_HEADER -D__STDC_CONSTANT_MACROS -D__STDC_FORMAT_MACROS -D__STDC_LIMIT_MACROS -Iprojects/libcxx/src -I/Users/buildslave/jenkins/workspace/mr-clang-stage1-cmake-RA-expensive/llvm-project/libcxx/src -I/Applications/Xcode.app/Contents/Developer/Platforms/MacOSX.platform/Developer/SDKs/MacOSX10.14.sdk/usr/include/libxml2 -Iinclude -I/Users/buildslave/jenkins/workspace/mr-clang-stage1-cmake-RA-expensive/llvm-project/llvm/include -Iprojects/libcxx/include/c++build -I/Users/buildslave/jenkins/workspace/mr-clang-stage1-cmake-RA-expensive/llvm-project/libcxx/include -fPIC -fvisibility-inlines-hidden -Werror=date-time -Werror=unguarded-availability-new -std=c++11 -Wall -Wextra -Wno-unused-parameter -Wwrite-strings -Wcast-qual -Wmissing-field-initializers  -Wno-long-long -Wimplicit-fallthrough -Wcovered-switch-default -Wno-noexcept-type -Wnon-virtual-dtor -Wdelete-non-virtual-dtor -Wstring-conversion -fdiagnostics-color -O3  -isysroot /Applications/Xcode.app/Contents/Developer/Platforms/MacOSX.platform/Developer/SDKs/MacOSX10.14.sdk -fPIC    -DLIBCXX_BUILDING_LIBCXXABI -std=c++11 -nostdinc++ -fvisibility-inlines-hidden -Wall -Wextra -W -Wwrite-strings -Wno-unused-parameter -Wno-long-long -Werror=return-type -Wextra-semi -Wno-user-defined-literals -Wno-covered-switch-default -Wno-ignored-attributes -Wno-error -MD -MT projects/libcxx/src/CMakeFiles/cxx_shared.dir/stdexcept.cpp.o -MF projects/libcxx/src/CMakeFiles/cxx_shared.dir/stdexcept.cpp.o.d -o projects/libcxx/src/CMakeFiles/cxx_shared.dir/stdexcept.cpp.o -c /Users/buildslave/jenkins/workspace/mr-clang-stage1-cmake-RA-expensive/llvm-project/libcxx/src/stdexcept.cpp
[2554/4432] /Applications/Xcode.app/Contents/Developer/Toolchains/XcodeDefault.xctoolchain/usr/bin/c++  -DEXPENSIVE_CHECKS -DNDEBUG -D_GLIBCXX_DEBUG -D_LIBCPP_BUILDING_LIBRARY -D_LIBCPP_HAS_NO_PRAGMA_SYSTEM_HEADER -D__STDC_CONSTANT_MACROS -D__STDC_FORMAT_MACROS -D__STDC_LIMIT_MACROS -Iprojects/libcxx/src -I/Users/buildslave/jenkins/workspace/mr-clang-stage1-cmake-RA-expensive/llvm-project/libcxx/src -I/Applications/Xcode.app/Contents/Developer/Platforms/MacOSX.platform/Developer/SDKs/MacOSX10.14.sdk/usr/include/libxml2 -Iinclude -I/Users/buildslave/jenkins/workspace/mr-clang-stage1-cmake-RA-expensive/llvm-project/llvm/include -Iprojects/libcxx/include/c++build -I/Users/buildslave/jenkins/workspace/mr-clang-stage1-cmake-RA-expensive/llvm-project/libcxx/include -fPIC -fvisibility-inlines-hidden -Werror=date-time -Werror=unguarded-availability-new -std=c++11 -Wall -Wextra -Wno-unused-parameter -Wwrite-strings -Wcast-qual -Wmissing-field-initializers  -Wno-long-long -Wimplicit-fallthrough -Wcovered-switch-default -Wno-noexcept-type -Wnon-virtual-dtor -Wdelete-non-virtual-dtor -Wstring-conversion -fdiagnostics-color -O3  -isysroot /Applications/Xcode.app/Contents/Developer/Platforms/MacOSX.platform/Developer/SDKs/MacOSX10.14.sdk -fPIC    -DLIBCXX_BUILDING_LIBCXXABI -std=c++11 -nostdinc++ -fvisibility-inlines-hidden -Wall -Wextra -W -Wwrite-strings -Wno-unused-parameter -Wno-long-long -Werror=return-type -Wextra-semi -Wno-user-defined-literals -Wno-covered-switch-default -Wno-ignored-attributes -Wno-error -MD -MT projects/libcxx/src/CMakeFiles/cxx_shared.dir/random.cpp.o -MF projects/libcxx/src/CMakeFiles/cxx_shared.dir/random.cpp.o.d -o projects/libcxx/src/CMakeFiles/cxx_shared.dir/random.cpp.o -c /Users/buildslave/jenkins/workspace/mr-clang-stage1-cmake-RA-expensive/llvm-project/libcxx/src/random.cpp
[2555/4432] /Applications/Xcode.app/Contents/Developer/Toolchains/XcodeDefault.xctoolchain/usr/bin/c++  -DEXPENSIVE_CHECKS -DNDEBUG -D_GLIBCXX_DEBUG -D_LIBCPP_BUILDING_LIBRARY -D_LIBCPP_HAS_NO_PRAGMA_SYSTEM_HEADER -D__STDC_CONSTANT_MACROS -D__STDC_FORMAT_MACROS -D__STDC_LIMIT_MACROS -Iprojects/libcxx/src -I/Users/buildslave/jenkins/workspace/mr-clang-stage1-cmake-RA-expensive/llvm-project/libcxx/src -I/Applications/Xcode.app/Contents/Developer/Platforms/MacOSX.platform/Developer/SDKs/MacOSX10.14.sdk/usr/include/libxml2 -Iinclude -I/Users/buildslave/jenkins/workspace/mr-clang-stage1-cmake-RA-expensive/llvm-project/llvm/include -Iprojects/libcxx/include/c++build -I/Users/buildslave/jenkins/workspace/mr-clang-stage1-cmake-RA-expensive/llvm-project/libcxx/include -fPIC -fvisibility-inlines-hidden -Werror=date-time -Werror=unguarded-availability-new -std=c++11 -Wall -Wextra -Wno-unused-parameter -Wwrite-strings -Wcast-qual -Wmissing-field-initializers  -Wno-long-long -Wimplicit-fallthrough -Wcovered-switch-default -Wno-noexcept-type -Wnon-virtual-dtor -Wdelete-non-virtual-dtor -Wstring-conversion -fdiagnostics-color -O3  -isysroot /Applications/Xcode.app/Contents/Developer/Platforms/MacOSX.platform/Developer/SDKs/MacOSX10.14.sdk -fPIC    -DLIBCXX_BUILDING_LIBCXXABI -std=c++11 -nostdinc++ -fvisibility-inlines-hidden -Wall -Wextra -W -Wwrite-strings -Wno-unused-parameter -Wno-long-long -Werror=return-type -Wextra-semi -Wno-user-defined-literals -Wno-covered-switch-default -Wno-ignored-attributes -Wno-error -MD -MT projects/libcxx/src/CMakeFiles/cxx_shared.dir/typeinfo.cpp.o -MF projects/libcxx/src/CMakeFiles/cxx_shared.dir/typeinfo.cpp.o.d -o projects/libcxx/src/CMakeFiles/cxx_shared.dir/typeinfo.cpp.o -c /Users/buildslave/jenkins/workspace/mr-clang-stage1-cmake-RA-expensive/llvm-project/libcxx/src/typeinfo.cpp
[2556/4432] /Applications/Xcode.app/Contents/Developer/Toolchains/XcodeDefault.xctoolchain/usr/bin/c++  -DEXPENSIVE_CHECKS -DNDEBUG -D_GLIBCXX_DEBUG -D_LIBCPP_BUILDING_LIBRARY -D_LIBCPP_HAS_NO_PRAGMA_SYSTEM_HEADER -D__STDC_CONSTANT_MACROS -D__STDC_FORMAT_MACROS -D__STDC_LIMIT_MACROS -Iprojects/libcxx/src -I/Users/buildslave/jenkins/workspace/mr-clang-stage1-cmake-RA-expensive/llvm-project/libcxx/src -I/Applications/Xcode.app/Contents/Developer/Platforms/MacOSX.platform/Developer/SDKs/MacOSX10.14.sdk/usr/include/libxml2 -Iinclude -I/Users/buildslave/jenkins/workspace/mr-clang-stage1-cmake-RA-expensive/llvm-project/llvm/include -Iprojects/libcxx/include/c++build -I/Users/buildslave/jenkins/workspace/mr-clang-stage1-cmake-RA-expensive/llvm-project/libcxx/include -fPIC -fvisibility-inlines-hidden -Werror=date-time -Werror=unguarded-availability-new -std=c++11 -Wall -Wextra -Wno-unused-parameter -Wwrite-strings -Wcast-qual -Wmissing-field-initializers  -Wno-long-long -Wimplicit-fallthrough -Wcovered-switch-default -Wno-noexcept-type -Wnon-virtual-dtor -Wdelete-non-virtual-dtor -Wstring-conversion -fdiagnostics-color -O3  -isysroot /Applications/Xcode.app/Contents/Developer/Platforms/MacOSX.platform/Developer/SDKs/MacOSX10.14.sdk -fPIC    -DLIBCXX_BUILDING_LIBCXXABI -std=c++11 -nostdinc++ -fvisibility-inlines-hidden -Wall -Wextra -W -Wwrite-strings -Wno-unused-parameter -Wno-long-long -Werror=return-type -Wextra-semi -Wno-user-defined-literals -Wno-covered-switch-default -Wno-ignored-attributes -Wno-error -MD -MT projects/libcxx/src/CMakeFiles/cxx_shared.dir/regex.cpp.o -MF projects/libcxx/src/CMakeFiles/cxx_shared.dir/regex.cpp.o.d -o projects/libcxx/src/CMakeFiles/cxx_shared.dir/regex.cpp.o -c /Users/buildslave/jenkins/workspace/mr-clang-stage1-cmake-RA-expensive/llvm-project/libcxx/src/regex.cpp
[2557/4432] /Applications/Xcode.app/Contents/Developer/Toolchains/XcodeDefault.xctoolchain/usr/bin/c++  -DEXPENSIVE_CHECKS -DNDEBUG -D_GLIBCXX_DEBUG -D_LIBCPP_BUILDING_LIBRARY -D_LIBCPP_HAS_NO_PRAGMA_SYSTEM_HEADER -D__STDC_CONSTANT_MACROS -D__STDC_FORMAT_MACROS -D__STDC_LIMIT_MACROS -Iprojects/libcxx/src -I/Users/buildslave/jenkins/workspace/mr-clang-stage1-cmake-RA-expensive/llvm-project/libcxx/src -I/Applications/Xcode.app/Contents/Developer/Platforms/MacOSX.platform/Developer/SDKs/MacOSX10.14.sdk/usr/include/libxml2 -Iinclude -I/Users/buildslave/jenkins/workspace/mr-clang-stage1-cmake-RA-expensive/llvm-project/llvm/include -Iprojects/libcxx/include/c++build -I/Users/buildslave/jenkins/workspace/mr-clang-stage1-cmake-RA-expensive/llvm-project/libcxx/include -fPIC -fvisibility-inlines-hidden -Werror=date-time -Werror=unguarded-availability-new -std=c++11 -Wall -Wextra -Wno-unused-parameter -Wwrite-strings -Wcast-qual -Wmissing-field-initializers  -Wno-long-long -Wimplicit-fallthrough -Wcovered-switch-default -Wno-noexcept-type -Wnon-virtual-dtor -Wdelete-non-virtual-dtor -Wstring-conversion -fdiagnostics-color -O3  -isysroot /Applications/Xcode.app/Contents/Developer/Platforms/MacOSX.platform/Developer/SDKs/MacOSX10.14.sdk -fPIC    -DLIBCXX_BUILDING_LIBCXXABI -std=c++11 -nostdinc++ -fvisibility-inlines-hidden -Wall -Wextra -W -Wwrite-strings -Wno-unused-parameter -Wno-long-long -Werror=return-type -Wextra-semi -Wno-user-defined-literals -Wno-covered-switch-default -Wno-ignored-attributes -Wno-error -MD -MT projects/libcxx/src/CMakeFiles/cxx_shared.dir/utility.cpp.o -MF projects/libcxx/src/CMakeFiles/cxx_shared.dir/utility.cpp.o.d -o projects/libcxx/src/CMakeFiles/cxx_shared.dir/utility.cpp.o -c /Users/buildslave/jenkins/workspace/mr-clang-stage1-cmake-RA-expensive/llvm-project/libcxx/src/utility.cpp
[2558/4432] /Applications/Xcode.app/Contents/Developer/Toolchains/XcodeDefault.xctoolchain/usr/bin/c++  -DEXPENSIVE_CHECKS -DNDEBUG -D_GLIBCXX_DEBUG -D_LIBCPP_BUILDING_LIBRARY -D_LIBCPP_HAS_NO_PRAGMA_SYSTEM_HEADER -D__STDC_CONSTANT_MACROS -D__STDC_FORMAT_MACROS -D__STDC_LIMIT_MACROS -Iprojects/libcxx/src -I/Users/buildslave/jenkins/workspace/mr-clang-stage1-cmake-RA-expensive/llvm-project/libcxx/src -I/Applications/Xcode.app/Contents/Developer/Platforms/MacOSX.platform/Developer/SDKs/MacOSX10.14.sdk/usr/include/libxml2 -Iinclude -I/Users/buildslave/jenkins/workspace/mr-clang-stage1-cmake-RA-expensive/llvm-project/llvm/include -Iprojects/libcxx/include/c++build -I/Users/buildslave/jenkins/workspace/mr-clang-stage1-cmake-RA-expensive/llvm-project/libcxx/include -fPIC -fvisibility-inlines-hidden -Werror=date-time -Werror=unguarded-availability-new -std=c++11 -Wall -Wextra -Wno-unused-parameter -Wwrite-strings -Wcast-qual -Wmissing-field-initializers  -Wno-long-long -Wimplicit-fallthrough -Wcovered-switch-default -Wno-noexcept-type -Wnon-virtual-dtor -Wdelete-non-virtual-dtor -Wstring-conversion -fdiagnostics-color -O3  -isysroot /Applications/Xcode.app/Contents/Developer/Platforms/MacOSX.platform/Developer/SDKs/MacOSX10.14.sdk -fPIC    -DLIBCXX_BUILDING_LIBCXXABI -std=c++11 -nostdinc++ -fvisibility-inlines-hidden -Wall -Wextra -W -Wwrite-strings -Wno-unused-parameter -Wno-long-long -Werror=return-type -Wextra-semi -Wno-user-defined-literals -Wno-covered-switch-default -Wno-ignored-attributes -Wno-error -MD -MT projects/libcxx/src/CMakeFiles/cxx_shared.dir/system_error.cpp.o -MF projects/libcxx/src/CMakeFiles/cxx_shared.dir/system_error.cpp.o.d -o projects/libcxx/src/CMakeFiles/cxx_shared.dir/system_error.cpp.o -c /Users/buildslave/jenkins/workspace/mr-clang-stage1-cmake-RA-expensive/llvm-project/libcxx/src/system_error.cpp
[2559/4432] /Applications/Xcode.app/Contents/Developer/Toolchains/XcodeDefault.xctoolchain/usr/bin/c++  -DEXPENSIVE_CHECKS -DNDEBUG -D_GLIBCXX_DEBUG -D_LIBCPP_BUILDING_LIBRARY -D_LIBCPP_HAS_NO_PRAGMA_SYSTEM_HEADER -D__STDC_CONSTANT_MACROS -D__STDC_FORMAT_MACROS -D__STDC_LIMIT_MACROS -Iprojects/libcxx/src -I/Users/buildslave/jenkins/workspace/mr-clang-stage1-cmake-RA-expensive/llvm-project/libcxx/src -I/Applications/Xcode.app/Contents/Developer/Platforms/MacOSX.platform/Developer/SDKs/MacOSX10.14.sdk/usr/include/libxml2 -Iinclude -I/Users/buildslave/jenkins/workspace/mr-clang-stage1-cmake-RA-expensive/llvm-project/llvm/include -Iprojects/libcxx/include/c++build -I/Users/buildslave/jenkins/workspace/mr-clang-stage1-cmake-RA-expensive/llvm-project/libcxx/include -fPIC -fvisibility-inlines-hidden -Werror=date-time -Werror=unguarded-availability-new -std=c++11 -Wall -Wextra -Wno-unused-parameter -Wwrite-strings -Wcast-qual -Wmissing-field-initializers  -Wno-long-long -Wimplicit-fallthrough -Wcovered-switch-default -Wno-noexcept-type -Wnon-virtual-dtor -Wdelete-non-virtual-dtor -Wstring-conversion -fdiagnostics-color -O3  -isysroot /Applications/Xcode.app/Contents/Developer/Platforms/MacOSX.platform/Developer/SDKs/MacOSX10.14.sdk -fPIC    -DLIBCXX_BUILDING_LIBCXXABI -std=c++11 -nostdinc++ -fvisibility-inlines-hidden -Wall -Wextra -W -Wwrite-strings -Wno-unused-parameter -Wno-long-long -Werror=return-type -Wextra-semi -Wno-user-defined-literals -Wno-covered-switch-default -Wno-ignored-attributes -Wno-error -MD -MT projects/libcxx/src/CMakeFiles/cxx_shared.dir/filesystem/int128_builtins.cpp.o -MF projects/libcxx/src/CMakeFiles/cxx_shared.dir/filesystem/int128_builtins.cpp.o.d -o projects/libcxx/src/CMakeFiles/cxx_shared.dir/filesystem/int128_builtins.cpp.o -c /Users/buildslave/jenkins/workspace/mr-clang-stage1-cmake-RA-expensive/llvm-project/libcxx/src/filesystem/int128_builtins.cpp
[2560/4432] /Applications/Xcode.app/Contents/Developer/Toolchains/XcodeDefault.xctoolchain/usr/bin/c++  -DEXPENSIVE_CHECKS -DNDEBUG -D_GLIBCXX_DEBUG -D_LIBCPP_BUILDING_LIBRARY -D_LIBCPP_HAS_NO_PRAGMA_SYSTEM_HEADER -D__STDC_CONSTANT_MACROS -D__STDC_FORMAT_MACROS -D__STDC_LIMIT_MACROS -Iprojects/libcxx/src -I/Users/buildslave/jenkins/workspace/mr-clang-stage1-cmake-RA-expensive/llvm-project/libcxx/src -I/Applications/Xcode.app/Contents/Developer/Platforms/MacOSX.platform/Developer/SDKs/MacOSX10.14.sdk/usr/include/libxml2 -Iinclude -I/Users/buildslave/jenkins/workspace/mr-clang-stage1-cmake-RA-expensive/llvm-project/llvm/include -Iprojects/libcxx/include/c++build -I/Users/buildslave/jenkins/workspace/mr-clang-stage1-cmake-RA-expensive/llvm-project/libcxx/include -fPIC -fvisibility-inlines-hidden -Werror=date-time -Werror=unguarded-availability-new -std=c++11 -Wall -Wextra -Wno-unused-parameter -Wwrite-strings -Wcast-qual -Wmissing-field-initializers  -Wno-long-long -Wimplicit-fallthrough -Wcovered-switch-default -Wno-noexcept-type -Wnon-virtual-dtor -Wdelete-non-virtual-dtor -Wstring-conversion -fdiagnostics-color -O3  -isysroot /Applications/Xcode.app/Contents/Developer/Platforms/MacOSX.platform/Developer/SDKs/MacOSX10.14.sdk -fPIC    -DLIBCXX_BUILDING_LIBCXXABI -std=c++11 -nostdinc++ -fvisibility-inlines-hidden -Wall -Wextra -W -Wwrite-strings -Wno-unused-parameter -Wno-long-long -Werror=return-type -Wextra-semi -Wno-user-defined-literals -Wno-covered-switch-default -Wno-ignored-attributes -Wno-error -MD -MT projects/libcxx/src/CMakeFiles/cxx_shared.dir/strstream.cpp.o -MF projects/libcxx/src/CMakeFiles/cxx_shared.dir/strstream.cpp.o.d -o projects/libcxx/src/CMakeFiles/cxx_shared.dir/strstream.cpp.o -c /Users/buildslave/jenkins/workspace/mr-clang-stage1-cmake-RA-expensive/llvm-project/libcxx/src/strstream.cpp
[2561/4432] /Applications/Xcode.app/Contents/Developer/Toolchains/XcodeDefault.xctoolchain/usr/bin/c++  -DEXPENSIVE_CHECKS -DGTEST_HAS_RTTI=0 -D_DEBUG -D_GLIBCXX_DEBUG -D__STDC_CONSTANT_MACROS -D__STDC_FORMAT_MACROS -D__STDC_LIMIT_MACROS -Itools/lto -I/Users/buildslave/jenkins/workspace/mr-clang-stage1-cmake-RA-expensive/llvm-project/llvm/tools/lto -I/Applications/Xcode.app/Contents/Developer/Platforms/MacOSX.platform/Developer/SDKs/MacOSX10.14.sdk/usr/include/libxml2 -Iinclude -I/Users/buildslave/jenkins/workspace/mr-clang-stage1-cmake-RA-expensive/llvm-project/llvm/include -fPIC -fvisibility-inlines-hidden -Werror=date-time -Werror=unguarded-availability-new -std=c++11 -Wall -Wextra -Wno-unused-parameter -Wwrite-strings -Wcast-qual -Wmissing-field-initializers -pedantic -Wno-long-long -Wimplicit-fallthrough -Wcovered-switch-default -Wno-noexcept-type -Wnon-virtual-dtor -Wdelete-non-virtual-dtor -Wstring-conversion -fdiagnostics-color -O3  -isysroot /Applications/Xcode.app/Contents/Developer/Platforms/MacOSX.platform/Developer/SDKs/MacOSX10.14.sdk -fPIC   -UNDEBUG  -fno-exceptions -fno-rtti -MD -MT tools/lto/CMakeFiles/LTO.dir/LTODisassembler.cpp.o -MF tools/lto/CMakeFiles/LTO.dir/LTODisassembler.cpp.o.d -o tools/lto/CMakeFiles/LTO.dir/LTODisassembler.cpp.o -c /Users/buildslave/jenkins/workspace/mr-clang-stage1-cmake-RA-expensive/llvm-project/llvm/tools/lto/LTODisassembler.cpp
[2562/4432] /Applications/Xcode.app/Contents/Developer/Toolchains/XcodeDefault.xctoolchain/usr/bin/c++  -DEXPENSIVE_CHECKS -DNDEBUG -D_GLIBCXX_DEBUG -D_LIBCPP_BUILDING_LIBRARY -D_LIBCPP_HAS_NO_PRAGMA_SYSTEM_HEADER -D__STDC_CONSTANT_MACROS -D__STDC_FORMAT_MACROS -D__STDC_LIMIT_MACROS -Iprojects/libcxx/src -I/Users/buildslave/jenkins/workspace/mr-clang-stage1-cmake-RA-expensive/llvm-project/libcxx/src -I/Applications/Xcode.app/Contents/Developer/Platforms/MacOSX.platform/Developer/SDKs/MacOSX10.14.sdk/usr/include/libxml2 -Iinclude -I/Users/buildslave/jenkins/workspace/mr-clang-stage1-cmake-RA-expensive/llvm-project/llvm/include -Iprojects/libcxx/include/c++build -I/Users/buildslave/jenkins/workspace/mr-clang-stage1-cmake-RA-expensive/llvm-project/libcxx/include -fPIC -fvisibility-inlines-hidden -Werror=date-time -Werror=unguarded-availability-new -std=c++11 -Wall -Wextra -Wno-unused-parameter -Wwrite-strings -Wcast-qual -Wmissing-field-initializers  -Wno-long-long -Wimplicit-fallthrough -Wcovered-switch-default -Wno-noexcept-type -Wnon-virtual-dtor -Wdelete-non-virtual-dtor -Wstring-conversion -fdiagnostics-color -O3  -isysroot /Applications/Xcode.app/Contents/Developer/Platforms/MacOSX.platform/Developer/SDKs/MacOSX10.14.sdk -fPIC    -DLIBCXX_BUILDING_LIBCXXABI -std=c++11 -nostdinc++ -fvisibility-inlines-hidden -Wall -Wextra -W -Wwrite-strings -Wno-unused-parameter -Wno-long-long -Werror=return-type -Wextra-semi -Wno-user-defined-literals -Wno-covered-switch-default -Wno-ignored-attributes -Wno-error -MD -MT projects/libcxx/src/CMakeFiles/cxx_shared.dir/variant.cpp.o -MF projects/libcxx/src/CMakeFiles/cxx_shared.dir/variant.cpp.o.d -o projects/libcxx/src/CMakeFiles/cxx_shared.dir/variant.cpp.o -c /Users/buildslave/jenkins/workspace/mr-clang-stage1-cmake-RA-expensive/llvm-project/libcxx/src/variant.cpp
[2563/4432] /Applications/Xcode.app/Contents/Developer/Toolchains/XcodeDefault.xctoolchain/usr/bin/c++  -DEXPENSIVE_CHECKS -DNDEBUG -D_GLIBCXX_DEBUG -D_LIBCPP_BUILDING_LIBRARY -D_LIBCPP_HAS_NO_PRAGMA_SYSTEM_HEADER -D__STDC_CONSTANT_MACROS -D__STDC_FORMAT_MACROS -D__STDC_LIMIT_MACROS -Iprojects/libcxx/src -I/Users/buildslave/jenkins/workspace/mr-clang-stage1-cmake-RA-expensive/llvm-project/libcxx/src -I/Applications/Xcode.app/Contents/Developer/Platforms/MacOSX.platform/Developer/SDKs/MacOSX10.14.sdk/usr/include/libxml2 -Iinclude -I/Users/buildslave/jenkins/workspace/mr-clang-stage1-cmake-RA-expensive/llvm-project/llvm/include -Iprojects/libcxx/include/c++build -I/Users/buildslave/jenkins/workspace/mr-clang-stage1-cmake-RA-expensive/llvm-project/libcxx/include -fPIC -fvisibility-inlines-hidden -Werror=date-time -Werror=unguarded-availability-new -std=c++11 -Wall -Wextra -Wno-unused-parameter -Wwrite-strings -Wcast-qual -Wmissing-field-initializers  -Wno-long-long -Wimplicit-fallthrough -Wcovered-switch-default -Wno-noexcept-type -Wnon-virtual-dtor -Wdelete-non-virtual-dtor -Wstring-conversion -fdiagnostics-color -O3  -isysroot /Applications/Xcode.app/Contents/Developer/Platforms/MacOSX.platform/Developer/SDKs/MacOSX10.14.sdk -fPIC    -DLIBCXX_BUILDING_LIBCXXABI -std=c++11 -nostdinc++ -fvisibility-inlines-hidden -Wall -Wextra -W -Wwrite-strings -Wno-unused-parameter -Wno-long-long -Werror=return-type -Wextra-semi -Wno-user-defined-literals -Wno-covered-switch-default -Wno-ignored-attributes -Wno-error -MD -MT projects/libcxx/src/CMakeFiles/cxx_shared.dir/valarray.cpp.o -MF projects/libcxx/src/CMakeFiles/cxx_shared.dir/valarray.cpp.o.d -o projects/libcxx/src/CMakeFiles/cxx_shared.dir/valarray.cpp.o -c /Users/buildslave/jenkins/workspace/mr-clang-stage1-cmake-RA-expensive/llvm-project/libcxx/src/valarray.cpp
[2564/4432] /Applications/Xcode.app/Contents/Developer/Toolchains/XcodeDefault.xctoolchain/usr/bin/c++  -DEXPENSIVE_CHECKS -D_DEBUG -D_GLIBCXX_DEBUG -D_LIBCPP_DISABLE_EXTERN_TEMPLATE -D_LIBCPP_ENABLE_CXX17_REMOVED_UNEXPECTED_FUNCTIONS -D_LIBCXXABI_BUILDING_LIBRARY -D__STDC_CONSTANT_MACROS -D__STDC_FORMAT_MACROS -D__STDC_LIMIT_MACROS -Dcxxabi_shared_EXPORTS -Iprojects/libcxxabi/src -I/Users/buildslave/jenkins/workspace/mr-clang-stage1-cmake-RA-expensive/llvm-project/libcxxabi/src -I/Applications/Xcode.app/Contents/Developer/Platforms/MacOSX.platform/Developer/SDKs/MacOSX10.14.sdk/usr/include/libxml2 -Iinclude -I/Users/buildslave/jenkins/workspace/mr-clang-stage1-cmake-RA-expensive/llvm-project/llvm/include -I/Users/buildslave/jenkins/workspace/mr-clang-stage1-cmake-RA-expensive/llvm-project/libcxxabi/include -I/Users/buildslave/jenkins/workspace/mr-clang-stage1-cmake-RA-expensive/llvm-project/libcxx/include -fPIC -fvisibility-inlines-hidden -Werror=date-time -Werror=unguarded-availability-new -std=c++11 -Wall -Wextra -Wno-unused-parameter -Wwrite-strings -Wcast-qual -Wmissing-field-initializers -pedantic -Wno-long-long -Wimplicit-fallthrough -Wcovered-switch-default -Wno-noexcept-type -Wnon-virtual-dtor -Wdelete-non-virtual-dtor -Wstring-conversion -fdiagnostics-color  -O3  -isysroot /Applications/Xcode.app/Contents/Developer/Platforms/MacOSX.platform/Developer/SDKs/MacOSX10.14.sdk -fPIC   -UNDEBUG -nostdinc++ -Werror=return-type -W -Wall -Wchar-subscripts -Wconversion -Wmismatched-tags -Wmissing-braces -Wnewline-eof -Wunused-function -Wshadow -Wshorten-64-to-32 -Wsign-compare -Wsign-conversion -Wstrict-aliasing=2 -Wstrict-overflow=4 -Wunused-parameter -Wunused-variable -Wwrite-strings -Wundef -Wno-error -pedantic -fstrict-aliasing -funwind-tables -D_DEBUG -UNDEBUG -std=c++11 -MD -MT projects/libcxxabi/src/CMakeFiles/cxxabi_shared.dir/cxa_demangle.cpp.o -MF projects/libcxxabi/src/CMakeFiles/cxxabi_shared.dir/cxa_demangle.cpp.o.d -o projects/libcxxabi/src/CMakeFiles/cxxabi_shared.dir/cxa_demangle.cpp.o -c /Users/buildslave/jenkins/workspace/mr-clang-stage1-cmake-RA-expensive/llvm-project/libcxxabi/src/cxa_demangle.cpp
[2565/4432] /Applications/Xcode.app/Contents/Developer/Toolchains/XcodeDefault.xctoolchain/usr/bin/c++  -DEXPENSIVE_CHECKS -DNDEBUG -D_GLIBCXX_DEBUG -D_LIBCPP_BUILDING_LIBRARY -D_LIBCPP_HAS_NO_PRAGMA_SYSTEM_HEADER -D__STDC_CONSTANT_MACROS -D__STDC_FORMAT_MACROS -D__STDC_LIMIT_MACROS -Iprojects/libcxx/src -I/Users/buildslave/jenkins/workspace/mr-clang-stage1-cmake-RA-expensive/llvm-project/libcxx/src -I/Applications/Xcode.app/Contents/Developer/Platforms/MacOSX.platform/Developer/SDKs/MacOSX10.14.sdk/usr/include/libxml2 -Iinclude -I/Users/buildslave/jenkins/workspace/mr-clang-stage1-cmake-RA-expensive/llvm-project/llvm/include -Iprojects/libcxx/include/c++build -I/Users/buildslave/jenkins/workspace/mr-clang-stage1-cmake-RA-expensive/llvm-project/libcxx/include -fPIC -fvisibility-inlines-hidden -Werror=date-time -Werror=unguarded-availability-new -std=c++11 -Wall -Wextra -Wno-unused-parameter -Wwrite-strings -Wcast-qual -Wmissing-field-initializers  -Wno-long-long -Wimplicit-fallthrough -Wcovered-switch-default -Wno-noexcept-type -Wnon-virtual-dtor -Wdelete-non-virtual-dtor -Wstring-conversion -fdiagnostics-color -O3  -isysroot /Applications/Xcode.app/Contents/Developer/Platforms/MacOSX.platform/Developer/SDKs/MacOSX10.14.sdk -fPIC    -DLIBCXX_BUILDING_LIBCXXABI -std=c++11 -nostdinc++ -fvisibility-inlines-hidden -Wall -Wextra -W -Wwrite-strings -Wno-unused-parameter -Wno-long-long -Werror=return-type -Wextra-semi -Wno-user-defined-literals -Wno-covered-switch-default -Wno-ignored-attributes -Wno-error -MD -MT projects/libcxx/src/CMakeFiles/cxx_shared.dir/vector.cpp.o -MF projects/libcxx/src/CMakeFiles/cxx_shared.dir/vector.cpp.o.d -o projects/libcxx/src/CMakeFiles/cxx_shared.dir/vector.cpp.o -c /Users/buildslave/jenkins/workspace/mr-clang-stage1-cmake-RA-expensive/llvm-project/libcxx/src/vector.cpp
[2566/4432] cd /Users/buildslave/jenkins/workspace/mr-clang-stage1-cmake-RA-expensive/clang-build/tools/clang/tools/libclang && sed -e "s/^/_/" < /Users/buildslave/jenkins/workspace/mr-clang-stage1-cmake-RA-expensive/llvm-project/clang/tools/libclang/libclang.exports > libclang.exports
[2567/4432] : && /Applications/Xcode.app/Contents/Developer/Toolchains/XcodeDefault.xctoolchain/usr/bin/c++ -fPIC -fvisibility-inlines-hidden -Werror=date-time -Werror=unguarded-availability-new -std=c++11 -Wall -Wextra -Wno-unused-parameter -Wwrite-strings -Wcast-qual -Wmissing-field-initializers -pedantic -Wno-long-long -Wimplicit-fallthrough -Wcovered-switch-default -Wno-noexcept-type -Wnon-virtual-dtor -Wdelete-non-virtual-dtor -Wstring-conversion -fdiagnostics-color  -O3 -isysroot /Applications/Xcode.app/Contents/Developer/Platforms/MacOSX.platform/Developer/SDKs/MacOSX10.14.sdk -dynamiclib -Wl,-headerpad_max_install_names -nodefaultlibs -compatibility_version 1 -install_name /usr/lib/libc++abi.1.dylib  -compatibility_version 1.0.0 -current_version 1.0.0 -o lib/libc++abi.1.0.dylib -install_name @rpath/libc++abi.1.dylib projects/libcxxabi/src/CMakeFiles/cxxabi_shared.dir/cxa_aux_runtime.cpp.o projects/libcxxabi/src/CMakeFiles/cxxabi_shared.dir/cxa_default_handlers.cpp.o projects/libcxxabi/src/CMakeFiles/cxxabi_shared.dir/cxa_demangle.cpp.o projects/libcxxabi/src/CMakeFiles/cxxabi_shared.dir/cxa_exception_storage.cpp.o projects/libcxxabi/src/CMakeFiles/cxxabi_shared.dir/cxa_guard.cpp.o projects/libcxxabi/src/CMakeFiles/cxxabi_shared.dir/cxa_handlers.cpp.o projects/libcxxabi/src/CMakeFiles/cxxabi_shared.dir/cxa_unexpected.cpp.o projects/libcxxabi/src/CMakeFiles/cxxabi_shared.dir/cxa_vector.cpp.o projects/libcxxabi/src/CMakeFiles/cxxabi_shared.dir/cxa_virtual.cpp.o projects/libcxxabi/src/CMakeFiles/cxxabi_shared.dir/stdlib_exception.cpp.o projects/libcxxabi/src/CMakeFiles/cxxabi_shared.dir/stdlib_stdexcept.cpp.o projects/libcxxabi/src/CMakeFiles/cxxabi_shared.dir/stdlib_typeinfo.cpp.o projects/libcxxabi/src/CMakeFiles/cxxabi_shared.dir/abort_message.cpp.o projects/libcxxabi/src/CMakeFiles/cxxabi_shared.dir/fallback_malloc.cpp.o projects/libcxxabi/src/CMakeFiles/cxxabi_shared.dir/private_typeinfo.cpp.o projects/libcxxabi/src/CMakeFiles/cxxabi_shared.dir/stdlib_new_delete.cpp.o projects/libcxxabi/src/CMakeFiles/cxxabi_shared.dir/cxa_exception.cpp.o projects/libcxxabi/src/CMakeFiles/cxxabi_shared.dir/cxa_personality.cpp.o  -Wl,-rpath,@loader_path/../lib -lpthread -lc -Wl,-exported_symbols_list,/Users/buildslave/jenkins/workspace/mr-clang-stage1-cmake-RA-expensive/llvm-project/libcxxabi/src/../lib/itanium-base.exp -Wl,-exported_symbols_list,/Users/buildslave/jenkins/workspace/mr-clang-stage1-cmake-RA-expensive/llvm-project/libcxxabi/src/../lib/new-delete.exp -Wl,-exported_symbols_list,/Users/buildslave/jenkins/workspace/mr-clang-stage1-cmake-RA-expensive/llvm-project/libcxxabi/src/../lib/personality-v0.exp && :
FAILED: lib/libc++abi.1.0.dylib 
: && /Applications/Xcode.app/Contents/Developer/Toolchains/XcodeDefault.xctoolchain/usr/bin/c++ -fPIC -fvisibility-inlines-hidden -Werror=date-time -Werror=unguarded-availability-new -std=c++11 -Wall -Wextra -Wno-unused-parameter -Wwrite-strings -Wcast-qual -Wmissing-field-initializers -pedantic -Wno-long-long -Wimplicit-fallthrough -Wcovered-switch-default -Wno-noexcept-type -Wnon-virtual-dtor -Wdelete-non-virtual-dtor -Wstring-conversion -fdiagnostics-color  -O3 -isysroot /Applications/Xcode.app/Contents/Developer/Platforms/MacOSX.platform/Developer/SDKs/MacOSX10.14.sdk -dynamiclib -Wl,-headerpad_max_install_names -nodefaultlibs -compatibility_version 1 -install_name /usr/lib/libc++abi.1.dylib  -compatibility_version 1.0.0 -current_version 1.0.0 -o lib/libc++abi.1.0.dylib -install_name @rpath/libc++abi.1.dylib projects/libcxxabi/src/CMakeFiles/cxxabi_shared.dir/cxa_aux_runtime.cpp.o projects/libcxxabi/src/CMakeFiles/cxxabi_shared.dir/cxa_default_handlers.cpp.o projects/libcxxabi/src/CMakeFiles/cxxabi_shared.dir/cxa_demangle.cpp.o projects/libcxxabi/src/CMakeFiles/cxxabi_shared.dir/cxa_exception_storage.cpp.o projects/libcxxabi/src/CMakeFiles/cxxabi_shared.dir/cxa_guard.cpp.o projects/libcxxabi/src/CMakeFiles/cxxabi_shared.dir/cxa_handlers.cpp.o projects/libcxxabi/src/CMakeFiles/cxxabi_shared.dir/cxa_unexpected.cpp.o projects/libcxxabi/src/CMakeFiles/cxxabi_shared.dir/cxa_vector.cpp.o projects/libcxxabi/src/CMakeFiles/cxxabi_shared.dir/cxa_virtual.cpp.o projects/libcxxabi/src/CMakeFiles/cxxabi_shared.dir/stdlib_exception.cpp.o projects/libcxxabi/src/CMakeFiles/cxxabi_shared.dir/stdlib_stdexcept.cpp.o projects/libcxxabi/src/CMakeFiles/cxxabi_shared.dir/stdlib_typeinfo.cpp.o projects/libcxxabi/src/CMakeFiles/cxxabi_shared.dir/abort_message.cpp.o projects/libcxxabi/src/CMakeFiles/cxxabi_shared.dir/fallback_malloc.cpp.o projects/libcxxabi/src/CMakeFiles/cxxabi_shared.dir/private_typeinfo.cpp.o projects/libcxxabi/src/CMakeFiles/cxxabi_shared.dir/stdlib_new_delete.cpp.o projects/libcxxabi/src/CMakeFiles/cxxabi_shared.dir/cxa_exception.cpp.o projects/libcxxabi/src/CMakeFiles/cxxabi_shared.dir/cxa_personality.cpp.o  -Wl,-rpath,@loader_path/../lib -lpthread -lc -Wl,-exported_symbols_list,/Users/buildslave/jenkins/workspace/mr-clang-stage1-cmake-RA-expensive/llvm-project/libcxxabi/src/../lib/itanium-base.exp -Wl,-exported_symbols_list,/Users/buildslave/jenkins/workspace/mr-clang-stage1-cmake-RA-expensive/llvm-project/libcxxabi/src/../lib/new-delete.exp -Wl,-exported_symbols_list,/Users/buildslave/jenkins/workspace/mr-clang-stage1-cmake-RA-expensive/llvm-project/libcxxabi/src/../lib/personality-v0.exp && :
Undefined symbols for architecture x86_64:
  "__ZTIDu", referenced from:
     -exported_symbol[s_list] command line option
  "__ZTIPDu", referenced from:
     -exported_symbol[s_list] command line option
  "__ZTIPKDu", referenced from:
     -exported_symbol[s_list] command line option
  "__ZTSDu", referenced from:
     -exported_symbol[s_list] command line option
  "__ZTSPDu", referenced from:
     -exported_symbol[s_list] command line option
  "__ZTSPKDu", referenced from:
     -exported_symbol[s_list] command line option
ld: symbol(s) not found for architecture x86_64
clang: error: linker command failed with exit code 1 (use -v to see invocation)
[2568/4432] /Applications/Xcode.app/Contents/Developer/Toolchains/XcodeDefault.xctoolchain/usr/bin/c++  -DEXPENSIVE_CHECKS -DNDEBUG -D_GLIBCXX_DEBUG -D_LIBCPP_BUILDING_LIBRARY -D_LIBCPP_HAS_NO_PRAGMA_SYSTEM_HEADER -D__STDC_CONSTANT_MACROS -D__STDC_FORMAT_MACROS -D__STDC_LIMIT_MACROS -Iprojects/libcxx/src -I/Users/buildslave/jenkins/workspace/mr-clang-stage1-cmake-RA-expensive/llvm-project/libcxx/src -I/Applications/Xcode.app/Contents/Developer/Platforms/MacOSX.platform/Developer/SDKs/MacOSX10.14.sdk/usr/include/libxml2 -Iinclude -I/Users/buildslave/jenkins/workspace/mr-clang-stage1-cmake-RA-expensive/llvm-project/llvm/include -Iprojects/libcxx/include/c++build -I/Users/buildslave/jenkins/workspace/mr-clang-stage1-cmake-RA-expensive/llvm-project/libcxx/include -fPIC -fvisibility-inlines-hidden -Werror=date-time -Werror=unguarded-availability-new -std=c++11 -Wall -Wextra -Wno-unused-parameter -Wwrite-strings -Wcast-qual -Wmissing-field-initializers  -Wno-long-long -Wimplicit-fallthrough -Wcovered-switch-default -Wno-noexcept-type -Wnon-virtual-dtor -Wdelete-non-virtual-dtor -Wstring-conversion -fdiagnostics-color -O3  -isysroot /Applications/Xcode.app/Contents/Developer/Platforms/MacOSX.platform/Developer/SDKs/MacOSX10.14.sdk -fPIC    -DLIBCXX_BUILDING_LIBCXXABI -std=c++11 -nostdinc++ -fvisibility-inlines-hidden -Wall -Wextra -W -Wwrite-strings -Wno-unused-parameter -Wno-long-long -Werror=return-type -Wextra-semi -Wno-user-defined-literals -Wno-covered-switch-default -Wno-ignored-attributes -Wno-error -MD -MT projects/libcxx/src/CMakeFiles/cxx_shared.dir/thread.cpp.o -MF projects/libcxx/src/CMakeFiles/cxx_shared.dir/thread.cpp.o.d -o projects/libcxx/src/CMakeFiles/cxx_shared.dir/thread.cpp.o -c /Users/buildslave/jenkins/workspace/mr-clang-stage1-cmake-RA-expensive/llvm-project/libcxx/src/thread.cpp
[2569/4432] /Applications/Xcode.app/Contents/Developer/Toolchains/XcodeDefault.xctoolchain/usr/bin/c++  -DEXPENSIVE_CHECKS -DNDEBUG -D_GLIBCXX_DEBUG -D_LIBCPP_BUILDING_LIBRARY -D_LIBCPP_HAS_NO_PRAGMA_SYSTEM_HEADER -D__STDC_CONSTANT_MACROS -D__STDC_FORMAT_MACROS -D__STDC_LIMIT_MACROS -Iprojects/libcxx/src -I/Users/buildslave/jenkins/workspace/mr-clang-stage1-cmake-RA-expensive/llvm-project/libcxx/src -I/Applications/Xcode.app/Contents/Developer/Platforms/MacOSX.platform/Developer/SDKs/MacOSX10.14.sdk/usr/include/libxml2 -Iinclude -I/Users/buildslave/jenkins/workspace/mr-clang-stage1-cmake-RA-expensive/llvm-project/llvm/include -Iprojects/libcxx/include/c++build -I/Users/buildslave/jenkins/workspace/mr-clang-stage1-cmake-RA-expensive/llvm-project/libcxx/include -fPIC -fvisibility-inlines-hidden -Werror=date-time -Werror=unguarded-availability-new -std=c++11 -Wall -Wextra -Wno-unused-parameter -Wwrite-strings -Wcast-qual -Wmissing-field-initializers  -Wno-long-long -Wimplicit-fallthrough -Wcovered-switch-default -Wno-noexcept-type -Wnon-virtual-dtor -Wdelete-non-virtual-dtor -Wstring-conversion -fdiagnostics-color -O3  -isysroot /Applications/Xcode.app/Contents/Developer/Platforms/MacOSX.platform/Developer/SDKs/MacOSX10.14.sdk    -DLIBCXX_BUILDING_LIBCXXABI -std=c++11 -nostdinc++ -fvisibility-inlines-hidden -Wall -Wextra -W -Wwrite-strings -Wno-unused-parameter -Wno-long-long -Werror=return-type -Wextra-semi -Wno-user-defined-literals -Wno-covered-switch-default -Wno-ignored-attributes -Wno-error -MD -MT projects/libcxx/src/CMakeFiles/cxx_static.dir/filesystem/operations.cpp.o -MF projects/libcxx/src/CMakeFiles/cxx_static.dir/filesystem/operations.cpp.o.d -o projects/libcxx/src/CMakeFiles/cxx_static.dir/filesystem/operations.cpp.o -c /Users/buildslave/jenkins/workspace/mr-clang-stage1-cmake-RA-expensive/llvm-project/libcxx/src/filesystem/operations.cpp
[2570/4432] /Applications/Xcode.app/Contents/Developer/Toolchains/XcodeDefault.xctoolchain/usr/bin/c++  -DEXPENSIVE_CHECKS -DNDEBUG -D_GLIBCXX_DEBUG -D_LIBCPP_BUILDING_LIBRARY -D_LIBCPP_HAS_NO_PRAGMA_SYSTEM_HEADER -D__STDC_CONSTANT_MACROS -D__STDC_FORMAT_MACROS -D__STDC_LIMIT_MACROS -Iprojects/libcxx/src -I/Users/buildslave/jenkins/workspace/mr-clang-stage1-cmake-RA-expensive/llvm-project/libcxx/src -I/Applications/Xcode.app/Contents/Developer/Platforms/MacOSX.platform/Developer/SDKs/MacOSX10.14.sdk/usr/include/libxml2 -Iinclude -I/Users/buildslave/jenkins/workspace/mr-clang-stage1-cmake-RA-expensive/llvm-project/llvm/include -Iprojects/libcxx/include/c++build -I/Users/buildslave/jenkins/workspace/mr-clang-stage1-cmake-RA-expensive/llvm-project/libcxx/include -fPIC -fvisibility-inlines-hidden -Werror=date-time -Werror=unguarded-availability-new -std=c++11 -Wall -Wextra -Wno-unused-parameter -Wwrite-strings -Wcast-qual -Wmissing-field-initializers  -Wno-long-long -Wimplicit-fallthrough -Wcovered-switch-default -Wno-noexcept-type -Wnon-virtual-dtor -Wdelete-non-virtual-dtor -Wstring-conversion -fdiagnostics-color -O3  -isysroot /Applications/Xcode.app/Contents/Developer/Platforms/MacOSX.platform/Developer/SDKs/MacOSX10.14.sdk -fPIC    -DLIBCXX_BUILDING_LIBCXXABI -std=c++11 -nostdinc++ -fvisibility-inlines-hidden -Wall -Wextra -W -Wwrite-strings -Wno-unused-parameter -Wno-long-long -Werror=return-type -Wextra-semi -Wno-user-defined-literals -Wno-covered-switch-default -Wno-ignored-attributes -Wno-error -MD -MT projects/libcxx/src/CMakeFiles/cxx_shared.dir/ios.cpp.o -MF projects/libcxx/src/CMakeFiles/cxx_shared.dir/ios.cpp.o.d -o projects/libcxx/src/CMakeFiles/cxx_shared.dir/ios.cpp.o -c /Users/buildslave/jenkins/workspace/mr-clang-stage1-cmake-RA-expensive/llvm-project/libcxx/src/ios.cpp
[2571/4432] /Applications/Xcode.app/Contents/Developer/Toolchains/XcodeDefault.xctoolchain/usr/bin/c++  -DEXPENSIVE_CHECKS -D_DEBUG -D_GLIBCXX_DEBUG -D_LIBCPP_DISABLE_EXTERN_TEMPLATE -D_LIBCPP_ENABLE_CXX17_REMOVED_UNEXPECTED_FUNCTIONS -D_LIBCXXABI_BUILDING_LIBRARY -D__STDC_CONSTANT_MACROS -D__STDC_FORMAT_MACROS -D__STDC_LIMIT_MACROS -Iprojects/libcxxabi/src -I/Users/buildslave/jenkins/workspace/mr-clang-stage1-cmake-RA-expensive/llvm-project/libcxxabi/src -I/Applications/Xcode.app/Contents/Developer/Platforms/MacOSX.platform/Developer/SDKs/MacOSX10.14.sdk/usr/include/libxml2 -Iinclude -I/Users/buildslave/jenkins/workspace/mr-clang-stage1-cmake-RA-expensive/llvm-project/llvm/include -I/Users/buildslave/jenkins/workspace/mr-clang-stage1-cmake-RA-expensive/llvm-project/libcxxabi/include -I/Users/buildslave/jenkins/workspace/mr-clang-stage1-cmake-RA-expensive/llvm-project/libcxx/include -fPIC -fvisibility-inlines-hidden -Werror=date-time -Werror=unguarded-availability-new -std=c++11 -Wall -Wextra -Wno-unused-parameter -Wwrite-strings -Wcast-qual -Wmissing-field-initializers -pedantic -Wno-long-long -Wimplicit-fallthrough -Wcovered-switch-default -Wno-noexcept-type -Wnon-virtual-dtor -Wdelete-non-virtual-dtor -Wstring-conversion -fdiagnostics-color  -O3  -isysroot /Applications/Xcode.app/Contents/Developer/Platforms/MacOSX.platform/Developer/SDKs/MacOSX10.14.sdk -fPIC   -UNDEBUG -nostdinc++ -Werror=return-type -W -Wall -Wchar-subscripts -Wconversion -Wmismatched-tags -Wmissing-braces -Wnewline-eof -Wunused-function -Wshadow -Wshorten-64-to-32 -Wsign-compare -Wsign-conversion -Wstrict-aliasing=2 -Wstrict-overflow=4 -Wunused-parameter -Wunused-variable -Wwrite-strings -Wundef -Wno-error -pedantic -fstrict-aliasing -funwind-tables -D_DEBUG -UNDEBUG -std=c++11 -MD -MT projects/libcxxabi/src/CMakeFiles/cxxabi_static.dir/cxa_demangle.cpp.o -MF projects/libcxxabi/src/CMakeFiles/cxxabi_static.dir/cxa_demangle.cpp.o.d -o projects/libcxxabi/src/CMakeFiles/cxxabi_static.dir/cxa_demangle.cpp.o -c /Users/buildslave/jenkins/workspace/mr-clang-stage1-cmake-RA-expensive/llvm-project/libcxxabi/src/cxa_demangle.cpp
[2572/4432] /Applications/Xcode.app/Contents/Developer/Toolchains/XcodeDefault.xctoolchain/usr/bin/c++  -DEXPENSIVE_CHECKS -DNDEBUG -D_GLIBCXX_DEBUG -D_LIBCPP_BUILDING_LIBRARY -D_LIBCPP_HAS_NO_PRAGMA_SYSTEM_HEADER -D__STDC_CONSTANT_MACROS -D__STDC_FORMAT_MACROS -D__STDC_LIMIT_MACROS -Iprojects/libcxx/src -I/Users/buildslave/jenkins/workspace/mr-clang-stage1-cmake-RA-expensive/llvm-project/libcxx/src -I/Applications/Xcode.app/Contents/Developer/Platforms/MacOSX.platform/Developer/SDKs/MacOSX10.14.sdk/usr/include/libxml2 -Iinclude -I/Users/buildslave/jenkins/workspace/mr-clang-stage1-cmake-RA-expensive/llvm-project/llvm/include -Iprojects/libcxx/include/c++build -I/Users/buildslave/jenkins/workspace/mr-clang-stage1-cmake-RA-expensive/llvm-project/libcxx/include -fPIC -fvisibility-inlines-hidden -Werror=date-time -Werror=unguarded-availability-new -std=c++11 -Wall -Wextra -Wno-unused-parameter -Wwrite-strings -Wcast-qual -Wmissing-field-initializers  -Wno-long-long -Wimplicit-fallthrough -Wcovered-switch-default -Wno-noexcept-type -Wnon-virtual-dtor -Wdelete-non-virtual-dtor -Wstring-conversion -fdiagnostics-color -O3  -isysroot /Applications/Xcode.app/Contents/Developer/Platforms/MacOSX.platform/Developer/SDKs/MacOSX10.14.sdk -fPIC    -DLIBCXX_BUILDING_LIBCXXABI -std=c++11 -nostdinc++ -fvisibility-inlines-hidden -Wall -Wextra -W -Wwrite-strings -Wno-unused-parameter -Wno-long-long -Werror=return-type -Wextra-semi -Wno-user-defined-literals -Wno-covered-switch-default -Wno-ignored-attributes -Wno-error -MD -MT projects/libcxx/src/CMakeFiles/cxx_shared.dir/string.cpp.o -MF projects/libcxx/src/CMakeFiles/cxx_shared.dir/string.cpp.o.d -o projects/libcxx/src/CMakeFiles/cxx_shared.dir/string.cpp.o -c /Users/buildslave/jenkins/workspace/mr-clang-stage1-cmake-RA-expensive/llvm-project/libcxx/src/string.cpp
[2573/4432] /Applications/Xcode.app/Contents/Developer/Toolchains/XcodeDefault.xctoolchain/usr/bin/c++  -DEXPENSIVE_CHECKS -DNDEBUG -D_GLIBCXX_DEBUG -D_LIBCPP_BUILDING_LIBRARY -D_LIBCPP_HAS_NO_PRAGMA_SYSTEM_HEADER -D__STDC_CONSTANT_MACROS -D__STDC_FORMAT_MACROS -D__STDC_LIMIT_MACROS -Iprojects/libcxx/src -I/Users/buildslave/jenkins/workspace/mr-clang-stage1-cmake-RA-expensive/llvm-project/libcxx/src -I/Applications/Xcode.app/Contents/Developer/Platforms/MacOSX.platform/Developer/SDKs/MacOSX10.14.sdk/usr/include/libxml2 -Iinclude -I/Users/buildslave/jenkins/workspace/mr-clang-stage1-cmake-RA-expensive/llvm-project/llvm/include -Iprojects/libcxx/include/c++build -I/Users/buildslave/jenkins/workspace/mr-clang-stage1-cmake-RA-expensive/llvm-project/libcxx/include -fPIC -fvisibility-inlines-hidden -Werror=date-time -Werror=unguarded-availability-new -std=c++11 -Wall -Wextra -Wno-unused-parameter -Wwrite-strings -Wcast-qual -Wmissing-field-initializers  -Wno-long-long -Wimplicit-fallthrough -Wcovered-switch-default -Wno-noexcept-type -Wnon-virtual-dtor -Wdelete-non-virtual-dtor -Wstring-conversion -fdiagnostics-color -O3  -isysroot /Applications/Xcode.app/Contents/Developer/Platforms/MacOSX.platform/Developer/SDKs/MacOSX10.14.sdk -fPIC    -DLIBCXX_BUILDING_LIBCXXABI -std=c++11 -nostdinc++ -fvisibility-inlines-hidden -Wall -Wextra -W -Wwrite-strings -Wno-unused-parameter -Wno-long-long -Werror=return-type -Wextra-semi -Wno-user-defined-literals -Wno-covered-switch-default -Wno-ignored-attributes -Wno-error -MD -MT projects/libcxx/src/CMakeFiles/cxx_shared.dir/filesystem/directory_iterator.cpp.o -MF projects/libcxx/src/CMakeFiles/cxx_shared.dir/filesystem/directory_iterator.cpp.o.d -o projects/libcxx/src/CMakeFiles/cxx_shared.dir/filesystem/directory_iterator.cpp.o -c /Users/buildslave/jenkins/workspace/mr-clang-stage1-cmake-RA-expensive/llvm-project/libcxx/src/filesystem/directory_iterator.cpp
[2574/4432] /Applications/Xcode.app/Contents/Developer/Toolchains/XcodeDefault.xctoolchain/usr/bin/c++  -DEXPENSIVE_CHECKS -DGTEST_HAS_RTTI=0 -D_DEBUG -D_GLIBCXX_DEBUG -D_GNU_SOURCE -D__STDC_CONSTANT_MACROS -D__STDC_FORMAT_MACROS -D__STDC_LIMIT_MACROS -Itools/clang/utils/TableGen -I/Users/buildslave/jenkins/workspace/mr-clang-stage1-cmake-RA-expensive/llvm-project/clang/utils/TableGen -I/Users/buildslave/jenkins/workspace/mr-clang-stage1-cmake-RA-expensive/llvm-project/clang/include -Itools/clang/include -I/Applications/Xcode.app/Contents/Developer/Platforms/MacOSX.platform/Developer/SDKs/MacOSX10.14.sdk/usr/include/libxml2 -Iinclude -I/Users/buildslave/jenkins/workspace/mr-clang-stage1-cmake-RA-expensive/llvm-project/llvm/include -fPIC -fvisibility-inlines-hidden -Werror=date-time -Werror=unguarded-availability-new -std=c++11 -Wall -Wextra -Wno-unused-parameter -Wwrite-strings -Wcast-qual -Wmissing-field-initializers -pedantic -Wno-long-long -Wimplicit-fallthrough -Wcovered-switch-default -Wno-noexcept-type -Wnon-virtual-dtor -Wdelete-non-virtual-dtor -Wstring-conversion -fdiagnostics-color -fno-common -Woverloaded-virtual -Wno-nested-anon-types -O3  -isysroot /Applications/Xcode.app/Contents/Developer/Platforms/MacOSX.platform/Developer/SDKs/MacOSX10.14.sdk   -UNDEBUG  -fno-exceptions -fno-rtti -MD -MT tools/clang/utils/TableGen/CMakeFiles/clang-tblgen.dir/ClangASTNodesEmitter.cpp.o -MF tools/clang/utils/TableGen/CMakeFiles/clang-tblgen.dir/ClangASTNodesEmitter.cpp.o.d -o tools/clang/utils/TableGen/CMakeFiles/clang-tblgen.dir/ClangASTNodesEmitter.cpp.o -c /Users/buildslave/jenkins/workspace/mr-clang-stage1-cmake-RA-expensive/llvm-project/clang/utils/TableGen/ClangASTNodesEmitter.cpp
[2575/4432] /Applications/Xcode.app/Contents/Developer/Toolchains/XcodeDefault.xctoolchain/usr/bin/c++  -DEXPENSIVE_CHECKS -DNDEBUG -D_GLIBCXX_DEBUG -D_LIBCPP_BUILDING_LIBRARY -D_LIBCPP_HAS_NO_PRAGMA_SYSTEM_HEADER -D__STDC_CONSTANT_MACROS -D__STDC_FORMAT_MACROS -D__STDC_LIMIT_MACROS -Iprojects/libcxx/src -I/Users/buildslave/jenkins/workspace/mr-clang-stage1-cmake-RA-expensive/llvm-project/libcxx/src -I/Applications/Xcode.app/Contents/Developer/Platforms/MacOSX.platform/Developer/SDKs/MacOSX10.14.sdk/usr/include/libxml2 -Iinclude -I/Users/buildslave/jenkins/workspace/mr-clang-stage1-cmake-RA-expensive/llvm-project/llvm/include -Iprojects/libcxx/include/c++build -I/Users/buildslave/jenkins/workspace/mr-clang-stage1-cmake-RA-expensive/llvm-project/libcxx/include -fPIC -fvisibility-inlines-hidden -Werror=date-time -Werror=unguarded-availability-new -std=c++11 -Wall -Wextra -Wno-unused-parameter -Wwrite-strings -Wcast-qual -Wmissing-field-initializers  -Wno-long-long -Wimplicit-fallthrough -Wcovered-switch-default -Wno-noexcept-type -Wnon-virtual-dtor -Wdelete-non-virtual-dtor -Wstring-conversion -fdiagnostics-color -O3  -isysroot /Applications/Xcode.app/Contents/Developer/Platforms/MacOSX.platform/Developer/SDKs/MacOSX10.14.sdk -fPIC    -DLIBCXX_BUILDING_LIBCXXABI -std=c++11 -nostdinc++ -fvisibility-inlines-hidden -Wall -Wextra -W -Wwrite-strings -Wno-unused-parameter -Wno-long-long -Werror=return-type -Wextra-semi -Wno-user-defined-literals -Wno-covered-switch-default -Wno-ignored-attributes -Wno-error -MD -MT projects/libcxx/src/CMakeFiles/cxx_shared.dir/filesystem/operations.cpp.o -MF projects/libcxx/src/CMakeFiles/cxx_shared.dir/filesystem/operations.cpp.o.d -o projects/libcxx/src/CMakeFiles/cxx_shared.dir/filesystem/operations.cpp.o -c /Users/buildslave/jenkins/workspace/mr-clang-stage1-cmake-RA-expensive/llvm-project/libcxx/src/filesystem/operations.cpp
[2576/4432] /Applications/Xcode.app/Contents/Developer/Toolchains/XcodeDefault.xctoolchain/usr/bin/c++  -DEXPENSIVE_CHECKS -DGTEST_HAS_RTTI=0 -D_DEBUG -D_GLIBCXX_DEBUG -D__STDC_CONSTANT_MACROS -D__STDC_FORMAT_MACROS -D__STDC_LIMIT_MACROS -Itools/lto -I/Users/buildslave/jenkins/workspace/mr-clang-stage1-cmake-RA-expensive/llvm-project/llvm/tools/lto -I/Applications/Xcode.app/Contents/Developer/Platforms/MacOSX.platform/Developer/SDKs/MacOSX10.14.sdk/usr/include/libxml2 -Iinclude -I/Users/buildslave/jenkins/workspace/mr-clang-stage1-cmake-RA-expensive/llvm-project/llvm/include -fPIC -fvisibility-inlines-hidden -Werror=date-time -Werror=unguarded-availability-new -std=c++11 -Wall -Wextra -Wno-unused-parameter -Wwrite-strings -Wcast-qual -Wmissing-field-initializers -pedantic -Wno-long-long -Wimplicit-fallthrough -Wcovered-switch-default -Wno-noexcept-type -Wnon-virtual-dtor -Wdelete-non-virtual-dtor -Wstring-conversion -fdiagnostics-color -O3  -isysroot /Applications/Xcode.app/Contents/Developer/Platforms/MacOSX.platform/Developer/SDKs/MacOSX10.14.sdk -fPIC   -UNDEBUG  -fno-exceptions -fno-rtti -MD -MT tools/lto/CMakeFiles/LTO.dir/lto.cpp.o -MF tools/lto/CMakeFiles/LTO.dir/lto.cpp.o.d -o tools/lto/CMakeFiles/LTO.dir/lto.cpp.o -c /Users/buildslave/jenkins/workspace/mr-clang-stage1-cmake-RA-expensive/llvm-project/llvm/tools/lto/lto.cpp
[2577/4432] /Applications/Xcode.app/Contents/Developer/Toolchains/XcodeDefault.xctoolchain/usr/bin/c++  -DCMAKE_CFG_INTDIR=\".\" -DEXPENSIVE_CHECKS -DGTEST_HAS_RTTI=0 -D_DEBUG -D_GLIBCXX_DEBUG -D__STDC_CONSTANT_MACROS -D__STDC_FORMAT_MACROS -D__STDC_LIMIT_MACROS -Itools/llvm-config -I/Users/buildslave/jenkins/workspace/mr-clang-stage1-cmake-RA-expensive/llvm-project/llvm/tools/llvm-config -I/Applications/Xcode.app/Contents/Developer/Platforms/MacOSX.platform/Developer/SDKs/MacOSX10.14.sdk/usr/include/libxml2 -Iinclude -I/Users/buildslave/jenkins/workspace/mr-clang-stage1-cmake-RA-expensive/llvm-project/llvm/include -fPIC -fvisibility-inlines-hidden -Werror=date-time -Werror=unguarded-availability-new -std=c++11 -Wall -Wextra -Wno-unused-parameter -Wwrite-strings -Wcast-qual -Wmissing-field-initializers -pedantic -Wno-long-long -Wimplicit-fallthrough -Wcovered-switch-default -Wno-noexcept-type -Wnon-virtual-dtor -Wdelete-non-virtual-dtor -Wstring-conversion -fdiagnostics-color -O3  -isysroot /Applications/Xcode.app/Contents/Developer/Platforms/MacOSX.platform/Developer/SDKs/MacOSX10.14.sdk   -UNDEBUG  -fno-exceptions -fno-rtti -MD -MT tools/llvm-config/CMakeFiles/llvm-config.dir/llvm-config.cpp.o -MF tools/llvm-config/CMakeFiles/llvm-config.dir/llvm-config.cpp.o.d -o tools/llvm-config/CMakeFiles/llvm-config.dir/llvm-config.cpp.o -c /Users/buildslave/jenkins/workspace/mr-clang-stage1-cmake-RA-expensive/llvm-project/llvm/tools/llvm-config/llvm-config.cpp
[2578/4432] /Applications/Xcode.app/Contents/Developer/Toolchains/XcodeDefault.xctoolchain/usr/bin/c++  -DEXPENSIVE_CHECKS -DGTEST_HAS_RTTI=0 -D_DEBUG -D_GLIBCXX_DEBUG -D__STDC_CONSTANT_MACROS -D__STDC_FORMAT_MACROS -D__STDC_LIMIT_MACROS -Itools/llvm-ar -I/Users/buildslave/jenkins/workspace/mr-clang-stage1-cmake-RA-expensive/llvm-project/llvm/tools/llvm-ar -I/Applications/Xcode.app/Contents/Developer/Platforms/MacOSX.platform/Developer/SDKs/MacOSX10.14.sdk/usr/include/libxml2 -Iinclude -I/Users/buildslave/jenkins/workspace/mr-clang-stage1-cmake-RA-expensive/llvm-project/llvm/include -fPIC -fvisibility-inlines-hidden -Werror=date-time -Werror=unguarded-availability-new -std=c++11 -Wall -Wextra -Wno-unused-parameter -Wwrite-strings -Wcast-qual -Wmissing-field-initializers -pedantic -Wno-long-long -Wimplicit-fallthrough -Wcovered-switch-default -Wno-noexcept-type -Wnon-virtual-dtor -Wdelete-non-virtual-dtor -Wstring-conversion -fdiagnostics-color -O3  -isysroot /Applications/Xcode.app/Contents/Developer/Platforms/MacOSX.platform/Developer/SDKs/MacOSX10.14.sdk   -UNDEBUG  -fno-exceptions -fno-rtti -MD -MT tools/llvm-ar/CMakeFiles/llvm-ar.dir/llvm-ar.cpp.o -MF tools/llvm-ar/CMakeFiles/llvm-ar.dir/llvm-ar.cpp.o.d -o tools/llvm-ar/CMakeFiles/llvm-ar.dir/llvm-ar.cpp.o -c /Users/buildslave/jenkins/workspace/mr-clang-stage1-cmake-RA-expensive/llvm-project/llvm/tools/llvm-ar/llvm-ar.cpp
[2579/4432] /Applications/Xcode.app/Contents/Developer/Toolchains/XcodeDefault.xctoolchain/usr/bin/c++  -DEXPENSIVE_CHECKS -DNDEBUG -D_GLIBCXX_DEBUG -D_LIBCPP_BUILDING_LIBRARY -D_LIBCPP_HAS_NO_PRAGMA_SYSTEM_HEADER -D__STDC_CONSTANT_MACROS -D__STDC_FORMAT_MACROS -D__STDC_LIMIT_MACROS -Iprojects/libcxx/src -I/Users/buildslave/jenkins/workspace/mr-clang-stage1-cmake-RA-expensive/llvm-project/libcxx/src -I/Applications/Xcode.app/Contents/Developer/Platforms/MacOSX.platform/Developer/SDKs/MacOSX10.14.sdk/usr/include/libxml2 -Iinclude -I/Users/buildslave/jenkins/workspace/mr-clang-stage1-cmake-RA-expensive/llvm-project/llvm/include -Iprojects/libcxx/include/c++build -I/Users/buildslave/jenkins/workspace/mr-clang-stage1-cmake-RA-expensive/llvm-project/libcxx/include -fPIC -fvisibility-inlines-hidden -Werror=date-time -Werror=unguarded-availability-new -std=c++11 -Wall -Wextra -Wno-unused-parameter -Wwrite-strings -Wcast-qual -Wmissing-field-initializers  -Wno-long-long -Wimplicit-fallthrough -Wcovered-switch-default -Wno-noexcept-type -Wnon-virtual-dtor -Wdelete-non-virtual-dtor -Wstring-conversion -fdiagnostics-color -O3  -isysroot /Applications/Xcode.app/Contents/Developer/Platforms/MacOSX.platform/Developer/SDKs/MacOSX10.14.sdk    -DLIBCXX_BUILDING_LIBCXXABI -std=c++11 -nostdinc++ -fvisibility-inlines-hidden -Wall -Wextra -W -Wwrite-strings -Wno-unused-parameter -Wno-long-long -Werror=return-type -Wextra-semi -Wno-user-defined-literals -Wno-covered-switch-default -Wno-ignored-attributes -Wno-error -MD -MT projects/libcxx/src/CMakeFiles/cxx_static.dir/locale.cpp.o -MF projects/libcxx/src/CMakeFiles/cxx_static.dir/locale.cpp.o.d -o projects/libcxx/src/CMakeFiles/cxx_static.dir/locale.cpp.o -c /Users/buildslave/jenkins/workspace/mr-clang-stage1-cmake-RA-expensive/llvm-project/libcxx/src/locale.cpp
[2580/4432] /Applications/Xcode.app/Contents/Developer/Toolchains/XcodeDefault.xctoolchain/usr/bin/c++  -DEXPENSIVE_CHECKS -DNDEBUG -D_GLIBCXX_DEBUG -D_LIBCPP_BUILDING_LIBRARY -D_LIBCPP_HAS_NO_PRAGMA_SYSTEM_HEADER -D__STDC_CONSTANT_MACROS -D__STDC_FORMAT_MACROS -D__STDC_LIMIT_MACROS -Iprojects/libcxx/src -I/Users/buildslave/jenkins/workspace/mr-clang-stage1-cmake-RA-expensive/llvm-project/libcxx/src -I/Applications/Xcode.app/Contents/Developer/Platforms/MacOSX.platform/Developer/SDKs/MacOSX10.14.sdk/usr/include/libxml2 -Iinclude -I/Users/buildslave/jenkins/workspace/mr-clang-stage1-cmake-RA-expensive/llvm-project/llvm/include -Iprojects/libcxx/include/c++build -I/Users/buildslave/jenkins/workspace/mr-clang-stage1-cmake-RA-expensive/llvm-project/libcxx/include -fPIC -fvisibility-inlines-hidden -Werror=date-time -Werror=unguarded-availability-new -std=c++11 -Wall -Wextra -Wno-unused-parameter -Wwrite-strings -Wcast-qual -Wmissing-field-initializers  -Wno-long-long -Wimplicit-fallthrough -Wcovered-switch-default -Wno-noexcept-type -Wnon-virtual-dtor -Wdelete-non-virtual-dtor -Wstring-conversion -fdiagnostics-color -O3  -isysroot /Applications/Xcode.app/Contents/Developer/Platforms/MacOSX.platform/Developer/SDKs/MacOSX10.14.sdk -fPIC    -DLIBCXX_BUILDING_LIBCXXABI -std=c++11 -nostdinc++ -fvisibility-inlines-hidden -Wall -Wextra -W -Wwrite-strings -Wno-unused-parameter -Wno-long-long -Werror=return-type -Wextra-semi -Wno-user-defined-literals -Wno-covered-switch-default -Wno-ignored-attributes -Wno-error -MD -MT projects/libcxx/src/CMakeFiles/cxx_shared.dir/locale.cpp.o -MF projects/libcxx/src/CMakeFiles/cxx_shared.dir/locale.cpp.o.d -o projects/libcxx/src/CMakeFiles/cxx_shared.dir/locale.cpp.o -c /Users/buildslave/jenkins/workspace/mr-clang-stage1-cmake-RA-expensive/llvm-project/libcxx/src/locale.cpp
[2581/4432] /Applications/Xcode.app/Contents/Developer/Toolchains/XcodeDefault.xctoolchain/usr/bin/c++  -DEXPENSIVE_CHECKS -DGTEST_HAS_RTTI=0 -D_DEBUG -D_GLIBCXX_DEBUG -D__STDC_CONSTANT_MACROS -D__STDC_FORMAT_MACROS -D__STDC_LIMIT_MACROS -Itools/llvm-profdata -I/Users/buildslave/jenkins/workspace/mr-clang-stage1-cmake-RA-expensive/llvm-project/llvm/tools/llvm-profdata -I/Applications/Xcode.app/Contents/Developer/Platforms/MacOSX.platform/Developer/SDKs/MacOSX10.14.sdk/usr/include/libxml2 -Iinclude -I/Users/buildslave/jenkins/workspace/mr-clang-stage1-cmake-RA-expensive/llvm-project/llvm/include -fPIC -fvisibility-inlines-hidden -Werror=date-time -Werror=unguarded-availability-new -std=c++11 -Wall -Wextra -Wno-unused-parameter -Wwrite-strings -Wcast-qual -Wmissing-field-initializers -pedantic -Wno-long-long -Wimplicit-fallthrough -Wcovered-switch-default -Wno-noexcept-type -Wnon-virtual-dtor -Wdelete-non-virtual-dtor -Wstring-conversion -fdiagnostics-color -O3  -isysroot /Applications/Xcode.app/Contents/Developer/Platforms/MacOSX.platform/Developer/SDKs/MacOSX10.14.sdk   -UNDEBUG  -fno-exceptions -fno-rtti -MD -MT tools/llvm-profdata/CMakeFiles/llvm-profdata.dir/llvm-profdata.cpp.o -MF tools/llvm-profdata/CMakeFiles/llvm-profdata.dir/llvm-profdata.cpp.o.d -o tools/llvm-profdata/CMakeFiles/llvm-profdata.dir/llvm-profdata.cpp.o -c /Users/buildslave/jenkins/workspace/mr-clang-stage1-cmake-RA-expensive/llvm-project/llvm/tools/llvm-profdata/llvm-profdata.cpp
[2582/4432] /Applications/Xcode.app/Contents/Developer/Toolchains/XcodeDefault.xctoolchain/usr/bin/c++  -DEXPENSIVE_CHECKS -DGTEST_HAS_RTTI=0 -D_DEBUG -D_GLIBCXX_DEBUG -D__STDC_CONSTANT_MACROS -D__STDC_FORMAT_MACROS -D__STDC_LIMIT_MACROS -Itools/llvm-lto -I/Users/buildslave/jenkins/workspace/mr-clang-stage1-cmake-RA-expensive/llvm-project/llvm/tools/llvm-lto -I/Applications/Xcode.app/Contents/Developer/Platforms/MacOSX.platform/Developer/SDKs/MacOSX10.14.sdk/usr/include/libxml2 -Iinclude -I/Users/buildslave/jenkins/workspace/mr-clang-stage1-cmake-RA-expensive/llvm-project/llvm/include -fPIC -fvisibility-inlines-hidden -Werror=date-time -Werror=unguarded-availability-new -std=c++11 -Wall -Wextra -Wno-unused-parameter -Wwrite-strings -Wcast-qual -Wmissing-field-initializers -pedantic -Wno-long-long -Wimplicit-fallthrough -Wcovered-switch-default -Wno-noexcept-type -Wnon-virtual-dtor -Wdelete-non-virtual-dtor -Wstring-conversion -fdiagnostics-color -O3  -isysroot /Applications/Xcode.app/Contents/Developer/Platforms/MacOSX.platform/Developer/SDKs/MacOSX10.14.sdk   -UNDEBUG  -fno-exceptions -fno-rtti -MD -MT tools/llvm-lto/CMakeFiles/llvm-lto.dir/llvm-lto.cpp.o -MF tools/llvm-lto/CMakeFiles/llvm-lto.dir/llvm-lto.cpp.o.d -o tools/llvm-lto/CMakeFiles/llvm-lto.dir/llvm-lto.cpp.o -c /Users/buildslave/jenkins/workspace/mr-clang-stage1-cmake-RA-expensive/llvm-project/llvm/tools/llvm-lto/llvm-lto.cpp
[2583/4432] /Applications/Xcode.app/Contents/Developer/Toolchains/XcodeDefault.xctoolchain/usr/bin/c++  -DEXPENSIVE_CHECKS -DGTEST_HAS_RTTI=0 -D_DEBUG -D_GLIBCXX_DEBUG -D__STDC_CONSTANT_MACROS -D__STDC_FORMAT_MACROS -D__STDC_LIMIT_MACROS -Ilib/Target/X86 -I/Users/buildslave/jenkins/workspace/mr-clang-stage1-cmake-RA-expensive/llvm-project/llvm/lib/Target/X86 -I/Applications/Xcode.app/Contents/Developer/Platforms/MacOSX.platform/Developer/SDKs/MacOSX10.14.sdk/usr/include/libxml2 -Iinclude -I/Users/buildslave/jenkins/workspace/mr-clang-stage1-cmake-RA-expensive/llvm-project/llvm/include -fPIC -fvisibility-inlines-hidden -Werror=date-time -Werror=unguarded-availability-new -std=c++11 -Wall -Wextra -Wno-unused-parameter -Wwrite-strings -Wcast-qual -Wmissing-field-initializers -pedantic -Wno-long-long -Wimplicit-fallthrough -Wcovered-switch-default -Wno-noexcept-type -Wnon-virtual-dtor -Wdelete-non-virtual-dtor -Wstring-conversion -fdiagnostics-color -O3  -isysroot /Applications/Xcode.app/Contents/Developer/Platforms/MacOSX.platform/Developer/SDKs/MacOSX10.14.sdk   -UNDEBUG  -fno-exceptions -fno-rtti -MD -MT lib/Target/X86/CMakeFiles/LLVMX86CodeGen.dir/X86ISelLowering.cpp.o -MF lib/Target/X86/CMakeFiles/LLVMX86CodeGen.dir/X86ISelLowering.cpp.o.d -o lib/Target/X86/CMakeFiles/LLVMX86CodeGen.dir/X86ISelLowering.cpp.o -c /Users/buildslave/jenkins/workspace/mr-clang-stage1-cmake-RA-expensive/llvm-project/llvm/lib/Target/X86/X86ISelLowering.cpp
[2584/4432] /Applications/Xcode.app/Contents/Developer/Toolchains/XcodeDefault.xctoolchain/usr/bin/c++  -DEXPENSIVE_CHECKS -DGTEST_HAS_RTTI=0 -D_DEBUG -D_GLIBCXX_DEBUG -D__STDC_CONSTANT_MACROS -D__STDC_FORMAT_MACROS -D__STDC_LIMIT_MACROS -Ilib/Passes -I/Users/buildslave/jenkins/workspace/mr-clang-stage1-cmake-RA-expensive/llvm-project/llvm/lib/Passes -I/Applications/Xcode.app/Contents/Developer/Platforms/MacOSX.platform/Developer/SDKs/MacOSX10.14.sdk/usr/include/libxml2 -Iinclude -I/Users/buildslave/jenkins/workspace/mr-clang-stage1-cmake-RA-expensive/llvm-project/llvm/include -fPIC -fvisibility-inlines-hidden -Werror=date-time -Werror=unguarded-availability-new -std=c++11 -Wall -Wextra -Wno-unused-parameter -Wwrite-strings -Wcast-qual -Wmissing-field-initializers -pedantic -Wno-long-long -Wimplicit-fallthrough -Wcovered-switch-default -Wno-noexcept-type -Wnon-virtual-dtor -Wdelete-non-virtual-dtor -Wstring-conversion -fdiagnostics-color -O3  -isysroot /Applications/Xcode.app/Contents/Developer/Platforms/MacOSX.platform/Developer/SDKs/MacOSX10.14.sdk   -UNDEBUG  -fno-exceptions -fno-rtti -MD -MT lib/Passes/CMakeFiles/LLVMPasses.dir/PassBuilder.cpp.o -MF lib/Passes/CMakeFiles/LLVMPasses.dir/PassBuilder.cpp.o.d -o lib/Passes/CMakeFiles/LLVMPasses.dir/PassBuilder.cpp.o -c /Users/buildslave/jenkins/workspace/mr-clang-stage1-cmake-RA-expensive/llvm-project/llvm/lib/Passes/PassBuilder.cpp
ninja: build stopped: subcommand failed.
Command failed 
Command: ['/usr/local/bin/ninja', '-v', 'all']
[Pipeline] }
[Pipeline] // timeout
[Pipeline] }
[Pipeline] // stage
[Pipeline] stage
[Pipeline] { (Test)
Stage "Test" skipped due to earlier failure(s)
[Pipeline] }
[Pipeline] // stage
[Pipeline] }
[Pipeline] // node
[Pipeline] End of Pipeline
[BFA] Scanning build for known causes...
[BFA] Found failure cause(s):
[BFA] Ninja target failed from category Compile
[BFA] Compile Error from category Compile
[BFA] Link error
[BFA] Done. 0s
ERROR: script returned exit code 1
Finished: FAILURE