Started 1 hr 8 min ago
Took 1 hr 7 min

Failed Build clang-d331631-g52f3a2faf92-t3716-b3716.tar.gz (Nov 12, 2019 2:10:30 AM)

Issues

Found 4 issues:
Ninja target: aarch64_neon_intrinsics.c.o
[8578/8583] /Users/buildslave/jenkins/workspace/test-suite-verify-machineinstrs-aarch64-O0-g/test-suite-build/tools/timeit --summary SingleSource/Regression/C++/EH/CMakeFiles/Regression-C++-class_hierarchy.dir/class_hierarchy.cpp.o.time /Users/buildslave/jenkins/workspace/test-suite-verify-machineinstrs-aarch64-O0-g/compiler/bin/clang++  -DNDEBUG  -B /Applications/Xcode.app/Contents/Developer/Toolchains/XcodeDefault.xctoolchain/usr/bin    -Wno-unused-command-line-argument -mllvm -verify-machineinstrs -O0 -g -arch arm64 -isysroot /Applications/Xcode.app/Contents/Developer/Platforms/iPhoneOS.platform/Developer/SDKs/iPhoneOS12.1.sdk   -w -Werror=date-time -MD -MT SingleSource/Regression/C++/EH/CMakeFiles/Regression-C++-class_hierarchy.dir/class_hierarchy.cpp.o -MF SingleSource/Regression/C++/EH/CMakeFiles/Regression-C++-class_hierarchy.dir/class_hierarchy.cpp.o.d -o SingleSource/Regression/C++/EH/CMakeFiles/Regression-C++-class_hierarchy.dir/class_hierarchy.cpp.o -c /Users/buildslave/jenkins/workspace/test-suite-verify-machineinstrs-aarch64-O0-g/test-suite/SingleSource/Regression/C++/EH/class_hierarchy.cpp
[8579/8583] : && /Users/buildslave/jenkins/workspace/test-suite-verify-machineinstrs-aarch64-O0-g/test-suite-build/tools/timeit --summary SingleSource/Regression/C++/EH/Regression-C++-class_hierarchy.link.time /Users/buildslave/jenkins/workspace/test-suite-verify-machineinstrs-aarch64-O0-g/compiler/bin/clang++  -B /Applications/Xcode.app/Contents/Developer/Toolchains/XcodeDefault.xctoolchain/usr/bin    -Wno-unused-command-line-argument -mllvm -verify-machineinstrs -O0 -g -arch arm64 -isysroot /Applications/Xcode.app/Contents/Developer/Platforms/iPhoneOS.platform/Developer/SDKs/iPhoneOS12.1.sdk -Wl,-search_paths_first -Wl,-headerpad_max_install_names -B /Applications/Xcode.app/Contents/Developer/Toolchains/XcodeDefault.xctoolchain/usr/bin SingleSource/Regression/C++/EH/CMakeFiles/Regression-C++-class_hierarchy.dir/class_hierarchy.cpp.o  -o SingleSource/Regression/C++/EH/Regression-C++-class_hierarchy  -lstdc++ && cd /Users/buildslave/jenkins/workspace/test-suite-verify-machineinstrs-aarch64-O0-g/test-suite-build/SingleSource/Regression/C++/EH && /usr/local/Cellar/cmake/3.13.1/bin/cmake -E create_symlink /Users/buildslave/jenkins/workspace/test-suite-verify-machineinstrs-aarch64-O0-g/test-suite/SingleSource/Regression/C++/EH/class_hierarchy.reference_output /Users/buildslave/jenkins/workspace/test-suite-verify-machineinstrs-aarch64-O0-g/test-suite-build/SingleSource/Regression/C++/EH/class_hierarchy.reference_output
[8580/8583] /Users/buildslave/jenkins/workspace/test-suite-verify-machineinstrs-aarch64-O0-g/test-suite-build/tools/timeit --summary SingleSource/Regression/C++/CMakeFiles/Regression-C++-ofstream_ctor.dir/ofstream_ctor.cpp.o.time /Users/buildslave/jenkins/workspace/test-suite-verify-machineinstrs-aarch64-O0-g/compiler/bin/clang++  -DNDEBUG  -B /Applications/Xcode.app/Contents/Developer/Toolchains/XcodeDefault.xctoolchain/usr/bin    -Wno-unused-command-line-argument -mllvm -verify-machineinstrs -O0 -g -arch arm64 -isysroot /Applications/Xcode.app/Contents/Developer/Platforms/iPhoneOS.platform/Developer/SDKs/iPhoneOS12.1.sdk   -w -Werror=date-time -MD -MT SingleSource/Regression/C++/CMakeFiles/Regression-C++-ofstream_ctor.dir/ofstream_ctor.cpp.o -MF SingleSource/Regression/C++/CMakeFiles/Regression-C++-ofstream_ctor.dir/ofstream_ctor.cpp.o.d -o SingleSource/Regression/C++/CMakeFiles/Regression-C++-ofstream_ctor.dir/ofstream_ctor.cpp.o -c /Users/buildslave/jenkins/workspace/test-suite-verify-machineinstrs-aarch64-O0-g/test-suite/SingleSource/Regression/C++/ofstream_ctor.cpp
[8581/8583] : && /Users/buildslave/jenkins/workspace/test-suite-verify-machineinstrs-aarch64-O0-g/test-suite-build/tools/timeit --summary SingleSource/Regression/C++/Regression-C++-ofstream_ctor.link.time /Users/buildslave/jenkins/workspace/test-suite-verify-machineinstrs-aarch64-O0-g/compiler/bin/clang++  -B /Applications/Xcode.app/Contents/Developer/Toolchains/XcodeDefault.xctoolchain/usr/bin    -Wno-unused-command-line-argument -mllvm -verify-machineinstrs -O0 -g -arch arm64 -isysroot /Applications/Xcode.app/Contents/Developer/Platforms/iPhoneOS.platform/Developer/SDKs/iPhoneOS12.1.sdk -Wl,-search_paths_first -Wl,-headerpad_max_install_names -B /Applications/Xcode.app/Contents/Developer/Toolchains/XcodeDefault.xctoolchain/usr/bin SingleSource/Regression/C++/CMakeFiles/Regression-C++-ofstream_ctor.dir/ofstream_ctor.cpp.o  -o SingleSource/Regression/C++/Regression-C++-ofstream_ctor  -lstdc++ && cd /Users/buildslave/jenkins/workspace/test-suite-verify-machineinstrs-aarch64-O0-g/test-suite-build/SingleSource/Regression/C++ && /usr/local/Cellar/cmake/3.13.1/bin/cmake -E create_symlink /Users/buildslave/jenkins/workspace/test-suite-verify-machineinstrs-aarch64-O0-g/test-suite/SingleSource/Regression/C++/ofstream_ctor.reference_output /Users/buildslave/jenkins/workspace/test-suite-verify-machineinstrs-aarch64-O0-g/test-suite-build/SingleSource/Regression/C++/ofstream_ctor.reference_output
[8582/8583] /Users/buildslave/jenkins/workspace/test-suite-verify-machineinstrs-aarch64-O0-g/test-suite-build/tools/timeit --summary SingleSource/UnitTests/Vector/AArch64/CMakeFiles/aarch64_neon_intrinsics.dir/aarch64_neon_intrinsics.c.o.time /Users/buildslave/jenkins/workspace/test-suite-verify-machineinstrs-aarch64-O0-g/compiler/bin/clang -DNDEBUG  -B /Applications/Xcode.app/Contents/Developer/Toolchains/XcodeDefault.xctoolchain/usr/bin    -Wno-unused-command-line-argument -mllvm -verify-machineinstrs -O0 -g -arch arm64 -isysroot /Applications/Xcode.app/Contents/Developer/Platforms/iPhoneOS.platform/Developer/SDKs/iPhoneOS12.1.sdk   -w -Werror=date-time -std=c99 -MD -MT SingleSource/UnitTests/Vector/AArch64/CMakeFiles/aarch64_neon_intrinsics.dir/aarch64_neon_intrinsics.c.o -MF SingleSource/UnitTests/Vector/AArch64/CMakeFiles/aarch64_neon_intrinsics.dir/aarch64_neon_intrinsics.c.o.d -o SingleSource/UnitTests/Vector/AArch64/CMakeFiles/aarch64_neon_intrinsics.dir/aarch64_neon_intrinsics.c.o   -c /Users/buildslave/jenkins/workspace/test-suite-verify-machineinstrs-aarch64-O0-g/test-suite/SingleSource/UnitTests/Vector/AArch64/aarch64_neon_intrinsics.c
FAILED: SingleSource/UnitTests/Vector/AArch64/CMakeFiles/aarch64_neon_intrinsics.dir/aarch64_neon_intrinsics.c.o 
/Users/buildslave/jenkins/workspace/test-suite-verify-machineinstrs-aarch64-O0-g/test-suite-build/tools/timeit --summary SingleSource/UnitTests/Vector/AArch64/CMakeFiles/aarch64_neon_intrinsics.dir/aarch64_neon_intrinsics.c.o.time /Users/buildslave/jenkins/workspace/test-suite-verify-machineinstrs-aarch64-O0-g/compiler/bin/clang -DNDEBUG  -B /Applications/Xcode.app/Contents/Developer/Toolchains/XcodeDefault.xctoolchain/usr/bin    -Wno-unused-command-line-argument -mllvm -verify-machineinstrs -O0 -g -arch arm64 -isysroot /Applications/Xcode.app/Contents/Developer/Platforms/iPhoneOS.platform/Developer/SDKs/iPhoneOS12.1.sdk   -w -Werror=date-time -std=c99 -MD -MT SingleSource/UnitTests/Vector/AArch64/CMakeFiles/aarch64_neon_intrinsics.dir/aarch64_neon_intrinsics.c.o -MF SingleSource/UnitTests/Vector/AArch64/CMakeFiles/aarch64_neon_intrinsics.dir/aarch64_neon_intrinsics.c.o.d -o SingleSource/UnitTests/Vector/AArch64/CMakeFiles/aarch64_neon_intrinsics.dir/aarch64_neon_intrinsics.c.o   -c /Users/buildslave/jenkins/workspace/test-suite-verify-machineinstrs-aarch64-O0-g/test-suite/SingleSource/UnitTests/Vector/AArch64/aarch64_neon_intrinsics.c
Assertion failed: (IsVector && "cannot get number of elements on scalar/aggregate"), function getNumElements, file /Users/buildslave/jenkins/workspace/clang-stage1-RA/llvm-project/llvm/include/llvm/Support/LowLevelTypeImpl.h, line 100.
assertion: IsVector && "cannot get number of elements on scalar/aggregate"
[8580/8583] /Users/buildslave/jenkins/workspace/test-suite-verify-machineinstrs-aarch64-O0-g/test-suite-build/tools/timeit --summary SingleSource/Regression/C++/CMakeFiles/Regression-C++-ofstream_ctor.dir/ofstream_ctor.cpp.o.time /Users/buildslave/jenkins/workspace/test-suite-verify-machineinstrs-aarch64-O0-g/compiler/bin/clang++  -DNDEBUG  -B /Applications/Xcode.app/Contents/Developer/Toolchains/XcodeDefault.xctoolchain/usr/bin    -Wno-unused-command-line-argument -mllvm -verify-machineinstrs -O0 -g -arch arm64 -isysroot /Applications/Xcode.app/Contents/Developer/Platforms/iPhoneOS.platform/Developer/SDKs/iPhoneOS12.1.sdk   -w -Werror=date-time -MD -MT SingleSource/Regression/C++/CMakeFiles/Regression-C++-ofstream_ctor.dir/ofstream_ctor.cpp.o -MF SingleSource/Regression/C++/CMakeFiles/Regression-C++-ofstream_ctor.dir/ofstream_ctor.cpp.o.d -o SingleSource/Regression/C++/CMakeFiles/Regression-C++-ofstream_ctor.dir/ofstream_ctor.cpp.o -c /Users/buildslave/jenkins/workspace/test-suite-verify-machineinstrs-aarch64-O0-g/test-suite/SingleSource/Regression/C++/ofstream_ctor.cpp
[8581/8583] : && /Users/buildslave/jenkins/workspace/test-suite-verify-machineinstrs-aarch64-O0-g/test-suite-build/tools/timeit --summary SingleSource/Regression/C++/Regression-C++-ofstream_ctor.link.time /Users/buildslave/jenkins/workspace/test-suite-verify-machineinstrs-aarch64-O0-g/compiler/bin/clang++  -B /Applications/Xcode.app/Contents/Developer/Toolchains/XcodeDefault.xctoolchain/usr/bin    -Wno-unused-command-line-argument -mllvm -verify-machineinstrs -O0 -g -arch arm64 -isysroot /Applications/Xcode.app/Contents/Developer/Platforms/iPhoneOS.platform/Developer/SDKs/iPhoneOS12.1.sdk -Wl,-search_paths_first -Wl,-headerpad_max_install_names -B /Applications/Xcode.app/Contents/Developer/Toolchains/XcodeDefault.xctoolchain/usr/bin SingleSource/Regression/C++/CMakeFiles/Regression-C++-ofstream_ctor.dir/ofstream_ctor.cpp.o  -o SingleSource/Regression/C++/Regression-C++-ofstream_ctor  -lstdc++ && cd /Users/buildslave/jenkins/workspace/test-suite-verify-machineinstrs-aarch64-O0-g/test-suite-build/SingleSource/Regression/C++ && /usr/local/Cellar/cmake/3.13.1/bin/cmake -E create_symlink /Users/buildslave/jenkins/workspace/test-suite-verify-machineinstrs-aarch64-O0-g/test-suite/SingleSource/Regression/C++/ofstream_ctor.reference_output /Users/buildslave/jenkins/workspace/test-suite-verify-machineinstrs-aarch64-O0-g/test-suite-build/SingleSource/Regression/C++/ofstream_ctor.reference_output
[8582/8583] /Users/buildslave/jenkins/workspace/test-suite-verify-machineinstrs-aarch64-O0-g/test-suite-build/tools/timeit --summary SingleSource/UnitTests/Vector/AArch64/CMakeFiles/aarch64_neon_intrinsics.dir/aarch64_neon_intrinsics.c.o.time /Users/buildslave/jenkins/workspace/test-suite-verify-machineinstrs-aarch64-O0-g/compiler/bin/clang -DNDEBUG  -B /Applications/Xcode.app/Contents/Developer/Toolchains/XcodeDefault.xctoolchain/usr/bin    -Wno-unused-command-line-argument -mllvm -verify-machineinstrs -O0 -g -arch arm64 -isysroot /Applications/Xcode.app/Contents/Developer/Platforms/iPhoneOS.platform/Developer/SDKs/iPhoneOS12.1.sdk   -w -Werror=date-time -std=c99 -MD -MT SingleSource/UnitTests/Vector/AArch64/CMakeFiles/aarch64_neon_intrinsics.dir/aarch64_neon_intrinsics.c.o -MF SingleSource/UnitTests/Vector/AArch64/CMakeFiles/aarch64_neon_intrinsics.dir/aarch64_neon_intrinsics.c.o.d -o SingleSource/UnitTests/Vector/AArch64/CMakeFiles/aarch64_neon_intrinsics.dir/aarch64_neon_intrinsics.c.o   -c /Users/buildslave/jenkins/workspace/test-suite-verify-machineinstrs-aarch64-O0-g/test-suite/SingleSource/UnitTests/Vector/AArch64/aarch64_neon_intrinsics.c
FAILED: SingleSource/UnitTests/Vector/AArch64/CMakeFiles/aarch64_neon_intrinsics.dir/aarch64_neon_intrinsics.c.o 
/Users/buildslave/jenkins/workspace/test-suite-verify-machineinstrs-aarch64-O0-g/test-suite-build/tools/timeit --summary SingleSource/UnitTests/Vector/AArch64/CMakeFiles/aarch64_neon_intrinsics.dir/aarch64_neon_intrinsics.c.o.time /Users/buildslave/jenkins/workspace/test-suite-verify-machineinstrs-aarch64-O0-g/compiler/bin/clang -DNDEBUG  -B /Applications/Xcode.app/Contents/Developer/Toolchains/XcodeDefault.xctoolchain/usr/bin    -Wno-unused-command-line-argument -mllvm -verify-machineinstrs -O0 -g -arch arm64 -isysroot /Applications/Xcode.app/Contents/Developer/Platforms/iPhoneOS.platform/Developer/SDKs/iPhoneOS12.1.sdk   -w -Werror=date-time -std=c99 -MD -MT SingleSource/UnitTests/Vector/AArch64/CMakeFiles/aarch64_neon_intrinsics.dir/aarch64_neon_intrinsics.c.o -MF SingleSource/UnitTests/Vector/AArch64/CMakeFiles/aarch64_neon_intrinsics.dir/aarch64_neon_intrinsics.c.o.d -o SingleSource/UnitTests/Vector/AArch64/CMakeFiles/aarch64_neon_intrinsics.dir/aarch64_neon_intrinsics.c.o   -c /Users/buildslave/jenkins/workspace/test-suite-verify-machineinstrs-aarch64-O0-g/test-suite/SingleSource/UnitTests/Vector/AArch64/aarch64_neon_intrinsics.c
Assertion failed: (IsVector && "cannot get number of elements on scalar/aggregate"), function getNumElements, file /Users/buildslave/jenkins/workspace/clang-stage1-RA/llvm-project/llvm/include/llvm/Support/LowLevelTypeImpl.h, line 100.
Stack dump:
0.	Program arguments: /Users/buildslave/jenkins/workspace/test-suite-verify-machineinstrs-aarch64-O0-g/compiler/bin/clang-10 -cc1 -triple arm64-apple-ios12.1.0 -Wdeprecated-objc-isa-usage -Werror=deprecated-objc-isa-usage -Werror=implicit-function-declaration -emit-obj -mrelax-all -disable-free -main-file-name aarch64_neon_intrinsics.c -mrelocation-model pic -pic-level 2 -mthread-model posix -mframe-pointer=all -fno-rounding-math -masm-verbose -munwind-tables -target-sdk-version=12.1 -target-cpu cyclone -target-feature +fp-armv8 -target-feature +neon -target-feature +crypto -target-feature +zcm -target-feature +zcz -target-feature +sha2 -target-feature +aes -target-abi darwinpcs -fallow-half-arguments-and-returns -dwarf-column-info -debug-info-kind=standalone -dwarf-version=4 -debugger-tuning=lldb -target-linker-version 409.12 -resource-dir /Users/buildslave/jenkins/workspace/test-suite-verify-machineinstrs-aarch64-O0-g/compiler/lib/clang/10.0.0 -dependency-file SingleSource/UnitTests/Vector/AArch64/CMakeFiles/aarch64_neon_intrinsics.dir/aarch64_neon_intrinsics.c.o.d -MT SingleSource/UnitTests/Vector/AArch64/CMakeFiles/aarch64_neon_intrinsics.dir/aarch64_neon_intrinsics.c.o -sys-header-deps -isysroot /Applications/Xcode.app/Contents/Developer/Platforms/iPhoneOS.platform/Developer/SDKs/iPhoneOS12.1.sdk -D NDEBUG -internal-isystem /Applications/Xcode.app/Contents/Developer/Platforms/iPhoneOS.platform/Developer/SDKs/iPhoneOS12.1.sdk/usr/local/include -internal-isystem /Users/buildslave/jenkins/workspace/test-suite-verify-machineinstrs-aarch64-O0-g/compiler/lib/clang/10.0.0/include -internal-externc-isystem /Applications/Xcode.app/Contents/Developer/Platforms/iPhoneOS.platform/Developer/SDKs/iPhoneOS12.1.sdk/usr/include -O0 -Wno-unused-command-line-argument -Werror=date-time -w -std=c99 -fdebug-compilation-dir /Users/buildslave/jenkins/workspace/test-suite-verify-machineinstrs-aarch64-O0-g/test-suite-build -ferror-limit 19 -fmessage-length 0 -stack-protector 1 -fblocks -fencode-extended-block-signature -fregister-global-dtors-with-atexit -fgnuc-version=4.2.1 -fobjc-runtime=ios-12.1.0 -fmax-type-align=16 -fdiagnostics-show-option -mllvm -verify-machineinstrs -o SingleSource/UnitTests/Vector/AArch64/CMakeFiles/aarch64_neon_intrinsics.dir/aarch64_neon_intrinsics.c.o -x c /Users/buildslave/jenkins/workspace/test-suite-verify-machineinstrs-aarch64-O0-g/test-suite/SingleSource/UnitTests/Vector/AArch64/aarch64_neon_intrinsics.c 
Error: unable to execute command: Abort trap: 6
20 clang-10                 0x000000011111d115 clang::CompilerInstance::ExecuteAction(clang::FrontendAction&) + 1557
21 clang-10                 0x00000001111e76cf clang::ExecuteCompilerInvocation(clang::CompilerInstance*) + 1759
22 clang-10                 0x000000010ec8f368 cc1_main(llvm::ArrayRef<char const*>, char const*, void*) + 2392
23 clang-10                 0x000000010ec8cab3 main + 10819
24 libdyld.dylib            0x00007fff5feb2085 start + 1
clang-10: error: unable to execute command: Abort trap: 6
clang-10: error: clang frontend command failed due to signal (use -v to see invocation)
clang version 10.0.0 (https://github.com/llvm/llvm-project.git 52f3a2faf92c4d8efd0e626d52d5f64b7c5d468f)
Error: clang frontend command failed due to signal (use -v to see invocation)
21 clang-10                 0x00000001111e76cf clang::ExecuteCompilerInvocation(clang::CompilerInstance*) + 1759
22 clang-10                 0x000000010ec8f368 cc1_main(llvm::ArrayRef<char const*>, char const*, void*) + 2392
23 clang-10                 0x000000010ec8cab3 main + 10819
24 libdyld.dylib            0x00007fff5feb2085 start + 1
clang-10: error: unable to execute command: Abort trap: 6
clang-10: error: clang frontend command failed due to signal (use -v to see invocation)
clang version 10.0.0 (https://github.com/llvm/llvm-project.git 52f3a2faf92c4d8efd0e626d52d5f64b7c5d468f)
Target: aarch64-apple-darwin18.0.0

Build Log

Changes
  1. [llvm-readelf/llvm-readobj][test] - Convert elf-linker-options.ll to use (detail)
  2. [VFABI] Remove unused variables in testcase, fix buildbot (detail)
  3. [X86] Update stale comment. NFC (detail)
  4. [X86] Add fptosi test to fp-intrinsics.ll (detail)
  5. MCP: Fixed bug with dest overlapping copy source (detail)
  6. [NFC][InstCombine] Add tests that show a number of canonicalization (detail)
  7. [lldb] Check if we actually have a Clang type in (detail)
  8. [lldb][NFC] Remove unused CompilerType::IsPossibleCPlusPlusDynamicType (detail)
  9. [lldb][NFC] Move LLVM RTTI implementation from enum to static ID (detail)

Started by upstream project relay-test-suite-verify-machineinstrs build number 6709
originally caused by:

This run spent:

  • 50 min waiting;
  • 1 hr 7 min build duration;
  • 1 hr 7 min total from scheduled to completion.
Revision: 52f3a2faf92c4d8efd0e626d52d5f64b7c5d468f
  • detached

Identified problems

Compile Error

This build failed because of a compile error. Below is a list of all errors in the build log:
Indication 1

Assertion failure

This build failed because of an assertion failure. Below is a list of all errors in the build log:
Indication 2

Ninja target failed

Below is a link to the first failed ninja target.
Indication 3