Started 1 hr 1 min ago
Took 18 min

Failed Build clang-d331605-g6c86d6efaf1-t3702-b3702.tar.gz (Nov 11, 2019 5:54:28 PM)

Issues

Found 4 issues:
Ninja target: aarch64_neon_intrinsics.c.o
[8578/8583] /Users/buildslave/jenkins/workspace/test-suite-verify-machineinstrs-aarch64-globalisel-O0-g/test-suite-build/tools/timeit --summary MultiSource/Benchmarks/MiBench/consumer-typeset/CMakeFiles/consumer-typeset.dir/z06.c.o.time /Users/buildslave/jenkins/workspace/test-suite-verify-machineinstrs-aarch64-globalisel-O0-g/compiler/bin/clang -DNDEBUG  -B /Applications/Xcode.app/Contents/Developer/Toolchains/XcodeDefault.xctoolchain/usr/bin    -Wno-unused-command-line-argument -mllvm -verify-machineinstrs -O0 -g -arch arm64 -isysroot /Applications/Xcode.app/Contents/Developer/Platforms/iPhoneOS.platform/Developer/SDKs/iPhoneOS11.4.sdk   -w -Werror=date-time -DOS_UNIX=1 -DOS_DOS=0 -DOS_MAC=0 -DDB_FIX=0 -DUSE_STAT=1 -DSAFE_DFT=0 -DCOLLATE=1 -DLIB_DIR=\"lout.lib\" -DFONT_DIR=\"font\" -DMAPS_DIR=\"maps\" -DINCL_DIR=\"include\" -DDATA_DIR=\"data\" -DHYPH_DIR=\"hyph\" -DLOCALE_DIR=\"locale\" -DCHAR_IN=1 -DCHAR_OUT=0 -DLOCALE_ON=1 -DASSERT_ON=1 -DDEBUG_ON=0 -DPDF_COMPRESSION=0 -D_FORTIFY_SOURCE=0 -MD -MT MultiSource/Benchmarks/MiBench/consumer-typeset/CMakeFiles/consumer-typeset.dir/z06.c.o -MF MultiSource/Benchmarks/MiBench/consumer-typeset/CMakeFiles/consumer-typeset.dir/z06.c.o.d -o MultiSource/Benchmarks/MiBench/consumer-typeset/CMakeFiles/consumer-typeset.dir/z06.c.o   -c /Users/buildslave/jenkins/workspace/test-suite-verify-machineinstrs-aarch64-globalisel-O0-g/test-suite/MultiSource/Benchmarks/MiBench/consumer-typeset/z06.c
[8579/8583] : && /Users/buildslave/jenkins/workspace/test-suite-verify-machineinstrs-aarch64-globalisel-O0-g/test-suite-build/tools/timeit --summary MultiSource/Benchmarks/MiBench/consumer-typeset/consumer-typeset.link.time /Users/buildslave/jenkins/workspace/test-suite-verify-machineinstrs-aarch64-globalisel-O0-g/compiler/bin/clang -B /Applications/Xcode.app/Contents/Developer/Toolchains/XcodeDefault.xctoolchain/usr/bin    -Wno-unused-command-line-argument -mllvm -verify-machineinstrs -O0 -g -arch arm64 -isysroot /Applications/Xcode.app/Contents/Developer/Platforms/iPhoneOS.platform/Developer/SDKs/iPhoneOS11.4.sdk -Wl,-search_paths_first -Wl,-headerpad_max_install_names -B /Applications/Xcode.app/Contents/Developer/Toolchains/XcodeDefault.xctoolchain/usr/bin MultiSource/Benchmarks/MiBench/consumer-typeset/CMakeFiles/consumer-typeset.dir/z01.c.o MultiSource/Benchmarks/MiBench/consumer-typeset/CMakeFiles/consumer-typeset.dir/z02.c.o MultiSource/Benchmarks/MiBench/consumer-typeset/CMakeFiles/consumer-typeset.dir/z03.c.o MultiSource/Benchmarks/MiBench/consumer-typeset/CMakeFiles/consumer-typeset.dir/z04.c.o MultiSource/Benchmarks/MiBench/consumer-typeset/CMakeFiles/consumer-typeset.dir/z05.c.o MultiSource/Benchmarks/MiBench/consumer-typeset/CMakeFiles/consumer-typeset.dir/z06.c.o MultiSource/Benchmarks/MiBench/consumer-typeset/CMakeFiles/consumer-typeset.dir/z07.c.o MultiSource/Benchmarks/MiBench/consumer-typeset/CMakeFiles/consumer-typeset.dir/z08.c.o MultiSource/Benchmarks/MiBench/consumer-typeset/CMakeFiles/consumer-typeset.dir/z09.c.o MultiSource/Benchmarks/MiBench/consumer-typeset/CMakeFiles/consumer-typeset.dir/z10.c.o MultiSource/Benchmarks/MiBench/consumer-typeset/CMakeFiles/consumer-typeset.dir/z11.c.o MultiSource/Benchmarks/MiBench/consumer-typeset/CMakeFiles/consumer-typeset.dir/z12.c.o MultiSource/Benchmarks/MiBench/consumer-typeset/CMakeFiles/consumer-typeset.dir/z13.c.o MultiSource/Benchmarks/MiBench/consumer-typeset/CMakeFiles/consumer-typeset.dir/z14.c.o MultiSource/Benchmarks/MiBench/consumer-typeset/CMakeFiles/consumer-typeset.dir/z15.c.o MultiSource/Benchmarks/MiBench/consumer-typeset/CMakeFiles/consumer-typeset.dir/z16.c.o MultiSource/Benchmarks/MiBench/consumer-typeset/CMakeFiles/consumer-typeset.dir/z17.c.o MultiSource/Benchmarks/MiBench/consumer-typeset/CMakeFiles/consumer-typeset.dir/z18.c.o MultiSource/Benchmarks/MiBench/consumer-typeset/CMakeFiles/consumer-typeset.dir/z19.c.o MultiSource/Benchmarks/MiBench/consumer-typeset/CMakeFiles/consumer-typeset.dir/z20.c.o MultiSource/Benchmarks/MiBench/consumer-typeset/CMakeFiles/consumer-typeset.dir/z21.c.o MultiSource/Benchmarks/MiBench/consumer-typeset/CMakeFiles/consumer-typeset.dir/z22.c.o MultiSource/Benchmarks/MiBench/consumer-typeset/CMakeFiles/consumer-typeset.dir/z23.c.o MultiSource/Benchmarks/MiBench/consumer-typeset/CMakeFiles/consumer-typeset.dir/z24.c.o MultiSource/Benchmarks/MiBench/consumer-typeset/CMakeFiles/consumer-typeset.dir/z25.c.o MultiSource/Benchmarks/MiBench/consumer-typeset/CMakeFiles/consumer-typeset.dir/z26.c.o MultiSource/Benchmarks/MiBench/consumer-typeset/CMakeFiles/consumer-typeset.dir/z27.c.o MultiSource/Benchmarks/MiBench/consumer-typeset/CMakeFiles/consumer-typeset.dir/z28.c.o MultiSource/Benchmarks/MiBench/consumer-typeset/CMakeFiles/consumer-typeset.dir/z29.c.o MultiSource/Benchmarks/MiBench/consumer-typeset/CMakeFiles/consumer-typeset.dir/z30.c.o MultiSource/Benchmarks/MiBench/consumer-typeset/CMakeFiles/consumer-typeset.dir/z31.c.o MultiSource/Benchmarks/MiBench/consumer-typeset/CMakeFiles/consumer-typeset.dir/z32.c.o MultiSource/Benchmarks/MiBench/consumer-typeset/CMakeFiles/consumer-typeset.dir/z33.c.o MultiSource/Benchmarks/MiBench/consumer-typeset/CMakeFiles/consumer-typeset.dir/z34.c.o MultiSource/Benchmarks/MiBench/consumer-typeset/CMakeFiles/consumer-typeset.dir/z35.c.o MultiSource/Benchmarks/MiBench/consumer-typeset/CMakeFiles/consumer-typeset.dir/z36.c.o MultiSource/Benchmarks/MiBench/consumer-typeset/CMakeFiles/consumer-typeset.dir/z37.c.o MultiSource/Benchmarks/MiBench/consumer-typeset/CMakeFiles/consumer-typeset.dir/z38.c.o MultiSource/Benchmarks/MiBench/consumer-typeset/CMakeFiles/consumer-typeset.dir/z39.c.o MultiSource/Benchmarks/MiBench/consumer-typeset/CMakeFiles/consumer-typeset.dir/z40.c.o MultiSource/Benchmarks/MiBench/consumer-typeset/CMakeFiles/consumer-typeset.dir/z41.c.o MultiSource/Benchmarks/MiBench/consumer-typeset/CMakeFiles/consumer-typeset.dir/z42.c.o MultiSource/Benchmarks/MiBench/consumer-typeset/CMakeFiles/consumer-typeset.dir/z43.c.o MultiSource/Benchmarks/MiBench/consumer-typeset/CMakeFiles/consumer-typeset.dir/z44.c.o MultiSource/Benchmarks/MiBench/consumer-typeset/CMakeFiles/consumer-typeset.dir/z45.c.o MultiSource/Benchmarks/MiBench/consumer-typeset/CMakeFiles/consumer-typeset.dir/z46.c.o MultiSource/Benchmarks/MiBench/consumer-typeset/CMakeFiles/consumer-typeset.dir/z47.c.o MultiSource/Benchmarks/MiBench/consumer-typeset/CMakeFiles/consumer-typeset.dir/z48.c.o MultiSource/Benchmarks/MiBench/consumer-typeset/CMakeFiles/consumer-typeset.dir/z49.c.o MultiSource/Benchmarks/MiBench/consumer-typeset/CMakeFiles/consumer-typeset.dir/z50.c.o MultiSource/Benchmarks/MiBench/consumer-typeset/CMakeFiles/consumer-typeset.dir/z51.c.o  -o MultiSource/Benchmarks/MiBench/consumer-typeset/consumer-typeset  -lm && cd /Users/buildslave/jenkins/workspace/test-suite-verify-machineinstrs-aarch64-globalisel-O0-g/test-suite-build/MultiSource/Benchmarks/MiBench/consumer-typeset && /usr/local/Cellar/cmake/3.13.1/bin/cmake -E create_symlink /Users/buildslave/jenkins/workspace/test-suite-verify-machineinstrs-aarch64-globalisel-O0-g/test-suite/MultiSource/Benchmarks/MiBench/consumer-typeset/consumer-typeset.reference_output /Users/buildslave/jenkins/workspace/test-suite-verify-machineinstrs-aarch64-globalisel-O0-g/test-suite-build/MultiSource/Benchmarks/MiBench/consumer-typeset/consumer-typeset.reference_output && cd /Users/buildslave/jenkins/workspace/test-suite-verify-machineinstrs-aarch64-globalisel-O0-g/test-suite-build/MultiSource/Benchmarks/MiBench/consumer-typeset && /usr/local/Cellar/cmake/3.13.1/bin/cmake -E create_symlink /Users/buildslave/jenkins/workspace/test-suite-verify-machineinstrs-aarch64-globalisel-O0-g/test-suite/MultiSource/Benchmarks/MiBench/consumer-typeset/large.lout /Users/buildslave/jenkins/workspace/test-suite-verify-machineinstrs-aarch64-globalisel-O0-g/test-suite-build/MultiSource/Benchmarks/MiBench/consumer-typeset/large.lout && cd /Users/buildslave/jenkins/workspace/test-suite-verify-machineinstrs-aarch64-globalisel-O0-g/test-suite-build/MultiSource/Benchmarks/MiBench/consumer-typeset && /usr/local/Cellar/cmake/3.13.1/bin/cmake -E create_symlink /Users/buildslave/jenkins/workspace/test-suite-verify-machineinstrs-aarch64-globalisel-O0-g/test-suite/MultiSource/Benchmarks/MiBench/consumer-typeset/data /Users/buildslave/jenkins/workspace/test-suite-verify-machineinstrs-aarch64-globalisel-O0-g/test-suite-build/MultiSource/Benchmarks/MiBench/consumer-typeset/data
[8580/8583] /Users/buildslave/jenkins/workspace/test-suite-verify-machineinstrs-aarch64-globalisel-O0-g/test-suite-build/tools/timeit --summary SingleSource/Regression/C++/CMakeFiles/Regression-C++-ofstream_ctor.dir/ofstream_ctor.cpp.o.time /Users/buildslave/jenkins/workspace/test-suite-verify-machineinstrs-aarch64-globalisel-O0-g/compiler/bin/clang++  -DNDEBUG  -B /Applications/Xcode.app/Contents/Developer/Toolchains/XcodeDefault.xctoolchain/usr/bin    -Wno-unused-command-line-argument -mllvm -verify-machineinstrs -O0 -g -arch arm64 -isysroot /Applications/Xcode.app/Contents/Developer/Platforms/iPhoneOS.platform/Developer/SDKs/iPhoneOS11.4.sdk   -w -Werror=date-time -MD -MT SingleSource/Regression/C++/CMakeFiles/Regression-C++-ofstream_ctor.dir/ofstream_ctor.cpp.o -MF SingleSource/Regression/C++/CMakeFiles/Regression-C++-ofstream_ctor.dir/ofstream_ctor.cpp.o.d -o SingleSource/Regression/C++/CMakeFiles/Regression-C++-ofstream_ctor.dir/ofstream_ctor.cpp.o -c /Users/buildslave/jenkins/workspace/test-suite-verify-machineinstrs-aarch64-globalisel-O0-g/test-suite/SingleSource/Regression/C++/ofstream_ctor.cpp
[8581/8583] : && /Users/buildslave/jenkins/workspace/test-suite-verify-machineinstrs-aarch64-globalisel-O0-g/test-suite-build/tools/timeit --summary SingleSource/Regression/C++/Regression-C++-ofstream_ctor.link.time /Users/buildslave/jenkins/workspace/test-suite-verify-machineinstrs-aarch64-globalisel-O0-g/compiler/bin/clang++  -B /Applications/Xcode.app/Contents/Developer/Toolchains/XcodeDefault.xctoolchain/usr/bin    -Wno-unused-command-line-argument -mllvm -verify-machineinstrs -O0 -g -arch arm64 -isysroot /Applications/Xcode.app/Contents/Developer/Platforms/iPhoneOS.platform/Developer/SDKs/iPhoneOS11.4.sdk -Wl,-search_paths_first -Wl,-headerpad_max_install_names -B /Applications/Xcode.app/Contents/Developer/Toolchains/XcodeDefault.xctoolchain/usr/bin SingleSource/Regression/C++/CMakeFiles/Regression-C++-ofstream_ctor.dir/ofstream_ctor.cpp.o  -o SingleSource/Regression/C++/Regression-C++-ofstream_ctor  -lstdc++ && cd /Users/buildslave/jenkins/workspace/test-suite-verify-machineinstrs-aarch64-globalisel-O0-g/test-suite-build/SingleSource/Regression/C++ && /usr/local/Cellar/cmake/3.13.1/bin/cmake -E create_symlink /Users/buildslave/jenkins/workspace/test-suite-verify-machineinstrs-aarch64-globalisel-O0-g/test-suite/SingleSource/Regression/C++/ofstream_ctor.reference_output /Users/buildslave/jenkins/workspace/test-suite-verify-machineinstrs-aarch64-globalisel-O0-g/test-suite-build/SingleSource/Regression/C++/ofstream_ctor.reference_output
[8582/8583] /Users/buildslave/jenkins/workspace/test-suite-verify-machineinstrs-aarch64-globalisel-O0-g/test-suite-build/tools/timeit --summary SingleSource/UnitTests/Vector/AArch64/CMakeFiles/aarch64_neon_intrinsics.dir/aarch64_neon_intrinsics.c.o.time /Users/buildslave/jenkins/workspace/test-suite-verify-machineinstrs-aarch64-globalisel-O0-g/compiler/bin/clang -DNDEBUG  -B /Applications/Xcode.app/Contents/Developer/Toolchains/XcodeDefault.xctoolchain/usr/bin    -Wno-unused-command-line-argument -mllvm -verify-machineinstrs -O0 -g -arch arm64 -isysroot /Applications/Xcode.app/Contents/Developer/Platforms/iPhoneOS.platform/Developer/SDKs/iPhoneOS11.4.sdk   -w -Werror=date-time -std=c99 -MD -MT SingleSource/UnitTests/Vector/AArch64/CMakeFiles/aarch64_neon_intrinsics.dir/aarch64_neon_intrinsics.c.o -MF SingleSource/UnitTests/Vector/AArch64/CMakeFiles/aarch64_neon_intrinsics.dir/aarch64_neon_intrinsics.c.o.d -o SingleSource/UnitTests/Vector/AArch64/CMakeFiles/aarch64_neon_intrinsics.dir/aarch64_neon_intrinsics.c.o   -c /Users/buildslave/jenkins/workspace/test-suite-verify-machineinstrs-aarch64-globalisel-O0-g/test-suite/SingleSource/UnitTests/Vector/AArch64/aarch64_neon_intrinsics.c
FAILED: SingleSource/UnitTests/Vector/AArch64/CMakeFiles/aarch64_neon_intrinsics.dir/aarch64_neon_intrinsics.c.o 
/Users/buildslave/jenkins/workspace/test-suite-verify-machineinstrs-aarch64-globalisel-O0-g/test-suite-build/tools/timeit --summary SingleSource/UnitTests/Vector/AArch64/CMakeFiles/aarch64_neon_intrinsics.dir/aarch64_neon_intrinsics.c.o.time /Users/buildslave/jenkins/workspace/test-suite-verify-machineinstrs-aarch64-globalisel-O0-g/compiler/bin/clang -DNDEBUG  -B /Applications/Xcode.app/Contents/Developer/Toolchains/XcodeDefault.xctoolchain/usr/bin    -Wno-unused-command-line-argument -mllvm -verify-machineinstrs -O0 -g -arch arm64 -isysroot /Applications/Xcode.app/Contents/Developer/Platforms/iPhoneOS.platform/Developer/SDKs/iPhoneOS11.4.sdk   -w -Werror=date-time -std=c99 -MD -MT SingleSource/UnitTests/Vector/AArch64/CMakeFiles/aarch64_neon_intrinsics.dir/aarch64_neon_intrinsics.c.o -MF SingleSource/UnitTests/Vector/AArch64/CMakeFiles/aarch64_neon_intrinsics.dir/aarch64_neon_intrinsics.c.o.d -o SingleSource/UnitTests/Vector/AArch64/CMakeFiles/aarch64_neon_intrinsics.dir/aarch64_neon_intrinsics.c.o   -c /Users/buildslave/jenkins/workspace/test-suite-verify-machineinstrs-aarch64-globalisel-O0-g/test-suite/SingleSource/UnitTests/Vector/AArch64/aarch64_neon_intrinsics.c
Assertion failed: (IsVector && "cannot get number of elements on scalar/aggregate"), function getNumElements, file /Users/buildslave/jenkins/workspace/clang-stage1-RA/llvm-project/llvm/include/llvm/Support/LowLevelTypeImpl.h, line 100.
assertion: IsVector && "cannot get number of elements on scalar/aggregate"
[8580/8583] /Users/buildslave/jenkins/workspace/test-suite-verify-machineinstrs-aarch64-globalisel-O0-g/test-suite-build/tools/timeit --summary SingleSource/Regression/C++/CMakeFiles/Regression-C++-ofstream_ctor.dir/ofstream_ctor.cpp.o.time /Users/buildslave/jenkins/workspace/test-suite-verify-machineinstrs-aarch64-globalisel-O0-g/compiler/bin/clang++  -DNDEBUG  -B /Applications/Xcode.app/Contents/Developer/Toolchains/XcodeDefault.xctoolchain/usr/bin    -Wno-unused-command-line-argument -mllvm -verify-machineinstrs -O0 -g -arch arm64 -isysroot /Applications/Xcode.app/Contents/Developer/Platforms/iPhoneOS.platform/Developer/SDKs/iPhoneOS11.4.sdk   -w -Werror=date-time -MD -MT SingleSource/Regression/C++/CMakeFiles/Regression-C++-ofstream_ctor.dir/ofstream_ctor.cpp.o -MF SingleSource/Regression/C++/CMakeFiles/Regression-C++-ofstream_ctor.dir/ofstream_ctor.cpp.o.d -o SingleSource/Regression/C++/CMakeFiles/Regression-C++-ofstream_ctor.dir/ofstream_ctor.cpp.o -c /Users/buildslave/jenkins/workspace/test-suite-verify-machineinstrs-aarch64-globalisel-O0-g/test-suite/SingleSource/Regression/C++/ofstream_ctor.cpp
[8581/8583] : && /Users/buildslave/jenkins/workspace/test-suite-verify-machineinstrs-aarch64-globalisel-O0-g/test-suite-build/tools/timeit --summary SingleSource/Regression/C++/Regression-C++-ofstream_ctor.link.time /Users/buildslave/jenkins/workspace/test-suite-verify-machineinstrs-aarch64-globalisel-O0-g/compiler/bin/clang++  -B /Applications/Xcode.app/Contents/Developer/Toolchains/XcodeDefault.xctoolchain/usr/bin    -Wno-unused-command-line-argument -mllvm -verify-machineinstrs -O0 -g -arch arm64 -isysroot /Applications/Xcode.app/Contents/Developer/Platforms/iPhoneOS.platform/Developer/SDKs/iPhoneOS11.4.sdk -Wl,-search_paths_first -Wl,-headerpad_max_install_names -B /Applications/Xcode.app/Contents/Developer/Toolchains/XcodeDefault.xctoolchain/usr/bin SingleSource/Regression/C++/CMakeFiles/Regression-C++-ofstream_ctor.dir/ofstream_ctor.cpp.o  -o SingleSource/Regression/C++/Regression-C++-ofstream_ctor  -lstdc++ && cd /Users/buildslave/jenkins/workspace/test-suite-verify-machineinstrs-aarch64-globalisel-O0-g/test-suite-build/SingleSource/Regression/C++ && /usr/local/Cellar/cmake/3.13.1/bin/cmake -E create_symlink /Users/buildslave/jenkins/workspace/test-suite-verify-machineinstrs-aarch64-globalisel-O0-g/test-suite/SingleSource/Regression/C++/ofstream_ctor.reference_output /Users/buildslave/jenkins/workspace/test-suite-verify-machineinstrs-aarch64-globalisel-O0-g/test-suite-build/SingleSource/Regression/C++/ofstream_ctor.reference_output
[8582/8583] /Users/buildslave/jenkins/workspace/test-suite-verify-machineinstrs-aarch64-globalisel-O0-g/test-suite-build/tools/timeit --summary SingleSource/UnitTests/Vector/AArch64/CMakeFiles/aarch64_neon_intrinsics.dir/aarch64_neon_intrinsics.c.o.time /Users/buildslave/jenkins/workspace/test-suite-verify-machineinstrs-aarch64-globalisel-O0-g/compiler/bin/clang -DNDEBUG  -B /Applications/Xcode.app/Contents/Developer/Toolchains/XcodeDefault.xctoolchain/usr/bin    -Wno-unused-command-line-argument -mllvm -verify-machineinstrs -O0 -g -arch arm64 -isysroot /Applications/Xcode.app/Contents/Developer/Platforms/iPhoneOS.platform/Developer/SDKs/iPhoneOS11.4.sdk   -w -Werror=date-time -std=c99 -MD -MT SingleSource/UnitTests/Vector/AArch64/CMakeFiles/aarch64_neon_intrinsics.dir/aarch64_neon_intrinsics.c.o -MF SingleSource/UnitTests/Vector/AArch64/CMakeFiles/aarch64_neon_intrinsics.dir/aarch64_neon_intrinsics.c.o.d -o SingleSource/UnitTests/Vector/AArch64/CMakeFiles/aarch64_neon_intrinsics.dir/aarch64_neon_intrinsics.c.o   -c /Users/buildslave/jenkins/workspace/test-suite-verify-machineinstrs-aarch64-globalisel-O0-g/test-suite/SingleSource/UnitTests/Vector/AArch64/aarch64_neon_intrinsics.c
FAILED: SingleSource/UnitTests/Vector/AArch64/CMakeFiles/aarch64_neon_intrinsics.dir/aarch64_neon_intrinsics.c.o 
/Users/buildslave/jenkins/workspace/test-suite-verify-machineinstrs-aarch64-globalisel-O0-g/test-suite-build/tools/timeit --summary SingleSource/UnitTests/Vector/AArch64/CMakeFiles/aarch64_neon_intrinsics.dir/aarch64_neon_intrinsics.c.o.time /Users/buildslave/jenkins/workspace/test-suite-verify-machineinstrs-aarch64-globalisel-O0-g/compiler/bin/clang -DNDEBUG  -B /Applications/Xcode.app/Contents/Developer/Toolchains/XcodeDefault.xctoolchain/usr/bin    -Wno-unused-command-line-argument -mllvm -verify-machineinstrs -O0 -g -arch arm64 -isysroot /Applications/Xcode.app/Contents/Developer/Platforms/iPhoneOS.platform/Developer/SDKs/iPhoneOS11.4.sdk   -w -Werror=date-time -std=c99 -MD -MT SingleSource/UnitTests/Vector/AArch64/CMakeFiles/aarch64_neon_intrinsics.dir/aarch64_neon_intrinsics.c.o -MF SingleSource/UnitTests/Vector/AArch64/CMakeFiles/aarch64_neon_intrinsics.dir/aarch64_neon_intrinsics.c.o.d -o SingleSource/UnitTests/Vector/AArch64/CMakeFiles/aarch64_neon_intrinsics.dir/aarch64_neon_intrinsics.c.o   -c /Users/buildslave/jenkins/workspace/test-suite-verify-machineinstrs-aarch64-globalisel-O0-g/test-suite/SingleSource/UnitTests/Vector/AArch64/aarch64_neon_intrinsics.c
Assertion failed: (IsVector && "cannot get number of elements on scalar/aggregate"), function getNumElements, file /Users/buildslave/jenkins/workspace/clang-stage1-RA/llvm-project/llvm/include/llvm/Support/LowLevelTypeImpl.h, line 100.
Stack dump:
0.	Program arguments: /Users/buildslave/jenkins/workspace/test-suite-verify-machineinstrs-aarch64-globalisel-O0-g/compiler/bin/clang-10 -cc1 -triple arm64-apple-ios11.4.0 -Wdeprecated-objc-isa-usage -Werror=deprecated-objc-isa-usage -Werror=implicit-function-declaration -emit-obj -mrelax-all -disable-free -main-file-name aarch64_neon_intrinsics.c -mrelocation-model pic -pic-level 2 -mthread-model posix -mframe-pointer=all -fno-rounding-math -masm-verbose -munwind-tables -target-sdk-version=11.4 -target-cpu cyclone -target-feature +fp-armv8 -target-feature +neon -target-feature +crypto -target-feature +zcm -target-feature +zcz -target-feature +sha2 -target-feature +aes -target-abi darwinpcs -fallow-half-arguments-and-returns -dwarf-column-info -debug-info-kind=standalone -dwarf-version=4 -debugger-tuning=lldb -target-linker-version 409.12 -resource-dir /Users/buildslave/jenkins/workspace/test-suite-verify-machineinstrs-aarch64-globalisel-O0-g/compiler/lib/clang/10.0.0 -dependency-file SingleSource/UnitTests/Vector/AArch64/CMakeFiles/aarch64_neon_intrinsics.dir/aarch64_neon_intrinsics.c.o.d -MT SingleSource/UnitTests/Vector/AArch64/CMakeFiles/aarch64_neon_intrinsics.dir/aarch64_neon_intrinsics.c.o -sys-header-deps -isysroot /Applications/Xcode.app/Contents/Developer/Platforms/iPhoneOS.platform/Developer/SDKs/iPhoneOS11.4.sdk -D NDEBUG -internal-isystem /Applications/Xcode.app/Contents/Developer/Platforms/iPhoneOS.platform/Developer/SDKs/iPhoneOS11.4.sdk/usr/local/include -internal-isystem /Users/buildslave/jenkins/workspace/test-suite-verify-machineinstrs-aarch64-globalisel-O0-g/compiler/lib/clang/10.0.0/include -internal-externc-isystem /Applications/Xcode.app/Contents/Developer/Platforms/iPhoneOS.platform/Developer/SDKs/iPhoneOS11.4.sdk/usr/include -O0 -Wno-unused-command-line-argument -Werror=date-time -w -std=c99 -fdebug-compilation-dir /Users/buildslave/jenkins/workspace/test-suite-verify-machineinstrs-aarch64-globalisel-O0-g/test-suite-build -ferror-limit 19 -fmessage-length 0 -stack-protector 1 -fblocks -fencode-extended-block-signature -fregister-global-dtors-with-atexit -fgnuc-version=4.2.1 -fobjc-runtime=ios-11.4.0 -fmax-type-align=16 -fdiagnostics-show-option -mllvm -verify-machineinstrs -o SingleSource/UnitTests/Vector/AArch64/CMakeFiles/aarch64_neon_intrinsics.dir/aarch64_neon_intrinsics.c.o -x c /Users/buildslave/jenkins/workspace/test-suite-verify-machineinstrs-aarch64-globalisel-O0-g/test-suite/SingleSource/UnitTests/Vector/AArch64/aarch64_neon_intrinsics.c 
Error: unable to execute command: Abort trap: 6
20 clang-10                 0x000000010c943a65 clang::CompilerInstance::ExecuteAction(clang::FrontendAction&) + 1557
21 clang-10                 0x000000010ca0e01f clang::ExecuteCompilerInvocation(clang::CompilerInstance*) + 1759
22 clang-10                 0x000000010a4bad38 cc1_main(llvm::ArrayRef<char const*>, char const*, void*) + 2392
23 clang-10                 0x000000010a4b8483 main + 10819
24 libdyld.dylib            0x00007fff68a5e015 start + 1
clang-10: error: unable to execute command: Abort trap: 6
clang-10: error: clang frontend command failed due to signal (use -v to see invocation)
clang version 10.0.0 (https://github.com/llvm/llvm-project.git 6c86d6efaf129c42d37121f1e7e9a7adffb54c1a)
Error: clang frontend command failed due to signal (use -v to see invocation)
21 clang-10                 0x000000010ca0e01f clang::ExecuteCompilerInvocation(clang::CompilerInstance*) + 1759
22 clang-10                 0x000000010a4bad38 cc1_main(llvm::ArrayRef<char const*>, char const*, void*) + 2392
23 clang-10                 0x000000010a4b8483 main + 10819
24 libdyld.dylib            0x00007fff68a5e015 start + 1
clang-10: error: unable to execute command: Abort trap: 6
clang-10: error: clang frontend command failed due to signal (use -v to see invocation)
clang version 10.0.0 (https://github.com/llvm/llvm-project.git 6c86d6efaf129c42d37121f1e7e9a7adffb54c1a)
Target: aarch64-apple-darwin17.6.0

Build Log

Changes
  1. [Reproducer] Quit the debugger after generating a reproducer (detail)
  2. clang/Modules: Delay err_module_file_conflict if a diagnostic is in (detail)
  3. Fixing PowerPC llc test cases for Disable hoisting MI to hotter basic (detail)
  4. [PowerPC][XCOFF] Add support for zero initialized global values. (detail)
  5. clang/Modules: Use range-based for in ASTReader::ReadAST, NFC (detail)
  6. clang/Modules: Split loop in ReadAST between failable and not (detail)
  7. [X86] Autogenerate checks in fp-intrinsics.ll. Split fma tests off to (detail)
  8. [X86] Add avx512 command lines to vector-constrained-fp-intrinsics.ll. (detail)
  9. [lldb] Re-enable VSCode tests (detail)
  10. clang/Modules: Add missing diagnostics for malformed AST files (detail)
  11. [X86] Remove some else branches after checking for !useSoftFloat() that (detail)

Started by upstream project relay-test-suite-verify-machineinstrs build number 6705
originally caused by:

This run spent:

  • 7.8 sec waiting;
  • 18 min build duration;
  • 18 min total from scheduled to completion.
Revision: 6c86d6efaf129c42d37121f1e7e9a7adffb54c1a
  • detached

Identified problems

Compile Error

This build failed because of a compile error. Below is a list of all errors in the build log:
Indication 1

Assertion failure

This build failed because of an assertion failure. Below is a list of all errors in the build log:
Indication 2

Ninja target failed

Below is a link to the first failed ninja target.
Indication 3