Started 26 days ago
Took 1 hr 33 min

Failed Build clang-d330162-g4c539e8da1b-t3131-b3131.tar.gz (Oct 22, 2019 3:02:52 PM)

Issues

Found 11 issues:
Ninja target: alias-3.c.o
[3803/7684] /Users/buildslave/jenkins/workspace/test-suite-verify-machineinstrs-x86_64h-O3/test-suite-build/tools/timeit --summary SingleSource/Regression/C/gcc-c-torture/execute/CMakeFiles/GCC-C-execute-alias-access-path-1.dir/alias-access-path-1.c.o.time /Users/buildslave/jenkins/workspace/test-suite-verify-machineinstrs-x86_64h-O3/compiler/bin/clang -DNDEBUG  -B /Applications/Xcode.app/Contents/Developer/Toolchains/XcodeDefault.xctoolchain/usr/bin    -Wno-unused-command-line-argument -mllvm -verify-machineinstrs -O3 -arch x86_64h -isysroot /Applications/Xcode.app/Contents/Developer/Platforms/MacOSX.platform/Developer/SDKs/MacOSX10.14.sdk   -w -Werror=date-time -w -MD -MT SingleSource/Regression/C/gcc-c-torture/execute/CMakeFiles/GCC-C-execute-alias-access-path-1.dir/alias-access-path-1.c.o -MF SingleSource/Regression/C/gcc-c-torture/execute/CMakeFiles/GCC-C-execute-alias-access-path-1.dir/alias-access-path-1.c.o.d -o SingleSource/Regression/C/gcc-c-torture/execute/CMakeFiles/GCC-C-execute-alias-access-path-1.dir/alias-access-path-1.c.o   -c /Users/buildslave/jenkins/workspace/test-suite-verify-machineinstrs-x86_64h-O3/test-suite/SingleSource/Regression/C/gcc-c-torture/execute/alias-access-path-1.c
[3804/7684] : && /Users/buildslave/jenkins/workspace/test-suite-verify-machineinstrs-x86_64h-O3/test-suite-build/tools/timeit --summary SingleSource/Regression/C/gcc-c-torture/execute/GCC-C-execute-align-1.link.time /Users/buildslave/jenkins/workspace/test-suite-verify-machineinstrs-x86_64h-O3/compiler/bin/clang -B /Applications/Xcode.app/Contents/Developer/Toolchains/XcodeDefault.xctoolchain/usr/bin    -Wno-unused-command-line-argument -mllvm -verify-machineinstrs -O3 -arch x86_64h -isysroot /Applications/Xcode.app/Contents/Developer/Platforms/MacOSX.platform/Developer/SDKs/MacOSX10.14.sdk -Wl,-search_paths_first -Wl,-headerpad_max_install_names -B /Applications/Xcode.app/Contents/Developer/Toolchains/XcodeDefault.xctoolchain/usr/bin SingleSource/Regression/C/gcc-c-torture/execute/CMakeFiles/GCC-C-execute-align-1.dir/align-1.c.o  -o SingleSource/Regression/C/gcc-c-torture/execute/GCC-C-execute-align-1  -Wl,-no_pie && :
[3805/7684] : && /Users/buildslave/jenkins/workspace/test-suite-verify-machineinstrs-x86_64h-O3/test-suite-build/tools/timeit --summary SingleSource/Regression/C/gcc-c-torture/execute/GCC-C-execute-alias-access-path-1.link.time /Users/buildslave/jenkins/workspace/test-suite-verify-machineinstrs-x86_64h-O3/compiler/bin/clang -B /Applications/Xcode.app/Contents/Developer/Toolchains/XcodeDefault.xctoolchain/usr/bin    -Wno-unused-command-line-argument -mllvm -verify-machineinstrs -O3 -arch x86_64h -isysroot /Applications/Xcode.app/Contents/Developer/Platforms/MacOSX.platform/Developer/SDKs/MacOSX10.14.sdk -Wl,-search_paths_first -Wl,-headerpad_max_install_names -B /Applications/Xcode.app/Contents/Developer/Toolchains/XcodeDefault.xctoolchain/usr/bin SingleSource/Regression/C/gcc-c-torture/execute/CMakeFiles/GCC-C-execute-alias-access-path-1.dir/alias-access-path-1.c.o  -o SingleSource/Regression/C/gcc-c-torture/execute/GCC-C-execute-alias-access-path-1  -Wl,-no_pie && :
[3806/7684] /Users/buildslave/jenkins/workspace/test-suite-verify-machineinstrs-x86_64h-O3/test-suite-build/tools/timeit --summary SingleSource/Regression/C/gcc-c-torture/execute/CMakeFiles/GCC-C-execute-pr61306-2.dir/pr61306-2.c.o.time /Users/buildslave/jenkins/workspace/test-suite-verify-machineinstrs-x86_64h-O3/compiler/bin/clang -DNDEBUG  -B /Applications/Xcode.app/Contents/Developer/Toolchains/XcodeDefault.xctoolchain/usr/bin    -Wno-unused-command-line-argument -mllvm -verify-machineinstrs -O3 -arch x86_64h -isysroot /Applications/Xcode.app/Contents/Developer/Platforms/MacOSX.platform/Developer/SDKs/MacOSX10.14.sdk   -w -Werror=date-time -w -MD -MT SingleSource/Regression/C/gcc-c-torture/execute/CMakeFiles/GCC-C-execute-pr61306-2.dir/pr61306-2.c.o -MF SingleSource/Regression/C/gcc-c-torture/execute/CMakeFiles/GCC-C-execute-pr61306-2.dir/pr61306-2.c.o.d -o SingleSource/Regression/C/gcc-c-torture/execute/CMakeFiles/GCC-C-execute-pr61306-2.dir/pr61306-2.c.o   -c /Users/buildslave/jenkins/workspace/test-suite-verify-machineinstrs-x86_64h-O3/test-suite/SingleSource/Regression/C/gcc-c-torture/execute/pr61306-2.c
[3807/7684] /Users/buildslave/jenkins/workspace/test-suite-verify-machineinstrs-x86_64h-O3/test-suite-build/tools/timeit --summary SingleSource/Regression/C/gcc-c-torture/execute/CMakeFiles/GCC-C-execute-alias-3.dir/alias-3.c.o.time /Users/buildslave/jenkins/workspace/test-suite-verify-machineinstrs-x86_64h-O3/compiler/bin/clang -DNDEBUG  -B /Applications/Xcode.app/Contents/Developer/Toolchains/XcodeDefault.xctoolchain/usr/bin    -Wno-unused-command-line-argument -mllvm -verify-machineinstrs -O3 -arch x86_64h -isysroot /Applications/Xcode.app/Contents/Developer/Platforms/MacOSX.platform/Developer/SDKs/MacOSX10.14.sdk   -w -Werror=date-time -w -MD -MT SingleSource/Regression/C/gcc-c-torture/execute/CMakeFiles/GCC-C-execute-alias-3.dir/alias-3.c.o -MF SingleSource/Regression/C/gcc-c-torture/execute/CMakeFiles/GCC-C-execute-alias-3.dir/alias-3.c.o.d -o SingleSource/Regression/C/gcc-c-torture/execute/CMakeFiles/GCC-C-execute-alias-3.dir/alias-3.c.o   -c /Users/buildslave/jenkins/workspace/test-suite-verify-machineinstrs-x86_64h-O3/test-suite/SingleSource/Regression/C/gcc-c-torture/execute/alias-3.c
FAILED: SingleSource/Regression/C/gcc-c-torture/execute/CMakeFiles/GCC-C-execute-alias-3.dir/alias-3.c.o 
/Users/buildslave/jenkins/workspace/test-suite-verify-machineinstrs-x86_64h-O3/test-suite-build/tools/timeit --summary SingleSource/Regression/C/gcc-c-torture/execute/CMakeFiles/GCC-C-execute-alias-3.dir/alias-3.c.o.time /Users/buildslave/jenkins/workspace/test-suite-verify-machineinstrs-x86_64h-O3/compiler/bin/clang -DNDEBUG  -B /Applications/Xcode.app/Contents/Developer/Toolchains/XcodeDefault.xctoolchain/usr/bin    -Wno-unused-command-line-argument -mllvm -verify-machineinstrs -O3 -arch x86_64h -isysroot /Applications/Xcode.app/Contents/Developer/Platforms/MacOSX.platform/Developer/SDKs/MacOSX10.14.sdk   -w -Werror=date-time -w -MD -MT SingleSource/Regression/C/gcc-c-torture/execute/CMakeFiles/GCC-C-execute-alias-3.dir/alias-3.c.o -MF SingleSource/Regression/C/gcc-c-torture/execute/CMakeFiles/GCC-C-execute-alias-3.dir/alias-3.c.o.d -o SingleSource/Regression/C/gcc-c-torture/execute/CMakeFiles/GCC-C-execute-alias-3.dir/alias-3.c.o   -c /Users/buildslave/jenkins/workspace/test-suite-verify-machineinstrs-x86_64h-O3/test-suite/SingleSource/Regression/C/gcc-c-torture/execute/alias-3.c
/Users/buildslave/jenkins/workspace/test-suite-verify-machineinstrs-x86_64h-O3/test-suite/SingleSource/Regression/C/gcc-c-torture/execute/alias-3.c:4:30: error: aliases are not supported on darwin
alias-3.c error: aliases are not supported on darwin
[3805/7684] : && /Users/buildslave/jenkins/workspace/test-suite-verify-machineinstrs-x86_64h-O3/test-suite-build/tools/timeit --summary SingleSource/Regression/C/gcc-c-torture/execute/GCC-C-execute-alias-access-path-1.link.time /Users/buildslave/jenkins/workspace/test-suite-verify-machineinstrs-x86_64h-O3/compiler/bin/clang -B /Applications/Xcode.app/Contents/Developer/Toolchains/XcodeDefault.xctoolchain/usr/bin    -Wno-unused-command-line-argument -mllvm -verify-machineinstrs -O3 -arch x86_64h -isysroot /Applications/Xcode.app/Contents/Developer/Platforms/MacOSX.platform/Developer/SDKs/MacOSX10.14.sdk -Wl,-search_paths_first -Wl,-headerpad_max_install_names -B /Applications/Xcode.app/Contents/Developer/Toolchains/XcodeDefault.xctoolchain/usr/bin SingleSource/Regression/C/gcc-c-torture/execute/CMakeFiles/GCC-C-execute-alias-access-path-1.dir/alias-access-path-1.c.o  -o SingleSource/Regression/C/gcc-c-torture/execute/GCC-C-execute-alias-access-path-1  -Wl,-no_pie && :
[3806/7684] /Users/buildslave/jenkins/workspace/test-suite-verify-machineinstrs-x86_64h-O3/test-suite-build/tools/timeit --summary SingleSource/Regression/C/gcc-c-torture/execute/CMakeFiles/GCC-C-execute-pr61306-2.dir/pr61306-2.c.o.time /Users/buildslave/jenkins/workspace/test-suite-verify-machineinstrs-x86_64h-O3/compiler/bin/clang -DNDEBUG  -B /Applications/Xcode.app/Contents/Developer/Toolchains/XcodeDefault.xctoolchain/usr/bin    -Wno-unused-command-line-argument -mllvm -verify-machineinstrs -O3 -arch x86_64h -isysroot /Applications/Xcode.app/Contents/Developer/Platforms/MacOSX.platform/Developer/SDKs/MacOSX10.14.sdk   -w -Werror=date-time -w -MD -MT SingleSource/Regression/C/gcc-c-torture/execute/CMakeFiles/GCC-C-execute-pr61306-2.dir/pr61306-2.c.o -MF SingleSource/Regression/C/gcc-c-torture/execute/CMakeFiles/GCC-C-execute-pr61306-2.dir/pr61306-2.c.o.d -o SingleSource/Regression/C/gcc-c-torture/execute/CMakeFiles/GCC-C-execute-pr61306-2.dir/pr61306-2.c.o   -c /Users/buildslave/jenkins/workspace/test-suite-verify-machineinstrs-x86_64h-O3/test-suite/SingleSource/Regression/C/gcc-c-torture/execute/pr61306-2.c
[3807/7684] /Users/buildslave/jenkins/workspace/test-suite-verify-machineinstrs-x86_64h-O3/test-suite-build/tools/timeit --summary SingleSource/Regression/C/gcc-c-torture/execute/CMakeFiles/GCC-C-execute-alias-3.dir/alias-3.c.o.time /Users/buildslave/jenkins/workspace/test-suite-verify-machineinstrs-x86_64h-O3/compiler/bin/clang -DNDEBUG  -B /Applications/Xcode.app/Contents/Developer/Toolchains/XcodeDefault.xctoolchain/usr/bin    -Wno-unused-command-line-argument -mllvm -verify-machineinstrs -O3 -arch x86_64h -isysroot /Applications/Xcode.app/Contents/Developer/Platforms/MacOSX.platform/Developer/SDKs/MacOSX10.14.sdk   -w -Werror=date-time -w -MD -MT SingleSource/Regression/C/gcc-c-torture/execute/CMakeFiles/GCC-C-execute-alias-3.dir/alias-3.c.o -MF SingleSource/Regression/C/gcc-c-torture/execute/CMakeFiles/GCC-C-execute-alias-3.dir/alias-3.c.o.d -o SingleSource/Regression/C/gcc-c-torture/execute/CMakeFiles/GCC-C-execute-alias-3.dir/alias-3.c.o   -c /Users/buildslave/jenkins/workspace/test-suite-verify-machineinstrs-x86_64h-O3/test-suite/SingleSource/Regression/C/gcc-c-torture/execute/alias-3.c
FAILED: SingleSource/Regression/C/gcc-c-torture/execute/CMakeFiles/GCC-C-execute-alias-3.dir/alias-3.c.o 
/Users/buildslave/jenkins/workspace/test-suite-verify-machineinstrs-x86_64h-O3/test-suite-build/tools/timeit --summary SingleSource/Regression/C/gcc-c-torture/execute/CMakeFiles/GCC-C-execute-alias-3.dir/alias-3.c.o.time /Users/buildslave/jenkins/workspace/test-suite-verify-machineinstrs-x86_64h-O3/compiler/bin/clang -DNDEBUG  -B /Applications/Xcode.app/Contents/Developer/Toolchains/XcodeDefault.xctoolchain/usr/bin    -Wno-unused-command-line-argument -mllvm -verify-machineinstrs -O3 -arch x86_64h -isysroot /Applications/Xcode.app/Contents/Developer/Platforms/MacOSX.platform/Developer/SDKs/MacOSX10.14.sdk   -w -Werror=date-time -w -MD -MT SingleSource/Regression/C/gcc-c-torture/execute/CMakeFiles/GCC-C-execute-alias-3.dir/alias-3.c.o -MF SingleSource/Regression/C/gcc-c-torture/execute/CMakeFiles/GCC-C-execute-alias-3.dir/alias-3.c.o.d -o SingleSource/Regression/C/gcc-c-torture/execute/CMakeFiles/GCC-C-execute-alias-3.dir/alias-3.c.o   -c /Users/buildslave/jenkins/workspace/test-suite-verify-machineinstrs-x86_64h-O3/test-suite/SingleSource/Regression/C/gcc-c-torture/execute/alias-3.c
/Users/buildslave/jenkins/workspace/test-suite-verify-machineinstrs-x86_64h-O3/test-suite/SingleSource/Regression/C/gcc-c-torture/execute/alias-3.c:4:30: error: aliases are not supported on darwin
extern int b __attribute__ ((alias("a")));
                             ^
Ninja target: alias-2.c.o
/Users/buildslave/jenkins/workspace/test-suite-verify-machineinstrs-x86_64h-O3/test-suite/SingleSource/Regression/C/gcc-c-torture/execute/alias-3.c:4:30: error: aliases are not supported on darwin
extern int b __attribute__ ((alias("a")));
                             ^
1 error generated.
[3808/7684] /Users/buildslave/jenkins/workspace/test-suite-verify-machineinstrs-x86_64h-O3/test-suite-build/tools/timeit --summary SingleSource/Regression/C/gcc-c-torture/execute/CMakeFiles/GCC-C-execute-alias-2.dir/alias-2.c.o.time /Users/buildslave/jenkins/workspace/test-suite-verify-machineinstrs-x86_64h-O3/compiler/bin/clang -DNDEBUG  -B /Applications/Xcode.app/Contents/Developer/Toolchains/XcodeDefault.xctoolchain/usr/bin    -Wno-unused-command-line-argument -mllvm -verify-machineinstrs -O3 -arch x86_64h -isysroot /Applications/Xcode.app/Contents/Developer/Platforms/MacOSX.platform/Developer/SDKs/MacOSX10.14.sdk   -w -Werror=date-time -w -MD -MT SingleSource/Regression/C/gcc-c-torture/execute/CMakeFiles/GCC-C-execute-alias-2.dir/alias-2.c.o -MF SingleSource/Regression/C/gcc-c-torture/execute/CMakeFiles/GCC-C-execute-alias-2.dir/alias-2.c.o.d -o SingleSource/Regression/C/gcc-c-torture/execute/CMakeFiles/GCC-C-execute-alias-2.dir/alias-2.c.o   -c /Users/buildslave/jenkins/workspace/test-suite-verify-machineinstrs-x86_64h-O3/test-suite/SingleSource/Regression/C/gcc-c-torture/execute/alias-2.c
FAILED: SingleSource/Regression/C/gcc-c-torture/execute/CMakeFiles/GCC-C-execute-alias-2.dir/alias-2.c.o 
/Users/buildslave/jenkins/workspace/test-suite-verify-machineinstrs-x86_64h-O3/test-suite-build/tools/timeit --summary SingleSource/Regression/C/gcc-c-torture/execute/CMakeFiles/GCC-C-execute-alias-2.dir/alias-2.c.o.time /Users/buildslave/jenkins/workspace/test-suite-verify-machineinstrs-x86_64h-O3/compiler/bin/clang -DNDEBUG  -B /Applications/Xcode.app/Contents/Developer/Toolchains/XcodeDefault.xctoolchain/usr/bin    -Wno-unused-command-line-argument -mllvm -verify-machineinstrs -O3 -arch x86_64h -isysroot /Applications/Xcode.app/Contents/Developer/Platforms/MacOSX.platform/Developer/SDKs/MacOSX10.14.sdk   -w -Werror=date-time -w -MD -MT SingleSource/Regression/C/gcc-c-torture/execute/CMakeFiles/GCC-C-execute-alias-2.dir/alias-2.c.o -MF SingleSource/Regression/C/gcc-c-torture/execute/CMakeFiles/GCC-C-execute-alias-2.dir/alias-2.c.o.d -o SingleSource/Regression/C/gcc-c-torture/execute/CMakeFiles/GCC-C-execute-alias-2.dir/alias-2.c.o   -c /Users/buildslave/jenkins/workspace/test-suite-verify-machineinstrs-x86_64h-O3/test-suite/SingleSource/Regression/C/gcc-c-torture/execute/alias-2.c
/Users/buildslave/jenkins/workspace/test-suite-verify-machineinstrs-x86_64h-O3/test-suite/SingleSource/Regression/C/gcc-c-torture/execute/alias-2.c:3:34: error: aliases are not supported on darwin
alias-2.c error: aliases are not supported on darwin
                             ^
1 error generated.
[3808/7684] /Users/buildslave/jenkins/workspace/test-suite-verify-machineinstrs-x86_64h-O3/test-suite-build/tools/timeit --summary SingleSource/Regression/C/gcc-c-torture/execute/CMakeFiles/GCC-C-execute-alias-2.dir/alias-2.c.o.time /Users/buildslave/jenkins/workspace/test-suite-verify-machineinstrs-x86_64h-O3/compiler/bin/clang -DNDEBUG  -B /Applications/Xcode.app/Contents/Developer/Toolchains/XcodeDefault.xctoolchain/usr/bin    -Wno-unused-command-line-argument -mllvm -verify-machineinstrs -O3 -arch x86_64h -isysroot /Applications/Xcode.app/Contents/Developer/Platforms/MacOSX.platform/Developer/SDKs/MacOSX10.14.sdk   -w -Werror=date-time -w -MD -MT SingleSource/Regression/C/gcc-c-torture/execute/CMakeFiles/GCC-C-execute-alias-2.dir/alias-2.c.o -MF SingleSource/Regression/C/gcc-c-torture/execute/CMakeFiles/GCC-C-execute-alias-2.dir/alias-2.c.o.d -o SingleSource/Regression/C/gcc-c-torture/execute/CMakeFiles/GCC-C-execute-alias-2.dir/alias-2.c.o   -c /Users/buildslave/jenkins/workspace/test-suite-verify-machineinstrs-x86_64h-O3/test-suite/SingleSource/Regression/C/gcc-c-torture/execute/alias-2.c
FAILED: SingleSource/Regression/C/gcc-c-torture/execute/CMakeFiles/GCC-C-execute-alias-2.dir/alias-2.c.o 
/Users/buildslave/jenkins/workspace/test-suite-verify-machineinstrs-x86_64h-O3/test-suite-build/tools/timeit --summary SingleSource/Regression/C/gcc-c-torture/execute/CMakeFiles/GCC-C-execute-alias-2.dir/alias-2.c.o.time /Users/buildslave/jenkins/workspace/test-suite-verify-machineinstrs-x86_64h-O3/compiler/bin/clang -DNDEBUG  -B /Applications/Xcode.app/Contents/Developer/Toolchains/XcodeDefault.xctoolchain/usr/bin    -Wno-unused-command-line-argument -mllvm -verify-machineinstrs -O3 -arch x86_64h -isysroot /Applications/Xcode.app/Contents/Developer/Platforms/MacOSX.platform/Developer/SDKs/MacOSX10.14.sdk   -w -Werror=date-time -w -MD -MT SingleSource/Regression/C/gcc-c-torture/execute/CMakeFiles/GCC-C-execute-alias-2.dir/alias-2.c.o -MF SingleSource/Regression/C/gcc-c-torture/execute/CMakeFiles/GCC-C-execute-alias-2.dir/alias-2.c.o.d -o SingleSource/Regression/C/gcc-c-torture/execute/CMakeFiles/GCC-C-execute-alias-2.dir/alias-2.c.o   -c /Users/buildslave/jenkins/workspace/test-suite-verify-machineinstrs-x86_64h-O3/test-suite/SingleSource/Regression/C/gcc-c-torture/execute/alias-2.c
/Users/buildslave/jenkins/workspace/test-suite-verify-machineinstrs-x86_64h-O3/test-suite/SingleSource/Regression/C/gcc-c-torture/execute/alias-2.c:3:34: error: aliases are not supported on darwin
extern int b[10] __attribute__ ((alias("a")));
                                 ^
Ninja target: GCC-C-execute-930513-1
[5993/7684] : && /Users/buildslave/jenkins/workspace/test-suite-verify-machineinstrs-x86_64h-O3/test-suite-build/tools/timeit --summary SingleSource/Regression/C/gcc-c-torture/execute/GCC-C-execute-930429-2.link.time /Users/buildslave/jenkins/workspace/test-suite-verify-machineinstrs-x86_64h-O3/compiler/bin/clang -B /Applications/Xcode.app/Contents/Developer/Toolchains/XcodeDefault.xctoolchain/usr/bin    -Wno-unused-command-line-argument -mllvm -verify-machineinstrs -O3 -arch x86_64h -isysroot /Applications/Xcode.app/Contents/Developer/Platforms/MacOSX.platform/Developer/SDKs/MacOSX10.14.sdk -Wl,-search_paths_first -Wl,-headerpad_max_install_names -B /Applications/Xcode.app/Contents/Developer/Toolchains/XcodeDefault.xctoolchain/usr/bin SingleSource/Regression/C/gcc-c-torture/execute/CMakeFiles/GCC-C-execute-930429-2.dir/930429-2.c.o  -o SingleSource/Regression/C/gcc-c-torture/execute/GCC-C-execute-930429-2  -Wl,-no_pie && :
[5994/7684] /Users/buildslave/jenkins/workspace/test-suite-verify-machineinstrs-x86_64h-O3/test-suite-build/tools/timeit --summary SingleSource/Regression/C/gcc-c-torture/execute/CMakeFiles/GCC-C-execute-930513-1.dir/930513-1.c.o.time /Users/buildslave/jenkins/workspace/test-suite-verify-machineinstrs-x86_64h-O3/compiler/bin/clang -DNDEBUG  -B /Applications/Xcode.app/Contents/Developer/Toolchains/XcodeDefault.xctoolchain/usr/bin    -Wno-unused-command-line-argument -mllvm -verify-machineinstrs -O3 -arch x86_64h -isysroot /Applications/Xcode.app/Contents/Developer/Platforms/MacOSX.platform/Developer/SDKs/MacOSX10.14.sdk   -w -Werror=date-time -w -MD -MT SingleSource/Regression/C/gcc-c-torture/execute/CMakeFiles/GCC-C-execute-930513-1.dir/930513-1.c.o -MF SingleSource/Regression/C/gcc-c-torture/execute/CMakeFiles/GCC-C-execute-930513-1.dir/930513-1.c.o.d -o SingleSource/Regression/C/gcc-c-torture/execute/CMakeFiles/GCC-C-execute-930513-1.dir/930513-1.c.o   -c /Users/buildslave/jenkins/workspace/test-suite-verify-machineinstrs-x86_64h-O3/test-suite/SingleSource/Regression/C/gcc-c-torture/execute/930513-1.c
[5995/7684] : && /Users/buildslave/jenkins/workspace/test-suite-verify-machineinstrs-x86_64h-O3/test-suite-build/tools/timeit --summary SingleSource/Regression/C/gcc-c-torture/execute/GCC-C-execute-930406-1.link.time /Users/buildslave/jenkins/workspace/test-suite-verify-machineinstrs-x86_64h-O3/compiler/bin/clang -B /Applications/Xcode.app/Contents/Developer/Toolchains/XcodeDefault.xctoolchain/usr/bin    -Wno-unused-command-line-argument -mllvm -verify-machineinstrs -O3 -arch x86_64h -isysroot /Applications/Xcode.app/Contents/Developer/Platforms/MacOSX.platform/Developer/SDKs/MacOSX10.14.sdk -Wl,-search_paths_first -Wl,-headerpad_max_install_names -B /Applications/Xcode.app/Contents/Developer/Toolchains/XcodeDefault.xctoolchain/usr/bin SingleSource/Regression/C/gcc-c-torture/execute/CMakeFiles/GCC-C-execute-930406-1.dir/930406-1.c.o  -o SingleSource/Regression/C/gcc-c-torture/execute/GCC-C-execute-930406-1  -Wl,-no_pie && :
[5996/7684] /Users/buildslave/jenkins/workspace/test-suite-verify-machineinstrs-x86_64h-O3/test-suite-build/tools/timeit --summary SingleSource/Regression/C/gcc-c-torture/execute/CMakeFiles/GCC-C-execute-931012-1.dir/931012-1.c.o.time /Users/buildslave/jenkins/workspace/test-suite-verify-machineinstrs-x86_64h-O3/compiler/bin/clang -DNDEBUG  -B /Applications/Xcode.app/Contents/Developer/Toolchains/XcodeDefault.xctoolchain/usr/bin    -Wno-unused-command-line-argument -mllvm -verify-machineinstrs -O3 -arch x86_64h -isysroot /Applications/Xcode.app/Contents/Developer/Platforms/MacOSX.platform/Developer/SDKs/MacOSX10.14.sdk   -w -Werror=date-time -w -MD -MT SingleSource/Regression/C/gcc-c-torture/execute/CMakeFiles/GCC-C-execute-931012-1.dir/931012-1.c.o -MF SingleSource/Regression/C/gcc-c-torture/execute/CMakeFiles/GCC-C-execute-931012-1.dir/931012-1.c.o.d -o SingleSource/Regression/C/gcc-c-torture/execute/CMakeFiles/GCC-C-execute-931012-1.dir/931012-1.c.o   -c /Users/buildslave/jenkins/workspace/test-suite-verify-machineinstrs-x86_64h-O3/test-suite/SingleSource/Regression/C/gcc-c-torture/execute/931012-1.c
[5997/7684] : && /Users/buildslave/jenkins/workspace/test-suite-verify-machineinstrs-x86_64h-O3/test-suite-build/tools/timeit --summary SingleSource/Regression/C/gcc-c-torture/execute/GCC-C-execute-930513-1.link.time /Users/buildslave/jenkins/workspace/test-suite-verify-machineinstrs-x86_64h-O3/compiler/bin/clang -B /Applications/Xcode.app/Contents/Developer/Toolchains/XcodeDefault.xctoolchain/usr/bin    -Wno-unused-command-line-argument -mllvm -verify-machineinstrs -O3 -arch x86_64h -isysroot /Applications/Xcode.app/Contents/Developer/Platforms/MacOSX.platform/Developer/SDKs/MacOSX10.14.sdk -Wl,-search_paths_first -Wl,-headerpad_max_install_names -B /Applications/Xcode.app/Contents/Developer/Toolchains/XcodeDefault.xctoolchain/usr/bin SingleSource/Regression/C/gcc-c-torture/execute/CMakeFiles/GCC-C-execute-930513-1.dir/930513-1.c.o  -o SingleSource/Regression/C/gcc-c-torture/execute/GCC-C-execute-930513-1  -Wl,-no_pie -Wl,-u,_printf_float && :
FAILED: SingleSource/Regression/C/gcc-c-torture/execute/GCC-C-execute-930513-1 
: && /Users/buildslave/jenkins/workspace/test-suite-verify-machineinstrs-x86_64h-O3/test-suite-build/tools/timeit --summary SingleSource/Regression/C/gcc-c-torture/execute/GCC-C-execute-930513-1.link.time /Users/buildslave/jenkins/workspace/test-suite-verify-machineinstrs-x86_64h-O3/compiler/bin/clang -B /Applications/Xcode.app/Contents/Developer/Toolchains/XcodeDefault.xctoolchain/usr/bin    -Wno-unused-command-line-argument -mllvm -verify-machineinstrs -O3 -arch x86_64h -isysroot /Applications/Xcode.app/Contents/Developer/Platforms/MacOSX.platform/Developer/SDKs/MacOSX10.14.sdk -Wl,-search_paths_first -Wl,-headerpad_max_install_names -B /Applications/Xcode.app/Contents/Developer/Toolchains/XcodeDefault.xctoolchain/usr/bin SingleSource/Regression/C/gcc-c-torture/execute/CMakeFiles/GCC-C-execute-930513-1.dir/930513-1.c.o  -o SingleSource/Regression/C/gcc-c-torture/execute/GCC-C-execute-930513-1  -Wl,-no_pie -Wl,-u,_printf_float && :
Undefined symbols for architecture x86_64h:
link error
: && /Users/buildslave/jenkins/workspace/test-suite-verify-machineinstrs-x86_64h-O3/test-suite-build/tools/timeit --summary SingleSource/Regression/C/gcc-c-torture/execute/GCC-C-execute-930513-1.link.time /Users/buildslave/jenkins/workspace/test-suite-verify-machineinstrs-x86_64h-O3/compiler/bin/clang -B /Applications/Xcode.app/Contents/Developer/Toolchains/XcodeDefault.xctoolchain/usr/bin    -Wno-unused-command-line-argument -mllvm -verify-machineinstrs -O3 -arch x86_64h -isysroot /Applications/Xcode.app/Contents/Developer/Platforms/MacOSX.platform/Developer/SDKs/MacOSX10.14.sdk -Wl,-search_paths_first -Wl,-headerpad_max_install_names -B /Applications/Xcode.app/Contents/Developer/Toolchains/XcodeDefault.xctoolchain/usr/bin SingleSource/Regression/C/gcc-c-torture/execute/CMakeFiles/GCC-C-execute-930513-1.dir/930513-1.c.o  -o SingleSource/Regression/C/gcc-c-torture/execute/GCC-C-execute-930513-1  -Wl,-no_pie -Wl,-u,_printf_float && :
Undefined symbols for architecture x86_64h:
  "_printf_float", referenced from:
     -u command line option
ld: symbol(s) not found for architecture x86_64h
clang-10: error: linker command failed with exit code 1 (use -v to see invocation)
[5998/7684] /Users/buildslave/jenkins/workspace/test-suite-verify-machineinstrs-x86_64h-O3/test-suite-build/tools/timeit --summary SingleSource/Regression/C/gcc-c-torture/execute/CMakeFiles/GCC-C-execute-921218-1.dir/921218-1.c.o.time /Users/buildslave/jenkins/workspace/test-suite-verify-machineinstrs-x86_64h-O3/compiler/bin/clang -DNDEBUG  -B /Applications/Xcode.app/Contents/Developer/Toolchains/XcodeDefault.xctoolchain/usr/bin    -Wno-unused-command-line-argument -mllvm -verify-machineinstrs -O3 -arch x86_64h -isysroot /Applications/Xcode.app/Contents/Developer/Platforms/MacOSX.platform/Developer/SDKs/MacOSX10.14.sdk   -w -Werror=date-time -w -MD -MT SingleSource/Regression/C/gcc-c-torture/execute/CMakeFiles/GCC-C-execute-921218-1.dir/921218-1.c.o -MF SingleSource/Regression/C/gcc-c-torture/execute/CMakeFiles/GCC-C-execute-921218-1.dir/921218-1.c.o.d -o SingleSource/Regression/C/gcc-c-torture/execute/CMakeFiles/GCC-C-execute-921218-1.dir/921218-1.c.o   -c /Users/buildslave/jenkins/workspace/test-suite-verify-machineinstrs-x86_64h-O3/test-suite/SingleSource/Regression/C/gcc-c-torture/execute/921218-1.c
[5999/7684] : && /Users/buildslave/jenkins/workspace/test-suite-verify-machineinstrs-x86_64h-O3/test-suite-build/tools/timeit --summary SingleSource/Regression/C/gcc-c-torture/execute/GCC-C-execute-931012-1.link.time /Users/buildslave/jenkins/workspace/test-suite-verify-machineinstrs-x86_64h-O3/compiler/bin/clang -B /Applications/Xcode.app/Contents/Developer/Toolchains/XcodeDefault.xctoolchain/usr/bin    -Wno-unused-command-line-argument -mllvm -verify-machineinstrs -O3 -arch x86_64h -isysroot /Applications/Xcode.app/Contents/Developer/Platforms/MacOSX.platform/Developer/SDKs/MacOSX10.14.sdk -Wl,-search_paths_first -Wl,-headerpad_max_install_names -B /Applications/Xcode.app/Contents/Developer/Toolchains/XcodeDefault.xctoolchain/usr/bin SingleSource/Regression/C/gcc-c-torture/execute/CMakeFiles/GCC-C-execute-931012-1.dir/931012-1.c.o  -o SingleSource/Regression/C/gcc-c-torture/execute/GCC-C-execute-931012-1  -Wl,-no_pie && :
Ninja target: alias-4.c.o
[6230/7684] : && /Users/buildslave/jenkins/workspace/test-suite-verify-machineinstrs-x86_64h-O3/test-suite-build/tools/timeit --summary SingleSource/Regression/C/gcc-c-torture/execute/GCC-C-execute-20051110-1.link.time /Users/buildslave/jenkins/workspace/test-suite-verify-machineinstrs-x86_64h-O3/compiler/bin/clang -B /Applications/Xcode.app/Contents/Developer/Toolchains/XcodeDefault.xctoolchain/usr/bin    -Wno-unused-command-line-argument -mllvm -verify-machineinstrs -O3 -arch x86_64h -isysroot /Applications/Xcode.app/Contents/Developer/Platforms/MacOSX.platform/Developer/SDKs/MacOSX10.14.sdk -Wl,-search_paths_first -Wl,-headerpad_max_install_names -B /Applications/Xcode.app/Contents/Developer/Toolchains/XcodeDefault.xctoolchain/usr/bin SingleSource/Regression/C/gcc-c-torture/execute/CMakeFiles/GCC-C-execute-20051110-1.dir/20051110-1.c.o  -o SingleSource/Regression/C/gcc-c-torture/execute/GCC-C-execute-20051110-1  -Wl,-no_pie && :
[6231/7684] /Users/buildslave/jenkins/workspace/test-suite-verify-machineinstrs-x86_64h-O3/test-suite-build/tools/timeit --summary SingleSource/Regression/C/gcc-c-torture/execute/CMakeFiles/GCC-C-execute-960312-1.dir/960312-1.c.o.time /Users/buildslave/jenkins/workspace/test-suite-verify-machineinstrs-x86_64h-O3/compiler/bin/clang -DNDEBUG  -B /Applications/Xcode.app/Contents/Developer/Toolchains/XcodeDefault.xctoolchain/usr/bin    -Wno-unused-command-line-argument -mllvm -verify-machineinstrs -O3 -arch x86_64h -isysroot /Applications/Xcode.app/Contents/Developer/Platforms/MacOSX.platform/Developer/SDKs/MacOSX10.14.sdk   -w -Werror=date-time -w -MD -MT SingleSource/Regression/C/gcc-c-torture/execute/CMakeFiles/GCC-C-execute-960312-1.dir/960312-1.c.o -MF SingleSource/Regression/C/gcc-c-torture/execute/CMakeFiles/GCC-C-execute-960312-1.dir/960312-1.c.o.d -o SingleSource/Regression/C/gcc-c-torture/execute/CMakeFiles/GCC-C-execute-960312-1.dir/960312-1.c.o   -c /Users/buildslave/jenkins/workspace/test-suite-verify-machineinstrs-x86_64h-O3/test-suite/SingleSource/Regression/C/gcc-c-torture/execute/960312-1.c
[6232/7684] : && /Users/buildslave/jenkins/workspace/test-suite-verify-machineinstrs-x86_64h-O3/test-suite-build/tools/timeit --summary SingleSource/Regression/C/gcc-c-torture/execute/GCC-C-execute-20081103-1.link.time /Users/buildslave/jenkins/workspace/test-suite-verify-machineinstrs-x86_64h-O3/compiler/bin/clang -B /Applications/Xcode.app/Contents/Developer/Toolchains/XcodeDefault.xctoolchain/usr/bin    -Wno-unused-command-line-argument -mllvm -verify-machineinstrs -O3 -arch x86_64h -isysroot /Applications/Xcode.app/Contents/Developer/Platforms/MacOSX.platform/Developer/SDKs/MacOSX10.14.sdk -Wl,-search_paths_first -Wl,-headerpad_max_install_names -B /Applications/Xcode.app/Contents/Developer/Toolchains/XcodeDefault.xctoolchain/usr/bin SingleSource/Regression/C/gcc-c-torture/execute/CMakeFiles/GCC-C-execute-20081103-1.dir/20081103-1.c.o  -o SingleSource/Regression/C/gcc-c-torture/execute/GCC-C-execute-20081103-1  -Wl,-no_pie && :
[6233/7684] /Users/buildslave/jenkins/workspace/test-suite-verify-machineinstrs-x86_64h-O3/test-suite-build/tools/timeit --summary SingleSource/Regression/C/gcc-c-torture/execute/CMakeFiles/GCC-C-execute-20000801-2.dir/20000801-2.c.o.time /Users/buildslave/jenkins/workspace/test-suite-verify-machineinstrs-x86_64h-O3/compiler/bin/clang -DNDEBUG  -B /Applications/Xcode.app/Contents/Developer/Toolchains/XcodeDefault.xctoolchain/usr/bin    -Wno-unused-command-line-argument -mllvm -verify-machineinstrs -O3 -arch x86_64h -isysroot /Applications/Xcode.app/Contents/Developer/Platforms/MacOSX.platform/Developer/SDKs/MacOSX10.14.sdk   -w -Werror=date-time -w -MD -MT SingleSource/Regression/C/gcc-c-torture/execute/CMakeFiles/GCC-C-execute-20000801-2.dir/20000801-2.c.o -MF SingleSource/Regression/C/gcc-c-torture/execute/CMakeFiles/GCC-C-execute-20000801-2.dir/20000801-2.c.o.d -o SingleSource/Regression/C/gcc-c-torture/execute/CMakeFiles/GCC-C-execute-20000801-2.dir/20000801-2.c.o   -c /Users/buildslave/jenkins/workspace/test-suite-verify-machineinstrs-x86_64h-O3/test-suite/SingleSource/Regression/C/gcc-c-torture/execute/20000801-2.c
[6234/7684] /Users/buildslave/jenkins/workspace/test-suite-verify-machineinstrs-x86_64h-O3/test-suite-build/tools/timeit --summary SingleSource/Regression/C/gcc-c-torture/execute/CMakeFiles/GCC-C-execute-alias-4.dir/alias-4.c.o.time /Users/buildslave/jenkins/workspace/test-suite-verify-machineinstrs-x86_64h-O3/compiler/bin/clang -DNDEBUG  -B /Applications/Xcode.app/Contents/Developer/Toolchains/XcodeDefault.xctoolchain/usr/bin    -Wno-unused-command-line-argument -mllvm -verify-machineinstrs -O3 -arch x86_64h -isysroot /Applications/Xcode.app/Contents/Developer/Platforms/MacOSX.platform/Developer/SDKs/MacOSX10.14.sdk   -w -Werror=date-time -w -MD -MT SingleSource/Regression/C/gcc-c-torture/execute/CMakeFiles/GCC-C-execute-alias-4.dir/alias-4.c.o -MF SingleSource/Regression/C/gcc-c-torture/execute/CMakeFiles/GCC-C-execute-alias-4.dir/alias-4.c.o.d -o SingleSource/Regression/C/gcc-c-torture/execute/CMakeFiles/GCC-C-execute-alias-4.dir/alias-4.c.o   -c /Users/buildslave/jenkins/workspace/test-suite-verify-machineinstrs-x86_64h-O3/test-suite/SingleSource/Regression/C/gcc-c-torture/execute/alias-4.c
FAILED: SingleSource/Regression/C/gcc-c-torture/execute/CMakeFiles/GCC-C-execute-alias-4.dir/alias-4.c.o 
/Users/buildslave/jenkins/workspace/test-suite-verify-machineinstrs-x86_64h-O3/test-suite-build/tools/timeit --summary SingleSource/Regression/C/gcc-c-torture/execute/CMakeFiles/GCC-C-execute-alias-4.dir/alias-4.c.o.time /Users/buildslave/jenkins/workspace/test-suite-verify-machineinstrs-x86_64h-O3/compiler/bin/clang -DNDEBUG  -B /Applications/Xcode.app/Contents/Developer/Toolchains/XcodeDefault.xctoolchain/usr/bin    -Wno-unused-command-line-argument -mllvm -verify-machineinstrs -O3 -arch x86_64h -isysroot /Applications/Xcode.app/Contents/Developer/Platforms/MacOSX.platform/Developer/SDKs/MacOSX10.14.sdk   -w -Werror=date-time -w -MD -MT SingleSource/Regression/C/gcc-c-torture/execute/CMakeFiles/GCC-C-execute-alias-4.dir/alias-4.c.o -MF SingleSource/Regression/C/gcc-c-torture/execute/CMakeFiles/GCC-C-execute-alias-4.dir/alias-4.c.o.d -o SingleSource/Regression/C/gcc-c-torture/execute/CMakeFiles/GCC-C-execute-alias-4.dir/alias-4.c.o   -c /Users/buildslave/jenkins/workspace/test-suite-verify-machineinstrs-x86_64h-O3/test-suite/SingleSource/Regression/C/gcc-c-torture/execute/alias-4.c
/Users/buildslave/jenkins/workspace/test-suite-verify-machineinstrs-x86_64h-O3/test-suite/SingleSource/Regression/C/gcc-c-torture/execute/alias-4.c:3:30: error: aliases are not supported on darwin
alias-4.c error: aliases are not supported on darwin
[6232/7684] : && /Users/buildslave/jenkins/workspace/test-suite-verify-machineinstrs-x86_64h-O3/test-suite-build/tools/timeit --summary SingleSource/Regression/C/gcc-c-torture/execute/GCC-C-execute-20081103-1.link.time /Users/buildslave/jenkins/workspace/test-suite-verify-machineinstrs-x86_64h-O3/compiler/bin/clang -B /Applications/Xcode.app/Contents/Developer/Toolchains/XcodeDefault.xctoolchain/usr/bin    -Wno-unused-command-line-argument -mllvm -verify-machineinstrs -O3 -arch x86_64h -isysroot /Applications/Xcode.app/Contents/Developer/Platforms/MacOSX.platform/Developer/SDKs/MacOSX10.14.sdk -Wl,-search_paths_first -Wl,-headerpad_max_install_names -B /Applications/Xcode.app/Contents/Developer/Toolchains/XcodeDefault.xctoolchain/usr/bin SingleSource/Regression/C/gcc-c-torture/execute/CMakeFiles/GCC-C-execute-20081103-1.dir/20081103-1.c.o  -o SingleSource/Regression/C/gcc-c-torture/execute/GCC-C-execute-20081103-1  -Wl,-no_pie && :
[6233/7684] /Users/buildslave/jenkins/workspace/test-suite-verify-machineinstrs-x86_64h-O3/test-suite-build/tools/timeit --summary SingleSource/Regression/C/gcc-c-torture/execute/CMakeFiles/GCC-C-execute-20000801-2.dir/20000801-2.c.o.time /Users/buildslave/jenkins/workspace/test-suite-verify-machineinstrs-x86_64h-O3/compiler/bin/clang -DNDEBUG  -B /Applications/Xcode.app/Contents/Developer/Toolchains/XcodeDefault.xctoolchain/usr/bin    -Wno-unused-command-line-argument -mllvm -verify-machineinstrs -O3 -arch x86_64h -isysroot /Applications/Xcode.app/Contents/Developer/Platforms/MacOSX.platform/Developer/SDKs/MacOSX10.14.sdk   -w -Werror=date-time -w -MD -MT SingleSource/Regression/C/gcc-c-torture/execute/CMakeFiles/GCC-C-execute-20000801-2.dir/20000801-2.c.o -MF SingleSource/Regression/C/gcc-c-torture/execute/CMakeFiles/GCC-C-execute-20000801-2.dir/20000801-2.c.o.d -o SingleSource/Regression/C/gcc-c-torture/execute/CMakeFiles/GCC-C-execute-20000801-2.dir/20000801-2.c.o   -c /Users/buildslave/jenkins/workspace/test-suite-verify-machineinstrs-x86_64h-O3/test-suite/SingleSource/Regression/C/gcc-c-torture/execute/20000801-2.c
[6234/7684] /Users/buildslave/jenkins/workspace/test-suite-verify-machineinstrs-x86_64h-O3/test-suite-build/tools/timeit --summary SingleSource/Regression/C/gcc-c-torture/execute/CMakeFiles/GCC-C-execute-alias-4.dir/alias-4.c.o.time /Users/buildslave/jenkins/workspace/test-suite-verify-machineinstrs-x86_64h-O3/compiler/bin/clang -DNDEBUG  -B /Applications/Xcode.app/Contents/Developer/Toolchains/XcodeDefault.xctoolchain/usr/bin    -Wno-unused-command-line-argument -mllvm -verify-machineinstrs -O3 -arch x86_64h -isysroot /Applications/Xcode.app/Contents/Developer/Platforms/MacOSX.platform/Developer/SDKs/MacOSX10.14.sdk   -w -Werror=date-time -w -MD -MT SingleSource/Regression/C/gcc-c-torture/execute/CMakeFiles/GCC-C-execute-alias-4.dir/alias-4.c.o -MF SingleSource/Regression/C/gcc-c-torture/execute/CMakeFiles/GCC-C-execute-alias-4.dir/alias-4.c.o.d -o SingleSource/Regression/C/gcc-c-torture/execute/CMakeFiles/GCC-C-execute-alias-4.dir/alias-4.c.o   -c /Users/buildslave/jenkins/workspace/test-suite-verify-machineinstrs-x86_64h-O3/test-suite/SingleSource/Regression/C/gcc-c-torture/execute/alias-4.c
FAILED: SingleSource/Regression/C/gcc-c-torture/execute/CMakeFiles/GCC-C-execute-alias-4.dir/alias-4.c.o 
/Users/buildslave/jenkins/workspace/test-suite-verify-machineinstrs-x86_64h-O3/test-suite-build/tools/timeit --summary SingleSource/Regression/C/gcc-c-torture/execute/CMakeFiles/GCC-C-execute-alias-4.dir/alias-4.c.o.time /Users/buildslave/jenkins/workspace/test-suite-verify-machineinstrs-x86_64h-O3/compiler/bin/clang -DNDEBUG  -B /Applications/Xcode.app/Contents/Developer/Toolchains/XcodeDefault.xctoolchain/usr/bin    -Wno-unused-command-line-argument -mllvm -verify-machineinstrs -O3 -arch x86_64h -isysroot /Applications/Xcode.app/Contents/Developer/Platforms/MacOSX.platform/Developer/SDKs/MacOSX10.14.sdk   -w -Werror=date-time -w -MD -MT SingleSource/Regression/C/gcc-c-torture/execute/CMakeFiles/GCC-C-execute-alias-4.dir/alias-4.c.o -MF SingleSource/Regression/C/gcc-c-torture/execute/CMakeFiles/GCC-C-execute-alias-4.dir/alias-4.c.o.d -o SingleSource/Regression/C/gcc-c-torture/execute/CMakeFiles/GCC-C-execute-alias-4.dir/alias-4.c.o   -c /Users/buildslave/jenkins/workspace/test-suite-verify-machineinstrs-x86_64h-O3/test-suite/SingleSource/Regression/C/gcc-c-torture/execute/alias-4.c
/Users/buildslave/jenkins/workspace/test-suite-verify-machineinstrs-x86_64h-O3/test-suite/SingleSource/Regression/C/gcc-c-torture/execute/alias-4.c:3:30: error: aliases are not supported on darwin
extern int b __attribute__ ((alias ("a")));
                             ^
alias-4.c error: aliases are not supported on darwin
FAILED: SingleSource/Regression/C/gcc-c-torture/execute/CMakeFiles/GCC-C-execute-alias-4.dir/alias-4.c.o 
/Users/buildslave/jenkins/workspace/test-suite-verify-machineinstrs-x86_64h-O3/test-suite-build/tools/timeit --summary SingleSource/Regression/C/gcc-c-torture/execute/CMakeFiles/GCC-C-execute-alias-4.dir/alias-4.c.o.time /Users/buildslave/jenkins/workspace/test-suite-verify-machineinstrs-x86_64h-O3/compiler/bin/clang -DNDEBUG  -B /Applications/Xcode.app/Contents/Developer/Toolchains/XcodeDefault.xctoolchain/usr/bin    -Wno-unused-command-line-argument -mllvm -verify-machineinstrs -O3 -arch x86_64h -isysroot /Applications/Xcode.app/Contents/Developer/Platforms/MacOSX.platform/Developer/SDKs/MacOSX10.14.sdk   -w -Werror=date-time -w -MD -MT SingleSource/Regression/C/gcc-c-torture/execute/CMakeFiles/GCC-C-execute-alias-4.dir/alias-4.c.o -MF SingleSource/Regression/C/gcc-c-torture/execute/CMakeFiles/GCC-C-execute-alias-4.dir/alias-4.c.o.d -o SingleSource/Regression/C/gcc-c-torture/execute/CMakeFiles/GCC-C-execute-alias-4.dir/alias-4.c.o   -c /Users/buildslave/jenkins/workspace/test-suite-verify-machineinstrs-x86_64h-O3/test-suite/SingleSource/Regression/C/gcc-c-torture/execute/alias-4.c
/Users/buildslave/jenkins/workspace/test-suite-verify-machineinstrs-x86_64h-O3/test-suite/SingleSource/Regression/C/gcc-c-torture/execute/alias-4.c:3:30: error: aliases are not supported on darwin
extern int b __attribute__ ((alias ("a")));
                             ^
/Users/buildslave/jenkins/workspace/test-suite-verify-machineinstrs-x86_64h-O3/test-suite/SingleSource/Regression/C/gcc-c-torture/execute/alias-4.c:5:30: error: aliases are not supported on darwin
extern int d __attribute__ ((alias ("c")));
                             ^
Ninja target: GCC-C-execute-920501-8
[7250/7684] /Users/buildslave/jenkins/workspace/test-suite-verify-machineinstrs-x86_64h-O3/test-suite-build/tools/timeit --summary SingleSource/Regression/C/gcc-c-torture/execute/CMakeFiles/GCC-C-execute-920501-8.dir/920501-8.c.o.time /Users/buildslave/jenkins/workspace/test-suite-verify-machineinstrs-x86_64h-O3/compiler/bin/clang -DNDEBUG  -B /Applications/Xcode.app/Contents/Developer/Toolchains/XcodeDefault.xctoolchain/usr/bin    -Wno-unused-command-line-argument -mllvm -verify-machineinstrs -O3 -arch x86_64h -isysroot /Applications/Xcode.app/Contents/Developer/Platforms/MacOSX.platform/Developer/SDKs/MacOSX10.14.sdk   -w -Werror=date-time -w -MD -MT SingleSource/Regression/C/gcc-c-torture/execute/CMakeFiles/GCC-C-execute-920501-8.dir/920501-8.c.o -MF SingleSource/Regression/C/gcc-c-torture/execute/CMakeFiles/GCC-C-execute-920501-8.dir/920501-8.c.o.d -o SingleSource/Regression/C/gcc-c-torture/execute/CMakeFiles/GCC-C-execute-920501-8.dir/920501-8.c.o   -c /Users/buildslave/jenkins/workspace/test-suite-verify-machineinstrs-x86_64h-O3/test-suite/SingleSource/Regression/C/gcc-c-torture/execute/920501-8.c
[7251/7684] /Users/buildslave/jenkins/workspace/test-suite-verify-machineinstrs-x86_64h-O3/test-suite-build/tools/timeit --summary SingleSource/Regression/C/gcc-c-torture/execute/CMakeFiles/GCC-C-execute-pr43560.dir/pr43560.c.o.time /Users/buildslave/jenkins/workspace/test-suite-verify-machineinstrs-x86_64h-O3/compiler/bin/clang -DNDEBUG  -B /Applications/Xcode.app/Contents/Developer/Toolchains/XcodeDefault.xctoolchain/usr/bin    -Wno-unused-command-line-argument -mllvm -verify-machineinstrs -O3 -arch x86_64h -isysroot /Applications/Xcode.app/Contents/Developer/Platforms/MacOSX.platform/Developer/SDKs/MacOSX10.14.sdk   -w -Werror=date-time -w -MD -MT SingleSource/Regression/C/gcc-c-torture/execute/CMakeFiles/GCC-C-execute-pr43560.dir/pr43560.c.o -MF SingleSource/Regression/C/gcc-c-torture/execute/CMakeFiles/GCC-C-execute-pr43560.dir/pr43560.c.o.d -o SingleSource/Regression/C/gcc-c-torture/execute/CMakeFiles/GCC-C-execute-pr43560.dir/pr43560.c.o   -c /Users/buildslave/jenkins/workspace/test-suite-verify-machineinstrs-x86_64h-O3/test-suite/SingleSource/Regression/C/gcc-c-torture/execute/pr43560.c
[7252/7684] : && /Users/buildslave/jenkins/workspace/test-suite-verify-machineinstrs-x86_64h-O3/test-suite-build/tools/timeit --summary SingleSource/Regression/C/gcc-c-torture/execute/GCC-C-execute-pr84521.link.time /Users/buildslave/jenkins/workspace/test-suite-verify-machineinstrs-x86_64h-O3/compiler/bin/clang -B /Applications/Xcode.app/Contents/Developer/Toolchains/XcodeDefault.xctoolchain/usr/bin    -Wno-unused-command-line-argument -mllvm -verify-machineinstrs -O3 -arch x86_64h -isysroot /Applications/Xcode.app/Contents/Developer/Platforms/MacOSX.platform/Developer/SDKs/MacOSX10.14.sdk -Wl,-search_paths_first -Wl,-headerpad_max_install_names -B /Applications/Xcode.app/Contents/Developer/Toolchains/XcodeDefault.xctoolchain/usr/bin SingleSource/Regression/C/gcc-c-torture/execute/CMakeFiles/GCC-C-execute-pr84521.dir/pr84521.c.o  -o SingleSource/Regression/C/gcc-c-torture/execute/GCC-C-execute-pr84521  -Wl,-no_pie && :
[7253/7684] : && /Users/buildslave/jenkins/workspace/test-suite-verify-machineinstrs-x86_64h-O3/test-suite-build/tools/timeit --summary SingleSource/Regression/C/gcc-c-torture/execute/GCC-C-execute-930208-1.link.time /Users/buildslave/jenkins/workspace/test-suite-verify-machineinstrs-x86_64h-O3/compiler/bin/clang -B /Applications/Xcode.app/Contents/Developer/Toolchains/XcodeDefault.xctoolchain/usr/bin    -Wno-unused-command-line-argument -mllvm -verify-machineinstrs -O3 -arch x86_64h -isysroot /Applications/Xcode.app/Contents/Developer/Platforms/MacOSX.platform/Developer/SDKs/MacOSX10.14.sdk -Wl,-search_paths_first -Wl,-headerpad_max_install_names -B /Applications/Xcode.app/Contents/Developer/Toolchains/XcodeDefault.xctoolchain/usr/bin SingleSource/Regression/C/gcc-c-torture/execute/CMakeFiles/GCC-C-execute-930208-1.dir/930208-1.c.o  -o SingleSource/Regression/C/gcc-c-torture/execute/GCC-C-execute-930208-1  -Wl,-no_pie && :
[7254/7684] : && /Users/buildslave/jenkins/workspace/test-suite-verify-machineinstrs-x86_64h-O3/test-suite-build/tools/timeit --summary SingleSource/Regression/C/gcc-c-torture/execute/GCC-C-execute-920501-8.link.time /Users/buildslave/jenkins/workspace/test-suite-verify-machineinstrs-x86_64h-O3/compiler/bin/clang -B /Applications/Xcode.app/Contents/Developer/Toolchains/XcodeDefault.xctoolchain/usr/bin    -Wno-unused-command-line-argument -mllvm -verify-machineinstrs -O3 -arch x86_64h -isysroot /Applications/Xcode.app/Contents/Developer/Platforms/MacOSX.platform/Developer/SDKs/MacOSX10.14.sdk -Wl,-search_paths_first -Wl,-headerpad_max_install_names -B /Applications/Xcode.app/Contents/Developer/Toolchains/XcodeDefault.xctoolchain/usr/bin SingleSource/Regression/C/gcc-c-torture/execute/CMakeFiles/GCC-C-execute-920501-8.dir/920501-8.c.o  -o SingleSource/Regression/C/gcc-c-torture/execute/GCC-C-execute-920501-8  -Wl,-no_pie -Wl,-u,_printf_float && :
FAILED: SingleSource/Regression/C/gcc-c-torture/execute/GCC-C-execute-920501-8 
: && /Users/buildslave/jenkins/workspace/test-suite-verify-machineinstrs-x86_64h-O3/test-suite-build/tools/timeit --summary SingleSource/Regression/C/gcc-c-torture/execute/GCC-C-execute-920501-8.link.time /Users/buildslave/jenkins/workspace/test-suite-verify-machineinstrs-x86_64h-O3/compiler/bin/clang -B /Applications/Xcode.app/Contents/Developer/Toolchains/XcodeDefault.xctoolchain/usr/bin    -Wno-unused-command-line-argument -mllvm -verify-machineinstrs -O3 -arch x86_64h -isysroot /Applications/Xcode.app/Contents/Developer/Platforms/MacOSX.platform/Developer/SDKs/MacOSX10.14.sdk -Wl,-search_paths_first -Wl,-headerpad_max_install_names -B /Applications/Xcode.app/Contents/Developer/Toolchains/XcodeDefault.xctoolchain/usr/bin SingleSource/Regression/C/gcc-c-torture/execute/CMakeFiles/GCC-C-execute-920501-8.dir/920501-8.c.o  -o SingleSource/Regression/C/gcc-c-torture/execute/GCC-C-execute-920501-8  -Wl,-no_pie -Wl,-u,_printf_float && :
Undefined symbols for architecture x86_64h:
link error
: && /Users/buildslave/jenkins/workspace/test-suite-verify-machineinstrs-x86_64h-O3/test-suite-build/tools/timeit --summary SingleSource/Regression/C/gcc-c-torture/execute/GCC-C-execute-920501-8.link.time /Users/buildslave/jenkins/workspace/test-suite-verify-machineinstrs-x86_64h-O3/compiler/bin/clang -B /Applications/Xcode.app/Contents/Developer/Toolchains/XcodeDefault.xctoolchain/usr/bin    -Wno-unused-command-line-argument -mllvm -verify-machineinstrs -O3 -arch x86_64h -isysroot /Applications/Xcode.app/Contents/Developer/Platforms/MacOSX.platform/Developer/SDKs/MacOSX10.14.sdk -Wl,-search_paths_first -Wl,-headerpad_max_install_names -B /Applications/Xcode.app/Contents/Developer/Toolchains/XcodeDefault.xctoolchain/usr/bin SingleSource/Regression/C/gcc-c-torture/execute/CMakeFiles/GCC-C-execute-920501-8.dir/920501-8.c.o  -o SingleSource/Regression/C/gcc-c-torture/execute/GCC-C-execute-920501-8  -Wl,-no_pie -Wl,-u,_printf_float && :
Undefined symbols for architecture x86_64h:
  "_printf_float", referenced from:
     -u command line option
ld: symbol(s) not found for architecture x86_64h
clang-10: error: linker command failed with exit code 1 (use -v to see invocation)
[7255/7684] : && /Users/buildslave/jenkins/workspace/test-suite-verify-machineinstrs-x86_64h-O3/test-suite-build/tools/timeit --summary SingleSource/Regression/C/gcc-c-torture/execute/GCC-C-execute-pr43560.link.time /Users/buildslave/jenkins/workspace/test-suite-verify-machineinstrs-x86_64h-O3/compiler/bin/clang -B /Applications/Xcode.app/Contents/Developer/Toolchains/XcodeDefault.xctoolchain/usr/bin    -Wno-unused-command-line-argument -mllvm -verify-machineinstrs -O3 -arch x86_64h -isysroot /Applications/Xcode.app/Contents/Developer/Platforms/MacOSX.platform/Developer/SDKs/MacOSX10.14.sdk -Wl,-search_paths_first -Wl,-headerpad_max_install_names -B /Applications/Xcode.app/Contents/Developer/Toolchains/XcodeDefault.xctoolchain/usr/bin SingleSource/Regression/C/gcc-c-torture/execute/CMakeFiles/GCC-C-execute-pr43560.dir/pr43560.c.o  -o SingleSource/Regression/C/gcc-c-torture/execute/GCC-C-execute-pr43560  -Wl,-no_pie && :
[7256/7684] /Users/buildslave/jenkins/workspace/test-suite-verify-machineinstrs-x86_64h-O3/test-suite-build/tools/timeit --summary SingleSource/Regression/C/gcc-c-torture/execute/CMakeFiles/GCC-C-execute-931228-1.dir/931228-1.c.o.time /Users/buildslave/jenkins/workspace/test-suite-verify-machineinstrs-x86_64h-O3/compiler/bin/clang -DNDEBUG  -B /Applications/Xcode.app/Contents/Developer/Toolchains/XcodeDefault.xctoolchain/usr/bin    -Wno-unused-command-line-argument -mllvm -verify-machineinstrs -O3 -arch x86_64h -isysroot /Applications/Xcode.app/Contents/Developer/Platforms/MacOSX.platform/Developer/SDKs/MacOSX10.14.sdk   -w -Werror=date-time -w -MD -MT SingleSource/Regression/C/gcc-c-torture/execute/CMakeFiles/GCC-C-execute-931228-1.dir/931228-1.c.o -MF SingleSource/Regression/C/gcc-c-torture/execute/CMakeFiles/GCC-C-execute-931228-1.dir/931228-1.c.o.d -o SingleSource/Regression/C/gcc-c-torture/execute/CMakeFiles/GCC-C-execute-931228-1.dir/931228-1.c.o   -c /Users/buildslave/jenkins/workspace/test-suite-verify-machineinstrs-x86_64h-O3/test-suite/SingleSource/Regression/C/gcc-c-torture/execute/931228-1.c

Build Log

Changes
  1. gn build: make sync build work with git revs now that svn is gone (detail)
  2. [AMDGPU] Allow tied operand subreg folding (detail)
  3. Test commit - add clarification to README regarding Darwin. (detail)
  4. Relax assertions when there's really no entries. [NFC] (detail)
  5. [AMDGPU] Updated fold-vgpr-copy.mir test. NFC. (detail)
  6. [NFC][LVI][CVP] Tests where pre-specified `add` no-wrap flags could be (detail)
  7. [DAGCombine][ARM] x ==/!= c  ->  (x - c) ==/!= 0  iff '-c' can be folded (detail)
  8. [HIP] Add option -fgpu-allow-device-init (detail)
  9. [RISCV] Add support for -ffixed-xX flags (detail)
  10. fix a few typos to test git committing (detail)
  11. Revert "Fix lld detection in standalone compiler-rt." (detail)
  12. Fix name of warn_ignored_hip_only_option (detail)
  13. Revert r374202"[ObjC generics] Fix not inheriting type bounds in (detail)

Started by upstream project relay-test-suite-verify-machineinstrs build number 6522
originally caused by:

This run spent:

  • 1 hr 6 min waiting;
  • 1 hr 33 min build duration;
  • 1 hr 33 min total from scheduled to completion.
Revision: 4c539e8da1b3de38a53ef3f7497f5c45a3243b61
  • detached

Identified problems

Ninja target failed

Below is a link to the first failed ninja target.
Indication 1

Compile Error

This build failed because of a compile error. Below is a list of all errors in the build log:
Indication 2

Link error

A link command has failed:
Indication 3