FailedConsole Output

Skipping 7,380 KB.. Full Log
4 of 3054)
PASS: SanitizerCommon-asan-x86_64-Darwin :: corelimit.cpp (1525 of 3054)
PASS: SanitizerCommon-asan-x86_64-Darwin :: ctype.c (1526 of 3054)
PASS: SanitizerCommon-asan-x86_64-Darwin :: fopen_nullptr.c (1527 of 3054)
UNSUPPORTED: SanitizerCommon-asan-x86_64-Darwin :: hard_rss_limit_mb_test.cpp (1528 of 3054)
PASS: SanitizerCommon-asan-x86_64-Darwin :: malloc_hook.cpp (1529 of 3054)
PASS: SanitizerCommon-asan-x86_64-Darwin :: get_module_and_offset_for_pc.cpp (1530 of 3054)
PASS: SanitizerCommon-asan-x86_64-Darwin :: onprint.cpp (1531 of 3054)
PASS: SanitizerCommon-asan-x86_64-Darwin :: options-help.cpp (1532 of 3054)
PASS: SanitizerCommon-asan-x86_64-Darwin :: options-include.cpp (1533 of 3054)
PASS: SanitizerCommon-asan-x86_64-Darwin :: options-invalid.cpp (1534 of 3054)
UNSUPPORTED: SanitizerCommon-asan-x86_64-Darwin :: print-stack-trace.cpp (1535 of 3054)
PASS: SanitizerCommon-asan-x86_64-Darwin :: allocator_returns_null.cpp (1536 of 3054)
PASS: SanitizerCommon-asan-x86_64-Darwin :: printf-ldbl.c (1537 of 3054)
UNSUPPORTED: SanitizerCommon-asan-x86_64-Darwin :: reallocarray-overflow.cpp (1538 of 3054)
UNSUPPORTED: SanitizerCommon-asan-x86_64-Darwin :: sanitizer_coverage_allowlist_blocklist.cpp (1539 of 3054)
PASS: SanitizerCommon-asan-x86_64-Darwin :: pthread_mutexattr_get.cpp (1540 of 3054)
UNSUPPORTED: SanitizerCommon-asan-x86_64-Darwin :: sanitizer_coverage_inline_bool_flag.cpp (1541 of 3054)
PASS: SanitizerCommon-asan-x86_64-Darwin :: sanitizer_coverage_inline8bit_counter.cpp (1542 of 3054)
PASS: SanitizerCommon-asan-x86_64-Darwin :: sanitizer_coverage_no_prune.cpp (1543 of 3054)
UNSUPPORTED: SanitizerCommon-asan-x86_64-Darwin :: sanitizer_coverage_symbolize.cpp (1544 of 3054)
PASS: SanitizerCommon-asan-x86_64-Darwin :: max_allocation_size.cpp (1545 of 3054)
UNSUPPORTED: SanitizerCommon-asan-x86_64-Darwin :: sanitizer_coverage_trace_pc_guard-init.cpp (1546 of 3054)
PASS: SanitizerCommon-asan-x86_64-Darwin :: sanitizer_coverage_stack_depth.cpp (1547 of 3054)
PASS: SanitizerCommon-asan-x86_64-Darwin :: sanitizer_coverage_trace_pc_guard.cpp (1548 of 3054)
PASS: SanitizerCommon-asan-x86_64-Darwin :: scanf-ldbl.c (1549 of 3054)
XFAIL: SanitizerCommon-asan-x86_64-Darwin :: sanitizer_coverage_trace_pc_guard-dso.cpp (1550 of 3054)
PASS: SanitizerCommon-asan-x86_64-Darwin :: strcasestr.c (1551 of 3054)
PASS: SanitizerCommon-asan-x86_64-Darwin :: strcspn.c (1552 of 3054)
PASS: SanitizerCommon-asan-x86_64-Darwin :: strnlen.c (1553 of 3054)
PASS: SanitizerCommon-asan-x86_64-Darwin :: strpbrk.c (1554 of 3054)
PASS: SanitizerCommon-asan-x86_64-Darwin :: strspn.c (1555 of 3054)
PASS: SanitizerCommon-asan-x86_64-Darwin :: strstr.c (1556 of 3054)
PASS: SanitizerCommon-asan-x86_64-Darwin :: symbolize_debug_argv.cpp (1557 of 3054)
PASS: SanitizerCommon-asan-x86_64-Darwin :: symbolize_pc.cpp (1558 of 3054)
XFAIL: SanitizerCommon-asan-x86_64-Darwin :: symbolize_pc_inline.cpp (1559 of 3054)
PASS: SanitizerCommon-asan-x86_64-Darwin :: wcrtomb.c (1560 of 3054)
UNSUPPORTED: SanitizerCommon-lsan-x86_64-Darwin :: Darwin/abort_on_error.cpp (1561 of 3054)
PASS: SanitizerCommon-asan-x86_64-Darwin :: wctomb.c (1562 of 3054)
PASS: SanitizerCommon-lsan-x86_64-Darwin :: Darwin/fputs_puts_null.cpp (1563 of 3054)
UNSUPPORTED: SanitizerCommon-lsan-x86_64-Darwin :: Darwin/print-stack-trace-in-code-loaded-after-fork.cpp (1564 of 3054)
PASS: SanitizerCommon-lsan-x86_64-Darwin :: Darwin/malloc_zone.cpp (1565 of 3054)
PASS: SanitizerCommon-lsan-x86_64-Darwin :: Darwin/print-stack-trace.cpp (1566 of 3054)
UNSUPPORTED: SanitizerCommon-lsan-x86_64-Darwin :: Darwin/symbolizer-function-offset-dladdr.cpp (1567 of 3054)
UNSUPPORTED: SanitizerCommon-lsan-x86_64-Darwin :: FreeBSD/capsicum.cpp (1568 of 3054)
UNSUPPORTED: SanitizerCommon-lsan-x86_64-Darwin :: FreeBSD/fdevname.cpp (1569 of 3054)
UNSUPPORTED: SanitizerCommon-lsan-x86_64-Darwin :: Linux/abort_on_error.cpp (1570 of 3054)
UNSUPPORTED: SanitizerCommon-lsan-x86_64-Darwin :: Linux/aligned_alloc-alignment.cpp (1571 of 3054)
UNSUPPORTED: SanitizerCommon-lsan-x86_64-Darwin :: Linux/aligned_alloc.c (1572 of 3054)
UNSUPPORTED: SanitizerCommon-lsan-x86_64-Darwin :: Linux/allow_user_segv.cpp (1573 of 3054)
UNSUPPORTED: SanitizerCommon-lsan-x86_64-Darwin :: Linux/assert.cpp (1574 of 3054)
UNSUPPORTED: SanitizerCommon-lsan-x86_64-Darwin :: Linux/closedir.c (1575 of 3054)
UNSUPPORTED: SanitizerCommon-lsan-x86_64-Darwin :: Linux/clock_gettime.c (1576 of 3054)
UNSUPPORTED: SanitizerCommon-lsan-x86_64-Darwin :: Linux/getcpuclockid.c (1577 of 3054)
UNSUPPORTED: SanitizerCommon-lsan-x86_64-Darwin :: Linux/crypt_r.cpp (1578 of 3054)
UNSUPPORTED: SanitizerCommon-lsan-x86_64-Darwin :: Linux/deepbind.cpp (1579 of 3054)
UNSUPPORTED: SanitizerCommon-lsan-x86_64-Darwin :: Linux/getpwnam_r_invalid_user.cpp (1580 of 3054)
UNSUPPORTED: SanitizerCommon-lsan-x86_64-Darwin :: Linux/decorate_proc_maps.cpp (1581 of 3054)
UNSUPPORTED: SanitizerCommon-lsan-x86_64-Darwin :: Linux/iconv_test.c (1582 of 3054)
UNSUPPORTED: SanitizerCommon-lsan-x86_64-Darwin :: Linux/ill.cpp (1583 of 3054)
UNSUPPORTED: SanitizerCommon-lsan-x86_64-Darwin :: Linux/mlock_test.cpp (1584 of 3054)
UNSUPPORTED: SanitizerCommon-lsan-x86_64-Darwin :: Linux/mmap64_test.c (1585 of 3054)
UNSUPPORTED: SanitizerCommon-lsan-x86_64-Darwin :: Linux/mallopt.cpp (1586 of 3054)
UNSUPPORTED: SanitizerCommon-lsan-x86_64-Darwin :: Linux/mmap_write_exec.cpp (1587 of 3054)
UNSUPPORTED: SanitizerCommon-lsan-x86_64-Darwin :: Linux/mprobe.cpp (1588 of 3054)
UNSUPPORTED: SanitizerCommon-lsan-x86_64-Darwin :: Linux/name_to_handle_at.cpp (1589 of 3054)
UNSUPPORTED: SanitizerCommon-lsan-x86_64-Darwin :: Linux/new_delete_test.cpp (1590 of 3054)
UNSUPPORTED: SanitizerCommon-lsan-x86_64-Darwin :: Linux/open_memstream.cpp (1591 of 3054)
UNSUPPORTED: SanitizerCommon-lsan-x86_64-Darwin :: Linux/protoent.cpp (1592 of 3054)
UNSUPPORTED: SanitizerCommon-lsan-x86_64-Darwin :: Linux/pthread_mutex.cpp (1593 of 3054)
UNSUPPORTED: SanitizerCommon-lsan-x86_64-Darwin :: Linux/ptrace.cpp (1594 of 3054)
UNSUPPORTED: SanitizerCommon-lsan-x86_64-Darwin :: Linux/pvalloc-overflow.cpp (1595 of 3054)
UNSUPPORTED: SanitizerCommon-lsan-x86_64-Darwin :: Linux/recv_msg_trunc.cpp (1596 of 3054)
UNSUPPORTED: SanitizerCommon-lsan-x86_64-Darwin :: Linux/sched_getparam.cpp (1597 of 3054)
UNSUPPORTED: SanitizerCommon-lsan-x86_64-Darwin :: Linux/sem_init_glibc.cpp (1598 of 3054)
UNSUPPORTED: SanitizerCommon-lsan-x86_64-Darwin :: Linux/signal_line.cpp (1599 of 3054)
UNSUPPORTED: SanitizerCommon-lsan-x86_64-Darwin :: Linux/signal_name.c (1600 of 3054)
UNSUPPORTED: SanitizerCommon-lsan-x86_64-Darwin :: Linux/signal_segv_handler.cpp (1601 of 3054)
UNSUPPORTED: SanitizerCommon-lsan-x86_64-Darwin :: Linux/signal_send.cpp (1602 of 3054)
UNSUPPORTED: SanitizerCommon-lsan-x86_64-Darwin :: Linux/signal_trap_handler.cpp (1603 of 3054)
UNSUPPORTED: SanitizerCommon-lsan-x86_64-Darwin :: Linux/soft_rss_limit_mb_test.cpp (1604 of 3054)
UNSUPPORTED: SanitizerCommon-lsan-x86_64-Darwin :: Linux/sysconf_interceptor_bypass_test.cpp (1605 of 3054)
UNSUPPORTED: SanitizerCommon-lsan-x86_64-Darwin :: Linux/sysmsg.c (1606 of 3054)
UNSUPPORTED: SanitizerCommon-lsan-x86_64-Darwin :: Linux/timerfd.cpp (1607 of 3054)
UNSUPPORTED: SanitizerCommon-lsan-x86_64-Darwin :: Linux/unexpected_format_specifier_test.cpp (1608 of 3054)
UNSUPPORTED: SanitizerCommon-lsan-x86_64-Darwin :: Linux/xdrrec.cpp (1609 of 3054)
UNSUPPORTED: SanitizerCommon-lsan-x86_64-Darwin :: NetBSD/asysctl.cpp (1610 of 3054)
UNSUPPORTED: SanitizerCommon-lsan-x86_64-Darwin :: NetBSD/cdb.cpp (1611 of 3054)
UNSUPPORTED: SanitizerCommon-lsan-x86_64-Darwin :: NetBSD/faccessat.cpp (1612 of 3054)
UNSUPPORTED: SanitizerCommon-lsan-x86_64-Darwin :: NetBSD/fparseln.cpp (1613 of 3054)
UNSUPPORTED: SanitizerCommon-lsan-x86_64-Darwin :: NetBSD/funopen2.cpp (1614 of 3054)
UNSUPPORTED: SanitizerCommon-lsan-x86_64-Darwin :: NetBSD/getgrouplist.cpp (1615 of 3054)
UNSUPPORTED: SanitizerCommon-lsan-x86_64-Darwin :: NetBSD/getgroupmembership.cpp (1616 of 3054)
UNSUPPORTED: SanitizerCommon-lsan-x86_64-Darwin :: NetBSD/getvfsstat.cpp (1617 of 3054)
UNSUPPORTED: SanitizerCommon-lsan-x86_64-Darwin :: NetBSD/gid_from_group.cpp (1618 of 3054)
UNSUPPORTED: SanitizerCommon-lsan-x86_64-Darwin :: NetBSD/group_from_gid.cpp (1619 of 3054)
UNSUPPORTED: SanitizerCommon-lsan-x86_64-Darwin :: NetBSD/md2.cpp (1620 of 3054)
UNSUPPORTED: SanitizerCommon-lsan-x86_64-Darwin :: NetBSD/md4.cpp (1621 of 3054)
UNSUPPORTED: SanitizerCommon-lsan-x86_64-Darwin :: NetBSD/md5.cpp (1622 of 3054)
UNSUPPORTED: SanitizerCommon-lsan-x86_64-Darwin :: NetBSD/mi_vector_hash.cpp (1623 of 3054)
UNSUPPORTED: SanitizerCommon-lsan-x86_64-Darwin :: NetBSD/netent.cpp (1624 of 3054)
UNSUPPORTED: SanitizerCommon-lsan-x86_64-Darwin :: NetBSD/paccept.cpp (1625 of 3054)
UNSUPPORTED: SanitizerCommon-lsan-x86_64-Darwin :: NetBSD/protoent.cpp (1626 of 3054)
UNSUPPORTED: SanitizerCommon-lsan-x86_64-Darwin :: NetBSD/rmd160.cpp (1627 of 3054)
UNSUPPORTED: SanitizerCommon-lsan-x86_64-Darwin :: NetBSD/sha1.cpp (1628 of 3054)
UNSUPPORTED: SanitizerCommon-lsan-x86_64-Darwin :: NetBSD/sha2.cpp (1629 of 3054)
UNSUPPORTED: SanitizerCommon-lsan-x86_64-Darwin :: NetBSD/statvfs1.cpp (1630 of 3054)
UNSUPPORTED: SanitizerCommon-lsan-x86_64-Darwin :: NetBSD/strmode.cpp (1631 of 3054)
UNSUPPORTED: SanitizerCommon-lsan-x86_64-Darwin :: NetBSD/strtoi.cpp (1632 of 3054)
UNSUPPORTED: SanitizerCommon-lsan-x86_64-Darwin :: NetBSD/sysctlgetmibinfo.cpp (1633 of 3054)
UNSUPPORTED: SanitizerCommon-lsan-x86_64-Darwin :: NetBSD/ttyent.cpp (1634 of 3054)
UNSUPPORTED: SanitizerCommon-lsan-x86_64-Darwin :: NetBSD/uid_from_user.cpp (1635 of 3054)
UNSUPPORTED: SanitizerCommon-lsan-x86_64-Darwin :: NetBSD/user_from_uid.cpp (1636 of 3054)
PASS: SanitizerCommon-asan-x86_64-Darwin :: symbolize_stack.cpp (1637 of 3054)
PASS: SanitizerCommon-lsan-x86_64-Darwin :: Posix/access.cpp (1638 of 3054)
UNSUPPORTED: SanitizerCommon-lsan-x86_64-Darwin :: Posix/crypt.cpp (1639 of 3054)
PASS: SanitizerCommon-lsan-x86_64-Darwin :: Posix/arc4random.cpp (1640 of 3054)
PASS: SanitizerCommon-lsan-x86_64-Darwin :: Posix/devname.cpp (1641 of 3054)
PASS: SanitizerCommon-lsan-x86_64-Darwin :: Darwin/symbolizer-function-offset-atos.cpp (1642 of 3054)
PASS: SanitizerCommon-lsan-x86_64-Darwin :: Posix/devname_r.cpp (1643 of 3054)
UNSUPPORTED: SanitizerCommon-lsan-x86_64-Darwin :: Posix/dump_registers.cpp (1644 of 3054)
PASS: SanitizerCommon-lsan-x86_64-Darwin :: Posix/feof_fileno_ferror.cpp (1645 of 3054)
PASS: SanitizerCommon-lsan-x86_64-Darwin :: Posix/fgetc_ungetc_getc.cpp (1646 of 3054)
PASS: SanitizerCommon-lsan-x86_64-Darwin :: Posix/dump_instruction_bytes.cpp (1647 of 3054)
PASS: SanitizerCommon-lsan-x86_64-Darwin :: Posix/dedup_token_length_test.cpp (1648 of 3054)
PASS: SanitizerCommon-lsan-x86_64-Darwin :: Posix/fgetln.cpp (1649 of 3054)
PASS: SanitizerCommon-lsan-x86_64-Darwin :: Posix/fgets.cpp (1650 of 3054)
PASS: SanitizerCommon-lsan-x86_64-Darwin :: Posix/fputc_putc_putchar.cpp (1651 of 3054)
UNSUPPORTED: SanitizerCommon-lsan-x86_64-Darwin :: Posix/fseek.cpp (1652 of 3054)
UNSUPPORTED: SanitizerCommon-lsan-x86_64-Darwin :: Posix/fts.cpp (1653 of 3054)
UNSUPPORTED: SanitizerCommon-lsan-x86_64-Darwin :: Posix/funopen.cpp (1654 of 3054)
PASS: SanitizerCommon-lsan-x86_64-Darwin :: Posix/fputs_puts.cpp (1655 of 3054)
UNSUPPORTED: SanitizerCommon-lsan-x86_64-Darwin :: Posix/getfsent.cpp (1656 of 3054)
PASS: SanitizerCommon-lsan-x86_64-Darwin :: Posix/getc_unlocked.cpp (1657 of 3054)
PASS: SanitizerCommon-lsan-x86_64-Darwin :: Posix/getmntinfo.cpp (1658 of 3054)
PASS: SanitizerCommon-lsan-x86_64-Darwin :: Posix/fpe.cpp (1659 of 3054)
UNSUPPORTED: SanitizerCommon-lsan-x86_64-Darwin :: Posix/getrandom.c (1660 of 3054)
PASS: SanitizerCommon-lsan-x86_64-Darwin :: Posix/getpass.cpp (1661 of 3054)
PASS: SanitizerCommon-lsan-x86_64-Darwin :: Posix/getusershell.cpp (1662 of 3054)
PASS: SanitizerCommon-lsan-x86_64-Darwin :: Posix/illegal_read_test.cpp (1663 of 3054)
PASS: SanitizerCommon-lsan-x86_64-Darwin :: Posix/getpw_getgr.cpp (1664 of 3054)
PASS: SanitizerCommon-lsan-x86_64-Darwin :: Posix/illegal_write_test.cpp (1665 of 3054)
UNSUPPORTED: SanitizerCommon-lsan-x86_64-Darwin :: Posix/nl_langinfo.cpp (1666 of 3054)
PASS: SanitizerCommon-lsan-x86_64-Darwin :: Posix/lstat.cpp (1667 of 3054)
PASS: SanitizerCommon-lsan-x86_64-Darwin :: Posix/mmap_test.c (1668 of 3054)
PASS: SanitizerCommon-lsan-x86_64-Darwin :: Posix/popen.cpp (1669 of 3054)
PASS: SanitizerCommon-lsan-x86_64-Darwin :: Posix/putc_putchar_unlocked.cpp (1670 of 3054)
PASS: SanitizerCommon-lsan-x86_64-Darwin :: Posix/readlink.c (1671 of 3054)
PASS: SanitizerCommon-lsan-x86_64-Darwin :: Posix/readlinkat.c (1672 of 3054)
UNSUPPORTED: SanitizerCommon-lsan-x86_64-Darwin :: Posix/regex.cpp (1673 of 3054)
PASS: SanitizerCommon-lsan-x86_64-Darwin :: Posix/recursion-in-qsort.cpp (1674 of 3054)
XFAIL: SanitizerCommon-lsan-x86_64-Darwin :: Posix/sanitizer_set_death_callback_test.cpp (1675 of 3054)
PASS: SanitizerCommon-lsan-x86_64-Darwin :: Posix/setvbuf.cpp (1676 of 3054)
UNSUPPORTED: SanitizerCommon-lsan-x86_64-Darwin :: Posix/sl_add.cpp (1677 of 3054)
PASS: SanitizerCommon-lsan-x86_64-Darwin :: Posix/posix_memalign-alignment.cpp (1678 of 3054)
PASS: SanitizerCommon-lsan-x86_64-Darwin :: Posix/sanitizer_set_report_fd_test.cpp (1679 of 3054)
UNSUPPORTED: SanitizerCommon-lsan-x86_64-Darwin :: Posix/strtonum.cpp (1680 of 3054)
UNSUPPORTED: SanitizerCommon-lsan-x86_64-Darwin :: Posix/strxfrm.c (1681 of 3054)
PASS: SanitizerCommon-lsan-x86_64-Darwin :: Posix/strlcat.cpp (1682 of 3054)
PASS: SanitizerCommon-lsan-x86_64-Darwin :: Posix/strlcpy.cpp (1683 of 3054)
UNSUPPORTED: SanitizerCommon-lsan-x86_64-Darwin :: Posix/vis.cpp (1684 of 3054)
PASS: SanitizerCommon-lsan-x86_64-Darwin :: Posix/uname.c (1685 of 3054)
UNSUPPORTED: SanitizerCommon-lsan-x86_64-Darwin :: Posix/wcsxfrm.c (1686 of 3054)
PASS: SanitizerCommon-lsan-x86_64-Darwin :: Posix/sysctl.cpp (1687 of 3054)
PASS: SanitizerCommon-lsan-x86_64-Darwin :: Posix/wcsdup.c (1688 of 3054)
UNSUPPORTED: SanitizerCommon-lsan-x86_64-Darwin :: corelimit.cpp (1689 of 3054)
XFAIL: SanitizerCommon-lsan-x86_64-Darwin :: Posix/weak_hook_test.cpp (1690 of 3054)
PASS: SanitizerCommon-lsan-x86_64-Darwin :: ctype.c (1691 of 3054)
PASS: SanitizerCommon-lsan-x86_64-Darwin :: fopen_nullptr.c (1692 of 3054)
UNSUPPORTED: SanitizerCommon-lsan-x86_64-Darwin :: hard_rss_limit_mb_test.cpp (1693 of 3054)
PASS: SanitizerCommon-lsan-x86_64-Darwin :: malloc_hook.cpp (1694 of 3054)
PASS: SanitizerCommon-lsan-x86_64-Darwin :: get_module_and_offset_for_pc.cpp (1695 of 3054)
PASS: SanitizerCommon-lsan-x86_64-Darwin :: onprint.cpp (1696 of 3054)
PASS: SanitizerCommon-lsan-x86_64-Darwin :: options-help.cpp (1697 of 3054)
PASS: SanitizerCommon-lsan-x86_64-Darwin :: options-include.cpp (1698 of 3054)
PASS: SanitizerCommon-lsan-x86_64-Darwin :: allocator_returns_null.cpp (1699 of 3054)
UNSUPPORTED: SanitizerCommon-lsan-x86_64-Darwin :: print-stack-trace.cpp (1700 of 3054)
PASS: SanitizerCommon-lsan-x86_64-Darwin :: options-invalid.cpp (1701 of 3054)
PASS: SanitizerCommon-lsan-x86_64-Darwin :: printf-ldbl.c (1702 of 3054)
UNSUPPORTED: SanitizerCommon-lsan-x86_64-Darwin :: reallocarray-overflow.cpp (1703 of 3054)
UNSUPPORTED: SanitizerCommon-lsan-x86_64-Darwin :: sanitizer_coverage_allowlist_blocklist.cpp (1704 of 3054)
PASS: SanitizerCommon-lsan-x86_64-Darwin :: max_allocation_size.cpp (1705 of 3054)
UNSUPPORTED: SanitizerCommon-lsan-x86_64-Darwin :: sanitizer_coverage_inline_bool_flag.cpp (1706 of 3054)
PASS: SanitizerCommon-lsan-x86_64-Darwin :: sanitizer_coverage_no_prune.cpp (1707 of 3054)
PASS: SanitizerCommon-lsan-x86_64-Darwin :: pthread_mutexattr_get.cpp (1708 of 3054)
UNSUPPORTED: SanitizerCommon-lsan-x86_64-Darwin :: sanitizer_coverage_symbolize.cpp (1709 of 3054)
PASS: SanitizerCommon-lsan-x86_64-Darwin :: sanitizer_coverage_inline8bit_counter.cpp (1710 of 3054)
UNSUPPORTED: SanitizerCommon-lsan-x86_64-Darwin :: sanitizer_coverage_trace_pc_guard-init.cpp (1711 of 3054)
PASS: SanitizerCommon-lsan-x86_64-Darwin :: sanitizer_coverage_trace_pc_guard.cpp (1712 of 3054)
PASS: SanitizerCommon-lsan-x86_64-Darwin :: sanitizer_coverage_stack_depth.cpp (1713 of 3054)
PASS: SanitizerCommon-lsan-x86_64-Darwin :: scanf-ldbl.c (1714 of 3054)
PASS: SanitizerCommon-lsan-x86_64-Darwin :: strcasestr.c (1715 of 3054)
XFAIL: SanitizerCommon-lsan-x86_64-Darwin :: sanitizer_coverage_trace_pc_guard-dso.cpp (1716 of 3054)
PASS: SanitizerCommon-lsan-x86_64-Darwin :: strcspn.c (1717 of 3054)
PASS: SanitizerCommon-lsan-x86_64-Darwin :: strnlen.c (1718 of 3054)
PASS: SanitizerCommon-lsan-x86_64-Darwin :: strpbrk.c (1719 of 3054)
PASS: SanitizerCommon-lsan-x86_64-Darwin :: strspn.c (1720 of 3054)
PASS: SanitizerCommon-lsan-x86_64-Darwin :: strstr.c (1721 of 3054)
PASS: SanitizerCommon-lsan-x86_64-Darwin :: symbolize_debug_argv.cpp (1722 of 3054)
PASS: SanitizerCommon-lsan-x86_64-Darwin :: symbolize_pc.cpp (1723 of 3054)
XFAIL: SanitizerCommon-lsan-x86_64-Darwin :: symbolize_pc_inline.cpp (1724 of 3054)
PASS: SanitizerCommon-lsan-x86_64-Darwin :: wcrtomb.c (1725 of 3054)
PASS: SanitizerCommon-lsan-x86_64-Darwin :: wctomb.c (1726 of 3054)
XFAIL: SanitizerCommon-lsan-x86_64-Darwin :: symbolize_stack.cpp (1727 of 3054)
PASS: SanitizerCommon-tsan-x86_64-Darwin :: Darwin/fputs_puts_null.cpp (1728 of 3054)
PASS: SanitizerCommon-tsan-x86_64-Darwin :: Darwin/abort_on_error.cpp (1729 of 3054)
PASS: SanitizerCommon-tsan-x86_64-Darwin :: Darwin/print-stack-trace-in-code-loaded-after-fork.cpp (1730 of 3054)
PASS: SanitizerCommon-tsan-x86_64-Darwin :: Darwin/malloc_zone.cpp (1731 of 3054)
UNSUPPORTED: SanitizerCommon-tsan-x86_64-Darwin :: FreeBSD/capsicum.cpp (1732 of 3054)
UNSUPPORTED: SanitizerCommon-tsan-x86_64-Darwin :: FreeBSD/fdevname.cpp (1733 of 3054)
PASS: SanitizerCommon-tsan-x86_64-Darwin :: Darwin/symbolizer-function-offset-dladdr.cpp (1734 of 3054)
UNSUPPORTED: SanitizerCommon-tsan-x86_64-Darwin :: Linux/abort_on_error.cpp (1735 of 3054)
UNSUPPORTED: SanitizerCommon-tsan-x86_64-Darwin :: Linux/aligned_alloc-alignment.cpp (1736 of 3054)
UNSUPPORTED: SanitizerCommon-tsan-x86_64-Darwin :: Linux/aligned_alloc.c (1737 of 3054)
UNSUPPORTED: SanitizerCommon-tsan-x86_64-Darwin :: Linux/allow_user_segv.cpp (1738 of 3054)
UNSUPPORTED: SanitizerCommon-tsan-x86_64-Darwin :: Linux/assert.cpp (1739 of 3054)
UNSUPPORTED: SanitizerCommon-tsan-x86_64-Darwin :: Linux/clock_gettime.c (1740 of 3054)
UNSUPPORTED: SanitizerCommon-tsan-x86_64-Darwin :: Linux/closedir.c (1741 of 3054)
UNSUPPORTED: SanitizerCommon-tsan-x86_64-Darwin :: Linux/crypt_r.cpp (1742 of 3054)
UNSUPPORTED: SanitizerCommon-tsan-x86_64-Darwin :: Linux/getpwnam_r_invalid_user.cpp (1743 of 3054)
UNSUPPORTED: SanitizerCommon-tsan-x86_64-Darwin :: Linux/deepbind.cpp (1744 of 3054)
UNSUPPORTED: SanitizerCommon-tsan-x86_64-Darwin :: Linux/decorate_proc_maps.cpp (1745 of 3054)
UNSUPPORTED: SanitizerCommon-tsan-x86_64-Darwin :: Linux/mallopt.cpp (1746 of 3054)
UNSUPPORTED: SanitizerCommon-tsan-x86_64-Darwin :: Linux/getcpuclockid.c (1747 of 3054)
UNSUPPORTED: SanitizerCommon-tsan-x86_64-Darwin :: Linux/iconv_test.c (1748 of 3054)
UNSUPPORTED: SanitizerCommon-tsan-x86_64-Darwin :: Linux/ill.cpp (1749 of 3054)
UNSUPPORTED: SanitizerCommon-tsan-x86_64-Darwin :: Linux/mlock_test.cpp (1750 of 3054)
UNSUPPORTED: SanitizerCommon-tsan-x86_64-Darwin :: Linux/mmap64_test.c (1751 of 3054)
UNSUPPORTED: SanitizerCommon-tsan-x86_64-Darwin :: Linux/mmap_write_exec.cpp (1752 of 3054)
UNSUPPORTED: SanitizerCommon-tsan-x86_64-Darwin :: Linux/mprobe.cpp (1753 of 3054)
UNSUPPORTED: SanitizerCommon-tsan-x86_64-Darwin :: Linux/name_to_handle_at.cpp (1754 of 3054)
UNSUPPORTED: SanitizerCommon-tsan-x86_64-Darwin :: Linux/new_delete_test.cpp (1755 of 3054)
UNSUPPORTED: SanitizerCommon-tsan-x86_64-Darwin :: Linux/open_memstream.cpp (1756 of 3054)
UNSUPPORTED: SanitizerCommon-tsan-x86_64-Darwin :: Linux/protoent.cpp (1757 of 3054)
UNSUPPORTED: SanitizerCommon-tsan-x86_64-Darwin :: Linux/pthread_mutex.cpp (1758 of 3054)
UNSUPPORTED: SanitizerCommon-tsan-x86_64-Darwin :: Linux/ptrace.cpp (1759 of 3054)
UNSUPPORTED: SanitizerCommon-tsan-x86_64-Darwin :: Linux/pvalloc-overflow.cpp (1760 of 3054)
UNSUPPORTED: SanitizerCommon-tsan-x86_64-Darwin :: Linux/recv_msg_trunc.cpp (1761 of 3054)
UNSUPPORTED: SanitizerCommon-tsan-x86_64-Darwin :: Linux/sched_getparam.cpp (1762 of 3054)
UNSUPPORTED: SanitizerCommon-tsan-x86_64-Darwin :: Linux/sem_init_glibc.cpp (1763 of 3054)
UNSUPPORTED: SanitizerCommon-tsan-x86_64-Darwin :: Linux/signal_line.cpp (1764 of 3054)
UNSUPPORTED: SanitizerCommon-tsan-x86_64-Darwin :: Linux/signal_name.c (1765 of 3054)
UNSUPPORTED: SanitizerCommon-tsan-x86_64-Darwin :: Linux/signal_segv_handler.cpp (1766 of 3054)
UNSUPPORTED: SanitizerCommon-tsan-x86_64-Darwin :: Linux/signal_send.cpp (1767 of 3054)
UNSUPPORTED: SanitizerCommon-tsan-x86_64-Darwin :: Linux/signal_trap_handler.cpp (1768 of 3054)
UNSUPPORTED: SanitizerCommon-tsan-x86_64-Darwin :: Linux/soft_rss_limit_mb_test.cpp (1769 of 3054)
UNSUPPORTED: SanitizerCommon-tsan-x86_64-Darwin :: Linux/sysconf_interceptor_bypass_test.cpp (1770 of 3054)
UNSUPPORTED: SanitizerCommon-tsan-x86_64-Darwin :: Linux/sysmsg.c (1771 of 3054)
UNSUPPORTED: SanitizerCommon-tsan-x86_64-Darwin :: Linux/timerfd.cpp (1772 of 3054)
UNSUPPORTED: SanitizerCommon-tsan-x86_64-Darwin :: Linux/unexpected_format_specifier_test.cpp (1773 of 3054)
UNSUPPORTED: SanitizerCommon-tsan-x86_64-Darwin :: Linux/xdrrec.cpp (1774 of 3054)
UNSUPPORTED: SanitizerCommon-tsan-x86_64-Darwin :: NetBSD/asysctl.cpp (1775 of 3054)
UNSUPPORTED: SanitizerCommon-tsan-x86_64-Darwin :: NetBSD/cdb.cpp (1776 of 3054)
UNSUPPORTED: SanitizerCommon-tsan-x86_64-Darwin :: NetBSD/faccessat.cpp (1777 of 3054)
UNSUPPORTED: SanitizerCommon-tsan-x86_64-Darwin :: NetBSD/fparseln.cpp (1778 of 3054)
UNSUPPORTED: SanitizerCommon-tsan-x86_64-Darwin :: NetBSD/funopen2.cpp (1779 of 3054)
UNSUPPORTED: SanitizerCommon-tsan-x86_64-Darwin :: NetBSD/getgrouplist.cpp (1780 of 3054)
UNSUPPORTED: SanitizerCommon-tsan-x86_64-Darwin :: NetBSD/getgroupmembership.cpp (1781 of 3054)
UNSUPPORTED: SanitizerCommon-tsan-x86_64-Darwin :: NetBSD/getvfsstat.cpp (1782 of 3054)
UNSUPPORTED: SanitizerCommon-tsan-x86_64-Darwin :: NetBSD/gid_from_group.cpp (1783 of 3054)
UNSUPPORTED: SanitizerCommon-tsan-x86_64-Darwin :: NetBSD/group_from_gid.cpp (1784 of 3054)
UNSUPPORTED: SanitizerCommon-tsan-x86_64-Darwin :: NetBSD/md2.cpp (1785 of 3054)
UNSUPPORTED: SanitizerCommon-tsan-x86_64-Darwin :: NetBSD/md4.cpp (1786 of 3054)
UNSUPPORTED: SanitizerCommon-tsan-x86_64-Darwin :: NetBSD/md5.cpp (1787 of 3054)
UNSUPPORTED: SanitizerCommon-tsan-x86_64-Darwin :: NetBSD/mi_vector_hash.cpp (1788 of 3054)
UNSUPPORTED: SanitizerCommon-tsan-x86_64-Darwin :: NetBSD/netent.cpp (1789 of 3054)
UNSUPPORTED: SanitizerCommon-tsan-x86_64-Darwin :: NetBSD/paccept.cpp (1790 of 3054)
UNSUPPORTED: SanitizerCommon-tsan-x86_64-Darwin :: NetBSD/protoent.cpp (1791 of 3054)
UNSUPPORTED: SanitizerCommon-tsan-x86_64-Darwin :: NetBSD/rmd160.cpp (1792 of 3054)
UNSUPPORTED: SanitizerCommon-tsan-x86_64-Darwin :: NetBSD/sha1.cpp (1793 of 3054)
UNSUPPORTED: SanitizerCommon-tsan-x86_64-Darwin :: NetBSD/sha2.cpp (1794 of 3054)
UNSUPPORTED: SanitizerCommon-tsan-x86_64-Darwin :: NetBSD/statvfs1.cpp (1795 of 3054)
UNSUPPORTED: SanitizerCommon-tsan-x86_64-Darwin :: NetBSD/strmode.cpp (1796 of 3054)
UNSUPPORTED: SanitizerCommon-tsan-x86_64-Darwin :: NetBSD/strtoi.cpp (1797 of 3054)
UNSUPPORTED: SanitizerCommon-tsan-x86_64-Darwin :: NetBSD/sysctlgetmibinfo.cpp (1798 of 3054)
UNSUPPORTED: SanitizerCommon-tsan-x86_64-Darwin :: NetBSD/ttyent.cpp (1799 of 3054)
UNSUPPORTED: SanitizerCommon-tsan-x86_64-Darwin :: NetBSD/uid_from_user.cpp (1800 of 3054)
UNSUPPORTED: SanitizerCommon-tsan-x86_64-Darwin :: NetBSD/user_from_uid.cpp (1801 of 3054)
PASS: SanitizerCommon-tsan-x86_64-Darwin :: Darwin/print-stack-trace.cpp (1802 of 3054)
PASS: SanitizerCommon-tsan-x86_64-Darwin :: Posix/access.cpp (1803 of 3054)
UNSUPPORTED: SanitizerCommon-tsan-x86_64-Darwin :: Posix/crypt.cpp (1804 of 3054)
PASS: SanitizerCommon-tsan-x86_64-Darwin :: Posix/arc4random.cpp (1805 of 3054)
PASS: SanitizerCommon-tsan-x86_64-Darwin :: Darwin/symbolizer-function-offset-atos.cpp (1806 of 3054)
PASS: SanitizerCommon-tsan-x86_64-Darwin :: Posix/devname.cpp (1807 of 3054)
PASS: SanitizerCommon-tsan-x86_64-Darwin :: Posix/devname_r.cpp (1808 of 3054)
UNSUPPORTED: SanitizerCommon-tsan-x86_64-Darwin :: Posix/dump_registers.cpp (1809 of 3054)
PASS: SanitizerCommon-tsan-x86_64-Darwin :: Posix/feof_fileno_ferror.cpp (1810 of 3054)
PASS: SanitizerCommon-tsan-x86_64-Darwin :: Posix/dump_instruction_bytes.cpp (1811 of 3054)
PASS: SanitizerCommon-tsan-x86_64-Darwin :: Posix/fgetc_ungetc_getc.cpp (1812 of 3054)
PASS: SanitizerCommon-tsan-x86_64-Darwin :: Posix/fgetln.cpp (1813 of 3054)
PASS: SanitizerCommon-tsan-x86_64-Darwin :: Posix/fgets.cpp (1814 of 3054)
PASS: SanitizerCommon-tsan-x86_64-Darwin :: Posix/dedup_token_length_test.cpp (1815 of 3054)
PASS: SanitizerCommon-tsan-x86_64-Darwin :: Posix/fputc_putc_putchar.cpp (1816 of 3054)
UNSUPPORTED: SanitizerCommon-tsan-x86_64-Darwin :: Posix/fseek.cpp (1817 of 3054)
UNSUPPORTED: SanitizerCommon-tsan-x86_64-Darwin :: Posix/fts.cpp (1818 of 3054)
UNSUPPORTED: SanitizerCommon-tsan-x86_64-Darwin :: Posix/funopen.cpp (1819 of 3054)
PASS: SanitizerCommon-tsan-x86_64-Darwin :: Posix/fputs_puts.cpp (1820 of 3054)
UNSUPPORTED: SanitizerCommon-tsan-x86_64-Darwin :: Posix/getfsent.cpp (1821 of 3054)
PASS: SanitizerCommon-tsan-x86_64-Darwin :: Posix/getc_unlocked.cpp (1822 of 3054)
PASS: SanitizerCommon-tsan-x86_64-Darwin :: Posix/getmntinfo.cpp (1823 of 3054)
PASS: SanitizerCommon-tsan-x86_64-Darwin :: Posix/fpe.cpp (1824 of 3054)
UNSUPPORTED: SanitizerCommon-tsan-x86_64-Darwin :: Posix/getrandom.c (1825 of 3054)
PASS: SanitizerCommon-tsan-x86_64-Darwin :: Posix/getusershell.cpp (1826 of 3054)
PASS: SanitizerCommon-tsan-x86_64-Darwin :: Posix/getpw_getgr.cpp (1827 of 3054)
PASS: SanitizerCommon-tsan-x86_64-Darwin :: Posix/getpass.cpp (1828 of 3054)
PASS: SanitizerCommon-tsan-x86_64-Darwin :: Posix/illegal_read_test.cpp (1829 of 3054)
PASS: SanitizerCommon-tsan-x86_64-Darwin :: Posix/illegal_write_test.cpp (1830 of 3054)
UNSUPPORTED: SanitizerCommon-tsan-x86_64-Darwin :: Posix/nl_langinfo.cpp (1831 of 3054)
PASS: SanitizerCommon-tsan-x86_64-Darwin :: Posix/lstat.cpp (1832 of 3054)
PASS: SanitizerCommon-tsan-x86_64-Darwin :: Posix/mmap_test.c (1833 of 3054)
PASS: SanitizerCommon-tsan-x86_64-Darwin :: Posix/popen.cpp (1834 of 3054)
PASS: SanitizerCommon-tsan-x86_64-Darwin :: Posix/putc_putchar_unlocked.cpp (1835 of 3054)
PASS: SanitizerCommon-tsan-x86_64-Darwin :: Posix/readlink.c (1836 of 3054)
PASS: SanitizerCommon-tsan-x86_64-Darwin :: Posix/readlinkat.c (1837 of 3054)
UNSUPPORTED: SanitizerCommon-tsan-x86_64-Darwin :: Posix/regex.cpp (1838 of 3054)
PASS: SanitizerCommon-tsan-x86_64-Darwin :: Posix/recursion-in-qsort.cpp (1839 of 3054)
PASS: SanitizerCommon-tsan-x86_64-Darwin :: Posix/sanitizer_set_death_callback_test.cpp (1840 of 3054)
PASS: SanitizerCommon-tsan-x86_64-Darwin :: Posix/setvbuf.cpp (1841 of 3054)
UNSUPPORTED: SanitizerCommon-tsan-x86_64-Darwin :: Posix/sl_add.cpp (1842 of 3054)
PASS: SanitizerCommon-tsan-x86_64-Darwin :: Posix/sanitizer_set_report_fd_test.cpp (1843 of 3054)
PASS: SanitizerCommon-tsan-x86_64-Darwin :: Posix/strlcat.cpp (1844 of 3054)
UNSUPPORTED: SanitizerCommon-tsan-x86_64-Darwin :: Posix/strtonum.cpp (1845 of 3054)
UNSUPPORTED: SanitizerCommon-tsan-x86_64-Darwin :: Posix/strxfrm.c (1846 of 3054)
PASS: SanitizerCommon-tsan-x86_64-Darwin :: Posix/strlcpy.cpp (1847 of 3054)
PASS: SanitizerCommon-tsan-x86_64-Darwin :: Posix/sysctl.cpp (1848 of 3054)
UNSUPPORTED: SanitizerCommon-tsan-x86_64-Darwin :: Posix/vis.cpp (1849 of 3054)
PASS: SanitizerCommon-tsan-x86_64-Darwin :: Posix/posix_memalign-alignment.cpp (1850 of 3054)
UNSUPPORTED: SanitizerCommon-tsan-x86_64-Darwin :: Posix/wcsxfrm.c (1851 of 3054)
PASS: SanitizerCommon-tsan-x86_64-Darwin :: Posix/uname.c (1852 of 3054)
PASS: SanitizerCommon-tsan-x86_64-Darwin :: Posix/wcsdup.c (1853 of 3054)
PASS: SanitizerCommon-tsan-x86_64-Darwin :: Posix/weak_hook_test.cpp (1854 of 3054)
PASS: SanitizerCommon-tsan-x86_64-Darwin :: corelimit.cpp (1855 of 3054)
PASS: SanitizerCommon-tsan-x86_64-Darwin :: ctype.c (1856 of 3054)
PASS: SanitizerCommon-tsan-x86_64-Darwin :: fopen_nullptr.c (1857 of 3054)
PASS: SanitizerCommon-tsan-x86_64-Darwin :: malloc_hook.cpp (1858 of 3054)
UNSUPPORTED: SanitizerCommon-tsan-x86_64-Darwin :: hard_rss_limit_mb_test.cpp (1859 of 3054)
PASS: SanitizerCommon-tsan-x86_64-Darwin :: get_module_and_offset_for_pc.cpp (1860 of 3054)
PASS: SanitizerCommon-tsan-x86_64-Darwin :: onprint.cpp (1861 of 3054)
PASS: SanitizerCommon-tsan-x86_64-Darwin :: options-help.cpp (1862 of 3054)
PASS: SanitizerCommon-tsan-x86_64-Darwin :: options-include.cpp (1863 of 3054)
PASS: SanitizerCommon-tsan-x86_64-Darwin :: options-invalid.cpp (1864 of 3054)
UNSUPPORTED: SanitizerCommon-tsan-x86_64-Darwin :: print-stack-trace.cpp (1865 of 3054)
PASS: SanitizerCommon-tsan-x86_64-Darwin :: allocator_returns_null.cpp (1866 of 3054)
PASS: SanitizerCommon-tsan-x86_64-Darwin :: printf-ldbl.c (1867 of 3054)
UNSUPPORTED: SanitizerCommon-tsan-x86_64-Darwin :: reallocarray-overflow.cpp (1868 of 3054)
UNSUPPORTED: SanitizerCommon-tsan-x86_64-Darwin :: sanitizer_coverage_allowlist_blocklist.cpp (1869 of 3054)
PASS: SanitizerCommon-tsan-x86_64-Darwin :: pthread_mutexattr_get.cpp (1870 of 3054)
UNSUPPORTED: SanitizerCommon-tsan-x86_64-Darwin :: sanitizer_coverage_inline_bool_flag.cpp (1871 of 3054)
PASS: SanitizerCommon-tsan-x86_64-Darwin :: sanitizer_coverage_no_prune.cpp (1872 of 3054)
PASS: SanitizerCommon-tsan-x86_64-Darwin :: sanitizer_coverage_inline8bit_counter.cpp (1873 of 3054)
UNSUPPORTED: SanitizerCommon-tsan-x86_64-Darwin :: sanitizer_coverage_symbolize.cpp (1874 of 3054)
PASS: SanitizerCommon-tsan-x86_64-Darwin :: max_allocation_size.cpp (1875 of 3054)
UNSUPPORTED: SanitizerCommon-tsan-x86_64-Darwin :: sanitizer_coverage_trace_pc_guard-init.cpp (1876 of 3054)
PASS: SanitizerCommon-tsan-x86_64-Darwin :: sanitizer_coverage_stack_depth.cpp (1877 of 3054)
XFAIL: SanitizerCommon-tsan-x86_64-Darwin :: sanitizer_coverage_trace_pc_guard-dso.cpp (1878 of 3054)
XFAIL: SanitizerCommon-tsan-x86_64-Darwin :: sanitizer_coverage_trace_pc_guard.cpp (1879 of 3054)
PASS: SanitizerCommon-tsan-x86_64-Darwin :: scanf-ldbl.c (1880 of 3054)
PASS: SanitizerCommon-tsan-x86_64-Darwin :: strcasestr.c (1881 of 3054)
PASS: SanitizerCommon-tsan-x86_64-Darwin :: strcspn.c (1882 of 3054)
PASS: SanitizerCommon-tsan-x86_64-Darwin :: strnlen.c (1883 of 3054)
PASS: SanitizerCommon-tsan-x86_64-Darwin :: strpbrk.c (1884 of 3054)
PASS: SanitizerCommon-tsan-x86_64-Darwin :: strspn.c (1885 of 3054)
PASS: SanitizerCommon-tsan-x86_64-Darwin :: strstr.c (1886 of 3054)
PASS: SanitizerCommon-tsan-x86_64-Darwin :: symbolize_debug_argv.cpp (1887 of 3054)
PASS: SanitizerCommon-tsan-x86_64-Darwin :: symbolize_pc.cpp (1888 of 3054)
XFAIL: SanitizerCommon-tsan-x86_64-Darwin :: symbolize_pc_inline.cpp (1889 of 3054)
PASS: SanitizerCommon-tsan-x86_64-Darwin :: wcrtomb.c (1890 of 3054)
PASS: SanitizerCommon-tsan-x86_64-Darwin :: wctomb.c (1891 of 3054)
PASS: SanitizerCommon-ubsan-x86_64-Darwin :: Darwin/fputs_puts_null.cpp (1892 of 3054)
PASS: SanitizerCommon-tsan-x86_64-Darwin :: symbolize_stack.cpp (1893 of 3054)
XFAIL: SanitizerCommon-ubsan-x86_64-Darwin :: Darwin/malloc_zone.cpp (1894 of 3054)
PASS: SanitizerCommon-ubsan-x86_64-Darwin :: Darwin/abort_on_error.cpp (1895 of 3054)
PASS: SanitizerCommon-ubsan-x86_64-Darwin :: Darwin/print-stack-trace.cpp (1896 of 3054)
UNSUPPORTED: SanitizerCommon-ubsan-x86_64-Darwin :: FreeBSD/capsicum.cpp (1897 of 3054)
UNSUPPORTED: SanitizerCommon-ubsan-x86_64-Darwin :: FreeBSD/fdevname.cpp (1898 of 3054)
PASS: SanitizerCommon-ubsan-x86_64-Darwin :: Darwin/print-stack-trace-in-code-loaded-after-fork.cpp (1899 of 3054)
UNSUPPORTED: SanitizerCommon-ubsan-x86_64-Darwin :: Linux/abort_on_error.cpp (1900 of 3054)
UNSUPPORTED: SanitizerCommon-ubsan-x86_64-Darwin :: Linux/aligned_alloc-alignment.cpp (1901 of 3054)
UNSUPPORTED: SanitizerCommon-ubsan-x86_64-Darwin :: Linux/aligned_alloc.c (1902 of 3054)
UNSUPPORTED: SanitizerCommon-ubsan-x86_64-Darwin :: Linux/allow_user_segv.cpp (1903 of 3054)
UNSUPPORTED: SanitizerCommon-ubsan-x86_64-Darwin :: Linux/assert.cpp (1904 of 3054)
UNSUPPORTED: SanitizerCommon-ubsan-x86_64-Darwin :: Linux/clock_gettime.c (1905 of 3054)
UNSUPPORTED: SanitizerCommon-ubsan-x86_64-Darwin :: Linux/closedir.c (1906 of 3054)
UNSUPPORTED: SanitizerCommon-ubsan-x86_64-Darwin :: Linux/crypt_r.cpp (1907 of 3054)
UNSUPPORTED: SanitizerCommon-ubsan-x86_64-Darwin :: Linux/getpwnam_r_invalid_user.cpp (1908 of 3054)
UNSUPPORTED: SanitizerCommon-ubsan-x86_64-Darwin :: Linux/decorate_proc_maps.cpp (1909 of 3054)
UNSUPPORTED: SanitizerCommon-ubsan-x86_64-Darwin :: Linux/iconv_test.c (1910 of 3054)
UNSUPPORTED: SanitizerCommon-ubsan-x86_64-Darwin :: Linux/deepbind.cpp (1911 of 3054)
UNSUPPORTED: SanitizerCommon-ubsan-x86_64-Darwin :: Linux/getcpuclockid.c (1912 of 3054)
UNSUPPORTED: SanitizerCommon-ubsan-x86_64-Darwin :: Linux/mallopt.cpp (1913 of 3054)
UNSUPPORTED: SanitizerCommon-ubsan-x86_64-Darwin :: Linux/ill.cpp (1914 of 3054)
UNSUPPORTED: SanitizerCommon-ubsan-x86_64-Darwin :: Linux/mlock_test.cpp (1915 of 3054)
UNSUPPORTED: SanitizerCommon-ubsan-x86_64-Darwin :: Linux/mmap64_test.c (1916 of 3054)
UNSUPPORTED: SanitizerCommon-ubsan-x86_64-Darwin :: Linux/mmap_write_exec.cpp (1917 of 3054)
UNSUPPORTED: SanitizerCommon-ubsan-x86_64-Darwin :: Linux/mprobe.cpp (1918 of 3054)
UNSUPPORTED: SanitizerCommon-ubsan-x86_64-Darwin :: Linux/name_to_handle_at.cpp (1919 of 3054)
UNSUPPORTED: SanitizerCommon-ubsan-x86_64-Darwin :: Linux/new_delete_test.cpp (1920 of 3054)
UNSUPPORTED: SanitizerCommon-ubsan-x86_64-Darwin :: Linux/open_memstream.cpp (1921 of 3054)
UNSUPPORTED: SanitizerCommon-ubsan-x86_64-Darwin :: Linux/protoent.cpp (1922 of 3054)
UNSUPPORTED: SanitizerCommon-ubsan-x86_64-Darwin :: Linux/pthread_mutex.cpp (1923 of 3054)
UNSUPPORTED: SanitizerCommon-ubsan-x86_64-Darwin :: Linux/ptrace.cpp (1924 of 3054)
UNSUPPORTED: SanitizerCommon-ubsan-x86_64-Darwin :: Linux/pvalloc-overflow.cpp (1925 of 3054)
UNSUPPORTED: SanitizerCommon-ubsan-x86_64-Darwin :: Linux/recv_msg_trunc.cpp (1926 of 3054)
UNSUPPORTED: SanitizerCommon-ubsan-x86_64-Darwin :: Linux/sched_getparam.cpp (1927 of 3054)
UNSUPPORTED: SanitizerCommon-ubsan-x86_64-Darwin :: Linux/sem_init_glibc.cpp (1928 of 3054)
UNSUPPORTED: SanitizerCommon-ubsan-x86_64-Darwin :: Linux/signal_line.cpp (1929 of 3054)
UNSUPPORTED: SanitizerCommon-ubsan-x86_64-Darwin :: Linux/signal_name.c (1930 of 3054)
UNSUPPORTED: SanitizerCommon-ubsan-x86_64-Darwin :: Linux/signal_segv_handler.cpp (1931 of 3054)
UNSUPPORTED: SanitizerCommon-ubsan-x86_64-Darwin :: Linux/signal_send.cpp (1932 of 3054)
UNSUPPORTED: SanitizerCommon-ubsan-x86_64-Darwin :: Linux/signal_trap_handler.cpp (1933 of 3054)
UNSUPPORTED: SanitizerCommon-ubsan-x86_64-Darwin :: Linux/soft_rss_limit_mb_test.cpp (1934 of 3054)
UNSUPPORTED: SanitizerCommon-ubsan-x86_64-Darwin :: Linux/sysconf_interceptor_bypass_test.cpp (1935 of 3054)
UNSUPPORTED: SanitizerCommon-ubsan-x86_64-Darwin :: Linux/sysmsg.c (1936 of 3054)
UNSUPPORTED: SanitizerCommon-ubsan-x86_64-Darwin :: Linux/timerfd.cpp (1937 of 3054)
UNSUPPORTED: SanitizerCommon-ubsan-x86_64-Darwin :: Linux/unexpected_format_specifier_test.cpp (1938 of 3054)
UNSUPPORTED: SanitizerCommon-ubsan-x86_64-Darwin :: Linux/xdrrec.cpp (1939 of 3054)
UNSUPPORTED: SanitizerCommon-ubsan-x86_64-Darwin :: NetBSD/asysctl.cpp (1940 of 3054)
UNSUPPORTED: SanitizerCommon-ubsan-x86_64-Darwin :: NetBSD/cdb.cpp (1941 of 3054)
UNSUPPORTED: SanitizerCommon-ubsan-x86_64-Darwin :: NetBSD/faccessat.cpp (1942 of 3054)
UNSUPPORTED: SanitizerCommon-ubsan-x86_64-Darwin :: NetBSD/fparseln.cpp (1943 of 3054)
UNSUPPORTED: SanitizerCommon-ubsan-x86_64-Darwin :: NetBSD/funopen2.cpp (1944 of 3054)
UNSUPPORTED: SanitizerCommon-ubsan-x86_64-Darwin :: NetBSD/getgrouplist.cpp (1945 of 3054)
UNSUPPORTED: SanitizerCommon-ubsan-x86_64-Darwin :: NetBSD/getgroupmembership.cpp (1946 of 3054)
UNSUPPORTED: SanitizerCommon-ubsan-x86_64-Darwin :: NetBSD/getvfsstat.cpp (1947 of 3054)
UNSUPPORTED: SanitizerCommon-ubsan-x86_64-Darwin :: NetBSD/gid_from_group.cpp (1948 of 3054)
UNSUPPORTED: SanitizerCommon-ubsan-x86_64-Darwin :: NetBSD/group_from_gid.cpp (1949 of 3054)
UNSUPPORTED: SanitizerCommon-ubsan-x86_64-Darwin :: NetBSD/md2.cpp (1950 of 3054)
UNSUPPORTED: SanitizerCommon-ubsan-x86_64-Darwin :: NetBSD/md4.cpp (1951 of 3054)
UNSUPPORTED: SanitizerCommon-ubsan-x86_64-Darwin :: NetBSD/md5.cpp (1952 of 3054)
UNSUPPORTED: SanitizerCommon-ubsan-x86_64-Darwin :: NetBSD/mi_vector_hash.cpp (1953 of 3054)
UNSUPPORTED: SanitizerCommon-ubsan-x86_64-Darwin :: NetBSD/netent.cpp (1954 of 3054)
UNSUPPORTED: SanitizerCommon-ubsan-x86_64-Darwin :: NetBSD/paccept.cpp (1955 of 3054)
UNSUPPORTED: SanitizerCommon-ubsan-x86_64-Darwin :: NetBSD/protoent.cpp (1956 of 3054)
UNSUPPORTED: SanitizerCommon-ubsan-x86_64-Darwin :: NetBSD/rmd160.cpp (1957 of 3054)
UNSUPPORTED: SanitizerCommon-ubsan-x86_64-Darwin :: NetBSD/sha1.cpp (1958 of 3054)
UNSUPPORTED: SanitizerCommon-ubsan-x86_64-Darwin :: NetBSD/sha2.cpp (1959 of 3054)
UNSUPPORTED: SanitizerCommon-ubsan-x86_64-Darwin :: NetBSD/statvfs1.cpp (1960 of 3054)
UNSUPPORTED: SanitizerCommon-ubsan-x86_64-Darwin :: NetBSD/strmode.cpp (1961 of 3054)
UNSUPPORTED: SanitizerCommon-ubsan-x86_64-Darwin :: NetBSD/strtoi.cpp (1962 of 3054)
UNSUPPORTED: SanitizerCommon-ubsan-x86_64-Darwin :: NetBSD/sysctlgetmibinfo.cpp (1963 of 3054)
UNSUPPORTED: SanitizerCommon-ubsan-x86_64-Darwin :: NetBSD/ttyent.cpp (1964 of 3054)
UNSUPPORTED: SanitizerCommon-ubsan-x86_64-Darwin :: NetBSD/uid_from_user.cpp (1965 of 3054)
UNSUPPORTED: SanitizerCommon-ubsan-x86_64-Darwin :: NetBSD/user_from_uid.cpp (1966 of 3054)
PASS: SanitizerCommon-ubsan-x86_64-Darwin :: Darwin/symbolizer-function-offset-dladdr.cpp (1967 of 3054)
PASS: SanitizerCommon-ubsan-x86_64-Darwin :: Darwin/symbolizer-function-offset-atos.cpp (1968 of 3054)
UNSUPPORTED: SanitizerCommon-ubsan-x86_64-Darwin :: Posix/crypt.cpp (1969 of 3054)
PASS: SanitizerCommon-ubsan-x86_64-Darwin :: Posix/access.cpp (1970 of 3054)
PASS: SanitizerCommon-ubsan-x86_64-Darwin :: Posix/arc4random.cpp (1971 of 3054)
PASS: SanitizerCommon-ubsan-x86_64-Darwin :: Posix/devname.cpp (1972 of 3054)
PASS: SanitizerCommon-ubsan-x86_64-Darwin :: Posix/devname_r.cpp (1973 of 3054)
UNSUPPORTED: SanitizerCommon-ubsan-x86_64-Darwin :: Posix/dump_registers.cpp (1974 of 3054)
PASS: SanitizerCommon-ubsan-x86_64-Darwin :: Posix/feof_fileno_ferror.cpp (1975 of 3054)
PASS: SanitizerCommon-ubsan-x86_64-Darwin :: Posix/fgetc_ungetc_getc.cpp (1976 of 3054)
PASS: SanitizerCommon-ubsan-x86_64-Darwin :: Posix/dump_instruction_bytes.cpp (1977 of 3054)
PASS: SanitizerCommon-ubsan-x86_64-Darwin :: Posix/fgetln.cpp (1978 of 3054)
PASS: SanitizerCommon-ubsan-x86_64-Darwin :: Posix/fgets.cpp (1979 of 3054)
PASS: SanitizerCommon-ubsan-x86_64-Darwin :: Posix/dedup_token_length_test.cpp (1980 of 3054)
PASS: SanitizerCommon-ubsan-x86_64-Darwin :: Posix/fputc_putc_putchar.cpp (1981 of 3054)
UNSUPPORTED: SanitizerCommon-ubsan-x86_64-Darwin :: Posix/fseek.cpp (1982 of 3054)
UNSUPPORTED: SanitizerCommon-ubsan-x86_64-Darwin :: Posix/fts.cpp (1983 of 3054)
UNSUPPORTED: SanitizerCommon-ubsan-x86_64-Darwin :: Posix/funopen.cpp (1984 of 3054)
PASS: SanitizerCommon-ubsan-x86_64-Darwin :: Posix/fputs_puts.cpp (1985 of 3054)
UNSUPPORTED: SanitizerCommon-ubsan-x86_64-Darwin :: Posix/getfsent.cpp (1986 of 3054)
PASS: SanitizerCommon-ubsan-x86_64-Darwin :: Posix/getc_unlocked.cpp (1987 of 3054)
PASS: SanitizerCommon-ubsan-x86_64-Darwin :: Posix/fpe.cpp (1988 of 3054)
PASS: SanitizerCommon-ubsan-x86_64-Darwin :: Posix/getmntinfo.cpp (1989 of 3054)
UNSUPPORTED: SanitizerCommon-ubsan-x86_64-Darwin :: Posix/getrandom.c (1990 of 3054)
PASS: SanitizerCommon-ubsan-x86_64-Darwin :: Posix/getpass.cpp (1991 of 3054)
PASS: SanitizerCommon-ubsan-x86_64-Darwin :: Posix/getusershell.cpp (1992 of 3054)
PASS: SanitizerCommon-ubsan-x86_64-Darwin :: Posix/illegal_read_test.cpp (1993 of 3054)
PASS: SanitizerCommon-ubsan-x86_64-Darwin :: Posix/getpw_getgr.cpp (1994 of 3054)
PASS: SanitizerCommon-ubsan-x86_64-Darwin :: Posix/illegal_write_test.cpp (1995 of 3054)
UNSUPPORTED: SanitizerCommon-ubsan-x86_64-Darwin :: Posix/nl_langinfo.cpp (1996 of 3054)
PASS: SanitizerCommon-ubsan-x86_64-Darwin :: Posix/lstat.cpp (1997 of 3054)
UNSUPPORTED: SanitizerCommon-ubsan-x86_64-Darwin :: Posix/posix_memalign-alignment.cpp (1998 of 3054)
PASS: SanitizerCommon-ubsan-x86_64-Darwin :: Posix/mmap_test.c (1999 of 3054)
PASS: SanitizerCommon-ubsan-x86_64-Darwin :: Posix/popen.cpp (2000 of 3054)
PASS: SanitizerCommon-ubsan-x86_64-Darwin :: Posix/putc_putchar_unlocked.cpp (2001 of 3054)
PASS: SanitizerCommon-ubsan-x86_64-Darwin :: Posix/readlink.c (2002 of 3054)
UNSUPPORTED: SanitizerCommon-ubsan-x86_64-Darwin :: Posix/regex.cpp (2003 of 3054)
PASS: SanitizerCommon-ubsan-x86_64-Darwin :: Posix/readlinkat.c (2004 of 3054)
PASS: SanitizerCommon-ubsan-x86_64-Darwin :: Posix/recursion-in-qsort.cpp (2005 of 3054)
XFAIL: SanitizerCommon-ubsan-x86_64-Darwin :: Posix/sanitizer_set_death_callback_test.cpp (2006 of 3054)
UNSUPPORTED: SanitizerCommon-ubsan-x86_64-Darwin :: Posix/sl_add.cpp (2007 of 3054)
PASS: SanitizerCommon-ubsan-x86_64-Darwin :: Posix/strlcat.cpp (2008 of 3054)
UNSUPPORTED: SanitizerCommon-ubsan-x86_64-Darwin :: Posix/strtonum.cpp (2009 of 3054)
PASS: SanitizerCommon-ubsan-x86_64-Darwin :: Posix/setvbuf.cpp (2010 of 3054)
UNSUPPORTED: SanitizerCommon-ubsan-x86_64-Darwin :: Posix/strxfrm.c (2011 of 3054)
PASS: SanitizerCommon-ubsan-x86_64-Darwin :: Posix/strlcpy.cpp (2012 of 3054)
PASS: SanitizerCommon-ubsan-x86_64-Darwin :: Posix/sysctl.cpp (2013 of 3054)
UNSUPPORTED: SanitizerCommon-ubsan-x86_64-Darwin :: Posix/vis.cpp (2014 of 3054)
PASS: SanitizerCommon-ubsan-x86_64-Darwin :: Posix/uname.c (2015 of 3054)
UNSUPPORTED: SanitizerCommon-ubsan-x86_64-Darwin :: Posix/wcsxfrm.c (2016 of 3054)
PASS: SanitizerCommon-ubsan-x86_64-Darwin :: Posix/sanitizer_set_report_fd_test.cpp (2017 of 3054)
UNSUPPORTED: SanitizerCommon-ubsan-x86_64-Darwin :: allocator_returns_null.cpp (2018 of 3054)
UNSUPPORTED: SanitizerCommon-ubsan-x86_64-Darwin :: corelimit.cpp (2019 of 3054)
PASS: SanitizerCommon-ubsan-x86_64-Darwin :: Posix/wcsdup.c (2020 of 3054)
XFAIL: SanitizerCommon-ubsan-x86_64-Darwin :: Posix/weak_hook_test.cpp (2021 of 3054)
PASS: SanitizerCommon-ubsan-x86_64-Darwin :: ctype.c (2022 of 3054)
UNSUPPORTED: SanitizerCommon-ubsan-x86_64-Darwin :: hard_rss_limit_mb_test.cpp (2023 of 3054)
PASS: SanitizerCommon-ubsan-x86_64-Darwin :: fopen_nullptr.c (2024 of 3054)
UNSUPPORTED: SanitizerCommon-ubsan-x86_64-Darwin :: max_allocation_size.cpp (2025 of 3054)
XFAIL: SanitizerCommon-ubsan-x86_64-Darwin :: malloc_hook.cpp (2026 of 3054)
PASS: SanitizerCommon-ubsan-x86_64-Darwin :: options-help.cpp (2027 of 3054)
PASS: SanitizerCommon-ubsan-x86_64-Darwin :: onprint.cpp (2028 of 3054)
PASS: SanitizerCommon-ubsan-x86_64-Darwin :: options-include.cpp (2029 of 3054)
UNSUPPORTED: SanitizerCommon-ubsan-x86_64-Darwin :: print-stack-trace.cpp (2030 of 3054)
PASS: SanitizerCommon-ubsan-x86_64-Darwin :: options-invalid.cpp (2031 of 3054)
PASS: SanitizerCommon-ubsan-x86_64-Darwin :: printf-ldbl.c (2032 of 3054)
UNSUPPORTED: SanitizerCommon-ubsan-x86_64-Darwin :: reallocarray-overflow.cpp (2033 of 3054)
UNSUPPORTED: SanitizerCommon-ubsan-x86_64-Darwin :: sanitizer_coverage_allowlist_blocklist.cpp (2034 of 3054)
PASS: SanitizerCommon-ubsan-x86_64-Darwin :: pthread_mutexattr_get.cpp (2035 of 3054)
UNSUPPORTED: SanitizerCommon-ubsan-x86_64-Darwin :: sanitizer_coverage_inline_bool_flag.cpp (2036 of 3054)
XFAIL: SanitizerCommon-ubsan-x86_64-Darwin :: sanitizer_coverage_no_prune.cpp (2037 of 3054)
PASS: SanitizerCommon-ubsan-x86_64-Darwin :: sanitizer_coverage_inline8bit_counter.cpp (2038 of 3054)
UNSUPPORTED: SanitizerCommon-ubsan-x86_64-Darwin :: sanitizer_coverage_symbolize.cpp (2039 of 3054)
UNSUPPORTED: SanitizerCommon-ubsan-x86_64-Darwin :: sanitizer_coverage_trace_pc_guard-dso.cpp (2040 of 3054)
UNSUPPORTED: SanitizerCommon-ubsan-x86_64-Darwin :: sanitizer_coverage_trace_pc_guard-init.cpp (2041 of 3054)
UNSUPPORTED: SanitizerCommon-ubsan-x86_64-Darwin :: sanitizer_coverage_trace_pc_guard.cpp (2042 of 3054)
UNSUPPORTED: ShadowCallStack :: init.c (2043 of 3054)
UNSUPPORTED: ShadowCallStack :: overflow.c (2044 of 3054)
PASS: SanitizerCommon-ubsan-x86_64-Darwin :: scanf-ldbl.c (2045 of 3054)
PASS: SanitizerCommon-ubsan-x86_64-Darwin :: get_module_and_offset_for_pc.cpp (2046 of 3054)
PASS: SanitizerCommon-ubsan-x86_64-Darwin :: sanitizer_coverage_stack_depth.cpp (2047 of 3054)
PASS: SanitizerCommon-ubsan-x86_64-Darwin :: strcasestr.c (2048 of 3054)
PASS: SanitizerCommon-ubsan-x86_64-Darwin :: strcspn.c (2049 of 3054)
PASS: SanitizerCommon-ubsan-x86_64-Darwin :: strnlen.c (2050 of 3054)
PASS: SanitizerCommon-ubsan-x86_64-Darwin :: strpbrk.c (2051 of 3054)
PASS: SanitizerCommon-ubsan-x86_64-Darwin :: strspn.c (2052 of 3054)
PASS: SanitizerCommon-ubsan-x86_64-Darwin :: strstr.c (2053 of 3054)
PASS: SanitizerCommon-ubsan-x86_64-Darwin :: symbolize_debug_argv.cpp (2054 of 3054)
PASS: SanitizerCommon-ubsan-x86_64-Darwin :: symbolize_pc.cpp (2055 of 3054)
XFAIL: SanitizerCommon-ubsan-x86_64-Darwin :: symbolize_pc_inline.cpp (2056 of 3054)
PASS: SanitizerCommon-ubsan-x86_64-Darwin :: wcrtomb.c (2057 of 3054)
PASS: SanitizerCommon-ubsan-x86_64-Darwin :: wctomb.c (2058 of 3054)
PASS: ThreadSanitizer-Unit :: rtl/./TsanRtlTest-x86_64-Test/Posix.CondBasic (2059 of 3054)
PASS: ThreadSanitizer-Unit :: rtl/./TsanRtlTest-x86_64-Test/Posix.ThreadLocalAccesses (2060 of 3054)
PASS: SanitizerCommon-ubsan-x86_64-Darwin :: symbolize_stack.cpp (2061 of 3054)
PASS: ThreadSanitizer-Unit :: rtl/./TsanRtlTest-x86_64-Test/Posix.ThreadSpecificDtors (2062 of 3054)
PASS: ThreadSanitizer-Unit :: rtl/./TsanRtlTest-x86_64-Test/ThreadSanitizer.BasicMutex (2063 of 3054)
PASS: ThreadSanitizer-Unit :: rtl/./TsanRtlTest-x86_64-Test/ThreadSanitizer.BasicRwMutex (2064 of 3054)
PASS: ThreadSanitizer-Unit :: rtl/./TsanRtlTest-x86_64-Test/ThreadSanitizer.BasicSpinMutex (2065 of 3054)
PASS: ThreadSanitizer-Unit :: rtl/./TsanRtlTest-x86_64-Test/ThreadSanitizer.BenignRaceOnVptr (2066 of 3054)
PASS: ThreadSanitizer-Unit :: rtl/./TsanRtlTest-x86_64-Test/ThreadSanitizer.FuncCall (2067 of 3054)
PASS: ThreadSanitizer-Unit :: rtl/./TsanRtlTest-x86_64-Test/ThreadSanitizer.HarmfulRaceOnVptr (2068 of 3054)
PASS: ThreadSanitizer-Unit :: rtl/./TsanRtlTest-x86_64-Test/ThreadSanitizer.LockedWriteThenRead (2069 of 3054)
PASS: ThreadSanitizer-Unit :: rtl/./TsanRtlTest-x86_64-Test/ThreadSanitizer.Memcpy (2070 of 3054)
PASS: ThreadSanitizer-Unit :: rtl/./TsanRtlTest-x86_64-Test/ThreadSanitizer.MemcpyRace1 (2071 of 3054)
PASS: ThreadSanitizer-Unit :: rtl/./TsanRtlTest-x86_64-Test/ThreadSanitizer.MemcpyRace2 (2072 of 3054)
PASS: ThreadSanitizer-Unit :: rtl/./TsanRtlTest-x86_64-Test/ThreadSanitizer.MemcpyRace3 (2073 of 3054)
PASS: ThreadSanitizer-Unit :: rtl/./TsanRtlTest-x86_64-Test/ThreadSanitizer.MemcpyStack (2074 of 3054)
PASS: ThreadSanitizer-Unit :: rtl/./TsanRtlTest-x86_64-Test/ThreadSanitizer.MemsetRace1 (2075 of 3054)
PASS: ThreadSanitizer-Unit :: rtl/./TsanRtlTest-x86_64-Test/ThreadSanitizer.Mutex (2076 of 3054)
PASS: ThreadSanitizer-Unit :: rtl/./TsanRtlTest-x86_64-Test/ThreadSanitizer.NoRaceWithOffset (2077 of 3054)
PASS: ThreadSanitizer-Unit :: rtl/./TsanRtlTest-x86_64-Test/ThreadSanitizer.RaceWithDeadThread (2078 of 3054)
PASS: ThreadSanitizer-Unit :: rtl/./TsanRtlTest-x86_64-Test/ThreadSanitizer.RaceWithOffset (2079 of 3054)
PASS: ThreadSanitizer-Unit :: rtl/./TsanRtlTest-x86_64-Test/ThreadSanitizer.RaceWithOffset2 (2080 of 3054)
PASS: ThreadSanitizer-Unit :: rtl/./TsanRtlTest-x86_64-Test/ThreadSanitizer.ReadReadNoRace (2081 of 3054)
PASS: ThreadSanitizer-Unit :: rtl/./TsanRtlTest-x86_64-Test/ThreadSanitizer.ReadWriteRace (2082 of 3054)
PASS: ThreadSanitizer-Unit :: rtl/./TsanRtlTest-x86_64-Test/ThreadSanitizer.ReportDeadThread (2083 of 3054)
PASS: ThreadSanitizer-Unit :: rtl/./TsanRtlTest-x86_64-Test/ThreadSanitizer.ReportRace (2084 of 3054)
PASS: ThreadSanitizer-Unit :: rtl/./TsanRtlTest-x86_64-Test/ThreadSanitizer.RwMutex (2085 of 3054)
PASS: ThreadSanitizer-Unit :: rtl/./TsanRtlTest-x86_64-Test/ThreadSanitizer.SimpleWrite (2086 of 3054)
PASS: ThreadSanitizer-Unit :: rtl/./TsanRtlTest-x86_64-Test/ThreadSanitizer.SimpleWriteWrite (2087 of 3054)
PASS: ThreadSanitizer-Unit :: rtl/./TsanRtlTest-x86_64-Test/ThreadSanitizer.SpinMutex (2088 of 3054)
PASS: ThreadSanitizer-Unit :: rtl/./TsanRtlTest-x86_64-Test/ThreadSanitizer.StaticMutex (2089 of 3054)
PASS: ThreadSanitizer-Unit :: rtl/./TsanRtlTest-x86_64-Test/ThreadSanitizer.ThreadDetach1 (2090 of 3054)
PASS: ThreadSanitizer-Unit :: rtl/./TsanRtlTest-x86_64-Test/ThreadSanitizer.ThreadDetach2 (2091 of 3054)
PASS: ThreadSanitizer-Unit :: rtl/./TsanRtlTest-x86_64-Test/ThreadSanitizer.ThreadSync (2092 of 3054)
PASS: ThreadSanitizer-Unit :: rtl/./TsanRtlTest-x86_64-Test/ThreadSanitizer.WriteReadRace (2093 of 3054)
PASS: ThreadSanitizer-Unit :: rtl/./TsanRtlTest-x86_64-Test/ThreadSanitizer.WriteThenLockedRead (2094 of 3054)
PASS: ThreadSanitizer-Unit :: rtl/./TsanRtlTest-x86_64-Test/ThreadSanitizer.WriteThenRead (2095 of 3054)
PASS: ThreadSanitizer-Unit :: unit/./TsanUnitTest-x86_64-Test/Clock.AcquireRelease (2096 of 3054)
PASS: ThreadSanitizer-Unit :: rtl/./TsanRtlTest-x86_64-Test/ThreadSanitizer.WriteWriteRace (2097 of 3054)
PASS: ThreadSanitizer-Unit :: unit/./TsanUnitTest-x86_64-Test/Clock.ChunkedBasic (2098 of 3054)
PASS: ThreadSanitizer-Unit :: unit/./TsanUnitTest-x86_64-Test/Clock.DifferentSizes (2099 of 3054)
PASS: ThreadSanitizer-Unit :: unit/./TsanUnitTest-x86_64-Test/Clock.Fuzzer (2100 of 3054)
PASS: ThreadSanitizer-Unit :: unit/./TsanUnitTest-x86_64-Test/Clock.Growth (2101 of 3054)
PASS: ThreadSanitizer-Unit :: unit/./TsanUnitTest-x86_64-Test/Clock.Growth2 (2102 of 3054)
PASS: ThreadSanitizer-Unit :: unit/./TsanUnitTest-x86_64-Test/Clock.Iter (2103 of 3054)
PASS: ThreadSanitizer-Unit :: unit/./TsanUnitTest-x86_64-Test/Clock.ManyThreads (2104 of 3054)
PASS: ThreadSanitizer-Unit :: unit/./TsanUnitTest-x86_64-Test/Clock.RepeatedAcquire (2105 of 3054)
PASS: ThreadSanitizer-Unit :: unit/./TsanUnitTest-x86_64-Test/Clock.VectorBasic (2106 of 3054)
PASS: ThreadSanitizer-Unit :: unit/./TsanUnitTest-x86_64-Test/Clock.releaseStoreAcquire (2107 of 3054)
PASS: ThreadSanitizer-Unit :: unit/./TsanUnitTest-x86_64-Test/Flags.Basic (2108 of 3054)
PASS: ThreadSanitizer-Unit :: unit/./TsanUnitTest-x86_64-Test/Flags.DefaultValues (2109 of 3054)
PASS: ThreadSanitizer-Unit :: unit/./TsanUnitTest-x86_64-Test/Flags.ParseDefaultOptions (2110 of 3054)
PASS: ThreadSanitizer-Unit :: unit/./TsanUnitTest-x86_64-Test/Flags.ParseEnvOptions (2111 of 3054)
PASS: ThreadSanitizer-Unit :: unit/./TsanUnitTest-x86_64-Test/Flags.ParsePriority (2112 of 3054)
PASS: ThreadSanitizer-Unit :: unit/./TsanUnitTest-x86_64-Test/MetaMap.Basic (2113 of 3054)
PASS: ThreadSanitizer-Unit :: unit/./TsanUnitTest-x86_64-Test/MetaMap.FreeRange (2114 of 3054)
PASS: ThreadSanitizer-Unit :: unit/./TsanUnitTest-x86_64-Test/MetaMap.MoveMemory (2115 of 3054)
PASS: ThreadSanitizer-Unit :: unit/./TsanUnitTest-x86_64-Test/MetaMap.ResetSync (2116 of 3054)
PASS: ThreadSanitizer-Unit :: unit/./TsanUnitTest-x86_64-Test/MetaMap.Sync (2117 of 3054)
PASS: ThreadSanitizer-Unit :: unit/./TsanUnitTest-x86_64-Test/Mman.AlignedAlloc (2118 of 3054)
PASS: ThreadSanitizer-Unit :: unit/./TsanUnitTest-x86_64-Test/Mman.Internal (2119 of 3054)
PASS: ThreadSanitizer-Unit :: unit/./TsanUnitTest-x86_64-Test/Mman.PosixMemalign (2120 of 3054)
PASS: ThreadSanitizer-Unit :: unit/./TsanUnitTest-x86_64-Test/Mman.Stats (2121 of 3054)
PASS: ThreadSanitizer-Unit :: unit/./TsanUnitTest-x86_64-Test/Mman.UsableSize (2122 of 3054)
PASS: ThreadSanitizer-Unit :: unit/./TsanUnitTest-x86_64-Test/Mman.Memalign (2123 of 3054)
PASS: ThreadSanitizer-Unit :: unit/./TsanUnitTest-x86_64-Test/Mman.User (2124 of 3054)
PASS: ThreadSanitizer-Unit :: unit/./TsanUnitTest-x86_64-Test/Mman.UserRealloc (2125 of 3054)
PASS: ThreadSanitizer-Unit :: unit/./TsanUnitTest-x86_64-Test/Mman.Valloc (2126 of 3054)
PASS: ThreadSanitizer-Unit :: unit/./TsanUnitTest-x86_64-Test/Mutex.ReadWrite (2127 of 3054)
PASS: ThreadSanitizer-Unit :: unit/./TsanUnitTest-x86_64-Test/Mutex.SpinWrite (2128 of 3054)
PASS: ThreadSanitizer-Unit :: unit/./TsanUnitTest-x86_64-Test/Mutex.Write (2129 of 3054)
PASS: ThreadSanitizer-Unit :: unit/./TsanUnitTest-x86_64-Test/Shadow.Celling (2130 of 3054)
PASS: ThreadSanitizer-Unit :: unit/./TsanUnitTest-x86_64-Test/Shadow.FastState (2131 of 3054)
PASS: ThreadSanitizer-Unit :: unit/./TsanUnitTest-x86_64-Test/Shadow.Mapping (2132 of 3054)
PASS: ThreadSanitizer-Unit :: unit/./TsanUnitTest-x86_64-Test/StackTrace.BasicBuffered (2133 of 3054)
PASS: ThreadSanitizer-Unit :: unit/./TsanUnitTest-x86_64-Test/StackTrace.BasicVarSize (2134 of 3054)
PASS: ThreadSanitizer-Unit :: unit/./TsanUnitTest-x86_64-Test/StackTrace.TrimBuffered (2135 of 3054)
PASS: ThreadSanitizer-Unit :: unit/./TsanUnitTest-x86_64-Test/StackTrace.TrimVarSize (2136 of 3054)
PASS: ThreadSanitizer-x86_64 :: Darwin/dlopen.cpp (2137 of 3054)
PASS: ThreadSanitizer-x86_64 :: Darwin/debug_external.cpp (2138 of 3054)
PASS: ThreadSanitizer-x86_64 :: Darwin/deadlock.mm (2139 of 3054)
PASS: ThreadSanitizer-x86_64 :: Darwin/external-lib.cpp (2140 of 3054)
PASS: ThreadSanitizer-x86_64 :: Darwin/external-noninstrumented-module.cpp (2141 of 3054)
PASS: ThreadSanitizer-x86_64 :: Darwin/external-dups.cpp (2142 of 3054)
PASS: ThreadSanitizer-x86_64 :: Darwin/external-ignore-noninstrumented.cpp (2143 of 3054)
PASS: ThreadSanitizer-x86_64 :: Darwin/external-swift-debugging.cpp (2144 of 3054)
PASS: ThreadSanitizer-x86_64 :: Darwin/external-swift.cpp (2145 of 3054)
PASS: ThreadSanitizer-x86_64 :: Darwin/gcd-sync-block-copy.mm (2146 of 3054)
PASS: ThreadSanitizer-x86_64 :: Darwin/ignore-noninstrumented.mm (2147 of 3054)
PASS: ThreadSanitizer-x86_64 :: Darwin/external.cpp (2148 of 3054)
PASS: ThreadSanitizer-x86_64 :: Darwin/libcxx-call-once.mm (2149 of 3054)
PASS: ThreadSanitizer-x86_64 :: Darwin/libcxx-future.mm (2150 of 3054)
PASS: ThreadSanitizer-x86_64 :: Darwin/libcxx-shared-ptr-recursive.mm (2151 of 3054)
PASS: ThreadSanitizer-x86_64 :: Darwin/libcxx-shared-ptr-stress.mm (2152 of 3054)
PASS: ThreadSanitizer-x86_64 :: Darwin/mach_vm_allocate.c (2153 of 3054)
PASS: ThreadSanitizer-x86_64 :: Darwin/libcxx-shared-ptr.mm (2154 of 3054)
PASS: ThreadSanitizer-x86_64 :: Darwin/malloc-stack-logging.cpp (2155 of 3054)
PASS: ThreadSanitizer-x86_64 :: Darwin/main_tid.mm (2156 of 3054)
PASS: ThreadSanitizer-x86_64 :: Darwin/malloc_size.mm (2157 of 3054)
PASS: ThreadSanitizer-x86_64 :: Darwin/no_call_setenv_in_symbolize.cpp (2158 of 3054)
PASS: ThreadSanitizer-x86_64 :: Darwin/norace-objcxx-run-time.mm (2159 of 3054)
PASS: ThreadSanitizer-x86_64 :: Darwin/objc-race.mm (2160 of 3054)
PASS: ThreadSanitizer-x86_64 :: Darwin/objc-simple.mm (2161 of 3054)
PASS: ThreadSanitizer-x86_64 :: Darwin/objc-synchronize-cycle-tagged.mm (2162 of 3054)
PASS: ThreadSanitizer-x86_64 :: Darwin/objc-synchronize-cycle.mm (2163 of 3054)
PASS: ThreadSanitizer-x86_64 :: Darwin/objc-double-property.mm (2164 of 3054)
PASS: ThreadSanitizer-x86_64 :: Darwin/objc-synchronize-nested-recursive.mm (2165 of 3054)
PASS: ThreadSanitizer-x86_64 :: Darwin/os_unfair_lock.c (2166 of 3054)
PASS: ThreadSanitizer-x86_64 :: Darwin/objc-synchronize.mm (2167 of 3054)
PASS: ThreadSanitizer-x86_64 :: Darwin/objc-synchronize-tagged.mm (2168 of 3054)
PASS: ThreadSanitizer-x86_64 :: Darwin/osatomics-add.mm (2169 of 3054)
PASS: ThreadSanitizer-x86_64 :: Darwin/osatomics-bitops.mm (2170 of 3054)
PASS: ThreadSanitizer-x86_64 :: Darwin/osatomics-list.mm (2171 of 3054)
PASS: ThreadSanitizer-x86_64 :: Darwin/osspinlock-norace.cpp (2172 of 3054)
PASS: ThreadSanitizer-x86_64 :: Darwin/realloc-zero.cpp (2173 of 3054)
PASS: ThreadSanitizer-x86_64 :: Darwin/signals-blocked.cpp (2174 of 3054)
PASS: ThreadSanitizer-x86_64 :: Darwin/symbolizer-dladdr.cpp (2175 of 3054)
PASS: ThreadSanitizer-x86_64 :: Darwin/symbolizer-atos.cpp (2176 of 3054)
PASS: ThreadSanitizer-x86_64 :: Darwin/variadic-open.cpp (2177 of 3054)
PASS: ThreadSanitizer-x86_64 :: Darwin/workerthreads.mm (2178 of 3054)
UNSUPPORTED: ThreadSanitizer-x86_64 :: Linux/check_memcpy.c (2179 of 3054)
UNSUPPORTED: ThreadSanitizer-x86_64 :: Linux/check_preinit.cpp (2180 of 3054)
PASS: ThreadSanitizer-x86_64 :: Darwin/xpc-cancel.mm (2181 of 3054)
UNSUPPORTED: ThreadSanitizer-x86_64 :: Linux/double_race.cpp (2182 of 3054)
UNSUPPORTED: ThreadSanitizer-x86_64 :: Linux/mutex_robust.cpp (2183 of 3054)
UNSUPPORTED: ThreadSanitizer-x86_64 :: Linux/mutex_robust2.cpp (2184 of 3054)
UNSUPPORTED: ThreadSanitizer-x86_64 :: Linux/pie_no_aslr.cpp (2185 of 3054)
UNSUPPORTED: ThreadSanitizer-x86_64 :: Linux/thread_timedjoin.c (2186 of 3054)
UNSUPPORTED: ThreadSanitizer-x86_64 :: Linux/thread_tryjoin.c (2187 of 3054)
UNSUPPORTED: ThreadSanitizer-x86_64 :: Linux/user_fopen.cpp (2188 of 3054)
UNSUPPORTED: ThreadSanitizer-x86_64 :: Linux/user_malloc.cpp (2189 of 3054)
PASS: ThreadSanitizer-x86_64 :: Darwin/xpc-race.mm (2190 of 3054)
PASS: ThreadSanitizer-x86_64 :: aligned_vs_unaligned_race.cpp (2191 of 3054)
PASS: ThreadSanitizer-x86_64 :: annotate_happens_before.cpp (2192 of 3054)
PASS: ThreadSanitizer-x86_64 :: atexit.cpp (2193 of 3054)
PASS: ThreadSanitizer-x86_64 :: Darwin/xpc.mm (2194 of 3054)
PASS: ThreadSanitizer-x86_64 :: atexit3.cpp (2195 of 3054)
PASS: ThreadSanitizer-x86_64 :: atexit2.cpp (2196 of 3054)
PASS: ThreadSanitizer-x86_64 :: atomic_free2.cpp (2197 of 3054)
PASS: ThreadSanitizer-x86_64 :: atomic_free3.cpp (2198 of 3054)
PASS: ThreadSanitizer-x86_64 :: atomic_hle.cpp (2199 of 3054)
PASS: ThreadSanitizer-x86_64 :: atomic_norace.cpp (2200 of 3054)
PASS: ThreadSanitizer-x86_64 :: atomic_race.cpp (2201 of 3054)
PASS: ThreadSanitizer-x86_64 :: atomic_stack.cpp (2202 of 3054)
UNSUPPORTED: ThreadSanitizer-x86_64 :: barrier.cpp (2203 of 3054)
UNSUPPORTED: ThreadSanitizer-x86_64 :: bench_acquire_only.cpp (2204 of 3054)
UNSUPPORTED: ThreadSanitizer-x86_64 :: bench_acquire_release.cpp (2205 of 3054)
UNSUPPORTED: ThreadSanitizer-x86_64 :: bench_local_mutex.cpp (2206 of 3054)
UNSUPPORTED: ThreadSanitizer-x86_64 :: bench_mutex.cpp (2207 of 3054)
UNSUPPORTED: ThreadSanitizer-x86_64 :: bench_release_only.cpp (2208 of 3054)
UNSUPPORTED: ThreadSanitizer-x86_64 :: bench_rwmutex.cpp (2209 of 3054)
PASS: ThreadSanitizer-x86_64 :: atomic_store.cpp (2210 of 3054)
UNSUPPORTED: ThreadSanitizer-x86_64 :: bench_single_writer.cpp (2211 of 3054)
UNSUPPORTED: ThreadSanitizer-x86_64 :: bench_ten_mutexes.cpp (2212 of 3054)
PASS: ThreadSanitizer-x86_64 :: bench_shadow_flush.cpp (2213 of 3054)
PASS: ThreadSanitizer-x86_64 :: benign_race.cpp (2214 of 3054)
PASS: ThreadSanitizer-x86_64 :: blacklist.cpp (2215 of 3054)
PASS: ThreadSanitizer-x86_64 :: cond.c (2216 of 3054)
PASS: ThreadSanitizer-x86_64 :: blacklist2.cpp (2217 of 3054)
PASS: ThreadSanitizer-x86_64 :: cond_cancel.c (2218 of 3054)
PASS: ThreadSanitizer-x86_64 :: cond_destruction.cpp (2219 of 3054)
UNSUPPORTED: ThreadSanitizer-x86_64 :: cond_version.c (2220 of 3054)
PASS: ThreadSanitizer-x86_64 :: cond_race.cpp (2221 of 3054)
PASS: ThreadSanitizer-x86_64 :: custom_mutex0.cpp (2222 of 3054)
PASS: ThreadSanitizer-x86_64 :: custom_mutex1.cpp (2223 of 3054)
PASS: ThreadSanitizer-x86_64 :: custom_mutex2.cpp (2224 of 3054)
PASS: ThreadSanitizer-x86_64 :: custom_mutex3.cpp (2225 of 3054)
PASS: ThreadSanitizer-x86_64 :: custom_mutex4.cpp (2226 of 3054)
PASS: ThreadSanitizer-x86_64 :: atomic_free.cpp (2227 of 3054)
PASS: ThreadSanitizer-x86_64 :: cxa_guard_acquire.cpp (2228 of 3054)
UNSUPPORTED: ThreadSanitizer-x86_64 :: debug_alloc_stack.cpp (2229 of 3054)
PASS: ThreadSanitizer-x86_64 :: custom_mutex5.cpp (2230 of 3054)
PASS: ThreadSanitizer-x86_64 :: debug_locate.cpp (2231 of 3054)
PASS: ThreadSanitizer-x86_64 :: debugging.cpp (2232 of 3054)
PASS: ThreadSanitizer-x86_64 :: default_options.cpp (2233 of 3054)
UNSUPPORTED: ThreadSanitizer-x86_64 :: dl_iterate_phdr.cpp (2234 of 3054)
PASS: ThreadSanitizer-x86_64 :: deep_stack1.cpp (2235 of 3054)
PASS: ThreadSanitizer-x86_64 :: dlclose.cpp (2236 of 3054)
PASS: ThreadSanitizer-x86_64 :: dtls.c (2237 of 3054)
PASS: ThreadSanitizer-x86_64 :: exceptions.cpp (2238 of 3054)
PASS: ThreadSanitizer-x86_64 :: fd_close_norace.cpp (2239 of 3054)
PASS: ThreadSanitizer-x86_64 :: fd_close_norace2.cpp (2240 of 3054)
PASS: ThreadSanitizer-x86_64 :: fd_dup_norace.cpp (2241 of 3054)
PASS: ThreadSanitizer-x86_64 :: fd_dup_norace2.cpp (2242 of 3054)
PASS: ThreadSanitizer-x86_64 :: fd_dup_race.cpp (2243 of 3054)
PASS: ThreadSanitizer-x86_64 :: fd_location.cpp (2244 of 3054)
PASS: ThreadSanitizer-x86_64 :: fd_pipe_norace.cpp (2245 of 3054)
PASS: ThreadSanitizer-x86_64 :: fd_pipe_race.cpp (2246 of 3054)
PASS: ThreadSanitizer-x86_64 :: fd_socket_connect_norace.cpp (2247 of 3054)
PASS: ThreadSanitizer-x86_64 :: fd_socket_norace.cpp (2248 of 3054)
PASS: ThreadSanitizer-x86_64 :: fd_socketpair_norace.cpp (2249 of 3054)
PASS: ThreadSanitizer-x86_64 :: deadlock_detector_stress_test.cpp (2250 of 3054)
PASS: ThreadSanitizer-x86_64 :: fd_stdout_race.cpp (2251 of 3054)
UNSUPPORTED: ThreadSanitizer-x86_64 :: fiber_cleanup.cpp (2252 of 3054)
PASS: ThreadSanitizer-x86_64 :: fiber_asm.cpp (2253 of 3054)
PASS: ThreadSanitizer-x86_64 :: fd_tid_recycled.cpp (2254 of 3054)
PASS: ThreadSanitizer-x86_64 :: fiber_from_thread.cpp (2255 of 3054)
PASS: ThreadSanitizer-x86_64 :: fiber_longjmp.cpp (2256 of 3054)
PASS: ThreadSanitizer-x86_64 :: fiber_race.cpp (2257 of 3054)
PASS: ThreadSanitizer-x86_64 :: fiber_simple.cpp (2258 of 3054)
PASS: ThreadSanitizer-x86_64 :: fiber_two_threads.cpp (2259 of 3054)
PASS: ThreadSanitizer-x86_64 :: fork_atexit.cpp (2260 of 3054)
PASS: ThreadSanitizer-x86_64 :: fork_multithreaded3.cpp (2261 of 3054)
PASS: ThreadSanitizer-x86_64 :: fork_multithreaded.cpp (2262 of 3054)
PASS: ThreadSanitizer-x86_64 :: free_race2.c (2263 of 3054)
PASS: ThreadSanitizer-x86_64 :: free_race.c (2264 of 3054)
PASS: ThreadSanitizer-x86_64 :: getline_nohang.cpp (2265 of 3054)
PASS: ThreadSanitizer-x86_64 :: global_race2.cpp (2266 of 3054)
PASS: ThreadSanitizer-x86_64 :: global_race3.cpp (2267 of 3054)
PASS: ThreadSanitizer-x86_64 :: fork_deadlock.cpp (2268 of 3054)
PASS: ThreadSanitizer-x86_64 :: heap_race.cpp (2269 of 3054)
PASS: ThreadSanitizer-x86_64 :: halt_on_error.cpp (2270 of 3054)
PASS: ThreadSanitizer-x86_64 :: ignore_free.cpp (2271 of 3054)
PASS: ThreadSanitizer-x86_64 :: ignore_lib0.cpp (2272 of 3054)
PASS: ThreadSanitizer-x86_64 :: ignore_lib1.cpp (2273 of 3054)
PASS: ThreadSanitizer-x86_64 :: ignore_lib2.cpp (2274 of 3054)
PASS: ThreadSanitizer-x86_64 :: ignore_lib3.cpp (2275 of 3054)
PASS: ThreadSanitizer-x86_64 :: ignore_lib5.cpp (2276 of 3054)
PASS: ThreadSanitizer-x86_64 :: ignore_lib4.cpp (2277 of 3054)
PASS: ThreadSanitizer-x86_64 :: global_race.cpp (2278 of 3054)
PASS: ThreadSanitizer-x86_64 :: ignore_malloc.cpp (2279 of 3054)
PASS: ThreadSanitizer-x86_64 :: ignore_race.cpp (2280 of 3054)
PASS: ThreadSanitizer-x86_64 :: ignore_sync.cpp (2281 of 3054)
PASS: ThreadSanitizer-x86_64 :: ignored-interceptors-mmap.cpp (2282 of 3054)
PASS: ThreadSanitizer-x86_64 :: inlined_memcpy_race.cpp (2283 of 3054)
PASS: ThreadSanitizer-x86_64 :: interface_atomic_test.c (2284 of 3054)
PASS: ThreadSanitizer-x86_64 :: inlined_memcpy_race2.cpp (2285 of 3054)
PASS: ThreadSanitizer-x86_64 :: ignore_lib6.cpp (2286 of 3054)
UNSUPPORTED: ThreadSanitizer-x86_64 :: java_finalizer2.cpp (2287 of 3054)
PASS: ThreadSanitizer-x86_64 :: java_alloc.cpp (2288 of 3054)
PASS: ThreadSanitizer-x86_64 :: java_finalizer.cpp (2289 of 3054)
PASS: ThreadSanitizer-x86_64 :: java_find.cpp (2290 of 3054)
PASS: ThreadSanitizer-x86_64 :: java_heap_init.cpp (2291 of 3054)
PASS: ThreadSanitizer-x86_64 :: java_lock.cpp (2292 of 3054)
PASS: ThreadSanitizer-x86_64 :: java_lock_move.cpp (2293 of 3054)
PASS: ThreadSanitizer-x86_64 :: java_lock_rec.cpp (2294 of 3054)
PASS: ThreadSanitizer-x86_64 :: java_lock_rec_race.cpp (2295 of 3054)
PASS: ThreadSanitizer-x86_64 :: java_move_overlap.cpp (2296 of 3054)
PASS: ThreadSanitizer-x86_64 :: java_move_overlap_race.cpp (2297 of 3054)
PASS: ThreadSanitizer-x86_64 :: java_race.cpp (2298 of 3054)
PASS: ThreadSanitizer-x86_64 :: java_race_move.cpp (2299 of 3054)
PASS: ThreadSanitizer-x86_64 :: java_rwlock.cpp (2300 of 3054)
PASS: ThreadSanitizer-x86_64 :: java_race_pc.cpp (2301 of 3054)
PASS: ThreadSanitizer-x86_64 :: java_symbolization.cpp (2302 of 3054)
PASS: ThreadSanitizer-x86_64 :: java_volatile.cpp (2303 of 3054)
PASS: ThreadSanitizer-x86_64 :: java_symbolization_legacy.cpp (2304 of 3054)
PASS: ThreadSanitizer-x86_64 :: libdispatch/after.c (2305 of 3054)
PASS: ThreadSanitizer-x86_64 :: large_malloc_meta.cpp (2306 of 3054)
PASS: ThreadSanitizer-x86_64 :: libcxx/std_shared_ptr.cpp (2307 of 3054)
PASS: ThreadSanitizer-x86_64 :: libdispatch/apply-race.c (2308 of 3054)
PASS: ThreadSanitizer-x86_64 :: libdispatch/apply.c (2309 of 3054)
PASS: ThreadSanitizer-x86_64 :: libdispatch/async-norace.c (2310 of 3054)
PASS: ThreadSanitizer-x86_64 :: libdispatch/async-race.c (2311 of 3054)
PASS: ThreadSanitizer-x86_64 :: libdispatch/async_and_wait.c (2312 of 3054)
PASS: ThreadSanitizer-x86_64 :: libdispatch/barrier.c (2313 of 3054)
PASS: ThreadSanitizer-x86_64 :: libdispatch/barrier-race.c (2314 of 3054)
PASS: ThreadSanitizer-x86_64 :: libdispatch/blocks.c (2315 of 3054)
PASS: ThreadSanitizer-x86_64 :: libdispatch/data.c (2316 of 3054)
PASS: ThreadSanitizer-x86_64 :: libdispatch/dispatch_once_deadlock.c (2317 of 3054)
PASS: ThreadSanitizer-x86_64 :: libdispatch/fd.c (2318 of 3054)
PASS: ThreadSanitizer-x86_64 :: libdispatch/dispatch_main.c (2319 of 3054)
PASS: ThreadSanitizer-x86_64 :: libdispatch/groups-leave.c (2320 of 3054)
PASS: ThreadSanitizer-x86_64 :: libdispatch/groups-destructor.cpp (2321 of 3054)
PASS: ThreadSanitizer-x86_64 :: libdispatch/groups-norace.c (2322 of 3054)
PASS: ThreadSanitizer-x86_64 :: libdispatch/io-barrier.c (2323 of 3054)
PASS: ThreadSanitizer-x86_64 :: libdispatch/io-barrier-race.c (2324 of 3054)
PASS: ThreadSanitizer-x86_64 :: libdispatch/io-cleanup.c (2325 of 3054)
PASS: ThreadSanitizer-x86_64 :: libdispatch/groups-stress.c (2326 of 3054)
PASS: ThreadSanitizer-x86_64 :: libdispatch/io.c (2327 of 3054)
PASS: ThreadSanitizer-x86_64 :: libdispatch/io-race.c (2328 of 3054)
PASS: ThreadSanitizer-x86_64 :: libdispatch/once.c (2329 of 3054)
PASS: ThreadSanitizer-x86_64 :: libdispatch/semaphore-norace.c (2330 of 3054)
PASS: ThreadSanitizer-x86_64 :: libdispatch/serial-queue-norace.c (2331 of 3054)
PASS: ThreadSanitizer-x86_64 :: libdispatch/source-cancel.c (2332 of 3054)
PASS: ThreadSanitizer-x86_64 :: libdispatch/source-cancel2.c (2333 of 3054)
PASS: ThreadSanitizer-x86_64 :: libdispatch/source-event.c (2334 of 3054)
PASS: ThreadSanitizer-x86_64 :: libdispatch/source-event2.c (2335 of 3054)
PASS: ThreadSanitizer-x86_64 :: libdispatch/source-registration.c (2336 of 3054)
PASS: ThreadSanitizer-x86_64 :: libdispatch/source-registration2.c (2337 of 3054)
PASS: ThreadSanitizer-x86_64 :: libdispatch/source-serial.c (2338 of 3054)
PASS: ThreadSanitizer-x86_64 :: libdispatch/suspend.c (2339 of 3054)
PASS: ThreadSanitizer-x86_64 :: libdispatch/sync-block-copy.cpp (2340 of 3054)
PASS: ThreadSanitizer-x86_64 :: libdispatch/sync-norace.c (2341 of 3054)
PASS: ThreadSanitizer-x86_64 :: libdispatch/target-queue-norace.c (2342 of 3054)
PASS: ThreadSanitizer-x86_64 :: libdispatch/sync-race.c (2343 of 3054)
PASS: ThreadSanitizer-x86_64 :: longjmp2.cpp (2344 of 3054)
PASS: ThreadSanitizer-x86_64 :: longjmp.cpp (2345 of 3054)
PASS: ThreadSanitizer-x86_64 :: load_shared_lib.cpp (2346 of 3054)
PASS: ThreadSanitizer-x86_64 :: longjmp3.cpp (2347 of 3054)
PASS: ThreadSanitizer-x86_64 :: longjmp4.cpp (2348 of 3054)
PASS: ThreadSanitizer-x86_64 :: malloc_overflow.cpp (2349 of 3054)
UNSUPPORTED: ThreadSanitizer-x86_64 :: map32bit.cpp (2350 of 3054)
PASS: ThreadSanitizer-x86_64 :: malloc_stack.cpp (2351 of 3054)
PASS: ThreadSanitizer-x86_64 :: lots_of_threads.c (2352 of 3054)
PASS: ThreadSanitizer-x86_64 :: memcmp_race.cpp (2353 of 3054)
PASS: ThreadSanitizer-x86_64 :: mmap_large.cpp (2354 of 3054)
PASS: ThreadSanitizer-x86_64 :: memcpy_race.cpp (2355 of 3054)
PASS: ThreadSanitizer-x86_64 :: mmap_stress.cpp (2356 of 3054)
PASS: ThreadSanitizer-x86_64 :: mop1.c (2357 of 3054)
XFAIL: ThreadSanitizer-x86_64 :: must_deadlock.cpp (2358 of 3054)
PASS: ThreadSanitizer-x86_64 :: mop_with_offset.cpp (2359 of 3054)
PASS: ThreadSanitizer-x86_64 :: mop_with_offset2.cpp (2360 of 3054)
PASS: ThreadSanitizer-x86_64 :: mutex_annotations.cpp (2361 of 3054)
PASS: ThreadSanitizer-x86_64 :: mutex_bad_read_lock.cpp (2362 of 3054)
PASS: ThreadSanitizer-x86_64 :: mutex_bad_read_unlock.cpp (2363 of 3054)
PASS: ThreadSanitizer-x86_64 :: mutex_bad_unlock.cpp (2364 of 3054)
PASS: ThreadSanitizer-x86_64 :: mutex_destroy_locked.cpp (2365 of 3054)
PASS: ThreadSanitizer-x86_64 :: mutex_destroy_locked2.cpp (2366 of 3054)
PASS: ThreadSanitizer-x86_64 :: mutex_double_lock.cpp (2367 of 3054)
PASS: ThreadSanitizer-x86_64 :: mutex_cycle2.c (2368 of 3054)
PASS: ThreadSanitizer-x86_64 :: mutex_cycle_long.c (2369 of 3054)
PASS: ThreadSanitizer-x86_64 :: mutexset1.cpp (2370 of 3054)
PASS: ThreadSanitizer-x86_64 :: mutexset2.cpp (2371 of 3054)
PASS: ThreadSanitizer-x86_64 :: mutex_lock_destroyed.cpp (2372 of 3054)
PASS: ThreadSanitizer-x86_64 :: mutexset3.cpp (2373 of 3054)
PASS: ThreadSanitizer-x86_64 :: mutexset4.cpp (2374 of 3054)
PASS: ThreadSanitizer-x86_64 :: mutexset5.cpp (2375 of 3054)
PASS: ThreadSanitizer-x86_64 :: mutexset6.cpp (2376 of 3054)
PASS: ThreadSanitizer-x86_64 :: mutexset7.cpp (2377 of 3054)
PASS: ThreadSanitizer-x86_64 :: mutexset8.cpp (2378 of 3054)
PASS: ThreadSanitizer-x86_64 :: pie_test.cpp (2379 of 3054)
PASS: ThreadSanitizer-x86_64 :: pthread_atfork_deadlock.c (2380 of 3054)
PASS: ThreadSanitizer-x86_64 :: pthread_atfork_deadlock2.c (2381 of 3054)
UNSUPPORTED: ThreadSanitizer-x86_64 :: race_on_barrier.c (2382 of 3054)
UNSUPPORTED: ThreadSanitizer-x86_64 :: race_on_barrier2.c (2383 of 3054)
PASS: ThreadSanitizer-x86_64 :: printf-1.c (2384 of 3054)
PASS: ThreadSanitizer-x86_64 :: pthread_key.cpp (2385 of 3054)
PASS: ThreadSanitizer-x86_64 :: race_on_fputs.cpp (2386 of 3054)
PASS: ThreadSanitizer-x86_64 :: race_on_heap.cpp (2387 of 3054)
PASS: ThreadSanitizer-x86_64 :: race_on_mutex.c (2388 of 3054)
PASS: ThreadSanitizer-x86_64 :: race_on_mutex2.c (2389 of 3054)
PASS: ThreadSanitizer-x86_64 :: race_on_puts.cpp (2390 of 3054)
PASS: ThreadSanitizer-x86_64 :: race_on_read.cpp (2391 of 3054)
PASS: ThreadSanitizer-x86_64 :: race_on_speculative_load.cpp (2392 of 3054)
PASS: ThreadSanitizer-x86_64 :: race_on_write.cpp (2393 of 3054)
PASS: ThreadSanitizer-x86_64 :: race_range_pc.cpp (2394 of 3054)
PASS: ThreadSanitizer-x86_64 :: race_stress.cpp (2395 of 3054)
PASS: ThreadSanitizer-x86_64 :: race_top_suppression.cpp (2396 of 3054)
PASS: ThreadSanitizer-x86_64 :: race_top_suppression1.cpp (2397 of 3054)
PASS: ThreadSanitizer-x86_64 :: race_with_finished_thread.cpp (2398 of 3054)
PASS: ThreadSanitizer-x86_64 :: real_deadlock_detector_stress_test.cpp (2399 of 3054)
PASS: ThreadSanitizer-x86_64 :: setuid.c (2400 of 3054)
PASS: ThreadSanitizer-x86_64 :: signal_block.cpp (2401 of 3054)
PASS: ThreadSanitizer-x86_64 :: setuid2.c (2402 of 3054)
PASS: ThreadSanitizer-x86_64 :: signal_cond.cpp (2403 of 3054)
PASS: ThreadSanitizer-x86_64 :: restore_stack.cpp (2404 of 3054)
PASS: ThreadSanitizer-x86_64 :: signal_longjmp.cpp (2405 of 3054)
PASS: ThreadSanitizer-x86_64 :: signal_errno.cpp (2406 of 3054)
UNSUPPORTED: ThreadSanitizer-x86_64 :: signal_recursive.cpp (2407 of 3054)
UNSUPPORTED: ThreadSanitizer-x86_64 :: signal_reset.cpp (2408 of 3054)
UNSUPPORTED: ThreadSanitizer-x86_64 :: signal_sync.cpp (2409 of 3054)
UNSUPPORTED: ThreadSanitizer-x86_64 :: signal_sync2.cpp (2410 of 3054)
UNSUPPORTED: ThreadSanitizer-x86_64 :: signal_thread.cpp (2411 of 3054)
PASS: ThreadSanitizer-x86_64 :: signal_malloc.cpp (2412 of 3054)
PASS: ThreadSanitizer-x86_64 :: signal_pause.cpp (2413 of 3054)
PASS: ThreadSanitizer-x86_64 :: signal_write.cpp (2414 of 3054)
PASS: ThreadSanitizer-x86_64 :: sigsuspend.cpp (2415 of 3054)
PASS: ThreadSanitizer-x86_64 :: simple_race.c (2416 of 3054)
PASS: ThreadSanitizer-x86_64 :: simple_race.cpp (2417 of 3054)
PASS: ThreadSanitizer-x86_64 :: simple_stack2.cpp (2418 of 3054)
PASS: ThreadSanitizer-x86_64 :: sleep_sync.cpp (2419 of 3054)
PASS: ThreadSanitizer-x86_64 :: simple_stack.c (2420 of 3054)
PASS: ThreadSanitizer-x86_64 :: sleep_sync2.cpp (2421 of 3054)
PASS: ThreadSanitizer-x86_64 :: stack_race.cpp (2422 of 3054)
PASS: ThreadSanitizer-x86_64 :: stack_race2.cpp (2423 of 3054)
PASS: ThreadSanitizer-x86_64 :: stack_sync_reuse.cpp (2424 of 3054)
PASS: ThreadSanitizer-x86_64 :: static_init1.cpp (2425 of 3054)
PASS: ThreadSanitizer-x86_64 :: static_init2.cpp (2426 of 3054)
PASS: ThreadSanitizer-x86_64 :: static_init4.cpp (2427 of 3054)
PASS: ThreadSanitizer-x86_64 :: static_init5.cpp (2428 of 3054)
UNSUPPORTED: ThreadSanitizer-x86_64 :: strerror_r.cpp (2429 of 3054)
UNSUPPORTED: ThreadSanitizer-x86_64 :: sunrpc.cpp (2430 of 3054)
PASS: ThreadSanitizer-x86_64 :: static_init3.cpp (2431 of 3054)
PASS: ThreadSanitizer-x86_64 :: static_init6.cpp (2432 of 3054)
PASS: ThreadSanitizer-x86_64 :: suppress_same_stacks.cpp (2433 of 3054)
PASS: ThreadSanitizer-x86_64 :: suppress_same_address.cpp (2434 of 3054)
PASS: ThreadSanitizer-x86_64 :: suppressions_global.cpp (2435 of 3054)
PASS: ThreadSanitizer-x86_64 :: suppressions_mutex.cpp (2436 of 3054)
PASS: ThreadSanitizer-x86_64 :: suppressions_race.cpp (2437 of 3054)
PASS: ThreadSanitizer-x86_64 :: thread_detach.c (2438 of 3054)
PASS: ThreadSanitizer-x86_64 :: suppressions_race2.cpp (2439 of 3054)
PASS: ThreadSanitizer-x86_64 :: thread_detach2.c (2440 of 3054)
PASS: ThreadSanitizer-x86_64 :: thread_end_with_ignore.cpp (2441 of 3054)
PASS: ThreadSanitizer-x86_64 :: thread_end_with_ignore2.cpp (2442 of 3054)
PASS: ThreadSanitizer-x86_64 :: thread_end_with_ignore3.cpp (2443 of 3054)
PASS: ThreadSanitizer-x86_64 :: thread_exit.c (2444 of 3054)
PASS: ThreadSanitizer-x86_64 :: thread_leak.c (2445 of 3054)
PASS: ThreadSanitizer-x86_64 :: thread_leak2.c (2446 of 3054)
PASS: ThreadSanitizer-x86_64 :: thread_leak4.c (2447 of 3054)
PASS: ThreadSanitizer-x86_64 :: thread_name.cpp (2448 of 3054)
UNSUPPORTED: ThreadSanitizer-x86_64 :: thread_name2.cpp (2449 of 3054)
PASS: ThreadSanitizer-x86_64 :: thread_leak3.c (2450 of 3054)
PASS: ThreadSanitizer-x86_64 :: thread_leak5.c (2451 of 3054)
PASS: ThreadSanitizer-x86_64 :: tiny_race.c (2452 of 3054)
PASS: ThreadSanitizer-x86_64 :: tls_race.cpp (2453 of 3054)
PASS: ThreadSanitizer-x86_64 :: tls_race2.cpp (2454 of 3054)
PASS: ThreadSanitizer-x86_64 :: unaligned_norace.cpp (2455 of 3054)
PASS: ThreadSanitizer-x86_64 :: unaligned_race.cpp (2456 of 3054)
PASS: ThreadSanitizer-x86_64 :: vfork.cpp (2457 of 3054)
PASS: ThreadSanitizer-x86_64 :: tsan-vs-gvn.cpp (2458 of 3054)
PASS: ThreadSanitizer-x86_64 :: virtual_inheritance_compile_bug.cpp (2459 of 3054)
PASS: ThreadSanitizer-x86_64 :: vptr_benign_race.cpp (2460 of 3054)
PASS: ThreadSanitizer-x86_64 :: vptr_harmful_race.cpp (2461 of 3054)
PASS: ThreadSanitizer-x86_64 :: vptr_harmful_race2.cpp (2462 of 3054)
PASS: ThreadSanitizer-x86_64 :: vptr_harmful_race3.cpp (2463 of 3054)
PASS: ThreadSanitizer-x86_64 :: vptr_harmful_race4.cpp (2464 of 3054)
PASS: ThreadSanitizer-x86_64 :: write_in_reader_lock.cpp (2465 of 3054)
PASS: UBSan-AddressSanitizer-x86_64 :: TestCases/Float/cast-overflow.cpp (2466 of 3054)
PASS: UBSan-AddressSanitizer-x86_64 :: TestCases/ImplicitConversion/integer-conversion-incdec.c (2467 of 3054)
PASS: UBSan-AddressSanitizer-x86_64 :: TestCases/ImplicitConversion/integer-sign-change-blacklist.c (2468 of 3054)
PASS: UBSan-AddressSanitizer-x86_64 :: TestCases/ImplicitConversion/integer-arithmetic-value-change.c (2469 of 3054)
PASS: UBSan-AddressSanitizer-x86_64 :: TestCases/ImplicitConversion/integer-conversion.c (2470 of 3054)
PASS: UBSan-AddressSanitizer-x86_64 :: TestCases/ImplicitConversion/integer-sign-change-summary.cpp (2471 of 3054)
PASS: UBSan-AddressSanitizer-x86_64 :: TestCases/ImplicitConversion/integer-sign-change-incdec.c (2472 of 3054)
PASS: UBSan-AddressSanitizer-x86_64 :: TestCases/ImplicitConversion/integer-sign-change.c (2473 of 3054)
PASS: UBSan-AddressSanitizer-x86_64 :: TestCases/ImplicitConversion/integer-truncation.c (2474 of 3054)
PASS: UBSan-AddressSanitizer-x86_64 :: TestCases/ImplicitConversion/signed-integer-truncation-incdec.c (2475 of 3054)
PASS: UBSan-AddressSanitizer-x86_64 :: TestCases/ImplicitConversion/signed-integer-truncation-or-sign-change-summary.cpp (2476 of 3054)
PASS: UBSan-AddressSanitizer-x86_64 :: TestCases/ImplicitConversion/signed-integer-truncation-summary.cpp (2477 of 3054)
PASS: UBSan-AddressSanitizer-x86_64 :: TestCases/ImplicitConversion/signed-integer-truncation-blacklist.c (2478 of 3054)
PASS: UBSan-AddressSanitizer-x86_64 :: TestCases/ImplicitConversion/signed-integer-truncation-or-sign-change-blacklist.c (2479 of 3054)
PASS: UBSan-AddressSanitizer-x86_64 :: TestCases/ImplicitConversion/unsigned-integer-truncation-summary.cpp (2480 of 3054)
PASS: UBSan-AddressSanitizer-x86_64 :: TestCases/ImplicitConversion/signed-integer-truncation.c (2481 of 3054)
PASS: UBSan-AddressSanitizer-x86_64 :: TestCases/Integer/add-overflow.cpp (2482 of 3054)
PASS: UBSan-AddressSanitizer-x86_64 :: TestCases/Integer/div-overflow.cpp (2483 of 3054)
PASS: UBSan-AddressSanitizer-x86_64 :: TestCases/Integer/div-zero.cpp (2484 of 3054)
PASS: UBSan-AddressSanitizer-x86_64 :: TestCases/Integer/incdec-overflow.cpp (2485 of 3054)
PASS: UBSan-AddressSanitizer-x86_64 :: TestCases/ImplicitConversion/unsigned-integer-truncation-blacklist.c (2486 of 3054)
PASS: UBSan-AddressSanitizer-x86_64 :: TestCases/ImplicitConversion/unsigned-integer-truncation.c (2487 of 3054)
PASS: UBSan-AddressSanitizer-x86_64 :: TestCases/Integer/mul-overflow.cpp (2488 of 3054)
PASS: UBSan-AddressSanitizer-x86_64 :: TestCases/Integer/negate-overflow.cpp (2489 of 3054)
PASS: UBSan-AddressSanitizer-x86_64 :: TestCases/Integer/no-recover.cpp (2490 of 3054)
PASS: UBSan-AddressSanitizer-x86_64 :: TestCases/Integer/summary.cpp (2491 of 3054)
PASS: UBSan-AddressSanitizer-x86_64 :: TestCases/Integer/sub-overflow.cpp (2492 of 3054)
PASS: UBSan-AddressSanitizer-x86_64 :: TestCases/Integer/suppressions.cpp (2493 of 3054)
PASS: UBSan-AddressSanitizer-x86_64 :: TestCases/Integer/uadd-overflow.cpp (2494 of 3054)
PASS: UBSan-AddressSanitizer-x86_64 :: TestCases/Integer/umul-overflow.cpp (2495 of 3054)
PASS: UBSan-AddressSanitizer-x86_64 :: TestCases/Integer/uincdec-overflow.cpp (2496 of 3054)
UNSUPPORTED: UBSan-AddressSanitizer-x86_64 :: TestCases/Misc/Linux/print_stack_trace.cpp (2497 of 3054)
PASS: UBSan-AddressSanitizer-x86_64 :: TestCases/Integer/unsigned-shift.cpp (2498 of 3054)
UNSUPPORTED: UBSan-AddressSanitizer-x86_64 :: TestCases/Misc/Linux/ubsan_options.cpp (2499 of 3054)
PASS: UBSan-AddressSanitizer-x86_64 :: TestCases/Misc/bool.cpp (2500 of 3054)
PASS: UBSan-AddressSanitizer-x86_64 :: TestCases/Misc/bool.m (2501 of 3054)
PASS: UBSan-AddressSanitizer-x86_64 :: TestCases/Integer/usub-overflow.cpp (2502 of 3054)
PASS: UBSan-AddressSanitizer-x86_64 :: TestCases/Integer/shift.cpp (2503 of 3054)
PASS: UBSan-AddressSanitizer-x86_64 :: TestCases/Misc/bounds.cpp (2504 of 3054)
PASS: UBSan-AddressSanitizer-x86_64 :: TestCases/Misc/builtins.cpp (2505 of 3054)
PASS: UBSan-AddressSanitizer-x86_64 :: TestCases/Misc/deduplication.cpp (2506 of 3054)
PASS: UBSan-AddressSanitizer-x86_64 :: TestCases/Misc/log-path_test.cpp (2507 of 3054)
PASS: UBSan-AddressSanitizer-x86_64 :: TestCases/Misc/enum.cpp (2508 of 3054)
PASS: UBSan-AddressSanitizer-x86_64 :: TestCases/Misc/monitor.cpp (2509 of 3054)
UNSUPPORTED: UBSan-AddressSanitizer-x86_64 :: TestCases/Misc/no-interception.cpp (2510 of 3054)
PASS: UBSan-AddressSanitizer-x86_64 :: TestCases/Misc/missing_return.cpp (2511 of 3054)
PASS: UBSan-AddressSanitizer-x86_64 :: TestCases/Misc/coverage-levels.cpp (2512 of 3054)
PASS: UBSan-AddressSanitizer-x86_64 :: TestCases/Misc/nullability.c (2513 of 3054)
PASS: UBSan-AddressSanitizer-x86_64 :: TestCases/Misc/nonnull-arg.cpp (2514 of 3054)
PASS: UBSan-AddressSanitizer-x86_64 :: TestCases/Misc/nonnull.cpp (2515 of 3054)
PASS: UBSan-AddressSanitizer-x86_64 :: TestCases/Misc/print_summary.c (2516 of 3054)
PASS: UBSan-AddressSanitizer-x86_64 :: TestCases/Misc/unreachable.cpp (2517 of 3054)
PASS: UBSan-AddressSanitizer-x86_64 :: TestCases/Misc/vla.c (2518 of 3054)
PASS: UBSan-AddressSanitizer-x86_64 :: TestCases/Misc/objc-cast.m (2519 of 3054)
PASS: UBSan-AddressSanitizer-x86_64 :: TestCases/Pointer/alignment-assumption-attribute-align_value-on-lvalue.cpp (2520 of 3054)
PASS: UBSan-AddressSanitizer-x86_64 :: TestCases/Pointer/alignment-assumption-attribute-align_value-on-paramvar.cpp (2521 of 3054)
PASS: UBSan-AddressSanitizer-x86_64 :: TestCases/Pointer/alignment-assumption-attribute-alloc_align-on-function-variable.cpp (2522 of 3054)
PASS: UBSan-AddressSanitizer-x86_64 :: TestCases/Pointer/alignment-assumption-attribute-alloc_align-on-function.cpp (2523 of 3054)
PASS: UBSan-AddressSanitizer-x86_64 :: TestCases/Pointer/alignment-assumption-attribute-assume_aligned-on-function-two-params.cpp (2524 of 3054)
PASS: UBSan-AddressSanitizer-x86_64 :: TestCases/Pointer/alignment-assumption-blacklist.cpp (2525 of 3054)
PASS: UBSan-AddressSanitizer-x86_64 :: TestCases/Pointer/alignment-assumption-attribute-assume_aligned-on-function.cpp (2526 of 3054)
PASS: UBSan-AddressSanitizer-x86_64 :: TestCases/Pointer/alignment-assumption-builtin_assume_aligned-three-params-variable.cpp (2527 of 3054)
PASS: UBSan-AddressSanitizer-x86_64 :: TestCases/Pointer/alignment-assumption-builtin_assume_aligned-three-params.cpp (2528 of 3054)
PASS: UBSan-AddressSanitizer-x86_64 :: TestCases/Pointer/alignment-assumption-summary.cpp (2529 of 3054)
PASS: UBSan-AddressSanitizer-x86_64 :: TestCases/Pointer/alignment-assumption-builtin_assume_aligned-two-params.cpp (2530 of 3054)
PASS: UBSan-AddressSanitizer-x86_64 :: TestCases/Pointer/index-overflow.cpp (2531 of 3054)
PASS: UBSan-AddressSanitizer-x86_64 :: TestCases/Pointer/alignment-assumption-openmp.cpp (2532 of 3054)
PASS: UBSan-AddressSanitizer-x86_64 :: TestCases/Pointer/nullptr-and-nonzero-offset-summary.cpp (2533 of 3054)
PASS: UBSan-AddressSanitizer-x86_64 :: TestCases/Pointer/unsigned-index-expression.cpp (2534 of 3054)
PASS: UBSan-Minimal-x86_64 :: TestCases/implicit-integer-sign-change.c (2535 of 3054)
PASS: UBSan-Minimal-x86_64 :: TestCases/alignment-assumption.c (2536 of 3054)
PASS: UBSan-Minimal-x86_64 :: TestCases/implicit-signed-integer-truncation-or-sign-change.c (2537 of 3054)
PASS: UBSan-Minimal-x86_64 :: TestCases/implicit-unsigned-integer-truncation.c (2538 of 3054)
PASS: UBSan-Minimal-x86_64 :: TestCases/implicit-signed-integer-truncation.c (2539 of 3054)
PASS: UBSan-Minimal-x86_64 :: TestCases/recover-dedup-limit.cpp (2540 of 3054)
PASS: UBSan-Minimal-x86_64 :: TestCases/test-darwin-interface.c (2541 of 3054)
PASS: UBSan-Minimal-x86_64 :: TestCases/recover-dedup.cpp (2542 of 3054)
PASS: UBSan-Minimal-x86_64 :: TestCases/nullptr-and-nonzero-offset.c (2543 of 3054)
PASS: UBSan-Standalone-x86_64 :: TestCases/Float/cast-overflow.cpp (2544 of 3054)
UNSUPPORTED: UBSan-AddressSanitizer-x86_64 :: TestCases/TypeCheck/Linux/PR33221.cpp (2545 of 3054)
PASS: UBSan-AddressSanitizer-x86_64 :: TestCases/Pointer/nullptr-and-nonzero-offset-constants.cpp (2546 of 3054)
PASS: UBSan-Minimal-x86_64 :: TestCases/uadd-overflow.cpp (2547 of 3054)
PASS: UBSan-AddressSanitizer-x86_64 :: TestCases/TypeCheck/Function/function.cpp (2548 of 3054)
UNSUPPORTED: UBSan-Standalone-x86_64 :: TestCases/ImplicitConversion/integer-sign-change-summary.cpp (2549 of 3054)
PASS: UBSan-AddressSanitizer-x86_64 :: TestCases/TypeCheck/PR33221.cpp (2550 of 3054)
PASS: UBSan-AddressSanitizer-x86_64 :: TestCases/TypeCheck/null.cpp (2551 of 3054)
PASS: UBSan-AddressSanitizer-x86_64 :: TestCases/TypeCheck/vptr-corrupted-vtable-itanium.cpp (2552 of 3054)
PASS: UBSan-AddressSanitizer-x86_64 :: TestCases/TypeCheck/misaligned.cpp (2553 of 3054)
UNSUPPORTED: UBSan-AddressSanitizer-x86_64 :: TestCases/TypeCheck/vptr-ptrauth-unauthenticated.cpp (2554 of 3054)
UNSUPPORTED: UBSan-Standalone-x86_64 :: TestCases/ImplicitConversion/signed-integer-truncation-or-sign-change-summary.cpp (2555 of 3054)
UNSUPPORTED: UBSan-Standalone-x86_64 :: TestCases/ImplicitConversion/signed-integer-truncation-summary.cpp (2556 of 3054)
PASS: UBSan-AddressSanitizer-x86_64 :: TestCases/TypeCheck/vptr-virtual-base-construction.cpp (2557 of 3054)
PASS: UBSan-AddressSanitizer-x86_64 :: TestCases/TypeCheck/vptr-non-unique-typeinfo.cpp (2558 of 3054)
UNSUPPORTED: UBSan-Standalone-x86_64 :: TestCases/ImplicitConversion/unsigned-integer-truncation-summary.cpp (2559 of 3054)
PASS: UBSan-Standalone-x86_64 :: TestCases/ImplicitConversion/integer-conversion-incdec.c (2560 of 3054)
PASS: UBSan-AddressSanitizer-x86_64 :: TestCases/TypeCheck/vptr-virtual-base.cpp (2561 of 3054)
PASS: UBSan-Standalone-x86_64 :: TestCases/ImplicitConversion/integer-sign-change-blacklist.c (2562 of 3054)
PASS: UBSan-Standalone-x86_64 :: TestCases/ImplicitConversion/integer-sign-change-incdec.c (2563 of 3054)
PASS: UBSan-Standalone-x86_64 :: TestCases/Integer/div-overflow.cpp (2564 of 3054)
PASS: UBSan-Standalone-x86_64 :: TestCases/Integer/mul-overflow.cpp (2565 of 3054)
PASS: UBSan-Standalone-x86_64 :: TestCases/Integer/add-overflow.cpp (2566 of 3054)
PASS: UBSan-AddressSanitizer-x86_64 :: TestCases/TypeCheck/vptr.cpp (2567 of 3054)
PASS: UBSan-Standalone-x86_64 :: TestCases/Integer/div-zero.cpp (2568 of 3054)
PASS: UBSan-AddressSanitizer-x86_64 :: TestCases/Pointer/nullptr-and-nonzero-offset-variable.cpp (2569 of 3054)
UNSUPPORTED: UBSan-Standalone-x86_64 :: TestCases/Integer/summary.cpp (2570 of 3054)
PASS: UBSan-Standalone-x86_64 :: TestCases/Integer/incdec-overflow.cpp (2571 of 3054)
PASS: UBSan-Standalone-x86_64 :: TestCases/Integer/negate-overflow.cpp (2572 of 3054)
PASS: UBSan-Standalone-x86_64 :: TestCases/ImplicitConversion/signed-integer-truncation-incdec.c (2573 of 3054)
PASS: UBSan-Standalone-x86_64 :: TestCases/Integer/no-recover.cpp (2574 of 3054)
PASS: UBSan-Standalone-x86_64 :: TestCases/Integer/umul-overflow.cpp (2575 of 3054)
PASS: UBSan-Standalone-x86_64 :: TestCases/Integer/suppressions.cpp (2576 of 3054)
UNSUPPORTED: UBSan-Standalone-x86_64 :: TestCases/Misc/Linux/print_stack_trace.cpp (2577 of 3054)
UNSUPPORTED: UBSan-Standalone-x86_64 :: TestCases/Misc/Linux/ubsan_options.cpp (2578 of 3054)
PASS: UBSan-Standalone-x86_64 :: TestCases/Integer/sub-overflow.cpp (2579 of 3054)
PASS: UBSan-Standalone-x86_64 :: TestCases/Misc/bool.cpp (2580 of 3054)
PASS: UBSan-Standalone-x86_64 :: TestCases/ImplicitConversion/integer-arithmetic-value-change.c (2581 of 3054)
PASS: UBSan-Standalone-x86_64 :: TestCases/ImplicitConversion/integer-sign-change.c (2582 of 3054)
PASS: UBSan-Standalone-x86_64 :: TestCases/Integer/uadd-overflow.cpp (2583 of 3054)
PASS: UBSan-Standalone-x86_64 :: TestCases/Integer/unsigned-shift.cpp (2584 of 3054)
PASS: UBSan-Standalone-x86_64 :: TestCases/Misc/bool.m (2585 of 3054)
PASS: UBSan-Standalone-x86_64 :: TestCases/Misc/bounds.cpp (2586 of 3054)
PASS: UBSan-Standalone-x86_64 :: TestCases/ImplicitConversion/integer-conversion.c (2587 of 3054)
PASS: UBSan-Standalone-x86_64 :: TestCases/Misc/deduplication.cpp (2588 of 3054)
UNSUPPORTED: UBSan-Standalone-x86_64 :: TestCases/Misc/no-interception.cpp (2589 of 3054)
PASS: UBSan-Standalone-x86_64 :: TestCases/Integer/uincdec-overflow.cpp (2590 of 3054)
PASS: UBSan-Standalone-x86_64 :: TestCases/Misc/log-path_test.cpp (2591 of 3054)
PASS: UBSan-Standalone-x86_64 :: TestCases/Integer/usub-overflow.cpp (2592 of 3054)
PASS: UBSan-Standalone-x86_64 :: TestCases/Misc/builtins.cpp (2593 of 3054)
PASS: UBSan-Standalone-x86_64 :: TestCases/Misc/missing_return.cpp (2594 of 3054)
PASS: UBSan-Standalone-x86_64 :: TestCases/Misc/monitor.cpp (2595 of 3054)
PASS: UBSan-Standalone-x86_64 :: TestCases/ImplicitConversion/integer-truncation.c (2596 of 3054)
PASS: UBSan-Standalone-x86_64 :: TestCases/Misc/nonnull-arg.cpp (2597 of 3054)
PASS: UBSan-Standalone-x86_64 :: TestCases/Misc/nullability.c (2598 of 3054)
PASS: UBSan-Standalone-x86_64 :: TestCases/Misc/print_summary.c (2599 of 3054)
PASS: UBSan-Standalone-x86_64 :: TestCases/Misc/unreachable.cpp (2600 of 3054)
PASS: UBSan-Standalone-x86_64 :: TestCases/Misc/vla.c (2601 of 3054)
PASS: UBSan-Standalone-x86_64 :: TestCases/Misc/enum.cpp (2602 of 3054)
PASS: UBSan-Standalone-x86_64 :: TestCases/Misc/nonnull.cpp (2603 of 3054)
PASS: UBSan-Standalone-x86_64 :: TestCases/Misc/objc-cast.m (2604 of 3054)
PASS: UBSan-Standalone-x86_64 :: TestCases/Pointer/alignment-assumption-blacklist.cpp (2605 of 3054)
PASS: UBSan-Standalone-x86_64 :: TestCases/Misc/coverage-levels.cpp (2606 of 3054)
PASS: UBSan-Standalone-x86_64 :: TestCases/ImplicitConversion/signed-integer-truncation.c (2607 of 3054)
UNSUPPORTED: UBSan-Standalone-x86_64 :: TestCases/Pointer/alignment-assumption-summary.cpp (2608 of 3054)
PASS: UBSan-Standalone-x86_64 :: TestCases/Pointer/index-overflow.cpp (2609 of 3054)
PASS: UBSan-Standalone-x86_64 :: TestCases/ImplicitConversion/unsigned-integer-truncation.c (2610 of 3054)
UNSUPPORTED: UBSan-Standalone-x86_64 :: TestCases/Pointer/nullptr-and-nonzero-offset-summary.cpp (2611 of 3054)
PASS: UBSan-Standalone-x86_64 :: TestCases/Pointer/alignment-assumption-attribute-align_value-on-lvalue.cpp (2612 of 3054)
PASS: UBSan-Standalone-x86_64 :: TestCases/Pointer/alignment-assumption-attribute-align_value-on-paramvar.cpp (2613 of 3054)
PASS: UBSan-Standalone-x86_64 :: TestCases/ImplicitConversion/signed-integer-truncation-or-sign-change-blacklist.c (2614 of 3054)
UNSUPPORTED: UBSan-Standalone-x86_64 :: TestCases/TypeCheck/Linux/PR33221.cpp (2615 of 3054)
PASS: UBSan-Standalone-x86_64 :: TestCases/Pointer/alignment-assumption-attribute-alloc_align-on-function-variable.cpp (2616 of 3054)
PASS: UBSan-Standalone-x86_64 :: TestCases/Pointer/alignment-assumption-attribute-alloc_align-on-function.cpp (2617 of 3054)
PASS: UBSan-Standalone-x86_64 :: TestCases/Pointer/alignment-assumption-attribute-assume_aligned-on-function-two-params.cpp (2618 of 3054)
PASS: UBSan-Standalone-x86_64 :: TestCases/Pointer/alignment-assumption-attribute-assume_aligned-on-function.cpp (2619 of 3054)
PASS: UBSan-Standalone-x86_64 :: TestCases/Pointer/unsigned-index-expression.cpp (2620 of 3054)
UNSUPPORTED: UBSan-Standalone-x86_64 :: TestCases/TypeCheck/vptr-ptrauth-unauthenticated.cpp (2621 of 3054)
PASS: UBSan-Standalone-x86_64 :: TestCases/TypeCheck/PR33221.cpp (2622 of 3054)
PASS: UBSan-Standalone-x86_64 :: TestCases/Pointer/alignment-assumption-builtin_assume_aligned-three-params-variable.cpp (2623 of 3054)
PASS: UBSan-Standalone-x86_64 :: TestCases/TypeCheck/null.cpp (2624 of 3054)
PASS: UBSan-Standalone-x86_64 :: TestCases/ImplicitConversion/signed-integer-truncation-blacklist.c (2625 of 3054)
PASS: UBSan-Standalone-x86_64 :: TestCases/TypeCheck/vptr-corrupted-vtable-itanium.cpp (2626 of 3054)
PASS: UBSan-Standalone-x86_64 :: TestCases/TypeCheck/vptr-virtual-base-construction.cpp (2627 of 3054)
PASS: UBSan-Standalone-x86_64 :: TestCases/TypeCheck/vptr-virtual-base.cpp (2628 of 3054)
PASS: UBSan-Standalone-x86_64 :: TestCases/Integer/shift.cpp (2629 of 3054)
PASS: UBSan-Standalone-x86_64 :: TestCases/Pointer/alignment-assumption-builtin_assume_aligned-three-params.cpp (2630 of 3054)
UNSUPPORTED: UBSan-StandaloneStatic-x86_64 :: TestCases/ImplicitConversion/integer-sign-change-summary.cpp (2631 of 3054)
PASS: UBSan-StandaloneStatic-x86_64 :: TestCases/Float/cast-overflow.cpp (2632 of 3054)
PASS: UBSan-Standalone-x86_64 :: TestCases/TypeCheck/misaligned.cpp (2633 of 3054)
PASS: UBSan-Standalone-x86_64 :: TestCases/TypeCheck/vptr-non-unique-typeinfo.cpp (2634 of 3054)
PASS: UBSan-Standalone-x86_64 :: TestCases/Pointer/alignment-assumption-builtin_assume_aligned-two-params.cpp (2635 of 3054)
PASS: UBSan-Standalone-x86_64 :: TestCases/Pointer/alignment-assumption-openmp.cpp (2636 of 3054)
UNSUPPORTED: UBSan-StandaloneStatic-x86_64 :: TestCases/ImplicitConversion/signed-integer-truncation-or-sign-change-summary.cpp (2637 of 3054)
UNSUPPORTED: UBSan-StandaloneStatic-x86_64 :: TestCases/ImplicitConversion/signed-integer-truncation-summary.cpp (2638 of 3054)
PASS: UBSan-Standalone-x86_64 :: TestCases/TypeCheck/Function/function.cpp (2639 of 3054)
PASS: UBSan-Standalone-x86_64 :: TestCases/TypeCheck/vptr.cpp (2640 of 3054)
UNSUPPORTED: UBSan-StandaloneStatic-x86_64 :: TestCases/ImplicitConversion/unsigned-integer-truncation-summary.cpp (2641 of 3054)
PASS: UBSan-Standalone-x86_64 :: TestCases/ImplicitConversion/unsigned-integer-truncation-blacklist.c (2642 of 3054)
PASS: UBSan-Standalone-x86_64 :: TestCases/Pointer/nullptr-and-nonzero-offset-constants.cpp (2643 of 3054)
PASS: UBSan-StandaloneStatic-x86_64 :: TestCases/Integer/div-overflow.cpp (2644 of 3054)
PASS: UBSan-StandaloneStatic-x86_64 :: TestCases/Integer/add-overflow.cpp (2645 of 3054)
PASS: UBSan-StandaloneStatic-x86_64 :: TestCases/ImplicitConversion/integer-conversion-incdec.c (2646 of 3054)
PASS: UBSan-StandaloneStatic-x86_64 :: TestCases/ImplicitConversion/integer-sign-change-blacklist.c (2647 of 3054)
PASS: UBSan-StandaloneStatic-x86_64 :: TestCases/Integer/div-zero.cpp (2648 of 3054)
PASS: UBSan-StandaloneStatic-x86_64 :: TestCases/ImplicitConversion/integer-sign-change-incdec.c (2649 of 3054)
PASS: UBSan-StandaloneStatic-x86_64 :: TestCases/Integer/mul-overflow.cpp (2650 of 3054)
PASS: UBSan-StandaloneStatic-x86_64 :: TestCases/ImplicitConversion/signed-integer-truncation-incdec.c (2651 of 3054)
UNSUPPORTED: UBSan-StandaloneStatic-x86_64 :: TestCases/Integer/summary.cpp (2652 of 3054)
PASS: UBSan-StandaloneStatic-x86_64 :: TestCases/Integer/incdec-overflow.cpp (2653 of 3054)
PASS: UBSan-StandaloneStatic-x86_64 :: TestCases/Integer/negate-overflow.cpp (2654 of 3054)
PASS: UBSan-StandaloneStatic-x86_64 :: TestCases/Integer/no-recover.cpp (2655 of 3054)
PASS: UBSan-Standalone-x86_64 :: TestCases/Pointer/nullptr-and-nonzero-offset-variable.cpp (2656 of 3054)
PASS: UBSan-StandaloneStatic-x86_64 :: TestCases/Integer/suppressions.cpp (2657 of 3054)
PASS: UBSan-StandaloneStatic-x86_64 :: TestCases/Integer/sub-overflow.cpp (2658 of 3054)
UNSUPPORTED: UBSan-StandaloneStatic-x86_64 :: TestCases/Misc/Linux/print_stack_trace.cpp (2659 of 3054)
UNSUPPORTED: UBSan-StandaloneStatic-x86_64 :: TestCases/Misc/Linux/ubsan_options.cpp (2660 of 3054)
PASS: UBSan-StandaloneStatic-x86_64 :: TestCases/Integer/umul-overflow.cpp (2661 of 3054)
PASS: UBSan-StandaloneStatic-x86_64 :: TestCases/Integer/uadd-overflow.cpp (2662 of 3054)
PASS: UBSan-StandaloneStatic-x86_64 :: TestCases/Misc/bool.cpp (2663 of 3054)
PASS: UBSan-StandaloneStatic-x86_64 :: TestCases/Misc/bool.m (2664 of 3054)
UNSUPPORTED: UBSan-StandaloneStatic-x86_64 :: TestCases/Misc/coverage-levels.cpp (2665 of 3054)
PASS: UBSan-StandaloneStatic-x86_64 :: TestCases/Integer/unsigned-shift.cpp (2666 of 3054)
PASS: UBSan-StandaloneStatic-x86_64 :: TestCases/Misc/bounds.cpp (2667 of 3054)
PASS: UBSan-StandaloneStatic-x86_64 :: TestCases/Misc/deduplication.cpp (2668 of 3054)
PASS: UBSan-StandaloneStatic-x86_64 :: TestCases/Integer/usub-overflow.cpp (2669 of 3054)
PASS: UBSan-StandaloneStatic-x86_64 :: TestCases/Misc/log-path_test.cpp (2670 of 3054)
UNSUPPORTED: UBSan-StandaloneStatic-x86_64 :: TestCases/Misc/no-interception.cpp (2671 of 3054)
PASS: UBSan-StandaloneStatic-x86_64 :: TestCases/ImplicitConversion/integer-sign-change.c (2672 of 3054)
PASS: UBSan-StandaloneStatic-x86_64 :: TestCases/Misc/builtins.cpp (2673 of 3054)
PASS: UBSan-StandaloneStatic-x86_64 :: TestCases/Integer/uincdec-overflow.cpp (2674 of 3054)
PASS: UBSan-StandaloneStatic-x86_64 :: TestCases/Misc/missing_return.cpp (2675 of 3054)
PASS: UBSan-StandaloneStatic-x86_64 :: TestCases/Misc/monitor.cpp (2676 of 3054)
PASS: UBSan-StandaloneStatic-x86_64 :: TestCases/Misc/nonnull-arg.cpp (2677 of 3054)
PASS: UBSan-StandaloneStatic-x86_64 :: TestCases/ImplicitConversion/integer-arithmetic-value-change.c (2678 of 3054)
PASS: UBSan-StandaloneStatic-x86_64 :: TestCases/Misc/nullability.c (2679 of 3054)
PASS: UBSan-StandaloneStatic-x86_64 :: TestCases/ImplicitConversion/integer-conversion.c (2680 of 3054)
PASS: UBSan-StandaloneStatic-x86_64 :: TestCases/Misc/print_summary.c (2681 of 3054)
PASS: UBSan-StandaloneStatic-x86_64 :: TestCases/Misc/enum.cpp (2682 of 3054)
PASS: UBSan-StandaloneStatic-x86_64 :: TestCases/Misc/unreachable.cpp (2683 of 3054)
PASS: UBSan-StandaloneStatic-x86_64 :: TestCases/Misc/vla.c (2684 of 3054)
PASS: UBSan-StandaloneStatic-x86_64 :: TestCases/Misc/nonnull.cpp (2685 of 3054)
PASS: UBSan-StandaloneStatic-x86_64 :: TestCases/ImplicitConversion/integer-truncation.c (2686 of 3054)
PASS: UBSan-StandaloneStatic-x86_64 :: TestCases/ImplicitConversion/signed-integer-truncation.c (2687 of 3054)
PASS: UBSan-StandaloneStatic-x86_64 :: TestCases/ImplicitConversion/unsigned-integer-truncation.c (2688 of 3054)
PASS: UBSan-StandaloneStatic-x86_64 :: TestCases/Misc/objc-cast.m (2689 of 3054)
UNSUPPORTED: UBSan-StandaloneStatic-x86_64 :: TestCases/Pointer/alignment-assumption-summary.cpp (2690 of 3054)
PASS: UBSan-StandaloneStatic-x86_64 :: TestCases/Pointer/alignment-assumption-blacklist.cpp (2691 of 3054)
PASS: UBSan-StandaloneStatic-x86_64 :: TestCases/Pointer/index-overflow.cpp (2692 of 3054)
UNSUPPORTED: UBSan-StandaloneStatic-x86_64 :: TestCases/Pointer/nullptr-and-nonzero-offset-summary.cpp (2693 of 3054)
PASS: UBSan-StandaloneStatic-x86_64 :: TestCases/ImplicitConversion/signed-integer-truncation-or-sign-change-blacklist.c (2694 of 3054)
PASS: UBSan-StandaloneStatic-x86_64 :: TestCases/Pointer/unsigned-index-expression.cpp (2695 of 3054)
PASS: UBSan-StandaloneStatic-x86_64 :: TestCases/Pointer/alignment-assumption-attribute-align_value-on-lvalue.cpp (2696 of 3054)
UNSUPPORTED: UBSan-StandaloneStatic-x86_64 :: TestCases/TypeCheck/Linux/PR33221.cpp (2697 of 3054)
PASS: UBSan-StandaloneStatic-x86_64 :: TestCases/Pointer/alignment-assumption-attribute-align_value-on-paramvar.cpp (2698 of 3054)
PASS: UBSan-StandaloneStatic-x86_64 :: TestCases/Pointer/alignment-assumption-attribute-alloc_align-on-function-variable.cpp (2699 of 3054)
PASS: UBSan-StandaloneStatic-x86_64 :: TestCases/Pointer/alignment-assumption-attribute-alloc_align-on-function.cpp (2700 of 3054)
PASS: UBSan-StandaloneStatic-x86_64 :: TestCases/Pointer/alignment-assumption-attribute-assume_aligned-on-function-two-params.cpp (2701 of 3054)
PASS: UBSan-StandaloneStatic-x86_64 :: TestCases/Integer/shift.cpp (2702 of 3054)
UNSUPPORTED: UBSan-StandaloneStatic-x86_64 :: TestCases/TypeCheck/vptr-ptrauth-unauthenticated.cpp (2703 of 3054)
PASS: UBSan-StandaloneStatic-x86_64 :: TestCases/ImplicitConversion/signed-integer-truncation-blacklist.c (2704 of 3054)
PASS: UBSan-StandaloneStatic-x86_64 :: TestCases/Pointer/alignment-assumption-attribute-assume_aligned-on-function.cpp (2705 of 3054)
PASS: UBSan-StandaloneStatic-x86_64 :: TestCases/Pointer/alignment-assumption-builtin_assume_aligned-three-params-variable.cpp (2706 of 3054)
PASS: UBSan-StandaloneStatic-x86_64 :: TestCases/Pointer/alignment-assumption-builtin_assume_aligned-three-params.cpp (2707 of 3054)
PASS: UBSan-StandaloneStatic-x86_64 :: TestCases/TypeCheck/PR33221.cpp (2708 of 3054)
PASS: UBSan-StandaloneStatic-x86_64 :: TestCases/TypeCheck/Function/function.cpp (2709 of 3054)
PASS: UBSan-StandaloneStatic-x86_64 :: TestCases/TypeCheck/null.cpp (2710 of 3054)
PASS: UBSan-StandaloneStatic-x86_64 :: TestCases/TypeCheck/vptr-corrupted-vtable-itanium.cpp (2711 of 3054)
PASS: UBSan-StandaloneStatic-x86_64 :: TestCases/TypeCheck/vptr-virtual-base-construction.cpp (2712 of 3054)
PASS: UBSan-StandaloneStatic-x86_64 :: TestCases/ImplicitConversion/unsigned-integer-truncation-blacklist.c (2713 of 3054)
PASS: UBSan-StandaloneStatic-x86_64 :: TestCases/TypeCheck/vptr-virtual-base.cpp (2714 of 3054)
PASS: UBSan-StandaloneStatic-x86_64 :: TestCases/Pointer/alignment-assumption-builtin_assume_aligned-two-params.cpp (2715 of 3054)
PASS: UBSan-StandaloneStatic-x86_64 :: TestCases/Pointer/alignment-assumption-openmp.cpp (2716 of 3054)
PASS: UBSan-StandaloneStatic-x86_64 :: TestCases/TypeCheck/vptr-non-unique-typeinfo.cpp (2717 of 3054)
PASS: UBSan-StandaloneStatic-x86_64 :: TestCases/TypeCheck/misaligned.cpp (2718 of 3054)
PASS: UBSan-StandaloneStatic-x86_64 :: TestCases/Pointer/nullptr-and-nonzero-offset-constants.cpp (2719 of 3054)
PASS: UBSan-StandaloneStatic-x86_64 :: TestCases/Pointer/nullptr-and-nonzero-offset-variable.cpp (2720 of 3054)
PASS: UBSan-StandaloneStatic-x86_64 :: TestCases/TypeCheck/vptr.cpp (2721 of 3054)
PASS: UBSan-ThreadSanitizer-x86_64 :: TestCases/Float/cast-overflow.cpp (2722 of 3054)
PASS: UBSan-ThreadSanitizer-x86_64 :: TestCases/ImplicitConversion/integer-conversion-incdec.c (2723 of 3054)
PASS: UBSan-ThreadSanitizer-x86_64 :: TestCases/ImplicitConversion/integer-sign-change-blacklist.c (2724 of 3054)
PASS: UBSan-ThreadSanitizer-x86_64 :: TestCases/ImplicitConversion/integer-arithmetic-value-change.c (2725 of 3054)
PASS: UBSan-ThreadSanitizer-x86_64 :: TestCases/ImplicitConversion/integer-sign-change-summary.cpp (2726 of 3054)
PASS: UBSan-ThreadSanitizer-x86_64 :: TestCases/ImplicitConversion/integer-conversion.c (2727 of 3054)
PASS: UBSan-ThreadSanitizer-x86_64 :: TestCases/ImplicitConversion/integer-sign-change-incdec.c (2728 of 3054)
PASS: UBSan-ThreadSanitizer-x86_64 :: TestCases/ImplicitConversion/integer-sign-change.c (2729 of 3054)
PASS: UBSan-ThreadSanitizer-x86_64 :: TestCases/ImplicitConversion/integer-truncation.c (2730 of 3054)
PASS: UBSan-ThreadSanitizer-x86_64 :: TestCases/ImplicitConversion/signed-integer-truncation-incdec.c (2731 of 3054)
PASS: UBSan-ThreadSanitizer-x86_64 :: TestCases/ImplicitConversion/signed-integer-truncation-or-sign-change-summary.cpp (2732 of 3054)
PASS: UBSan-ThreadSanitizer-x86_64 :: TestCases/ImplicitConversion/signed-integer-truncation-summary.cpp (2733 of 3054)
PASS: UBSan-ThreadSanitizer-x86_64 :: TestCases/ImplicitConversion/signed-integer-truncation-blacklist.c (2734 of 3054)
PASS: UBSan-ThreadSanitizer-x86_64 :: TestCases/ImplicitConversion/signed-integer-truncation-or-sign-change-blacklist.c (2735 of 3054)
PASS: UBSan-ThreadSanitizer-x86_64 :: TestCases/ImplicitConversion/unsigned-integer-truncation-summary.cpp (2736 of 3054)
PASS: UBSan-ThreadSanitizer-x86_64 :: TestCases/ImplicitConversion/signed-integer-truncation.c (2737 of 3054)
PASS: UBSan-ThreadSanitizer-x86_64 :: TestCases/Integer/add-overflow.cpp (2738 of 3054)
PASS: UBSan-ThreadSanitizer-x86_64 :: TestCases/Integer/div-overflow.cpp (2739 of 3054)
PASS: UBSan-ThreadSanitizer-x86_64 :: TestCases/ImplicitConversion/unsigned-integer-truncation-blacklist.c (2740 of 3054)
PASS: UBSan-ThreadSanitizer-x86_64 :: TestCases/Integer/div-zero.cpp (2741 of 3054)
PASS: UBSan-ThreadSanitizer-x86_64 :: TestCases/Integer/mul-overflow.cpp (2742 of 3054)
PASS: UBSan-ThreadSanitizer-x86_64 :: TestCases/Integer/incdec-overflow.cpp (2743 of 3054)
PASS: UBSan-ThreadSanitizer-x86_64 :: TestCases/Integer/negate-overflow.cpp (2744 of 3054)
PASS: UBSan-ThreadSanitizer-x86_64 :: TestCases/Integer/no-recover.cpp (2745 of 3054)
PASS: UBSan-ThreadSanitizer-x86_64 :: TestCases/ImplicitConversion/unsigned-integer-truncation.c (2746 of 3054)
UNSUPPORTED: UBSan-ThreadSanitizer-x86_64 :: TestCases/Integer/summary.cpp (2747 of 3054)
PASS: UBSan-ThreadSanitizer-x86_64 :: TestCases/Integer/sub-overflow.cpp (2748 of 3054)
PASS: UBSan-ThreadSanitizer-x86_64 :: TestCases/Integer/suppressions.cpp (2749 of 3054)
PASS: UBSan-ThreadSanitizer-x86_64 :: TestCases/Integer/uadd-overflow.cpp (2750 of 3054)
PASS: UBSan-ThreadSanitizer-x86_64 :: TestCases/Integer/umul-overflow.cpp (2751 of 3054)
PASS: UBSan-ThreadSanitizer-x86_64 :: TestCases/Integer/unsigned-shift.cpp (2752 of 3054)
UNSUPPORTED: UBSan-ThreadSanitizer-x86_64 :: TestCases/Misc/Linux/print_stack_trace.cpp (2753 of 3054)
PASS: UBSan-ThreadSanitizer-x86_64 :: TestCases/Integer/uincdec-overflow.cpp (2754 of 3054)
UNSUPPORTED: UBSan-ThreadSanitizer-x86_64 :: TestCases/Misc/Linux/ubsan_options.cpp (2755 of 3054)
PASS: UBSan-ThreadSanitizer-x86_64 :: TestCases/Misc/bool.cpp (2756 of 3054)
PASS: UBSan-ThreadSanitizer-x86_64 :: TestCases/Integer/usub-overflow.cpp (2757 of 3054)
PASS: UBSan-ThreadSanitizer-x86_64 :: TestCases/Integer/shift.cpp (2758 of 3054)
PASS: UBSan-ThreadSanitizer-x86_64 :: TestCases/Misc/bool.m (2759 of 3054)
XFAIL: UBSan-ThreadSanitizer-x86_64 :: TestCases/Misc/coverage-levels.cpp (2760 of 3054)
PASS: UBSan-ThreadSanitizer-x86_64 :: TestCases/Misc/builtins.cpp (2761 of 3054)
PASS: UBSan-ThreadSanitizer-x86_64 :: TestCases/Misc/deduplication.cpp (2762 of 3054)
PASS: UBSan-ThreadSanitizer-x86_64 :: TestCases/Misc/bounds.cpp (2763 of 3054)
PASS: UBSan-ThreadSanitizer-x86_64 :: TestCases/Misc/log-path_test.cpp (2764 of 3054)
PASS: UBSan-ThreadSanitizer-x86_64 :: TestCases/Misc/missing_return.cpp (2765 of 3054)
UNSUPPORTED: UBSan-ThreadSanitizer-x86_64 :: TestCases/Misc/no-interception.cpp (2766 of 3054)
PASS: UBSan-ThreadSanitizer-x86_64 :: TestCases/Misc/enum.cpp (2767 of 3054)
PASS: UBSan-ThreadSanitizer-x86_64 :: TestCases/Misc/monitor.cpp (2768 of 3054)
PASS: UBSan-ThreadSanitizer-x86_64 :: TestCases/Misc/nullability.c (2769 of 3054)
PASS: UBSan-ThreadSanitizer-x86_64 :: TestCases/Misc/nonnull.cpp (2770 of 3054)
PASS: UBSan-ThreadSanitizer-x86_64 :: TestCases/Misc/print_summary.c (2771 of 3054)
PASS: UBSan-ThreadSanitizer-x86_64 :: TestCases/Misc/nonnull-arg.cpp (2772 of 3054)
PASS: UBSan-ThreadSanitizer-x86_64 :: TestCases/Misc/objc-cast.m (2773 of 3054)
PASS: UBSan-ThreadSanitizer-x86_64 :: TestCases/Misc/unreachable.cpp (2774 of 3054)
PASS: UBSan-ThreadSanitizer-x86_64 :: TestCases/Misc/vla.c (2775 of 3054)
PASS: UBSan-ThreadSanitizer-x86_64 :: TestCases/Pointer/alignment-assumption-attribute-align_value-on-lvalue.cpp (2776 of 3054)
PASS: UBSan-ThreadSanitizer-x86_64 :: TestCases/Pointer/alignment-assumption-attribute-align_value-on-paramvar.cpp (2777 of 3054)
PASS: UBSan-ThreadSanitizer-x86_64 :: TestCases/Pointer/alignment-assumption-attribute-alloc_align-on-function-variable.cpp (2778 of 3054)
PASS: UBSan-ThreadSanitizer-x86_64 :: TestCases/Pointer/alignment-assumption-attribute-alloc_align-on-function.cpp (2779 of 3054)
PASS: UBSan-ThreadSanitizer-x86_64 :: TestCases/Pointer/alignment-assumption-attribute-assume_aligned-on-function-two-params.cpp (2780 of 3054)
PASS: UBSan-ThreadSanitizer-x86_64 :: TestCases/Pointer/alignment-assumption-attribute-assume_aligned-on-function.cpp (2781 of 3054)
PASS: UBSan-ThreadSanitizer-x86_64 :: TestCases/Pointer/alignment-assumption-blacklist.cpp (2782 of 3054)
PASS: UBSan-ThreadSanitizer-x86_64 :: TestCases/Pointer/alignment-assumption-builtin_assume_aligned-three-params-variable.cpp (2783 of 3054)
PASS: UBSan-ThreadSanitizer-x86_64 :: TestCases/Pointer/alignment-assumption-builtin_assume_aligned-three-params.cpp (2784 of 3054)
PASS: UBSan-ThreadSanitizer-x86_64 :: TestCases/Pointer/alignment-assumption-builtin_assume_aligned-two-params.cpp (2785 of 3054)
PASS: UBSan-ThreadSanitizer-x86_64 :: TestCases/Pointer/alignment-assumption-summary.cpp (2786 of 3054)
PASS: UBSan-ThreadSanitizer-x86_64 :: TestCases/Pointer/index-overflow.cpp (2787 of 3054)
PASS: UBSan-ThreadSanitizer-x86_64 :: TestCases/Pointer/alignment-assumption-openmp.cpp (2788 of 3054)
UNSUPPORTED: XRay-x86_64-darwin :: TestCases/Posix/always-never-instrument.cpp (2789 of 3054)
UNSUPPORTED: XRay-x86_64-darwin :: TestCases/Posix/arg1-arg0-logging.cpp (2790 of 3054)
UNSUPPORTED: XRay-x86_64-darwin :: TestCases/Posix/arg1-logger.cpp (2791 of 3054)
UNSUPPORTED: XRay-x86_64-darwin :: TestCases/Posix/arg1-logging-implicit-this.cpp (2792 of 3054)
UNSUPPORTED: XRay-x86_64-darwin :: TestCases/Posix/argv0-log-file-name.cpp (2793 of 3054)
UNSUPPORTED: XRay-x86_64-darwin :: TestCases/Posix/basic-filtering.cpp (2794 of 3054)
UNSUPPORTED: XRay-x86_64-darwin :: TestCases/Posix/c-test.cpp (2795 of 3054)
UNSUPPORTED: XRay-x86_64-darwin :: TestCases/Posix/clang-no-xray-instrument.cpp (2796 of 3054)
UNSUPPORTED: XRay-x86_64-darwin :: TestCases/Posix/common-trampoline-alignment.cpp (2797 of 3054)
UNSUPPORTED: XRay-x86_64-darwin :: TestCases/Posix/coverage-sample.cpp (2798 of 3054)
UNSUPPORTED: XRay-x86_64-darwin :: TestCases/Posix/custom-event-handler-alignment.cpp (2799 of 3054)
UNSUPPORTED: XRay-x86_64-darwin :: TestCases/Posix/custom-event-logging.cpp (2800 of 3054)
UNSUPPORTED: XRay-x86_64-darwin :: TestCases/Posix/fdr-mode-inmemory.cpp (2801 of 3054)
UNSUPPORTED: XRay-x86_64-darwin :: TestCases/Posix/fdr-mode-multiple.cpp (2802 of 3054)
UNSUPPORTED: XRay-x86_64-darwin :: TestCases/Posix/fdr-mode.cpp (2803 of 3054)
UNSUPPORTED: XRay-x86_64-darwin :: TestCases/Posix/fdr-reinit.cpp (2804 of 3054)
UNSUPPORTED: XRay-x86_64-darwin :: TestCases/Posix/fdr-single-thread.cpp (2805 of 3054)
UNSUPPORTED: XRay-x86_64-darwin :: TestCases/Posix/fdr-thread-order.cpp (2806 of 3054)
UNSUPPORTED: XRay-x86_64-darwin :: TestCases/Posix/fixedsize-logging.cpp (2807 of 3054)
UNSUPPORTED: XRay-x86_64-darwin :: TestCases/Posix/fork_basic_logging.cpp (2808 of 3054)
UNSUPPORTED: XRay-x86_64-darwin :: TestCases/Posix/func-id-utils.cpp (2809 of 3054)
UNSUPPORTED: XRay-x86_64-darwin :: TestCases/Posix/logging-modes.cpp (2810 of 3054)
UNSUPPORTED: XRay-x86_64-darwin :: TestCases/Posix/optional-inmemory-log.cpp (2811 of 3054)
UNSUPPORTED: XRay-x86_64-darwin :: TestCases/Posix/patching-unpatching.cpp (2812 of 3054)
UNSUPPORTED: XRay-x86_64-darwin :: TestCases/Posix/pic_test.cpp (2813 of 3054)
UNSUPPORTED: XRay-x86_64-darwin :: TestCases/Posix/profiling-multi-threaded.cpp (2814 of 3054)
UNSUPPORTED: XRay-x86_64-darwin :: TestCases/Posix/profiling-single-threaded.cpp (2815 of 3054)
UNSUPPORTED: XRay-x86_64-darwin :: TestCases/Posix/quiet-start.cpp (2816 of 3054)
UNSUPPORTED: XRay-x86_64h-darwin :: TestCases/Posix/always-never-instrument.cpp (2817 of 3054)
UNSUPPORTED: XRay-x86_64h-darwin :: TestCases/Posix/arg1-arg0-logging.cpp (2818 of 3054)
UNSUPPORTED: XRay-x86_64h-darwin :: TestCases/Posix/arg1-logger.cpp (2819 of 3054)
UNSUPPORTED: XRay-x86_64h-darwin :: TestCases/Posix/arg1-logging-implicit-this.cpp (2820 of 3054)
UNSUPPORTED: XRay-x86_64h-darwin :: TestCases/Posix/argv0-log-file-name.cpp (2821 of 3054)
UNSUPPORTED: XRay-x86_64h-darwin :: TestCases/Posix/basic-filtering.cpp (2822 of 3054)
UNSUPPORTED: XRay-x86_64h-darwin :: TestCases/Posix/c-test.cpp (2823 of 3054)
UNSUPPORTED: XRay-x86_64h-darwin :: TestCases/Posix/clang-no-xray-instrument.cpp (2824 of 3054)
UNSUPPORTED: XRay-x86_64h-darwin :: TestCases/Posix/common-trampoline-alignment.cpp (2825 of 3054)
UNSUPPORTED: XRay-x86_64h-darwin :: TestCases/Posix/coverage-sample.cpp (2826 of 3054)
UNSUPPORTED: XRay-x86_64h-darwin :: TestCases/Posix/custom-event-handler-alignment.cpp (2827 of 3054)
UNSUPPORTED: XRay-x86_64h-darwin :: TestCases/Posix/custom-event-logging.cpp (2828 of 3054)
UNSUPPORTED: XRay-x86_64h-darwin :: TestCases/Posix/fdr-mode-inmemory.cpp (2829 of 3054)
UNSUPPORTED: XRay-x86_64h-darwin :: TestCases/Posix/fdr-mode-multiple.cpp (2830 of 3054)
UNSUPPORTED: XRay-x86_64h-darwin :: TestCases/Posix/fdr-mode.cpp (2831 of 3054)
UNSUPPORTED: XRay-x86_64h-darwin :: TestCases/Posix/fdr-reinit.cpp (2832 of 3054)
UNSUPPORTED: XRay-x86_64h-darwin :: TestCases/Posix/fdr-single-thread.cpp (2833 of 3054)
UNSUPPORTED: XRay-x86_64h-darwin :: TestCases/Posix/fdr-thread-order.cpp (2834 of 3054)
UNSUPPORTED: XRay-x86_64h-darwin :: TestCases/Posix/fixedsize-logging.cpp (2835 of 3054)
UNSUPPORTED: XRay-x86_64h-darwin :: TestCases/Posix/fork_basic_logging.cpp (2836 of 3054)
UNSUPPORTED: XRay-x86_64h-darwin :: TestCases/Posix/func-id-utils.cpp (2837 of 3054)
UNSUPPORTED: XRay-x86_64h-darwin :: TestCases/Posix/logging-modes.cpp (2838 of 3054)
UNSUPPORTED: XRay-x86_64h-darwin :: TestCases/Posix/optional-inmemory-log.cpp (2839 of 3054)
UNSUPPORTED: XRay-x86_64h-darwin :: TestCases/Posix/patching-unpatching.cpp (2840 of 3054)
UNSUPPORTED: XRay-x86_64h-darwin :: TestCases/Posix/pic_test.cpp (2841 of 3054)
UNSUPPORTED: XRay-x86_64h-darwin :: TestCases/Posix/profiling-multi-threaded.cpp (2842 of 3054)
UNSUPPORTED: XRay-x86_64h-darwin :: TestCases/Posix/profiling-single-threaded.cpp (2843 of 3054)
UNSUPPORTED: XRay-x86_64h-darwin :: TestCases/Posix/quiet-start.cpp (2844 of 3054)
PASS: UBSan-ThreadSanitizer-x86_64 :: TestCases/Pointer/nullptr-and-nonzero-offset-summary.cpp (2845 of 3054)
PASS: UBSan-ThreadSanitizer-x86_64 :: TestCases/Pointer/unsigned-index-expression.cpp (2846 of 3054)
PASS: cfi-devirt-x86_64 :: bad-split.cpp (2847 of 3054)
UNSUPPORTED: UBSan-ThreadSanitizer-x86_64 :: TestCases/TypeCheck/Linux/PR33221.cpp (2848 of 3054)
PASS: UBSan-ThreadSanitizer-x86_64 :: TestCases/Pointer/nullptr-and-nonzero-offset-constants.cpp (2849 of 3054)
UNSUPPORTED: cfi-devirt-x86_64 :: create-derivers.test (2850 of 3054)
UNSUPPORTED: cfi-devirt-x86_64 :: cross-dso/icall/diag.cpp (2851 of 3054)
UNSUPPORTED: cfi-devirt-x86_64 :: cross-dso/icall/dlopen.cpp (2852 of 3054)
UNSUPPORTED: cfi-devirt-x86_64 :: cross-dso/icall/icall-from-dso.cpp (2853 of 3054)
UNSUPPORTED: cfi-devirt-x86_64 :: cross-dso/icall/icall.cpp (2854 of 3054)
UNSUPPORTED: cfi-devirt-x86_64 :: cross-dso/shadow_is_read_only.cpp (2855 of 3054)
UNSUPPORTED: cfi-devirt-x86_64 :: cross-dso/simple-fail.cpp (2856 of 3054)
UNSUPPORTED: cfi-devirt-x86_64 :: cross-dso/simple-pass.cpp (2857 of 3054)
UNSUPPORTED: cfi-devirt-x86_64 :: cross-dso/stats.cpp (2858 of 3054)
UNSUPPORTED: cfi-devirt-x86_64 :: cross-dso/target_out_of_bounds.cpp (2859 of 3054)
PASS: cfi-devirt-x86_64 :: anon-namespace.cpp (2860 of 3054)
UNSUPPORTED: cfi-devirt-x86_64 :: icall/external-call.c (2861 of 3054)
XFAIL: cfi-devirt-x86_64 :: icall/weak.c (2862 of 3054)
UNSUPPORTED: cfi-devirt-x86_64 :: icall/wrong-signature-mixed-lto.c (2863 of 3054)
PASS: cfi-devirt-x86_64 :: bad-cast.cpp (2864 of 3054)
PASS: UBSan-ThreadSanitizer-x86_64 :: TestCases/TypeCheck/PR33221.cpp (2865 of 3054)
PASS: cfi-devirt-x86_64 :: cross-dso-diagnostic.cpp (2866 of 3054)
PASS: cfi-devirt-x86_64 :: multiple-inheritance2.cpp (2867 of 3054)
PASS: cfi-devirt-x86_64 :: icall/bad-signature.c (2868 of 3054)
XFAIL: cfi-devirt-x86_64 :: sibling.cpp (2869 of 3054)
PASS: cfi-devirt-x86_64 :: mfcall.cpp (2870 of 3054)
XFAIL: cfi-devirt-x86_64 :: simple-pass.cpp (2871 of 3054)
UNSUPPORTED: cfi-devirt-x86_64 :: stats.cpp (2872 of 3054)
PASS: cfi-devirt-x86_64 :: target_uninstrumented.cpp (2873 of 3054)
PASS: UBSan-ThreadSanitizer-x86_64 :: TestCases/TypeCheck/Function/function.cpp (2874 of 3054)
PASS: cfi-devirt-x86_64 :: multiple-inheritance.cpp (2875 of 3054)
PASS: cfi-devirt-x86_64 :: nvcall.cpp (2876 of 3054)
XFAIL: cfi-devirt-x86_64 :: two-vcalls.cpp (2877 of 3054)
PASS: cfi-devirt-x86_64 :: overwrite.cpp (2878 of 3054)
PASS: cfi-devirt-x86_64 :: vtable-may-alias.cpp (2879 of 3054)
PASS: cfi-standalone-x86_64 :: bad-split.cpp (2880 of 3054)
UNSUPPORTED: cfi-standalone-x86_64 :: create-derivers.test (2881 of 3054)
PASS: cfi-standalone-x86_64 :: cross-dso-diagnostic.cpp (2882 of 3054)
UNSUPPORTED: cfi-standalone-x86_64 :: cross-dso/icall/diag.cpp (2883 of 3054)
UNSUPPORTED: cfi-standalone-x86_64 :: cross-dso/icall/dlopen.cpp (2884 of 3054)
UNSUPPORTED: cfi-standalone-x86_64 :: cross-dso/icall/icall-from-dso.cpp (2885 of 3054)
UNSUPPORTED: cfi-standalone-x86_64 :: cross-dso/icall/icall.cpp (2886 of 3054)
UNSUPPORTED: cfi-standalone-x86_64 :: cross-dso/shadow_is_read_only.cpp (2887 of 3054)
UNSUPPORTED: cfi-standalone-x86_64 :: cross-dso/simple-fail.cpp (2888 of 3054)
UNSUPPORTED: cfi-standalone-x86_64 :: cross-dso/simple-pass.cpp (2889 of 3054)
UNSUPPORTED: cfi-standalone-x86_64 :: cross-dso/stats.cpp (2890 of 3054)
UNSUPPORTED: cfi-standalone-x86_64 :: cross-dso/target_out_of_bounds.cpp (2891 of 3054)
PASS: cfi-devirt-x86_64 :: base-derived-destructor.cpp (2892 of 3054)
UNSUPPORTED: cfi-standalone-x86_64 :: icall/external-call.c (2893 of 3054)
XFAIL: cfi-standalone-x86_64 :: icall/weak.c (2894 of 3054)
UNSUPPORTED: cfi-standalone-x86_64 :: icall/wrong-signature-mixed-lto.c (2895 of 3054)
PASS: cfi-devirt-x86_64 :: vdtor.cpp (2896 of 3054)
PASS: cfi-standalone-x86_64 :: icall/bad-signature.c (2897 of 3054)
PASS: cfi-standalone-x86_64 :: anon-namespace.cpp (2898 of 3054)
PASS: cfi-standalone-x86_64 :: bad-cast.cpp (2899 of 3054)
PASS: cfi-standalone-x86_64 :: multiple-inheritance2.cpp (2900 of 3054)
XFAIL: cfi-standalone-x86_64 :: sibling.cpp (2901 of 3054)
PASS: cfi-standalone-x86_64 :: mfcall.cpp (2902 of 3054)
XFAIL: cfi-standalone-x86_64 :: simple-pass.cpp (2903 of 3054)
PASS: cfi-standalone-x86_64 :: multiple-inheritance.cpp (2904 of 3054)
PASS: cfi-standalone-x86_64 :: stats.cpp (2905 of 3054)
PASS: cfi-standalone-x86_64 :: nvcall.cpp (2906 of 3054)
PASS: cfi-standalone-x86_64 :: overwrite.cpp (2907 of 3054)
XFAIL: cfi-standalone-x86_64 :: two-vcalls.cpp (2908 of 3054)
PASS: cfi-standalone-x86_64 :: vtable-may-alias.cpp (2909 of 3054)
PASS: cfi-standalone-x86_64 :: target_uninstrumented.cpp (2910 of 3054)
PASS: cfi-standalone-x86_64 :: base-derived-destructor.cpp (2911 of 3054)
PASS: cfi-devirt-x86_64 :: simple-fail.cpp (2912 of 3054)
PASS: cfi-standalone-x86_64 :: vdtor.cpp (2913 of 3054)
PASS: UBSan-ThreadSanitizer-x86_64 :: TestCases/TypeCheck/null.cpp (2914 of 3054)
PASS: cfi-standalone-x86_64 :: simple-fail.cpp (2915 of 3054)
PASS: UBSan-ThreadSanitizer-x86_64 :: TestCases/TypeCheck/vptr-corrupted-vtable-itanium.cpp (2916 of 3054)
PASS: UBSan-ThreadSanitizer-x86_64 :: TestCases/TypeCheck/vptr-non-unique-typeinfo.cpp (2917 of 3054)
UNSUPPORTED: UBSan-ThreadSanitizer-x86_64 :: TestCases/TypeCheck/vptr-ptrauth-unauthenticated.cpp (2918 of 3054)
PASS: UBSan-ThreadSanitizer-x86_64 :: TestCases/TypeCheck/vptr-virtual-base-construction.cpp (2919 of 3054)
PASS: UBSan-ThreadSanitizer-x86_64 :: TestCases/TypeCheck/vptr-virtual-base.cpp (2920 of 3054)
PASS: UBSan-ThreadSanitizer-x86_64 :: TestCases/TypeCheck/misaligned.cpp (2921 of 3054)
PASS: UBSan-ThreadSanitizer-x86_64 :: TestCases/Pointer/nullptr-and-nonzero-offset-variable.cpp (2922 of 3054)
UNSUPPORTED: libFuzzer :: afl-driver-close-fd-mask.test (2923 of 3054)
PASS: libFuzzer :: acquire-crash-state.test (2924 of 3054)
UNSUPPORTED: libFuzzer :: afl-driver.test (2925 of 3054)
PASS: libFuzzer :: bad-strcmp.test (2926 of 3054)
UNSUPPORTED: libFuzzer :: bcmp.test (2927 of 3054)
PASS: libFuzzer :: bogus-initialize.test (2928 of 3054)
PASS: libFuzzer :: afl-driver-stderr.test (2929 of 3054)
PASS: libFuzzer :: buffer-overflow-on-input.test (2930 of 3054)
PASS: libFuzzer :: caller-callee.test (2931 of 3054)
UNSUPPORTED: libFuzzer :: compressed.test (2932 of 3054)
PASS: libFuzzer :: counters.test (2933 of 3054)
PASS: libFuzzer :: coverage.test (2934 of 3054)
PASS: libFuzzer :: cross_over.test (2935 of 3054)
PASS: libFuzzer :: cross_over_copy.test (2936 of 3054)
PASS: libFuzzer :: cleanse.test (2937 of 3054)
UNSUPPORTED: libFuzzer :: cross_over_uniform_dist.test (2938 of 3054)
UNSUPPORTED: libFuzzer :: custom-allocator.test (2939 of 3054)
PASS: libFuzzer :: cross_over_insert.test (2940 of 3054)
UNSUPPORTED: libFuzzer :: dataflow.test (2941 of 3054)
PASS: libFuzzer :: cxxstring.test (2942 of 3054)
UNSUPPORTED: libFuzzer :: deep-recursion.test (2943 of 3054)
PASS: libFuzzer :: dead-stripping.test (2944 of 3054)
UNSUPPORTED: libFuzzer :: disable-leaks.test (2945 of 3054)
PASS: libFuzzer :: deprecated-instrumentation.test (2946 of 3054)
UNSUPPORTED: libFuzzer :: entropic-scale-per-exec-time.test (2947 of 3054)
UNSUPPORTED: libFuzzer :: equivalence-signals.test (2948 of 3054)
UNSUPPORTED: libFuzzer :: equivalence.test (2949 of 3054)
PASS: libFuzzer :: dso.test (2950 of 3054)
PASS: UBSan-ThreadSanitizer-x86_64 :: TestCases/TypeCheck/vptr.cpp (2951 of 3054)
UNSUPPORTED: libFuzzer :: extra-counters.test (2952 of 3054)
UNSUPPORTED: libFuzzer :: features_dir.test (2953 of 3054)
UNSUPPORTED: libFuzzer :: focus-function.test (2954 of 3054)
UNSUPPORTED: libFuzzer :: fork-sigusr.test (2955 of 3054)
UNSUPPORTED: libFuzzer :: fork-ubsan.test (2956 of 3054)
UNSUPPORTED: libFuzzer :: fork.test (2957 of 3054)
PASS: libFuzzer :: exit-report.test (2958 of 3054)
PASS: libFuzzer :: full-coverage-set.test (2959 of 3054)
PASS: libFuzzer :: exit_on_src_pos.test (2960 of 3054)
PASS: libFuzzer :: fuzzer-alignment-assumption.test (2961 of 3054)
PASS: libFuzzer :: fuzzer-customcrossoverandmutate.test (2962 of 3054)
PASS: libFuzzer :: fuzzer-customcrossover.test (2963 of 3054)
PASS: libFuzzer :: fuzzer-dict.test (2964 of 3054)
PASS: libFuzzer :: fuzzer-custommutator.test (2965 of 3054)
PASS: libFuzzer :: fuzzer-fdmask.test (2966 of 3054)
PASS: libFuzzer :: fuzzer-finalstats.test (2967 of 3054)
PASS: libFuzzer :: fuzzer-dirs.test (2968 of 3054)
PASS: libFuzzer :: fuzzer-flags.test (2969 of 3054)
PASS: libFuzzer :: fuzzer-implicit-integer-sign-change.test (2970 of 3054)
PASS: libFuzzer :: fuzzer-implicit-signed-integer-truncation-or-sign-change.test (2971 of 3054)
UNSUPPORTED: libFuzzer :: fuzzer-leak.test (2972 of 3054)
UNSUPPORTED: libFuzzer :: fuzzer-oom-with-profile.test (2973 of 3054)
PASS: libFuzzer :: fuzzer-implicit-signed-integer-truncation.test (2974 of 3054)
PASS: libFuzzer :: fuzzer-implicit-unsigned-integer-truncation.test (2975 of 3054)
PASS: libFuzzer :: fuzzer-printcovpcs.test (2976 of 3054)
PASS: libFuzzer :: fuzzer-seed.test (2977 of 3054)
PASS: libFuzzer :: fuzzer-runs.test (2978 of 3054)
PASS: libFuzzer :: fuzzer-segv.test (2979 of 3054)
PASS: libFuzzer :: fuzzer-singleinputs.test (2980 of 3054)
PASS: libFuzzer :: fuzzer-oom.test (2981 of 3054)
PASS: libFuzzer :: fuzzer-ubsan.test (2982 of 3054)
UNSUPPORTED: libFuzzer :: gc-sections.test (2983 of 3054)
PASS: libFuzzer :: fuzzer-threaded.test (2984 of 3054)
UNSUPPORTED: libFuzzer :: keep-seed.test (2985 of 3054)
PASS: libFuzzer :: initialize.test (2986 of 3054)
PASS: libFuzzer :: len_control.test (2987 of 3054)
UNSUPPORTED: libFuzzer :: libcxx.test (2988 of 3054)
UNSUPPORTED: libFuzzer :: magic-separator.test (2989 of 3054)
PASS: libFuzzer :: max-number-of-runs.test (2990 of 3054)
PASS: libFuzzer :: memcmp.test (2991 of 3054)
PASS: libFuzzer :: memcmp64.test (2992 of 3054)
PASS: libFuzzer :: merge-control-file.test (2993 of 3054)
PASS: libFuzzer :: fuzzer-timeout.test (2994 of 3054)
UNSUPPORTED: libFuzzer :: merge-sigusr.test (2995 of 3054)
PASS: libFuzzer :: merge-posix.test (2996 of 3054)
PASS: libFuzzer :: merge_two_step.test (2997 of 3054)
PASS: libFuzzer :: merge.test (2998 of 3054)
PASS: libFuzzer :: large.test (2999 of 3054)
PASS: libFuzzer :: minimize_timeout.test (3000 of 3054)
UNSUPPORTED: libFuzzer :: msan-param-unpoison.test (3001 of 3054)
UNSUPPORTED: libFuzzer :: msan.test (3002 of 3054)
UNSUPPORTED: libFuzzer :: mutation-graph.test (3003 of 3054)
UNSUPPORTED: libFuzzer :: noasan-bcmp.test (3004 of 3054)
UNSUPPORTED: libFuzzer :: noasan-memcmp.test (3005 of 3054)
UNSUPPORTED: libFuzzer :: noasan-memcmp64.test (3006 of 3054)
UNSUPPORTED: libFuzzer :: noasan-strcmp.test (3007 of 3054)
UNSUPPORTED: libFuzzer :: noasan-strncmp.test (3008 of 3054)
UNSUPPORTED: libFuzzer :: noasan-strstr.test (3009 of 3054)
PASS: libFuzzer :: not-instrumented.test (3010 of 3054)
PASS: libFuzzer :: null-deref-on-empty.test (3011 of 3054)
PASS: libFuzzer :: minimize_two_crashes.test (3012 of 3054)
UNSUPPORTED: libFuzzer :: only-some-bytes-fork.test (3013 of 3054)
UNSUPPORTED: libFuzzer :: only-some-bytes.test (3014 of 3054)
PASS: libFuzzer :: overwrite-input.test (3015 of 3054)
UNSUPPORTED: libFuzzer :: print-func.test (3016 of 3054)
PASS: libFuzzer :: null-deref.test (3017 of 3054)
PASS: libFuzzer :: recommended-dictionary.test (3018 of 3054)
PASS: libFuzzer :: read-binary.test (3019 of 3054)
PASS: libFuzzer :: reduce_inputs.test (3020 of 3054)
PASS: libFuzzer :: repeated-bytes.test (3021 of 3054)
PASS: libFuzzer :: reload.test (3022 of 3054)
PASS: libFuzzer :: minimize_crash.test (3023 of 3054)
UNSUPPORTED: libFuzzer :: sigint.test (3024 of 3054)
UNSUPPORTED: libFuzzer :: sigusr.test (3025 of 3054)
UNSUPPORTED: libFuzzer :: simple-cmp.test (3026 of 3054)
PASS: libFuzzer :: seed_inputs.test (3027 of 3054)
PASS: libFuzzer :: standalone.test (3028 of 3054)
PASS: libFuzzer :: simple.test (3029 of 3054)
PASS: libFuzzer :: shrink.test (3030 of 3054)
PASS: libFuzzer :: strcmp.test (3031 of 3054)
PASS: libFuzzer :: strncmp-oob.test (3032 of 3054)
PASS: libFuzzer :: strstr.test (3033 of 3054)
PASS: libFuzzer :: symbolize-deadlock.test (3034 of 3054)
PASS: libFuzzer :: swap-cmp.test (3035 of 3054)
UNSUPPORTED: libFuzzer :: trace-malloc-2.test (3036 of 3054)
UNSUPPORTED: libFuzzer :: trace-malloc-threaded.test (3037 of 3054)
UNSUPPORTED: libFuzzer :: trace-malloc-unbalanced.test (3038 of 3054)
PASS: libFuzzer :: strncmp.test (3039 of 3054)
PASS: libFuzzer :: three-bytes.test (3040 of 3054)
PASS: libFuzzer :: trace-malloc.test (3041 of 3054)
PASS: libFuzzer :: ulimit.test (3042 of 3054)
PASS: libFuzzer :: value-profile-cmp2.test (3043 of 3054)
PASS: libFuzzer :: value-profile-cmp3.test (3044 of 3054)
PASS: libFuzzer :: value-profile-cmp4.test (3045 of 3054)
PASS: libFuzzer :: value-profile-div.test (3046 of 3054)
PASS: libFuzzer :: value-profile-load.test (3047 of 3054)
PASS: libFuzzer :: value-profile-cmp.test (3048 of 3054)
PASS: libFuzzer :: value-profile-strcmp.test (3049 of 3054)
PASS: libFuzzer :: value-profile-set.test (3050 of 3054)
PASS: libFuzzer :: value-profile-strncmp.test (3051 of 3054)
UNSUPPORTED: libFuzzer :: windows-opt-ref.test (3052 of 3054)
PASS: libFuzzer :: value-profile-mem.test (3053 of 3054)
PASS: libFuzzer :: value-profile-switch.test (3054 of 3054)

Hide Details

22 warning(s) in tests ******************** Failed Tests (2): LeakSanitizer-AddressSanitizer-x86_64 :: TestCases/use_registers_extra.cpp LeakSanitizer-Standalone-x86_64 :: TestCases/use_registers_extra.cpp

Hide Details

Hide Details

Testing Time: 892.40s Unsupported : 908 Passed : 2114 Expectedly Failed: 30 Failed : 2 FAILED: test/CMakeFiles/check-compiler-rt cd /Users/buildslave/jenkins/workspace/clang-stage2-Rthinlto/clang-build/Build/tools/clang/runtime/compiler-rt-bins/test && /usr/local/Frameworks/Python.framework/Versions/3.7/bin/python3.7 /Users/buildslave/jenkins/workspace/clang-stage2-Rthinlto/clang-build/Build/./bin/llvm-lit --xunit-xml-output=testresults.xunit.xml -v -vv --timeout=600 /Users/buildslave/jenkins/workspace/clang-stage2-Rthinlto/clang-build/Build/tools/clang/runtime/compiler-rt-bins/test/builtins/TestCases /Users/buildslave/jenkins/workspace/clang-stage2-Rthinlto/clang-build/Build/tools/clang/runtime/compiler-rt-bins/test/builtins/Unit/X86_64DarwinConfig /Users/buildslave/jenkins/workspace/clang-stage2-Rthinlto/clang-build/Build/tools/clang/runtime/compiler-rt-bins/test/lsan/X86_64LsanConfig /Users/buildslave/jenkins/workspace/clang-stage2-Rthinlto/clang-build/Build/tools/clang/runtime/compiler-rt-bins/test/lsan/X86_64AsanConfig /Users/buildslave/jenkins/workspace/clang-stage2-Rthinlto/clang-build/Build/tools/clang/runtime/compiler-rt-bins/test/ubsan/Standalone-x86_64 /Users/buildslave/jenkins/workspace/clang-stage2-Rthinlto/clang-build/Build/tools/clang/runtime/compiler-rt-bins/test/ubsan/AddressSanitizer-x86_64 /Users/buildslave/jenkins/workspace/clang-stage2-Rthinlto/clang-build/Build/tools/clang/runtime/compiler-rt-bins/test/ubsan/ThreadSanitizer-x86_64 /Users/buildslave/jenkins/workspace/clang-stage2-Rthinlto/clang-build/Build/tools/clang/runtime/compiler-rt-bins/test/ubsan/StandaloneStatic-x86_64 /Users/buildslave/jenkins/workspace/clang-stage2-Rthinlto/clang-build/Build/tools/clang/runtime/compiler-rt-bins/test/cfi/Standalone-x86_64 /Users/buildslave/jenkins/workspace/clang-stage2-Rthinlto/clang-build/Build/tools/clang/runtime/compiler-rt-bins/test/cfi/Devirt-x86_64 /Users/buildslave/jenkins/workspace/clang-stage2-Rthinlto/clang-build/Build/tools/clang/runtime/compiler-rt-bins/test/sanitizer_common/asan-x86_64-Darwin /Users/buildslave/jenkins/workspace/clang-stage2-Rthinlto/clang-build/Build/tools/clang/runtime/compiler-rt-bins/test/sanitizer_common/lsan-x86_64-Darwin /Users/buildslave/jenkins/workspace/clang-stage2-Rthinlto/clang-build/Build/tools/clang/runtime/compiler-rt-bins/test/sanitizer_common/tsan-x86_64-Darwin /Users/buildslave/jenkins/workspace/clang-stage2-Rthinlto/clang-build/Build/tools/clang/runtime/compiler-rt-bins/test/sanitizer_common/ubsan-x86_64-Darwin /Users/buildslave/jenkins/workspace/clang-stage2-Rthinlto/clang-build/Build/tools/clang/runtime/compiler-rt-bins/test/sanitizer_common/Unit /Users/buildslave/jenkins/workspace/clang-stage2-Rthinlto/clang-build/Build/tools/clang/runtime/compiler-rt-bins/test/fuzzer/unit /Users/buildslave/jenkins/workspace/clang-stage2-Rthinlto/clang-build/Build/tools/clang/runtime/compiler-rt-bins/test/fuzzer/X86_64DefaultDarwinConfig/ /Users/buildslave/jenkins/workspace/clang-stage2-Rthinlto/clang-build/Build/tools/clang/runtime/compiler-rt-bins/test/asan/X86_64DarwinConfig /Users/buildslave/jenkins/workspace/clang-stage2-Rthinlto/clang-build/Build/tools/clang/runtime/compiler-rt-bins/test/asan/Unit /Users/buildslave/jenkins/workspace/clang-stage2-Rthinlto/clang-build/Build/tools/clang/runtime/compiler-rt-bins/test/tsan/X86_64Config /Users/buildslave/jenkins/workspace/clang-stage2-Rthinlto/clang-build/Build/tools/clang/runtime/compiler-rt-bins/test/tsan/Unit /Users/buildslave/jenkins/workspace/clang-stage2-Rthinlto/clang-build/Build/tools/clang/runtime/compiler-rt-bins/test/ubsan_minimal/x86_64 /Users/buildslave/jenkins/workspace/clang-stage2-Rthinlto/clang-build/Build/tools/clang/runtime/compiler-rt-bins/test/profile/Profile-x86_64 /Users/buildslave/jenkins/workspace/clang-stage2-Rthinlto/clang-build/Build/tools/clang/runtime/compiler-rt-bins/test/xray/X86_64DarwinConfig /Users/buildslave/jenkins/workspace/clang-stage2-Rthinlto/clang-build/Build/tools/clang/runtime/compiler-rt-bins/test/xray/X86_64HDarwinConfig /Users/buildslave/jenkins/workspace/clang-stage2-Rthinlto/clang-build/Build/tools/clang/runtime/compiler-rt-bins/test/shadowcallstack/arm64 ninja: build stopped: subcommand failed. [2/4] cd /Users/buildslave/jenkins/workspace/clang-stage2-Rthinlto/llvm-project/clang/bindings/python && /usr/local/Cellar/cmake/3.17.2/bin/cmake -E env CLANG_LIBRARY_PATH=/Users/buildslave/jenkins/workspace/clang-stage2-Rthinlto/clang-build/Build/lib /usr/local/Frameworks/Python.framework/Versions/3.7/bin/python3.7 -m unittest discover .............................................................................................................................. ---------------------------------------------------------------------- Ran 126 tests in 1.998s

Hide Details

OK FAILED: tools/clang/runtime/CMakeFiles/check-compiler-rt cd /Users/buildslave/jenkins/workspace/clang-stage2-Rthinlto/clang-build/Build/tools/clang/runtime/compiler-rt-bins && /usr/local/Cellar/cmake/3.17.2/bin/cmake --build . --target check-all --config RelWithDebInfo ninja: build stopped: cannot make progress due to previous errors. Command failed: Command '['env', 'MALLOC_LOG_FILE=/dev/null', '/usr/local/bin/ninja', '-v', '-k', '0', 'check-all']' returned non-zero exit status 1 Command: ['env', 'MALLOC_LOG_FILE=/dev/null', '/usr/local/bin/ninja', '-v', '-k', '0', 'check-all'] [Pipeline] } [Pipeline] // timeout [Pipeline] } [Pipeline] // stage [Pipeline] stage [Pipeline] { (Declarative: Post Actions) [Pipeline] scanForIssues [Clang (LLVM based)] Sleeping for 5 seconds due to JENKINS-32191... [Clang (LLVM based)] Parsing console log (workspace: '/Users/buildslave/jenkins/workspace/clang-stage2-Rthinlto') [Clang (LLVM based)] Successfully parsed console log [Clang (LLVM based)] -> found 9 issues (skipped 29 duplicates) [Clang (LLVM based)] [-ERROR-] Can't create fingerprints for some files: [Clang (LLVM based)] [-ERROR-] - '/tmp/gotsan.IPhSXfQWYL/gotsan.cpp', IO exception has been thrown: java.nio.file.NoSuchFileException: /tmp/gotsan.IPhSXfQWYL/gotsan.cpp [Clang (LLVM based)] [-ERROR-] - '/tmp/gotsan.IPhSXfQWYL/gotsan.cpp', IO exception has been thrown: java.nio.file.NoSuchFileException: /tmp/gotsan.IPhSXfQWYL/gotsan.cpp [Clang (LLVM based)] [-ERROR-] - '/tmp/gotsan.IPhSXfQWYL/gotsan.cpp', IO exception has been thrown: java.nio.file.NoSuchFileException: /tmp/gotsan.IPhSXfQWYL/gotsan.cpp [Clang (LLVM based)] [-ERROR-] - '/tmp/gotsan.IPhSXfQWYL/gotsan.cpp', IO exception has been thrown: java.nio.file.NoSuchFileException: /tmp/gotsan.IPhSXfQWYL/gotsan.cpp [Clang (LLVM based)] [-ERROR-] - '/tmp/gotsan.IPhSXfQWYL/gotsan.cpp', IO exception has been thrown: java.nio.file.NoSuchFileException: /tmp/gotsan.IPhSXfQWYL/gotsan.cpp [Clang (LLVM based)] [-ERROR-] - '/tmp/gotsan.IPhSXfQWYL/gotsan.cpp', IO exception has been thrown: java.nio.file.NoSuchFileException: /tmp/gotsan.IPhSXfQWYL/gotsan.cpp [Clang (LLVM based)] [-ERROR-] - '/tmp/gotsan.IPhSXfQWYL/gotsan.cpp', IO exception has been thrown: java.nio.file.NoSuchFileException: /tmp/gotsan.IPhSXfQWYL/gotsan.cpp [Clang (LLVM based)] [-ERROR-] - '/tmp/gotsan.IPhSXfQWYL/gotsan.cpp', IO exception has been thrown: java.nio.file.NoSuchFileException: /tmp/gotsan.IPhSXfQWYL/gotsan.cpp [Clang (LLVM based)] [-ERROR-] - '/Users/buildslave/jenkins/workspace/clang-stage2-Rthinlto/clang-build/Build/tools/clang/runtime/compiler-rt-bins/llvm-lit: /Users/buildslave/jenkins/workspace/clang-stage2-Rthinlto/llvm-project/compiler-rt/test/lit.common.cfg.py', IO exception has been thrown: java.nio.file.NoSuchFileException: /Users/buildslave/jenkins/workspace/clang-stage2-Rthinlto/clang-build/Build/tools/clang/runtime/compiler-rt-bins/llvm-lit: /Users/buildslave/jenkins/workspace/clang-stage2-Rthinlto/llvm-project/compiler-rt/test/lit.common.cfg.py [Clang (LLVM based)] Post processing issues on 'green-dragon-22' with source code encoding 'UTF-8' [Clang (LLVM based)] Creating SCM blamer to obtain author and commit information for affected files [Clang (LLVM based)] Creating SCM miner to obtain statistics for affected repository files [Clang (LLVM based)] Resolving file names for all issues in source directory '/Users/buildslave/jenkins/workspace/clang-stage2-Rthinlto' [Clang (LLVM based)] -> resolved paths in source directory (0 found, 2 not found) [Clang (LLVM based)] Resolving module names from module definitions (build.xml, pom.xml, or Manifest.mf files) [Clang (LLVM based)] -> resolved module names for 9 issues [Clang (LLVM based)] Resolving package names (or namespaces) by parsing the affected files [Clang (LLVM based)] -> resolved package names of 2 affected files [Clang (LLVM based)] No filter has been set, publishing all 9 issues [Clang (LLVM based)] Creating fingerprints for all affected code blocks to track issues over different builds [Clang (LLVM based)] -> created fingerprints for 0 issues (skipped 9 issues) [Clang (LLVM based)] Copying affected files to Jenkins' build folder '/Users/Shared/Jenkins/Home/jobs/clang-stage2-Rthinlto/builds/3562/files-with-issues' [Clang (LLVM based)] -> 0 copied, 0 not in workspace, 9 not-found, 0 with I/O error [Pipeline] emailext Warning: czhengsz@cn.ibm.com is not a recognized user, but sending mail anyway Warning: ecaldas@google.com is not a recognized user, but sending mail anyway Warning: zhuoryin@amd.com is not a recognized user, but sending mail anyway Warning: nikita.ppv@gmail.com is not a recognized user, but sending mail anyway Warning: yvan.roux@linaro.org is not a recognized user, but sending mail anyway Warning: Sanne.Wouda@arm.com is not a recognized user, but sending mail anyway Warning: jasonliu.development@gmail.com is not a recognized user, but sending mail anyway Warning: kerry.mclaughlin@arm.com is not a recognized user, but sending mail anyway Warning: jrtc27@jrtc27.com is not a recognized user, but sending mail anyway Warning: listmail@philipreames.com is not a recognized user, but sending mail anyway Warning: Stanislav.Mekhanoshin@amd.com is not a recognized user, but sending mail anyway Warning: daniel.kiss@arm.com is not a recognized user, but sending mail anyway Warning: raul.tambre@cleveron.com is not a recognized user, but sending mail anyway Warning: herhut@google.com is not a recognized user, but sending mail anyway Warning: tpopp@google.com is not a recognized user, but sending mail anyway Warning: jonathan_roelofs@apple.com is not a recognized user, but sending mail anyway Warning: michael.hliao@gmail.com is not a recognized user, but sending mail anyway Warning: cullen.rhodes@arm.com is not a recognized user, but sending mail anyway Warning: Yaxun.Liu@amd.com is not a recognized user, but sending mail anyway Warning: vincentzhaorz@gmail.com is not a recognized user, but sending mail anyway Warning: limo@google.com is not a recognized user, but sending mail anyway Warning: hanchung@google.com is not a recognized user, but sending mail anyway Warning: rahmanl@google.com is not a recognized user, but sending mail anyway Warning: david.spickett@arm.com is not a recognized user, but sending mail anyway Warning: mikael.holmen@ericsson.com is not a recognized user, but sending mail anyway Warning: amy.kwan1@ibm.com is not a recognized user, but sending mail anyway Warning: aeubanks@google.com is not a recognized user, but sending mail anyway Warning: grimar@accesssoftek.com is not a recognized user, but sending mail anyway Warning: mtrofin@google.com is not a recognized user, but sending mail anyway Warning: andrew_litteken@apple.com is not a recognized user, but sending mail anyway Warning: dblaikie@gmail.com is not a recognized user, but sending mail anyway Warning: mkazantsev@azul.com is not a recognized user, but sending mail anyway Warning: richard@metafoo.co.uk is not a recognized user, but sending mail anyway Warning: maskray@google.com is not a recognized user, but sending mail anyway Warning: psteinfeld@nvidia.com is not a recognized user, but sending mail anyway Warning: rprichard@google.com is not a recognized user, but sending mail anyway Warning: mydeveloperday@gmail.com is not a recognized user, but sending mail anyway Warning: thakis@chromium.org is not a recognized user, but sending mail anyway Warning: jianzhouzh@google.com is not a recognized user, but sending mail anyway Warning: akhuang@google.com is not a recognized user, but sending mail anyway Warning: david.green@arm.com is not a recognized user, but sending mail anyway Warning: i@maskray.me is not a recognized user, but sending mail anyway Warning: craig.topper@intel.com is not a recognized user, but sending mail anyway Warning: flo@fhahn.com is not a recognized user, but sending mail anyway Warning: jurahul@google.com is not a recognized user, but sending mail anyway Warning: lntue@google.com is not a recognized user, but sending mail anyway Warning: sam.parker@arm.com is not a recognized user, but sending mail anyway Warning: lebedev.ri@gmail.com is not a recognized user, but sending mail anyway Warning: llvm-dev@redking.me.uk is not a recognized user, but sending mail anyway Warning: ogiroux@gmail.com is not a recognized user, but sending mail anyway Warning: jay.foad@gmail.com is not a recognized user, but sending mail anyway Warning: sjoerd.meijer@arm.com is not a recognized user, but sending mail anyway Warning: xun@fb.com is not a recognized user, but sending mail anyway Warning: zinenko@google.com is not a recognized user, but sending mail anyway Warning: llvmgnsyncbot@gmail.com is not a recognized user, but sending mail anyway Warning: qiucofan@cn.ibm.com is not a recognized user, but sending mail anyway Warning: n54@gmx.com is not a recognized user, but sending mail anyway Warning: alexshap@fb.com is not a recognized user, but sending mail anyway Warning: clementval@gmail.com is not a recognized user, but sending mail anyway Warning: spatel@rotateright.com is not a recognized user, but sending mail anyway Warning: asbirlea@google.com is not a recognized user, but sending mail anyway Warning: qcolombet@apple.com is not a recognized user, but sending mail anyway Warning: zhaoshiz@quicinc.com is not a recognized user, but sending mail anyway Warning: uday@polymagelabs.com is not a recognized user, but sending mail anyway Warning: thomasraoux@google.com is not a recognized user, but sending mail anyway Warning: douglas.yung@sony.com is not a recognized user, but sending mail anyway Warning: echristo@gmail.com is not a recognized user, but sending mail anyway Warning: weiwei64@huawei.com is not a recognized user, but sending mail anyway Warning: a.bataev@hotmail.com is not a recognized user, but sending mail anyway Warning: silvasean@google.com is not a recognized user, but sending mail anyway Warning: wei.huang@ibm.com is not a recognized user, but sending mail anyway Warning: mascasa@google.com is not a recognized user, but sending mail anyway Warning: dschuff@google.com is not a recognized user, but sending mail anyway Warning: zhanghb97@126.com is not a recognized user, but sending mail anyway Warning: rupprecht@google.com is not a recognized user, but sending mail anyway Warning: mcinally@cray.com is not a recognized user, but sending mail anyway Warning: mcgrathr@google.com is not a recognized user, but sending mail anyway Warning: maxim.kuvyrkov@linaro.org is not a recognized user, but sending mail anyway Warning: whitneyt@recycler.canlab.ibm.com is not a recognized user, but sending mail anyway Warning: stilis@microsoft.com is not a recognized user, but sending mail anyway Warning: ikudrin@accesssoftek.com is not a recognized user, but sending mail anyway Warning: ro@gcc.gnu.org is not a recognized user, but sending mail anyway Warning: rnk@google.com is not a recognized user, but sending mail anyway Warning: benny.kra@googlemail.com is not a recognized user, but sending mail anyway Warning: tejohnson@google.com is not a recognized user, but sending mail anyway Warning: tianshilei1992@gmail.com is not a recognized user, but sending mail anyway Warning: czhengsz@cn.ibm.com is not a recognized user, but sending mail anyway Warning: ecaldas@google.com is not a recognized user, but sending mail anyway Warning: zhuoryin@amd.com is not a recognized user, but sending mail anyway Warning: nikita.ppv@gmail.com is not a recognized user, but sending mail anyway Warning: yvan.roux@linaro.org is not a recognized user, but sending mail anyway Warning: Sanne.Wouda@arm.com is not a recognized user, but sending mail anyway Warning: jasonliu.development@gmail.com is not a recognized user, but sending mail anyway Warning: kerry.mclaughlin@arm.com is not a recognized user, but sending mail anyway Warning: jrtc27@jrtc27.com is not a recognized user, but sending mail anyway Warning: listmail@philipreames.com is not a recognized user, but sending mail anyway Warning: Stanislav.Mekhanoshin@amd.com is not a recognized user, but sending mail anyway Warning: daniel.kiss@arm.com is not a recognized user, but sending mail anyway Warning: raul.tambre@cleveron.com is not a recognized user, but sending mail anyway Warning: herhut@google.com is not a recognized user, but sending mail anyway Warning: tpopp@google.com is not a recognized user, but sending mail anyway Warning: jonathan_roelofs@apple.com is not a recognized user, but sending mail anyway Warning: michael.hliao@gmail.com is not a recognized user, but sending mail anyway Warning: cullen.rhodes@arm.com is not a recognized user, but sending mail anyway Warning: Yaxun.Liu@amd.com is not a recognized user, but sending mail anyway Warning: vincentzhaorz@gmail.com is not a recognized user, but sending mail anyway Warning: limo@google.com is not a recognized user, but sending mail anyway Warning: hanchung@google.com is not a recognized user, but sending mail anyway Warning: rahmanl@google.com is not a recognized user, but sending mail anyway Warning: david.spickett@arm.com is not a recognized user, but sending mail anyway Warning: mikael.holmen@ericsson.com is not a recognized user, but sending mail anyway Warning: amy.kwan1@ibm.com is not a recognized user, but sending mail anyway Warning: aeubanks@google.com is not a recognized user, but sending mail anyway Warning: grimar@accesssoftek.com is not a recognized user, but sending mail anyway Warning: mtrofin@google.com is not a recognized user, but sending mail anyway Warning: andrew_litteken@apple.com is not a recognized user, but sending mail anyway Warning: dblaikie@gmail.com is not a recognized user, but sending mail anyway Warning: mkazantsev@azul.com is not a recognized user, but sending mail anyway Warning: richard@metafoo.co.uk is not a recognized user, but sending mail anyway Warning: maskray@google.com is not a recognized user, but sending mail anyway Warning: psteinfeld@nvidia.com is not a recognized user, but sending mail anyway Warning: rprichard@google.com is not a recognized user, but sending mail anyway Warning: mydeveloperday@gmail.com is not a recognized user, but sending mail anyway Warning: thakis@chromium.org is not a recognized user, but sending mail anyway Warning: jianzhouzh@google.com is not a recognized user, but sending mail anyway Warning: akhuang@google.com is not a recognized user, but sending mail anyway Warning: david.green@arm.com is not a recognized user, but sending mail anyway Warning: i@maskray.me is not a recognized user, but sending mail anyway Warning: craig.topper@intel.com is not a recognized user, but sending mail anyway Warning: flo@fhahn.com is not a recognized user, but sending mail anyway Warning: jurahul@google.com is not a recognized user, but sending mail anyway Warning: lntue@google.com is not a recognized user, but sending mail anyway Warning: sam.parker@arm.com is not a recognized user, but sending mail anyway Warning: lebedev.ri@gmail.com is not a recognized user, but sending mail anyway Warning: llvm-dev@redking.me.uk is not a recognized user, but sending mail anyway Warning: ogiroux@gmail.com is not a recognized user, but sending mail anyway Warning: jay.foad@gmail.com is not a recognized user, but sending mail anyway Warning: sjoerd.meijer@arm.com is not a recognized user, but sending mail anyway Warning: xun@fb.com is not a recognized user, but sending mail anyway Warning: zinenko@google.com is not a recognized user, but sending mail anyway Warning: llvmgnsyncbot@gmail.com is not a recognized user, but sending mail anyway Warning: qiucofan@cn.ibm.com is not a recognized user, but sending mail anyway Warning: n54@gmx.com is not a recognized user, but sending mail anyway Warning: alexshap@fb.com is not a recognized user, but sending mail anyway Warning: clementval@gmail.com is not a recognized user, but sending mail anyway Warning: spatel@rotateright.com is not a recognized user, but sending mail anyway Warning: asbirlea@google.com is not a recognized user, but sending mail anyway Warning: qcolombet@apple.com is not a recognized user, but sending mail anyway Warning: zhaoshiz@quicinc.com is not a recognized user, but sending mail anyway Warning: uday@polymagelabs.com is not a recognized user, but sending mail anyway Warning: thomasraoux@google.com is not a recognized user, but sending mail anyway Warning: douglas.yung@sony.com is not a recognized user, but sending mail anyway Warning: echristo@gmail.com is not a recognized user, but sending mail anyway Warning: weiwei64@huawei.com is not a recognized user, but sending mail anyway Warning: a.bataev@hotmail.com is not a recognized user, but sending mail anyway Warning: silvasean@google.com is not a recognized user, but sending mail anyway Warning: wei.huang@ibm.com is not a recognized user, but sending mail anyway Warning: mascasa@google.com is not a recognized user, but sending mail anyway Warning: dschuff@google.com is not a recognized user, but sending mail anyway Warning: zhanghb97@126.com is not a recognized user, but sending mail anyway Warning: rupprecht@google.com is not a recognized user, but sending mail anyway Warning: mcinally@cray.com is not a recognized user, but sending mail anyway Warning: mcgrathr@google.com is not a recognized user, but sending mail anyway Warning: maxim.kuvyrkov@linaro.org is not a recognized user, but sending mail anyway Warning: whitneyt@recycler.canlab.ibm.com is not a recognized user, but sending mail anyway Warning: stilis@microsoft.com is not a recognized user, but sending mail anyway Warning: ikudrin@accesssoftek.com is not a recognized user, but sending mail anyway Warning: ro@gcc.gnu.org is not a recognized user, but sending mail anyway Warning: rnk@google.com is not a recognized user, but sending mail anyway Warning: benny.kra@googlemail.com is not a recognized user, but sending mail anyway Warning: tejohnson@google.com is not a recognized user, but sending mail anyway Warning: tianshilei1992@gmail.com is not a recognized user, but sending mail anyway

Hide Details

Begin Pre-Send Script... Sending email to: Florian Hahn <florian_hahn@apple.com> Florian Hahn <florian_hahn@apple.com> Azhar Mohammed <azhar@apple.com>
[Pipeline] } [Pipeline] // stage [Pipeline] } [Pipeline] // node [Pipeline] End of Pipeline ERROR: script returned exit code 1 Finished: FAILURE