FailedConsole Output

Skipping 18,031 KB.. Full Log
dulesNonObjCTarget.py (864 of 1202)
PASS: lldb-api :: commands/command/delete/TestCommandDelete.py (865 of 1202)
PASS: lldb-api :: functionalities/breakpoint/breakpoint_callback_command_source/TestBreakpointCallbackCommandSource.py (866 of 1202)
PASS: lldb-api :: commands/expression/formatters/TestFormatters.py (867 of 1202)
PASS: lldb-shell :: Minidump/memory-region.yaml (868 of 1202)
PASS: lldb-shell :: SymbolFile/DWARF/debug-names-compressed.cpp (869 of 1202)
UNSUPPORTED: lldb-api :: functionalities/breakpoint/hardware_breakpoints/hardware_breakpoint_on_multiple_threads/TestHWBreakMultiThread.py (870 of 1202)
PASS: lldb-api :: types/TestShortType.py (871 of 1202)
PASS: lldb-api :: functionalities/data-formatter/data-formatter-objc/TestDataFormatterObjCNSDate.py (872 of 1202)
PASS: lldb-api :: commands/expression/regression-access-function-template-in-record/TestRegressionAccessFunctionTemplateInRecord.py (873 of 1202)
PASS: lldb-api :: functionalities/thread/step_out/TestThreadStepOut.py (874 of 1202)
PASS: lldb-api :: types/TestFloatTypes.py (875 of 1202)
PASS: lldb-api :: functionalities/data-formatter/data-formatter-cpp/TestDataFormatterCpp.py (876 of 1202)
PASS: lldb-api :: functionalities/gdb_remote_client/TestArmRegisterDefinition.py (877 of 1202)
PASS: lldb-shell :: Commands/command-source.test (878 of 1202)
PASS: lldb-api :: commands/register/register/register_command/TestRegisters.py (879 of 1202)
PASS: lldb-api :: python_api/watchpoint/watchlocation/TestSetWatchlocation.py (880 of 1202)
UNSUPPORTED: lldb-shell :: Quit/TestQuitExitCode30.test (881 of 1202)
PASS: lldb-shell :: Settings/TestDisassemblyFormat.test (882 of 1202)
PASS: lldb-shell :: SymbolFile/NativePDB/source-list.cpp (883 of 1202)
PASS: lldb-api :: commands/expression/unicode-in-variable/TestUnicodeInVariable.py (884 of 1202)
UNSUPPORTED: lldb-api :: lang/objc/objc-dynamic-value/TestObjCDynamicValue.py (885 of 1202)
PASS: lldb-api :: functionalities/data-formatter/type_summary_list_arg/TestTypeSummaryListArg.py (886 of 1202)
PASS: lldb-api :: commands/expression/rdar42038760/TestScalarURem.py (887 of 1202)
PASS: lldb-api :: python_api/watchpoint/TestWatchpointIgnoreCount.py (888 of 1202)
PASS: lldb-api :: lang/cpp/namespace_conflicts/TestNamespaceConflicts.py (889 of 1202)
UNSUPPORTED: lldb-shell :: SymbolFile/NativePDB/typedefs.cpp (890 of 1202)
UNSUPPORTED: lldb-api :: functionalities/unwind/ehframe/TestEhFrameUnwind.py (891 of 1202)
PASS: lldb-shell :: SymbolFile/NativePDB/break-by-line.cpp (892 of 1202)
PASS: lldb-api :: functionalities/thread/exit_during_step/TestExitDuringStep.py (893 of 1202)
PASS: lldb-api :: commands/expression/entry-bp/TestExprEntryBP.py (894 of 1202)
PASS: lldb-api :: lang/cpp/covariant-return-types/TestCovariantReturnTypes.py (895 of 1202)
UNSUPPORTED: lldb-api :: functionalities/darwin_log/format/TestDarwinLogMessageFormat.py (896 of 1202)
UNSUPPORTED: lldb-api :: tools/intel-features/intel-pt/test/TestIntelPTSimpleBinary.py (897 of 1202)
PASS: lldb-api :: source-manager/TestSourceManager.py (898 of 1202)
PASS: lldb-api :: commands/expression/namespace_local_var_same_name_obj_c/TestNamespaceLocalVarSameNameObjC.py (899 of 1202)
PASS: lldb-shell :: SymbolFile/DWARF/DW_AT_declaration-with-children.s (900 of 1202)
PASS: lldb-shell :: SymbolFile/NativePDB/function-types-calling-conv.cpp (901 of 1202)
PASS: lldb-api :: functionalities/avoids-fd-leak/TestFdLeak.py (902 of 1202)
PASS: lldb-api :: lang/objc/modules-app-update/TestClangModulesAppUpdate.py (903 of 1202)
UNSUPPORTED: lldb-shell :: SymbolFile/PDB/variables-locations.test (904 of 1202)
PASS: lldb-api :: functionalities/tsan/thread_numbers/TestTsanThreadNumbers.py (905 of 1202)
PASS: lldb-shell :: SymbolFile/Breakpad/symtab.test (906 of 1202)
PASS: lldb-api :: lang/cpp/function-qualifiers/TestCppFunctionQualifiers.py (907 of 1202)
PASS: lldb-api :: functionalities/postmortem/minidump-new/TestMiniDumpUUID.py (908 of 1202)
PASS: lldb-api :: lang/objcxx/cxx-bridged-po/TestObjCXXBridgedPO.py (909 of 1202)
PASS: lldb-shell :: ObjectFile/PECOFF/invalid-export-table.yaml (910 of 1202)
PASS: lldb-api :: lang/objc/exceptions/TestObjCExceptions.py (911 of 1202)
PASS: lldb-api :: commands/expression/call-throws/TestCallThatThrows.py (912 of 1202)
PASS: lldb-api :: commands/watchpoints/watchpoint_size/TestWatchpointSizes.py (913 of 1202)
UNSUPPORTED: lldb-api :: commands/expression/import-std-module/basic/TestImportStdModule.py (914 of 1202)
PASS: lldb-api :: functionalities/data-formatter/data-formatter-stl/libcxx/initializerlist/TestInitializerList.py (915 of 1202)
PASS: lldb-api :: commands/expression/invalid-args/TestInvalidArgsExpression.py (916 of 1202)
PASS: lldb-api :: lang/cpp/overloaded-functions/TestOverloadedFunctions.py (917 of 1202)
PASS: lldb-api :: functionalities/tail_call_frames/cross_dso/TestCrossDSOTailCalls.py (918 of 1202)
PASS: lldb-shell :: BuildScript/modes.test (919 of 1202)
PASS: lldb-api :: lang/c/const_variables/TestConstVariables.py (920 of 1202)
PASS: lldb-api :: commands/expression/two-files/TestObjCTypeQueryFromOtherCompileUnit.py (921 of 1202)
UNSUPPORTED: lldb-api :: commands/process/attach-resume/TestAttachResume.py (922 of 1202)
PASS: lldb-shell :: SymbolFile/DWARF/debug_ranges_and_rnglists.test (923 of 1202)
UNSUPPORTED: lldb-shell :: Driver/TestFile.test (924 of 1202)
PASS: lldb-api :: functionalities/tsan/cpp_global_location/TestTsanCPPGlobalLocation.py (925 of 1202)
PASS: lldb-shell :: ObjectFile/ELF/section-permissions.yaml (926 of 1202)
PASS: lldb-api :: functionalities/value_md5_crash/TestValueMD5Crash.py (927 of 1202)
UNSUPPORTED: lldb-api :: lang/cpp/function-template-parameter-pack/TestFunctionTemplateParameterPack.py (928 of 1202)
PASS: lldb-api :: commands/version/TestVersion.py (929 of 1202)
UNSUPPORTED: lldb-shell :: Register/x86-64-read.test (930 of 1202)
PASS: lldb-shell :: SymbolFile/DWARF/dir-separator-windows.s (931 of 1202)
PASS: lldb-api :: functionalities/gdb_remote_client/TestProcessConnect.py (932 of 1202)
PASS: lldb-shell :: SymbolFile/DWARF/dwarf5-index-is-used.cpp (933 of 1202)
PASS: lldb-api :: functionalities/postmortem/minidump/TestMiniDump.py (934 of 1202)
PASS: lldb-api :: functionalities/data-formatter/data-formatter-stl/libcxx/bitset/TestDataFormatterLibcxxBitset.py (935 of 1202)
UNSUPPORTED: lldb-shell :: ScriptInterpreter/Lua/breakpoint_callback.test (936 of 1202)
PASS: lldb-shell :: Breakpoint/debug_rnglist_rlestartend.test (937 of 1202)
PASS: lldb-api :: functionalities/breakpoint/breakpoint_conditions/TestBreakpointConditions.py (938 of 1202)
UNSUPPORTED: lldb-api :: functionalities/breakpoint/breakpoint_set_restart/TestBreakpointSetRestart.py (939 of 1202)
UNSUPPORTED: lldb-api :: commands/expression/call-restarts/TestCallThatRestarts.py (940 of 1202)
PASS: lldb-api :: lang/objc/objc-class-method/TestObjCClassMethod.py (941 of 1202)
PASS: lldb-api :: functionalities/breakpoint/source_regexp/TestSourceRegexBreakpoints.py (942 of 1202)
PASS: lldb-api :: functionalities/process_crash_info/TestProcessCrashInfo.py (943 of 1202)
UNSUPPORTED: lldb-shell :: SymbolFile/target-symbols-add-unwind.test (944 of 1202)
PASS: lldb-api :: iohandler/resize/TestIOHandlerResize.py (945 of 1202)
PASS: lldb-api :: functionalities/multidebugger_commands/TestMultipleDebuggersCommands.py (946 of 1202)
PASS: lldb-api :: commands/process/attach/TestProcessAttach.py (947 of 1202)
PASS: lldb-shell :: ObjectFile/ELF/PT_LOAD-overlap-section.yaml (948 of 1202)
PASS: lldb-api :: python_api/value/empty_class/TestValueAPIEmptyClass.py (949 of 1202)
PASS: lldb-shell :: ObjectFile/ELF/compressed-sections.yaml (950 of 1202)
PASS: lldb-api :: functionalities/data-formatter/data-formatter-objc/TestDataFormatterObjCCF.py (951 of 1202)
PASS: lldb-api :: commands/platform/file/close/TestPlatformFileClose.py (952 of 1202)
PASS: lldb-api :: commands/target/stop-hook/disable/TestTargetStopHookDisable.py (953 of 1202)
PASS: lldb-api :: lang/cpp/alignas_base_class/TestAlignAsBaseClass.py (954 of 1202)
PASS: lldb-api :: lang/cpp/constructors/TestCppConstructors.py (955 of 1202)
PASS: lldb-api :: lang/objc/objc-baseclass-sbtype/TestObjCBaseClassSBType.py (956 of 1202)
PASS: lldb-shell :: ObjectFile/ELF/PT_LOAD-overlap-PT_TLS.yaml (957 of 1202)
PASS: lldb-api :: python_api/signals/TestSignalsAPI.py (958 of 1202)
UNSUPPORTED: lldb-api :: functionalities/data-formatter/data-formatter-stl/libstdcpp/vbool/TestDataFormatterStdVBool.py (959 of 1202)
UNSUPPORTED: lldb-shell :: SymbolFile/DWARF/DW_TAG_GNU_call_site-DW_AT_low_pc.s (960 of 1202)
UNSUPPORTED: lldb-api :: tools/lldb-server/TestGdbRemote_vContThreads.py (961 of 1202)
PASS: lldb-shell :: BuildScript/toolchain-clang.test (962 of 1202)
UNSUPPORTED: lldb-shell :: Process/TestEnvironment.test (963 of 1202)
PASS: lldb-api :: lang/objcxx/objcxx-ivar-vector/TestIvarVector.py (964 of 1202)
PASS: lldb-api :: commands/add-dsym/uuid/TestAddDsymCommand.py (965 of 1202)
PASS: lldb-api :: functionalities/postmortem/elf-core/gcore/TestGCore.py (966 of 1202)
PASS: lldb-api :: api/multiple-targets/TestMultipleTargets.py (967 of 1202)
PASS: lldb-api :: commands/target/select/TestTargetSelect.py (968 of 1202)
UNSUPPORTED: lldb-shell :: Reproducer/TestMultipleTargets.test (969 of 1202)
UNSUPPORTED: lldb-api :: commands/expression/import-std-module/no-std-module/TestMissingStdModule.py (970 of 1202)
UNSUPPORTED: lldb-api :: tools/lldb-vscode/module/TestVSCode_module.py (971 of 1202)
PASS: lldb-api :: sample_test/TestSampleInlineTest.py (972 of 1202)
UNSUPPORTED: lldb-shell :: Reproducer/Modules/TestModuleCXX.test (973 of 1202)
PASS: lldb-api :: functionalities/data-formatter/var-in-aggregate-misuse/TestVarInAggregateMisuse.py (974 of 1202)
PASS: lldb-api :: functionalities/thread/crash_during_step/TestCrashDuringStep.py (975 of 1202)
PASS: lldb-api :: functionalities/thread/concurrent_events/TestConcurrentTwoBreakpointsOneDelaySignal.py (976 of 1202)
PASS: lldb-shell :: ObjectFile/ELF/PT_LOAD-empty.yaml (977 of 1202)
PASS: lldb-api :: lang/cpp/limit-debug-info/TestWithLimitDebugInfo.py (978 of 1202)
UNSUPPORTED: lldb-api :: commands/watchpoints/multi_watchpoint_slots/TestWatchpointMultipleSlots.py (979 of 1202)
PASS: lldb-api :: commands/breakpoint/set/func-regex/TestBreakpointRegexError.py (980 of 1202)
PASS: lldb-shell :: SymbolFile/NativePDB/ast-functions.cpp (981 of 1202)
PASS: lldb-api :: lang/cpp/typeof/TestTypeOfDeclTypeExpr.py (982 of 1202)
PASS: lldb-api :: lang/c/unions/TestUnionMembers.py (983 of 1202)
PASS: lldb-api :: functionalities/data-formatter/frameformat_smallstruct/TestFrameFormatSmallStruct.py (984 of 1202)
PASS: lldb-api :: functionalities/data-formatter/data-formatter-objc/TestDataFormatterObjCNSError.py (985 of 1202)
PASS: lldb-api :: python_api/sbplatform/TestSBPlatform.py (986 of 1202)
UNSUPPORTED: lldb-api :: macosx/profile_vrs_detach/TestDetachVrsProfile.py (987 of 1202)
PASS: lldb-api :: functionalities/data-formatter/data-formatter-stl/libstdcpp/unique_ptr/invalid/TestDataFormatterInvalidStdUniquePtr.py (988 of 1202)
UNSUPPORTED: lldb-shell :: Unwind/eh-frame-augment-noop.test (989 of 1202)
PASS: lldb-api :: functionalities/data-formatter/data-formatter-objc/nsstring/TestDataFormatterNSString.py (990 of 1202)
PASS: lldb-api :: functionalities/breakpoint/objc/TestObjCBreakpoints.py (991 of 1202)
PASS: lldb-api :: functionalities/data-formatter/synthupdate/TestSyntheticFilterRecompute.py (992 of 1202)
PASS: lldb-api :: python_api/watchpoint/condition/TestWatchpointConditionAPI.py (993 of 1202)
PASS: lldb-api :: functionalities/thread/concurrent_events/TestConcurrentManyCrash.py (994 of 1202)
PASS: lldb-api :: lang/objc/hidden-ivars/TestHiddenIvars.py (995 of 1202)
PASS: lldb-shell :: Settings/TestStopCommandSourceOnError.test (996 of 1202)
PASS: lldb-shell :: SymbolFile/DWARF/find-basic-variable.cpp (997 of 1202)
PASS: lldb-api :: commands/gui/basic/TestGuiBasic.py (998 of 1202)
PASS: lldb-shell :: SymbolFile/NativePDB/disassembly.cpp (999 of 1202)
PASS: lldb-shell :: Settings/TestDisableColor.test (1000 of 1202)
UNSUPPORTED: lldb-shell :: Reproducer/TestProcessList.test (1001 of 1202)
UNSUPPORTED: lldb-api :: arm/breakpoint-thumb-codesection/TestBreakpointThumbCodesection.py (1002 of 1202)
PASS: lldb-api :: lang/mixed/TestMixedLanguages.py (1003 of 1202)
PASS: lldb-api :: functionalities/data-formatter/data-formatter-stl/libcxx/map/TestDataFormatterLibccMap.py (1004 of 1202)
PASS: lldb-api :: functionalities/tail_call_frames/inlining_and_tail_calls/TestInliningAndTailCalls.py (1005 of 1202)
PASS: lldb-shell :: Quit/TestQuitExitCodeHex0.test (1006 of 1202)
PASS: lldb-api :: functionalities/data-formatter/data-formatter-enum-format/TestDataFormatterEnumFormat.py (1007 of 1202)
UNSUPPORTED: lldb-api :: python_api/symbol-context/TestSymbolContext.py (1008 of 1202)
PASS: lldb-api :: lang/cpp/gmodules-templates/TestGModules.py (1009 of 1202)
UNSUPPORTED: lldb-api :: commands/expression/import-std-module/list-dbg-info-content/TestDbgInfoContentListFromStdModule.py (1010 of 1202)
UNSUPPORTED: lldb-shell :: BuildScript/toolchain-msvc.test (1011 of 1202)
PASS: lldb-api :: lang/cpp/nested-class-other-compilation-unit/TestNestedClassWithParentInAnotherCU.py (1012 of 1202)
PASS: lldb-api :: functionalities/data-formatter/array_typedef/TestArrayTypedef.py (1013 of 1202)
PASS: lldb-api :: types/TestCharTypeExpr.py (1014 of 1202)
PASS: lldb-shell :: Breakpoint/case-sensitive.test (1015 of 1202)
PASS: lldb-shell :: ObjectFile/PECOFF/sections.yaml (1016 of 1202)
PASS: lldb-api :: lang/objc/global_ptrs/TestGlobalObjects.py (1017 of 1202)
PASS: lldb-api :: python_api/lldbutil/TestSwigVersion.py (1018 of 1202)
PASS: lldb-api :: functionalities/data-formatter/data-formatter-stl/libcxx/unique_ptr/TestDataFormatterLibcxxUniquePtr.py (1019 of 1202)
PASS: lldb-api :: lang/c/step_over_no_deadlock/TestStepOverDoesntBlock.py (1020 of 1202)
PASS: lldb-api :: functionalities/postmortem/elf-core/thread_crash/TestLinuxCoreThreads.py (1021 of 1202)
PASS: lldb-shell :: SymbolFile/DWARF/debug-types-line-tables.s (1022 of 1202)
PASS: lldb-shell :: SymbolFile/DWARF/clang-ast-from-dwarf-unamed-and-anon-structs.cpp (1023 of 1202)
PASS: lldb-api :: commands/frame/language/TestGuessLanguage.py (1024 of 1202)
PASS: lldb-api :: commands/expression/calculator_mode/TestCalculatorMode.py (1025 of 1202)
PASS: lldb-shell :: SymbolFile/DWARF/debug-types-dwarf5.s (1026 of 1202)
PASS: lldb-api :: functionalities/gdb_remote_client/TestTargetXMLArch.py (1027 of 1202)
PASS: lldb-api :: lang/objc/objc-super/TestObjCSuper.py (1028 of 1202)
PASS: lldb-api :: commands/frame/diagnose/dereference-this/TestDiagnoseDereferenceThis.py (1029 of 1202)
PASS: lldb-api :: lang/cpp/breakpoint-commands/TestCPPBreakpointCommands.py (1030 of 1202)
UNSUPPORTED: lldb-api :: commands/command/script/TestCommandScript.py (1031 of 1202)
PASS: lldb-shell :: Expr/TestMultilineExpr.test (1032 of 1202)
PASS: lldb-api :: functionalities/data-formatter/synthcapping/TestSyntheticCapping.py (1033 of 1202)
PASS: lldb-api :: commands/expression/ir-interpreter/TestIRInterpreter.py (1034 of 1202)
PASS: lldb-api :: functionalities/pre_run_dylibs/TestPreRunDylibs.py (1035 of 1202)
UNSUPPORTED: lldb-api :: functionalities/postmortem/netbsd-core/TestNetBSDCore.py (1036 of 1202)
UNSUPPORTED: lldb-shell :: Reproducer/TestDiscard.test (1037 of 1202)
PASS: lldb-api :: lang/c/struct_types/TestStructTypes.py (1038 of 1202)
PASS: lldb-api :: commands/frame/diagnose/virtual-method-call/TestDiagnoseDereferenceVirtualMethodCall.py (1039 of 1202)
PASS: lldb-api :: functionalities/testid/TestTestId.py (1040 of 1202)
PASS: lldb-api :: lang/c/conflicting-symbol/TestConflictingSymbol.py (1041 of 1202)
UNSUPPORTED: lldb-api :: commands/process/launch/TestProcessLaunch.py (1042 of 1202)
PASS: lldb-api :: lang/objc/objc-static-method/TestObjCStaticMethod.py (1043 of 1202)
UNSUPPORTED: lldb-api :: commands/expression/import-std-module/shared_ptr/TestSharedPtrFromStdModule.py (1044 of 1202)
PASS: lldb-api :: functionalities/data-formatter/data-formatter-stl/libcxx/vector/TestDataFormatterLibcxxVector.py (1045 of 1202)
UNSUPPORTED: lldb-api :: functionalities/load_using_paths/TestLoadUsingPaths.py (1046 of 1202)
PASS: lldb-shell :: Unwind/trap_frame_sym_ctx.test (1047 of 1202)
UNSUPPORTED: lldb-shell :: Reproducer/TestCrash.test (1048 of 1202)
PASS: lldb-shell :: SymbolFile/DWARF/win-i386-line-table.s (1049 of 1202)
PASS: lldb-api :: terminal/TestSTTYBeforeAndAfter.py (1050 of 1202)
PASS: lldb-api :: lang/cpp/const_this/TestConstThis.py (1051 of 1202)
PASS: lldb-api :: functionalities/gdb_remote_client/TestNoWatchpointSupportInfo.py (1052 of 1202)
PASS: lldb-shell :: Minidump/dump-all.test (1053 of 1202)
PASS: lldb-api :: commands/expression/static-initializers/TestStaticInitializers.py (1054 of 1202)
PASS: lldb-api :: commands/expression/anonymous-struct/TestCallUserAnonTypedef.py (1055 of 1202)
UNSUPPORTED: lldb-api :: functionalities/thread/thread_specific_break_plus_condition/TestThreadSpecificBpPlusCondition.py (1056 of 1202)
PASS: lldb-api :: tools/lldb-server/TestAppleSimulatorOSType.py (1057 of 1202)
PASS: lldb-api :: functionalities/breakpoint/cpp/TestCPPBreakpointLocations.py (1058 of 1202)
PASS: lldb-shell :: SymbolFile/NativePDB/global-classes.cpp (1059 of 1202)
PASS: lldb-api :: lang/c/inlines/TestRedefinitionsInInlines.py (1060 of 1202)
PASS: lldb-api :: iohandler/unicode/TestUnicode.py (1061 of 1202)
PASS: lldb-api :: functionalities/inferior-crashing/recursive-inferior/TestRecursiveInferior.py (1062 of 1202)
PASS: lldb-shell :: ObjectFile/PECOFF/disassemble-thumb.yaml (1063 of 1202)
PASS: lldb-shell :: SymbolFile/DWARF/debug_loc_and_loclists.s (1064 of 1202)
PASS: lldb-api :: functionalities/multiword-commands/TestMultiWordCommands.py (1065 of 1202)
PASS: lldb-api :: commands/disassemble/basic/TestFrameDisassemble.py (1066 of 1202)
PASS: lldb-api :: lang/objc/conflicting-definition/TestConflictingDefinition.py (1067 of 1202)
PASS: lldb-api :: lang/cpp/class_types/TestClassTypesDisassembly.py (1068 of 1202)
PASS: lldb-api :: types/TestFloatTypesExpr.py (1069 of 1202)
PASS: lldb-shell :: SymbolFile/DWARF/debug-types-address-ranges.s (1070 of 1202)
PASS: lldb-api :: functionalities/data-formatter/parray/TestPrintArray.py (1071 of 1202)
PASS: lldb-shell :: Driver/TestProcessAttach.test (1072 of 1202)
UNSUPPORTED: lldb-shell :: Register/aarch64-fp-read.test (1073 of 1202)
PASS: lldb-api :: functionalities/memory/find/TestMemoryFind.py (1074 of 1202)
PASS: lldb-api :: functionalities/thread/ignore_suspended/TestIgnoreSuspendedThread.py (1075 of 1202)
UNSUPPORTED: lldb-api :: functionalities/darwin_log/source/debug/TestDarwinLogSourceDebug.py (1076 of 1202)
PASS: lldb-api :: tools/lldb-server/TestGdbRemoteSingleStep.py (1077 of 1202)
PASS: lldb-api :: functionalities/breakpoint/breakpoint_locations/TestBreakpointLocations.py (1078 of 1202)
PASS: lldb-api :: functionalities/abbreviation/TestCommonShortSpellings.py (1079 of 1202)
PASS: lldb-api :: functionalities/data-formatter/data-formatter-objc/TestDataFormatterObjCPlain.py (1080 of 1202)
PASS: lldb-shell :: SymbolFile/Breakpad/line-table-mixed-path-styles.test (1081 of 1202)
PASS: lldb-api :: functionalities/data-formatter/data-formatter-objc/TestDataFormatterObjCNSData.py (1082 of 1202)
PASS: lldb-api :: functionalities/thread/concurrent_events/TestConcurrentTwoWatchpointThreads.py (1083 of 1202)
PASS: lldb-shell :: Minidump/fb-dump.test (1084 of 1202)
PASS: lldb-api :: functionalities/memory/read/TestMemoryRead.py (1085 of 1202)
PASS: lldb-shell :: Unwind/eh-frame-dwarf-unwind.test (1086 of 1202)
UNSUPPORTED: lldb-shell :: Register/aarch64-gp-read.test (1087 of 1202)
PASS: lldb-api :: functionalities/data-formatter/nssetsynth/TestNSSetSynthetic.py (1088 of 1202)
PASS: lldb-api :: functionalities/data-formatter/data-formatter-stl/libcxx/list/TestDataFormatterLibcxxList.py (1089 of 1202)
PASS: lldb-api :: commands/expression/fixits/TestFixIts.py (1090 of 1202)
UNSUPPORTED: lldb-api :: commands/expression/import-std-module/list/TestListFromStdModule.py (1091 of 1202)
PASS: lldb-shell :: SymbolFile/DWARF/debug-types-basic.test (1092 of 1202)
PASS: lldb-shell :: SymbolFile/DWARF/parallel-indexing-stress.s (1093 of 1202)
PASS: lldb-api :: lang/objc/self/TestObjCSelf.py (1094 of 1202)
PASS: lldb-api :: functionalities/tail_call_frames/unambiguous_sequence/TestUnambiguousTailCalls.py (1095 of 1202)
PASS: lldb-shell :: Minidump/Windows/broken-unwind.test (1096 of 1202)
PASS: lldb-api :: lang/c/stepping/TestStepAndBreakpoints.py (1097 of 1202)
PASS: lldb-shell :: Breakpoint/split-dwarf5-debug-stroffsets.test (1098 of 1202)
PASS: lldb-api :: tools/lldb-server/inferior-crash/TestGdbRemoteAbort.py (1099 of 1202)
UNSUPPORTED: lldb-shell :: ScriptInterpreter/Lua/io.test (1100 of 1202)
UNSUPPORTED: lldb-api :: tools/lldb-vscode/variables/TestVSCode_variables.py (1101 of 1202)
PASS: lldb-shell :: ObjectFile/PECOFF/basic-info-arm.yaml (1102 of 1202)
PASS: lldb-shell :: SymbolFile/DWARF/debug-types-missing-signature.test (1103 of 1202)
PASS: lldb-api :: functionalities/exec/TestExec.py (1104 of 1202)
UNSUPPORTED: lldb-shell :: Reproducer/TestDriverOptions.test (1105 of 1202)
UNSUPPORTED: lldb-api :: benchmarks/expression/TestRepeatedExprs.py (1106 of 1202)
UNSUPPORTED: lldb-api :: commands/expression/import-std-module/unique_ptr-dbg-info-content/TestUniquePtrDbgInfoContent.py (1107 of 1202)
PASS: lldb-api :: commands/target/create-deps/TestTargetCreateDeps.py (1108 of 1202)
PASS: lldb-api :: functionalities/breakpoint/consecutive_breakpoints/TestConsecutiveBreakpoints.py (1109 of 1202)
PASS: lldb-shell :: SymbolFile/DWARF/module-ownership.mm (1110 of 1202)
PASS: lldb-api :: lang/cpp/static_methods/TestCPPStaticMethods.py (1111 of 1202)
PASS: lldb-api :: functionalities/breakpoint/breakpoint_command/TestBreakpointCommand.py (1112 of 1202)
PASS: lldb-api :: lang/objc/rdar-10967107/TestRdar10967107.py (1113 of 1202)
PASS: lldb-shell :: SymbolFile/DWARF/find-method-local-struct.cpp (1114 of 1202)
PASS: lldb-api :: tools/lldb-server/TestGdbRemoteHostInfo.py (1115 of 1202)
PASS: lldb-shell :: ObjectFile/PECOFF/dep-modules.yaml (1116 of 1202)
PASS: lldb-shell :: Settings/TestFrameFormatNoColor.test (1117 of 1202)
PASS: lldb-api :: lang/cpp/virtual-overload/TestVirtualOverload.py (1118 of 1202)
PASS: lldb-api :: lang/cpp/stl/TestSTL.py (1119 of 1202)
PASS: lldb-shell :: Breakpoint/single-file-split-dwarf.test (1120 of 1202)
PASS: lldb-api :: functionalities/thread/concurrent_events/TestConcurrentManyWatchpoints.py (1121 of 1202)
PASS: lldb-api :: functionalities/thread/concurrent_events/TestConcurrentWatchBreak.py (1122 of 1202)
PASS: lldb-api :: lang/cpp/operators/TestCppOperators.py (1123 of 1202)
PASS: lldb-api :: lang/c/anonymous/TestAnonymous.py (1124 of 1202)
PASS: lldb-api :: lang/cpp/class_types/TestClassTypes.py (1125 of 1202)
PASS: lldb-shell :: SymbolFile/DWARF/split-dwarf-inlining.cpp (1126 of 1202)
PASS: lldb-api :: lang/cpp/diamond/TestDiamond.py (1127 of 1202)
UNSUPPORTED: lldb-api :: tools/lldb-vscode/breakpoint/TestVSCode_setBreakpoints.py (1128 of 1202)
PASS: lldb-api :: commands/command/invalid-args/TestInvalidArgsCommand.py (1129 of 1202)
PASS: lldb-api :: commands/watchpoints/watchpoint_set_command/TestWatchLocationWithWatchSet.py (1130 of 1202)
PASS: lldb-api :: functionalities/ptr_refs/TestPtrRefs.py (1131 of 1202)
PASS: lldb-api :: lang/cpp/dynamic-value/TestCppValueCast.py (1132 of 1202)
PASS: lldb-api :: types/TestRecursiveTypes.py (1133 of 1202)
UNSUPPORTED: lldb-shell :: ScriptInterpreter/Lua/independent_state.test (1134 of 1202)
UNSUPPORTED: lldb-shell :: ExecControl/StopHook/stop-hook-threads.test (1135 of 1202)
PASS: lldb-api :: types/TestShortTypeExpr.py (1136 of 1202)
PASS: lldb-api :: lang/objc/foundation/TestObjCMethodsNSError.py (1137 of 1202)
PASS: lldb-api :: lang/objcxx/hide-runtime-values/TestObjCXXHideRuntimeValues.py (1138 of 1202)
PASS: lldb-api :: functionalities/pointer_num_children/TestPointerNumChildren.py (1139 of 1202)
PASS: lldb-shell :: SymbolFile/DWARF/debug_loc-aslr.s (1140 of 1202)
PASS: lldb-api :: functionalities/data-formatter/data-formatter-objc/nsindexpath/TestDataFormatterNSIndexPath.py (1141 of 1202)
PASS: lldb-api :: functionalities/breakpoint/debugbreak/TestDebugBreak.py (1142 of 1202)
PASS: lldb-shell :: SymbolFile/DWARF/debug-line-basic.s (1143 of 1202)
PASS: lldb-api :: types/TestLongTypes.py (1144 of 1202)
UNSUPPORTED: lldb-api :: functionalities/process_save_core/TestProcessSaveCore.py (1145 of 1202)
UNSUPPORTED: lldb-api :: commands/expression/import-std-module/weak_ptr/TestWeakPtrFromStdModule.py (1146 of 1202)
PASS: lldb-api :: functionalities/thread/concurrent_events/TestConcurrentCrashWithSignal.py (1147 of 1202)
PASS: lldb-shell :: Quit/TestQuitExitCodeNonInt.test (1148 of 1202)
UNSUPPORTED: lldb-api :: tools/lldb-server/TestGdbRemoteModuleInfo.py (1149 of 1202)
PASS: lldb-api :: commands/process/signal/TestProcessSignal.py (1150 of 1202)
PASS: lldb-api :: lang/cpp/trivial_abi/TestTrivialABI.py (1151 of 1202)
PASS: lldb-api :: functionalities/fat_archives/TestFatArchives.py (1152 of 1202)
PASS: lldb-api :: linux/builtin_trap/TestBuiltinTrap.py (1153 of 1202)
PASS: lldb-shell :: ObjectFile/ELF/short-build-id.yaml (1154 of 1202)
UNSUPPORTED: lldb-api :: tools/lldb-server/platform-process-connect/TestPlatformProcessConnect.py (1155 of 1202)
PASS: lldb-api :: functionalities/thread/jump/TestThreadJump.py (1156 of 1202)
PASS: lldb-api :: macosx/DBGSourcePathRemapping/TestDSYMSourcePathRemapping.py (1157 of 1202)
PASS: lldb-api :: functionalities/gdb_remote_client/TestRecognizeBreakpoint.py (1158 of 1202)
PASS: lldb-api :: functionalities/breakpoint/breakpoint_command/TestRegexpBreakCommand.py (1159 of 1202)
UNSUPPORTED: lldb-shell :: Register/x86-64-ymm-read.test (1160 of 1202)
PASS: lldb-shell :: Heap/heap-cstr.test (1161 of 1202)
PASS: lldb-api :: functionalities/data-formatter/data-formatter-objc/TestDataFormatterObjCKVO.py (1162 of 1202)
UNSUPPORTED: lldb-api :: commands/expression/import-std-module/stack/TestStackFromStdModule.py (1163 of 1202)
PASS: lldb-api :: commands/platform/basic/TestPlatformPython.py (1164 of 1202)
UNSUPPORTED: lldb-api :: commands/expression/unwind_expression/TestUnwindExpression.py (1165 of 1202)
PASS: lldb-api :: lang/cpp/dynamic-value/TestDynamicValue.py (1166 of 1202)
PASS: lldb-api :: commands/expression/vector_of_enums/TestVectorOfEnums.py (1167 of 1202)
UNSUPPORTED: lldb-shell :: SymbolFile/PDB/function-level-linking.test (1168 of 1202)
UNSUPPORTED: lldb-api :: functionalities/breakpoint/breakpoint_in_delayslot/TestAvoidBreakpointInDelaySlot.py (1169 of 1202)
PASS: lldb-api :: functionalities/conditional_break/TestConditionalBreak.py (1170 of 1202)
PASS: lldb-api :: lang/cpp/class_static/TestStaticVariables.py (1171 of 1202)
PASS: lldb-api :: functionalities/data-formatter/summary-string-onfail/Test-rdar-9974002.py (1172 of 1202)
PASS: lldb-api :: lang/objc/modules-hash-mismatch/TestClangModulesHashMismatch.py (1173 of 1202)
PASS: lldb-api :: functionalities/data-formatter/pyobjsynthprovider/TestPyObjSynthProvider.py (1174 of 1202)
UNSUPPORTED: lldb-api :: functionalities/darwin_log/filter/regex/activity-chain/TestDarwinLogFilterRegexActivityChain.py (1175 of 1202)
UNSUPPORTED: lldb-shell :: SymbolFile/NativePDB/stack_unwinding01.cpp (1176 of 1202)
PASS: lldb-api :: functionalities/breakpoint/breakpoint_by_line_and_column/TestBreakpointByLineAndColumn.py (1177 of 1202)
UNSUPPORTED: lldb-shell :: SymbolFile/PDB/expressions.test (1178 of 1202)
UNSUPPORTED: lldb-shell :: Register/arm-fp-read.test (1179 of 1202)
PASS: lldb-shell :: SymbolFile/symbol-binding.test (1180 of 1202)
PASS: lldb-api :: commands/settings/use_source_cache/TestUseSourceCache.py (1181 of 1202)
PASS: lldb-api :: functionalities/thread/concurrent_events/TestConcurrentWatchBreakDelay.py (1182 of 1202)
PASS: lldb-api :: lang/cpp/namespace/TestNamespaceLookup.py (1183 of 1202)
UNSUPPORTED: lldb-api :: commands/expression/import-std-module/deque-dbg-info-content/TestDbgInfoContentDequeFromStdModule.py (1184 of 1202)
PASS: lldb-shell :: ObjectFile/Breakpad/sections-trailing-func.test (1185 of 1202)
PASS: lldb-api :: lang/cpp/rvalue-references/TestRvalueReferences.py (1186 of 1202)
UNSUPPORTED: lldb-api :: tools/lldb-vscode/coreFile/TestVSCode_coreFile.py (1187 of 1202)
PASS: lldb-api :: functionalities/breakpoint/address_breakpoints/TestAddressBreakpoints.py (1188 of 1202)
PASS: lldb-api :: commands/expression/context-object/TestContextObject.py (1189 of 1202)
PASS: lldb-api :: commands/expression/inline-namespace/TestInlineNamespace.py (1190 of 1202)
PASS: lldb-api :: lang/objc/forward-decl/TestForwardDecl.py (1191 of 1202)
PASS: lldb-api :: python_api/sbvalue_const_addrof/TestSBValueConstAddrOf.py (1192 of 1202)
PASS: lldb-api :: functionalities/data-formatter/data-formatter-stl/libcxx/multimap/TestDataFormatterLibccMultiMap.py (1193 of 1202)
PASS: lldb-api :: functionalities/tail_call_frames/ambiguous_tail_call_seq1/TestAmbiguousTailCallSeq1.py (1194 of 1202)
PASS: lldb-api :: commands/target/basic/TestTargetCommand.py (1195 of 1202)
PASS: lldb-api :: functionalities/gdb_remote_client/TestGDBRemoteLoad.py (1196 of 1202)
PASS: lldb-api :: lang/cpp/virtual-functions/TestCppVirtualFunctions.py (1197 of 1202)
PASS: lldb-api :: python_api/lldbutil/iter/TestLLDBIterator.py (1198 of 1202)
UNSUPPORTED: lldb-api :: functionalities/gdb_remote_client/TestWriteMemory.py (1199 of 1202)
PASS: lldb-api :: tools/lldb-server/TestGdbRemoteThreadsInStopReply.py (1200 of 1202)
PASS: lldb-api :: lang/cpp/enum_types/TestCPP11EnumTypes.py (1201 of 1202)
PASS: lldb-api :: functionalities/gdb_remote_client/TestGDBRemoteClient.py (1202 of 1202)
Slowest Tests:
--------------------------------------------------------------------------
180.74s: lldb-api :: functionalities/gdb_remote_client/TestGDBRemoteClient.py
87.43s: lldb-api :: tools/lldb-server/TestLldbGdbServer.py
79.33s: lldb-api :: lang/objc/foundation/TestFoundationDisassembly.py
69.78s: lldb-api :: lang/objc/foundation/TestObjCMethods.py
61.55s: lldb-api :: api/multithreaded/TestMultithreaded.py
61.48s: lldb-api :: lang/objc/exceptions/TestObjCExceptions.py
60.65s: lldb-api :: functionalities/gdb_remote_client/TestGDBRemoteLoad.py
60.64s: lldb-api :: functionalities/gdb_remote_client/TestProcessConnect.py
52.51s: lldb-api :: types/TestLongTypesExpr.py
52.15s: lldb-api :: lang/cpp/enum_types/TestCPP11EnumTypes.py
49.81s: lldb-api :: lang/objc/objc-new-syntax/TestObjCNewSyntaxLiteral.py
48.97s: lldb-api :: lang/objc/hidden-ivars/TestHiddenIvars.py
47.94s: lldb-api :: lang/cpp/namespace/TestNamespaceLookup.py
43.14s: lldb-api :: lang/objc/real-definition/TestRealDefinition.py
39.10s: lldb-api :: lang/objc/foundation/TestObjCMethodsString.py
39.05s: lldb-api :: lang/objc/objc-new-syntax/TestObjCNewSyntaxDictionary.py
38.55s: lldb-api :: lang/objc/objc-new-syntax/TestObjCNewSyntaxArray.py
37.30s: lldb-api :: functionalities/recursion/TestValueObjectRecursion.py
35.19s: lldb-api :: lang/objc/foundation/TestObjCMethodsNSError.py
34.29s: lldb-api :: types/TestLongTypes.py

Hide Details

Tests Times: -------------------------------------------------------------------------- [ Range ] :: [ Percentage ] :: [ Count ] -------------------------------------------------------------------------- [180s,190s) :: [ ] :: [ 1/1202] [170s,180s) :: [ ] :: [ 0/1202] [160s,170s) :: [ ] :: [ 0/1202] [150s,160s) :: [ ] :: [ 0/1202] [140s,150s) :: [ ] :: [ 0/1202] [130s,140s) :: [ ] :: [ 0/1202] [120s,130s) :: [ ] :: [ 0/1202] [110s,120s) :: [ ] :: [ 0/1202] [100s,110s) :: [ ] :: [ 0/1202] [ 90s,100s) :: [ ] :: [ 1/1202] [ 80s, 90s) :: [ ] :: [ 1/1202] [ 70s, 80s) :: [ ] :: [ 1/1202] [ 60s, 70s) :: [ ] :: [ 4/1202] [ 50s, 60s) :: [ ] :: [ 5/1202] [ 40s, 50s) :: [ ] :: [ 4/1202] [ 30s, 40s) :: [ ] :: [ 9/1202] [ 20s, 30s) :: [ ] :: [ 23/1202] [ 10s, 20s) :: [**** ] :: [ 140/1202] [ 0s, 10s) :: [********************************* ] :: [1013/1202] --------------------------------------------------------------------------

Hide Details

Testing Time: 507.54s Unsupported : 262 Passed : 934 Expectedly Failed: 6 [182/183] cd /Users/buildslave/jenkins/workspace/lldb-cmake-reproducers/lldb-build/tools/lldb/test && /usr/local/Frameworks/Python.framework/Versions/3.7/bin/python3.7 /Users/buildslave/jenkins/workspace/lldb-cmake-reproducers/lldb-build/./bin/llvm-lit -v --time-tests --shuffle --xunit-xml-output=/Users/buildslave/jenkins/workspace/lldb-cmake-reproducers/test/results.xml -v --param lldb-run-with-repro=replay /Users/buildslave/jenkins/workspace/lldb-cmake-reproducers/lldb-build/tools/lldb/test/API /Users/buildslave/jenkins/workspace/lldb-cmake-reproducers/lldb-build/tools/lldb/test/Shell Deleting module cache at /Users/buildslave/jenkins/workspace/lldb-cmake-reproducers/lldb-build/lldb-test-build.noindex/module-cache-clang/lldb-api. Deleting module cache at /Users/buildslave/jenkins/workspace/lldb-cmake-reproducers/lldb-build/lldb-test-build.noindex/module-cache-lldb/lldb-api. -- Testing: 1202 tests, 16 workers -- llvm-lit: /Users/buildslave/jenkins/workspace/lldb-cmake-reproducers/llvm-project/lldb/test/API/lit.cfg.py:125: note: Running API tests in replay mode. llvm-lit: /Users/buildslave/jenkins/workspace/lldb-cmake-reproducers/llvm-project/lldb/test/Shell/lit.cfg.py:52: note: Running Shell tests in replay mode. llvm-lit: /Users/buildslave/jenkins/workspace/lldb-cmake-reproducers/llvm-project/lldb/test/Shell/helper/toolchain.py:115: note: using SDKROOT: '/Applications/Xcode.app/Contents/Developer/Platforms/MacOSX.platform/Developer/SDKs/MacOSX.sdk' llvm-lit: /Users/buildslave/jenkins/workspace/lldb-cmake-reproducers/lldb-build/bin/../../llvm-project/llvm/utils/lit/lit/llvm/config.py:345: note: using clang: /Users/buildslave/jenkins/workspace/lldb-cmake-reproducers/lldb-build/bin/clang llvm-lit: /Users/buildslave/jenkins/workspace/lldb-cmake-reproducers/lldb-build/bin/../../llvm-project/llvm/utils/lit/lit/llvm/config.py:345: note: using ld.lld: /Users/buildslave/jenkins/workspace/lldb-cmake-reproducers/lldb-build/bin/ld.lld llvm-lit: /Users/buildslave/jenkins/workspace/lldb-cmake-reproducers/lldb-build/bin/../../llvm-project/llvm/utils/lit/lit/llvm/config.py:345: note: using lld-link: /Users/buildslave/jenkins/workspace/lldb-cmake-reproducers/lldb-build/bin/lld-link llvm-lit: /Users/buildslave/jenkins/workspace/lldb-cmake-reproducers/lldb-build/bin/../../llvm-project/llvm/utils/lit/lit/llvm/config.py:345: note: using ld64.lld: /Users/buildslave/jenkins/workspace/lldb-cmake-reproducers/lldb-build/bin/ld64.lld llvm-lit: /Users/buildslave/jenkins/workspace/lldb-cmake-reproducers/lldb-build/bin/../../llvm-project/llvm/utils/lit/lit/llvm/config.py:345: note: using wasm-ld: /Users/buildslave/jenkins/workspace/lldb-cmake-reproducers/lldb-build/bin/wasm-ld PASS: lldb-shell :: ObjectFile/ELF/aarch64-relocations.yaml (1 of 1202) PASS: lldb-shell :: Settings/TestDisassemblyFormat.test (2 of 1202) PASS: lldb-shell :: SymbolFile/DWARF/debug_line-tombstone.s (3 of 1202) PASS: lldb-shell :: SymbolFile/DWARF/find-method.cpp (4 of 1202) PASS: lldb-shell :: SymbolFile/DWARF/dwo-type-in-main-file.s (5 of 1202) UNSUPPORTED: lldb-shell :: Driver/LocalLLDBInit.test (6 of 1202) UNSUPPORTED: lldb-api :: commands/expression/import-std-module/queue/TestQueueFromStdModule.py (7 of 1202) UNSUPPORTED: lldb-api :: commands/expression/import-std-module/list/TestListFromStdModule.py (8 of 1202) UNSUPPORTED: lldb-api :: commands/watchpoints/multi_watchpoint_slots/TestWatchpointMultipleSlots.py (9 of 1202) UNSUPPORTED: lldb-api :: macosx/profile_vrs_detach/TestDetachVrsProfile.py (10 of 1202) UNSUPPORTED: lldb-api :: commands/session/save/TestSessionSave.py (11 of 1202) UNSUPPORTED: lldb-api :: python_api/process/io/TestProcessIO.py (12 of 1202) PASS: lldb-api :: functionalities/show_location/TestShowLocationDwarf5.py (13 of 1202) PASS: lldb-api :: lang/c/local_types/TestUseClosestType.py (14 of 1202) PASS: lldb-api :: functionalities/source-map/TestTargetSourceMap.py (15 of 1202) UNSUPPORTED: lldb-shell :: Register/x86-64-gp-write.test (16 of 1202) UNSUPPORTED: lldb-api :: commands/expression/call-restarts/TestCallThatRestarts.py (17 of 1202) UNSUPPORTED: lldb-shell :: SymbolFile/PDB/func-symbols.test (18 of 1202) PASS: lldb-shell :: SymbolFile/DWARF/debug-types-address-ranges.s (19 of 1202) PASS: lldb-api :: functionalities/breakpoint/source_regexp/TestSourceRegexBreakpoints.py (20 of 1202) PASS: lldb-api :: functionalities/breakpoint/address_breakpoints/TestBadAddressBreakpoints.py (21 of 1202) PASS: lldb-shell :: SymbolFile/DWARF/anon_class_w_and_wo_export_symbols.ll (22 of 1202) PASS: lldb-api :: functionalities/thread/concurrent_events/TestConcurrentSignalDelayWatch.py (23 of 1202) PASS: lldb-api :: functionalities/thread/concurrent_events/TestConcurrentTwoBreakpointsOneSignal.py (24 of 1202) PASS: lldb-api :: functionalities/thread/concurrent_events/TestConcurrentSignalNWatchNBreak.py (25 of 1202) PASS: lldb-shell :: SymbolFile/Breakpad/symtab.test (26 of 1202) UNSUPPORTED: lldb-api :: commands/command/script/TestCommandScript.py (27 of 1202) UNSUPPORTED: lldb-api :: commands/expression/import-std-module/vector-dbg-info-content/TestDbgInfoContentVectorFromStdModule.py (28 of 1202) PASS: lldb-shell :: ObjectFile/ELF/many-sections.s (29 of 1202) PASS: lldb-shell :: ObjectFile/MachO/lc_build_version.yaml (30 of 1202) PASS: lldb-shell :: Settings/TestLineMarkerColor.test (31 of 1202) PASS: lldb-shell :: SymbolFile/Breakpad/line-table.test (32 of 1202) PASS: lldb-shell :: ObjectFile/ELF/gnu-debuglink.yaml (33 of 1202) XFAIL: lldb-shell :: Register/x86-64-write.test (34 of 1202) PASS: lldb-api :: functionalities/thread/concurrent_events/TestConcurrentTwoWatchpointThreads.py (35 of 1202) PASS: lldb-api :: commands/expression/cast_int_to_anonymous_enum/TestCastIntToAnonymousEnum.py (36 of 1202) PASS: lldb-api :: commands/source/info/TestSourceInfo.py (37 of 1202) PASS: lldb-api :: functionalities/data-formatter/var-in-aggregate-misuse/TestVarInAggregateMisuse.py (38 of 1202) PASS: lldb-api :: lang/cpp/scope/TestCppScope.py (39 of 1202) PASS: lldb-api :: functionalities/data-formatter/data-formatter-script/TestDataFormatterScript.py (40 of 1202) PASS: lldb-api :: lang/cpp/unique-types/TestUniqueTypes.py (41 of 1202) PASS: lldb-api :: functionalities/tail_call_frames/inlining_and_tail_calls/TestInliningAndTailCalls.py (42 of 1202) PASS: lldb-api :: lang/objc/foundation/TestSymbolTable.py (43 of 1202) PASS: lldb-shell :: SymbolFile/NativePDB/disassembly.cpp (44 of 1202) PASS: lldb-api :: lang/cpp/symbols/TestSymbols.py (45 of 1202) UNSUPPORTED: lldb-shell :: SymbolFile/NativePDB/local-variables.cpp (46 of 1202) PASS: lldb-api :: functionalities/unwind/sigtramp/TestSigtrampUnwind.py (47 of 1202) PASS: lldb-api :: macosx/find-app-in-bundle/TestFindAppInBundle.py (48 of 1202) PASS: lldb-shell :: SymbolFile/NativePDB/break-by-function.cpp (49 of 1202) UNSUPPORTED: lldb-api :: tools/lldb-vscode/attach/TestVSCode_attach.py (50 of 1202) PASS: lldb-api :: lang/objc/modules-app-update/TestClangModulesAppUpdate.py (51 of 1202) PASS: lldb-shell :: ObjectFile/PECOFF/section-types.yaml (52 of 1202) PASS: lldb-api :: commands/expression/call-function/TestCallStopAndContinue.py (53 of 1202) PASS: lldb-shell :: Driver/TestTarget.test (54 of 1202) PASS: lldb-shell :: SymbolFile/NativePDB/ast-methods.cpp (55 of 1202) PASS: lldb-api :: macosx/order/TestOrderFile.py (56 of 1202) UNSUPPORTED: lldb-shell :: Breakpoint/case-insensitive.test (57 of 1202) PASS: lldb-api :: lang/cpp/constructors/TestCppConstructors.py (58 of 1202) PASS: lldb-api :: commands/platform/process/list/TestProcessList.py (59 of 1202) PASS: lldb-api :: functionalities/data-formatter/data-formatter-stl/libcxx/string/TestDataFormatterLibcxxString.py (60 of 1202) PASS: lldb-shell :: Driver/TestProcessAttach.test (61 of 1202) PASS: lldb-api :: functionalities/recursion/TestValueObjectRecursion.py (62 of 1202) PASS: lldb-api :: functionalities/data-formatter/data-formatter-stl/libcxx/map/TestDataFormatterLibccMap.py (63 of 1202) PASS: lldb-shell :: Commands/command-regex-unalias.test (64 of 1202) PASS: lldb-api :: lang/c/conflicting-symbol/TestConflictingSymbol.py (65 of 1202) UNSUPPORTED: lldb-shell :: Register/x86-64-xmm16-read.test (66 of 1202) PASS: lldb-api :: commands/process/attach/TestProcessAttach.py (67 of 1202) UNSUPPORTED: lldb-shell :: SymbolFile/NativePDB/stack_unwinding01.cpp (68 of 1202) PASS: lldb-api :: functionalities/thread/concurrent_events/TestConcurrentWatchBreak.py (69 of 1202) PASS: lldb-api :: commands/expression/completion-crash-incomplete-record/TestCompletionCrashIncompleteRecord.py (70 of 1202) PASS: lldb-shell :: BuildScript/compiler-full-path.test (71 of 1202) PASS: lldb-api :: functionalities/tsan/multiple/TestTsanMultiple.py (72 of 1202) PASS: lldb-api :: functionalities/breakpoint/hardware_breakpoints/require_hw_breakpoints/TestRequireHWBreakpoints.py (73 of 1202) UNSUPPORTED: lldb-shell :: SymbolFile/PDB/function-level-linking.test (74 of 1202) PASS: lldb-api :: functionalities/thread/concurrent_events/TestConcurrentTwoBreakpointsOneWatchpoint.py (75 of 1202) PASS: lldb-api :: lang/cpp/static_methods/TestCPPStaticMethods.py (76 of 1202) PASS: lldb-shell :: SymbolFile/DWARF/debug_loc_and_loclists.s (77 of 1202) PASS: lldb-api :: functionalities/data-formatter/data-formatter-synthtype/TestDataFormatterSynthType.py (78 of 1202) UNSUPPORTED: lldb-api :: linux/add-symbols/TestTargetSymbolsAddCommand.py (79 of 1202) UNSUPPORTED: lldb-api :: api/multiple-debuggers/TestMultipleDebuggers.py (80 of 1202) PASS: lldb-shell :: SymbolFile/Breakpad/unwind-via-stack-win.test (81 of 1202) PASS: lldb-shell :: SymbolFile/NativePDB/source-list.cpp (82 of 1202) PASS: lldb-api :: lang/cpp/function_refs/TestFunctionRefs.py (83 of 1202) UNSUPPORTED: lldb-shell :: Reproducer/TestRelativePath.test (84 of 1202) PASS: lldb-api :: macosx/load-kext/TestLoadKext.py (85 of 1202) PASS: lldb-api :: functionalities/postmortem/elf-core/TestLinuxCore.py (86 of 1202) PASS: lldb-api :: lang/c/find_struct_type/TestFindStructTypes.py (87 of 1202) PASS: lldb-api :: lang/c/set_values/TestSetValues.py (88 of 1202) PASS: lldb-shell :: Settings/TestDisableColor.test (89 of 1202) UNSUPPORTED: lldb-api :: functionalities/thread/break_after_join/TestBreakAfterJoin.py (90 of 1202) PASS: lldb-api :: lang/cpp/namespace_conflicts/TestNamespaceConflicts.py (91 of 1202) PASS: lldb-api :: functionalities/memory/read/TestMemoryRead.py (92 of 1202) PASS: lldb-api :: functionalities/thread/exit_during_break/TestExitDuringBreak.py (93 of 1202) PASS: lldb-api :: functionalities/thread/exit_during_step/TestExitDuringStep.py (94 of 1202) PASS: lldb-api :: lang/objc/direct-dispatch-step/TestObjCDirectDispatchStepping.py (95 of 1202) PASS: lldb-api :: functionalities/breakpoint/global_constructor/TestBreakpointInGlobalConstructor.py (96 of 1202) PASS: lldb-api :: commands/session/history/TestSessionHistory.py (97 of 1202) UNSUPPORTED: lldb-shell :: ScriptInterpreter/Python/crashlog.test (98 of 1202) UNSUPPORTED: lldb-api :: functionalities/load_using_paths/TestLoadUsingPaths.py (99 of 1202) PASS: lldb-api :: api/multiple-targets/TestMultipleTargets.py (100 of 1202) PASS: lldb-shell :: Driver/TestConvenienceVariables.test (101 of 1202) PASS: lldb-api :: functionalities/plugins/command_plugin/TestPluginCommands.py (102 of 1202) PASS: lldb-api :: functionalities/ubsan/user-expression/TestUbsanUserExpression.py (103 of 1202) PASS: lldb-api :: functionalities/thread/concurrent_events/TestConcurrentCrashWithSignal.py (104 of 1202) UNSUPPORTED: lldb-api :: functionalities/longjmp/TestLongjmp.py (105 of 1202) UNSUPPORTED: lldb-shell :: SymbolFile/PDB/ast-restore.test (106 of 1202) PASS: lldb-api :: functionalities/dlopen_other_executable/TestDlopenOtherExecutable.py (107 of 1202) PASS: lldb-api :: lang/c/register_variables/TestRegisterVariables.py (108 of 1202) PASS: lldb-api :: commands/target/create-deps/TestTargetCreateDeps.py (109 of 1202) PASS: lldb-shell :: SymbolFile/DWARF/apple-index-is-used.cpp (110 of 1202) UNSUPPORTED: lldb-api :: tools/lldb-vscode/console/TestVSCode_console.py (111 of 1202) UNSUPPORTED: lldb-api :: benchmarks/expression/TestRepeatedExprs.py (112 of 1202) PASS: lldb-shell :: SymbolFile/DWARF/debug_rnglists.s (113 of 1202) PASS: lldb-api :: types/TestDoubleTypes.py (114 of 1202) PASS: lldb-api :: functionalities/gdb_remote_client/TestNoGPacketSupported.py (115 of 1202) PASS: lldb-api :: functionalities/data-formatter/data-formatter-stl/libcxx/atomic/TestLibCxxAtomic.py (116 of 1202) UNSUPPORTED: lldb-shell :: Quit/TestQuitExitCode-30.test (117 of 1202) PASS: lldb-api :: functionalities/plugins/python_os_plugin/stepping_plugin_threads/TestOSPluginStepping.py (118 of 1202) PASS: lldb-shell :: SymbolFile/NativePDB/function-types-builtins.cpp (119 of 1202) UNSUPPORTED: lldb-shell :: ObjectFile/ELF/minidebuginfo-set-and-hit-breakpoint.test (120 of 1202) PASS: lldb-api :: commands/expression/po_verbosity/TestPoVerbosity.py (121 of 1202) UNSUPPORTED: lldb-shell :: SymbolFile/DWARF/debug-types-expressions.test (122 of 1202) PASS: lldb-shell :: SymbolFile/DWARF/dwarf5-atomic.s (123 of 1202) PASS: lldb-api :: functionalities/lazy-loading/TestLazyLoading.py (124 of 1202) PASS: lldb-api :: commands/thread/select/TestThreadSelect.py (125 of 1202) PASS: lldb-shell :: SymbolFile/DWARF/debug_ranges-missing-section.s (126 of 1202) PASS: lldb-shell :: SymbolFile/DWARF/debug_loc-aslr.s (127 of 1202) PASS: lldb-api :: commands/frame/diagnose/virtual-method-call/TestDiagnoseDereferenceVirtualMethodCall.py (128 of 1202) PASS: lldb-api :: lang/cpp/function-qualifiers/TestCppFunctionQualifiers.py (129 of 1202) PASS: lldb-shell :: SymbolFile/DWARF/DW_TAG_basic_type_DW_ATE_UTF_nonC.ll (130 of 1202) PASS: lldb-api :: lang/objc/objc-builtin-types/TestObjCBuiltinTypes.py (131 of 1202) UNSUPPORTED: lldb-shell :: Register/x86-64-ymm16-read.test (132 of 1202) PASS: lldb-shell :: Commands/CommandScriptImmediateOutput/CommandScriptImmediateOutputFile.test (133 of 1202) PASS: lldb-api :: functionalities/data-formatter/dump_dynamic/TestDumpDynamic.py (134 of 1202) PASS: lldb-api :: python_api/sbenvironment/TestSBEnvironment.py (135 of 1202) PASS: lldb-api :: commands/expression/static-initializers/TestStaticInitializers.py (136 of 1202) PASS: lldb-api :: commands/version/TestVersion.py (137 of 1202) PASS: lldb-api :: functionalities/breakpoint/breakpoint_language/TestBreakpointLanguage.py (138 of 1202) PASS: lldb-api :: sample_test/TestSampleInlineTest.py (139 of 1202) UNSUPPORTED: lldb-api :: lang/cpp/function-template-parameter-pack/TestFunctionTemplateParameterPack.py (140 of 1202) PASS: lldb-api :: lang/objc/objc-optimized/TestObjcOptimized.py (141 of 1202) PASS: lldb-shell :: ObjectFile/ELF/PT_LOAD-overlap-section.yaml (142 of 1202) UNSUPPORTED: lldb-api :: functionalities/breakpoint/breakpoint_in_delayslot/TestAvoidBreakpointInDelaySlot.py (143 of 1202) PASS: lldb-api :: commands/watchpoints/watchpoint_events/TestWatchpointEvents.py (144 of 1202) UNSUPPORTED: lldb-api :: functionalities/darwin_log/filter/exact_match/activity-chain/TestDarwinLogFilterMatchActivityChain.py (145 of 1202) PASS: lldb-api :: functionalities/data-formatter/data-formatter-disabling/TestDataFormatterDisabling.py (146 of 1202) PASS: lldb-api :: python_api/watchpoint/condition/TestWatchpointConditionAPI.py (147 of 1202) PASS: lldb-api :: lang/objc/foundation/TestObjCMethodsNSArray.py (148 of 1202) PASS: lldb-shell :: Minidump/fb-dump.test (149 of 1202) PASS: lldb-api :: functionalities/thread/concurrent_events/TestConcurrentTwoWatchpointsOneBreakpoint.py (150 of 1202) PASS: lldb-api :: python_api/type/TestTypeList.py (151 of 1202) PASS: lldb-api :: functionalities/data-formatter/frameformat_smallstruct/TestFrameFormatSmallStruct.py (152 of 1202) PASS: lldb-api :: functionalities/thread/concurrent_events/TestConcurrentBreakpointDelayBreakpointOneSignal.py (153 of 1202) PASS: lldb-api :: functionalities/inferior-crashing/TestInferiorCrashing.py (154 of 1202) PASS: lldb-api :: python_api/sbtype_typeclass/TestSBTypeTypeClass.py (155 of 1202) PASS: lldb-api :: functionalities/return-value/TestReturnValue.py (156 of 1202) PASS: lldb-api :: functionalities/type_completion/TestTypeCompletion.py (157 of 1202) XFAIL: lldb-shell :: Register/x86-64-ymm-write.test (158 of 1202) UNSUPPORTED: lldb-shell :: ScriptInterpreter/Lua/bindings.test (159 of 1202) PASS: lldb-api :: commands/expression/test/TestExprs.py (160 of 1202) UNSUPPORTED: lldb-shell :: Register/aarch64-gp-read.test (161 of 1202) PASS: lldb-api :: functionalities/data-formatter/data-formatter-objc/TestDataFormatterObjCNSDate.py (162 of 1202) UNSUPPORTED: lldb-shell :: Driver/TestRepl.test (163 of 1202) UNSUPPORTED: lldb-shell :: Reproducer/TestVersionCheck.test (164 of 1202) UNSUPPORTED: lldb-api :: tools/lldb-server/TestGdbRemoteModuleInfo.py (165 of 1202) UNSUPPORTED: lldb-api :: functionalities/data-formatter/data-formatter-stl/libstdcpp/smart_ptr/TestDataFormatterStdSmartPtr.py (166 of 1202) PASS: lldb-api :: lang/cpp/gmodules/TestWithModuleDebugging.py (167 of 1202) UNSUPPORTED: lldb-api :: commands/expression/import-std-module/unique_ptr/TestUniquePtrFromStdModule.py (168 of 1202) PASS: lldb-api :: functionalities/breakpoint/breakpoint_hit_count/TestBreakpointHitCount.py (169 of 1202) PASS: lldb-api :: functionalities/breakpoint/dummy_target_breakpoints/TestBreakpointsWithNoTargets.py (170 of 1202) PASS: lldb-shell :: Settings/TestEchoCommands.test (171 of 1202) PASS: lldb-api :: commands/expression/codegen-crash-typedefdecl-not-in_declcontext/TestCodegenCrashTypedefDeclNotInDeclContext.py (172 of 1202) PASS: lldb-api :: lang/cpp/nested-class-other-compilation-unit/TestNestedClassWithParentInAnotherCU.py (173 of 1202) PASS: lldb-api :: commands/expression/multiline-navigation/TestMultilineNavigation.py (174 of 1202) PASS: lldb-shell :: Host/TestCustomShell.test (175 of 1202) PASS: lldb-shell :: SymbolFile/DWARF/DW_AT_loclists_base.s (176 of 1202) PASS: lldb-shell :: ObjectFile/ELF/PT_LOAD-empty.yaml (177 of 1202) PASS: lldb-api :: functionalities/breakpoint/step_over_breakpoint/TestStepOverBreakpoint.py (178 of 1202) PASS: lldb-api :: functionalities/gdb_remote_client/TestWasm.py (179 of 1202) PASS: lldb-shell :: ObjectFile/ELF/section-permissions.yaml (180 of 1202) PASS: lldb-api :: functionalities/float-display/TestFloatDisplay.py (181 of 1202) PASS: lldb-api :: functionalities/tail_call_frames/disambiguate_call_site/TestDisambiguateCallSite.py (182 of 1202) PASS: lldb-api :: lang/objc/modules-compile-error/TestModulesCompileError.py (183 of 1202) UNSUPPORTED: lldb-shell :: SymbolFile/PDB/variables.test (184 of 1202) UNSUPPORTED: lldb-api :: functionalities/thread/concurrent_events/TestConcurrentManySignals.py (185 of 1202) PASS: lldb-shell :: SymbolFile/DWARF/dir-separator-no-comp-dir.s (186 of 1202) UNSUPPORTED: lldb-api :: commands/expression/import-std-module/stack/TestStackFromStdModule.py (187 of 1202) PASS: lldb-api :: lang/cpp/lambdas/TestLambdas.py (188 of 1202) UNSUPPORTED: lldb-shell :: Driver/TestHelp.test (189 of 1202) UNSUPPORTED: lldb-api :: functionalities/reproducers/attach/TestReproducerAttach.py (190 of 1202) PASS: lldb-api :: functionalities/thread/jump/TestThreadJump.py (191 of 1202) PASS: lldb-api :: commands/watchpoints/watchpoint_commands/command/TestWatchpointCommandPython.py (192 of 1202) PASS: lldb-api :: lang/objc/objc-struct-return/TestObjCStructReturn.py (193 of 1202) PASS: lldb-api :: python_api/watchpoint/TestSetWatchpoint.py (194 of 1202) UNSUPPORTED: lldb-api :: functionalities/darwin_log/filter/exact_match/category/TestDarwinLogFilterMatchCategory.py (195 of 1202) UNSUPPORTED: lldb-api :: benchmarks/startup/TestStartupDelays.py (196 of 1202) UNSUPPORTED: lldb-api :: macosx/version_zero/TestGetVersionZeroVersion.py (197 of 1202) UNSUPPORTED: lldb-shell :: ScriptInterpreter/Lua/io.test (198 of 1202) PASS: lldb-api :: lang/cpp/auto/TestCPPAuto.py (199 of 1202) PASS: lldb-api :: functionalities/data-formatter/array_typedef/TestArrayTypedef.py (200 of 1202) PASS: lldb-api :: tools/lldb-server/commandline/TestStubReverseConnect.py (201 of 1202) PASS: lldb-shell :: Settings/TestSettingsWrite.test (202 of 1202) PASS: lldb-api :: lang/objc/foundation/TestObjectDescriptionAPI.py (203 of 1202) PASS: lldb-api :: lang/cpp/trivial_abi/TestTrivialABI.py (204 of 1202) PASS: lldb-shell :: SymbolFile/Breakpad/unwind-via-raSearch.test (205 of 1202) PASS: lldb-api :: functionalities/target_var/TestTargetVar.py (206 of 1202) PASS: lldb-api :: macosx/thread_suspend/TestInternalThreadSuspension.py (207 of 1202) PASS: lldb-api :: functionalities/step-avoids-no-debug/TestStepNoDebug.py (208 of 1202) PASS: lldb-api :: tools/lldb-server/TestGdbRemote_qThreadStopInfo.py (209 of 1202) PASS: lldb-api :: python_api/function_symbol/TestDisasmAPI.py (210 of 1202) PASS: lldb-api :: lang/cpp/char8_t/TestCxxChar8_t.py (211 of 1202) UNSUPPORTED: lldb-shell :: Reproducer/TestCaptureEnvOverride.test (212 of 1202) PASS: lldb-api :: commands/log/invalid-args/TestInvalidArgsLog.py (213 of 1202) PASS: lldb-api :: lang/objc/modules-cache/TestClangModulesCache.py (214 of 1202) PASS: lldb-shell :: ObjectFile/ELF/PT_LOAD.yaml (215 of 1202) PASS: lldb-api :: commands/target/dump-symtab-demangle/TestDumpSymtabDemangle.py (216 of 1202) PASS: lldb-api :: commands/frame/var/TestFrameVar.py (217 of 1202) UNSUPPORTED: lldb-api :: benchmarks/expression/TestExpressionCmd.py (218 of 1202) PASS: lldb-api :: lang/cpp/template-function/TestTemplateFunctions.py (219 of 1202) PASS: lldb-api :: lang/cpp/dynamic-value/TestCppValueCast.py (220 of 1202) PASS: lldb-shell :: ScriptInterpreter/None/import_module.test (221 of 1202) UNSUPPORTED: lldb-api :: functionalities/darwin_log/basic/TestDarwinLogBasic.py (222 of 1202) PASS: lldb-api :: tools/lldb-server/TestGdbRemoteThreadsInStopReply.py (223 of 1202) PASS: lldb-shell :: ObjectFile/PECOFF/invalid-export-table.yaml (224 of 1202) UNSUPPORTED: lldb-api :: tools/lldb-vscode/variables/TestVSCode_variables.py (225 of 1202) PASS: lldb-api :: python_api/frame/inlines/TestInlinedFrame.py (226 of 1202) PASS: lldb-api :: functionalities/thread/concurrent_events/TestConcurrentTwoWatchpointsOneSignal.py (227 of 1202) PASS: lldb-shell :: SymbolFile/DWARF/limit-debug-info.s (228 of 1202) PASS: lldb-api :: lang/cpp/std-function-step-into-callable/TestStdFunctionStepIntoCallable.py (229 of 1202) PASS: lldb-api :: lang/cpp/class-template-parameter-pack/TestClassTemplateParameterPack.py (230 of 1202) UNSUPPORTED: lldb-shell :: Reproducer/TestProcessList.test (231 of 1202) PASS: lldb-shell :: Breakpoint/debug_addrx.test (232 of 1202) PASS: lldb-api :: lang/objc/objc-struct-argument/TestObjCStructArgument.py (233 of 1202) UNSUPPORTED: lldb-shell :: ScriptInterpreter/Lua/persistent_state.test (234 of 1202) UNSUPPORTED: lldb-shell :: Register/x86-gp-read.test (235 of 1202) XFAIL: lldb-shell :: SymbolFile/DWARF/find-type-in-function.cpp (236 of 1202) PASS: lldb-api :: commands/breakpoint/set/func-regex/TestBreakpointRegexError.py (237 of 1202) PASS: lldb-api :: functionalities/breakpoint/comp_dir_symlink/TestCompDirSymLink.py (238 of 1202) PASS: lldb-api :: commands/expression/char/TestExprsChar.py (239 of 1202) PASS: lldb-api :: lang/cpp/namespace/TestNamespaceLookup.py (240 of 1202) PASS: lldb-api :: functionalities/memory/cache/TestMemoryCache.py (241 of 1202) UNSUPPORTED: lldb-shell :: Register/arm-fp-read.test (242 of 1202) PASS: lldb-api :: commands/expression/calculator_mode/TestCalculatorMode.py (243 of 1202) PASS: lldb-api :: commands/process/signal/TestProcessSignal.py (244 of 1202) PASS: lldb-shell :: SymbolFile/NativePDB/ast-types.cpp (245 of 1202) PASS: lldb-shell :: SymbolFile/DWARF/compilercontext.ll (246 of 1202) UNSUPPORTED: lldb-shell :: SymbolFile/DWARF/DW_TAG_GNU_call_site-DW_AT_low_pc.s (247 of 1202) PASS: lldb-shell :: SymbolFile/NativePDB/tag-types.cpp (248 of 1202) PASS: lldb-api :: functionalities/thread/concurrent_events/TestConcurrentCrashWithBreak.py (249 of 1202) PASS: lldb-api :: functionalities/data-formatter/data-formatter-proper-plurals/TestFormattersOneIsSingular.py (250 of 1202) PASS: lldb-api :: tools/lldb-server/TestGdbRemoteExitCode.py (251 of 1202) UNSUPPORTED: lldb-shell :: Register/x86-ymm-write.test (252 of 1202) UNSUPPORTED: lldb-api :: functionalities/thread/exit_during_expression/TestExitDuringExpression.py (253 of 1202) PASS: lldb-shell :: SymbolFile/Breakpad/line-table-missing-file.test (254 of 1202) PASS: lldb-api :: lang/objc/foundation/TestObjCMethodsString.py (255 of 1202) PASS: lldb-api :: functionalities/postmortem/minidump-new/TestMiniDumpNew.py (256 of 1202) PASS: lldb-api :: commands/disassemble/basic/TestDisassembleBreakpoint.py (257 of 1202) PASS: lldb-api :: functionalities/data-formatter/language_category_updates/TestDataFormatterLanguageCategoryUpdates.py (258 of 1202) PASS: lldb-api :: commands/expression/multiline-completion/TestMultilineCompletion.py (259 of 1202) PASS: lldb-shell :: SymbolFile/Breakpad/unwind-via-stack-cfi.test (260 of 1202) UNSUPPORTED: lldb-shell :: Driver/TestPositionalArgs.test (261 of 1202) UNSUPPORTED: lldb-shell :: ScriptInterpreter/Python/scripted_breakpoint.test (262 of 1202) PASS: lldb-api :: functionalities/data-formatter/data-formatter-stl/libcxx/set/TestDataFormatterLibcxxSet.py (263 of 1202) PASS: lldb-api :: lang/c/const_variables/TestConstVariables.py (264 of 1202) PASS: lldb-api :: macosx/universal/TestUniversal.py (265 of 1202) PASS: lldb-api :: commands/command/script/import/TestImport.py (266 of 1202) PASS: lldb-api :: commands/frame/diagnose/dereference-this/TestDiagnoseDereferenceThis.py (267 of 1202) PASS: lldb-api :: macosx/find-dsym/deep-bundle/TestDeepBundle.py (268 of 1202) PASS: lldb-api :: functionalities/archives/TestBSDArchives.py (269 of 1202) PASS: lldb-api :: lang/cpp/incomplete-types/TestCppIncompleteTypes.py (270 of 1202) PASS: lldb-api :: lang/c/inlines/TestRedefinitionsInInlines.py (271 of 1202) PASS: lldb-shell :: Breakpoint/debug_rnglist_basic.test (272 of 1202) PASS: lldb-api :: functionalities/tail_call_frames/disambiguate_tail_call_seq/TestDisambiguateTailCallSeq.py (273 of 1202) PASS: lldb-api :: sample_test/TestSampleTest.py (274 of 1202) PASS: lldb-shell :: SymbolFile/Breakpad/line-table-discontinuous-file-ids.test (275 of 1202) PASS: lldb-shell :: SymbolFile/DWARF/find-basic-namespace.cpp (276 of 1202) PASS: lldb-api :: tools/lldb-server/inferior-crash/TestGdbRemoteAbort.py (277 of 1202) PASS: lldb-shell :: SymbolFile/DWARF/find-variable-dwo.cpp (278 of 1202) PASS: lldb-api :: functionalities/data-formatter/pyobjsynthprovider/TestPyObjSynthProvider.py (279 of 1202) UNSUPPORTED: lldb-api :: commands/target/auto-install-main-executable/TestAutoInstallMainExecutable.py (280 of 1202) PASS: lldb-shell :: ObjectFile/ELF/PT_LOAD-overlap-PT_INTERP.yaml (281 of 1202) PASS: lldb-api :: lang/cpp/dynamic-value/TestDynamicValue.py (282 of 1202) PASS: lldb-api :: functionalities/breakpoint/move_nearest/TestMoveNearest.py (283 of 1202) PASS: lldb-shell :: ObjectFile/ELF/short-build-id.yaml (284 of 1202) UNSUPPORTED: lldb-api :: commands/register/register/intel_xtended_registers/TestMPXRegisters.py (285 of 1202) PASS: lldb-api :: python_api/debugger/TestDebuggerAPI.py (286 of 1202) UNSUPPORTED: lldb-api :: functionalities/gdb_remote_client/TestWriteMemory.py (287 of 1202) PASS: lldb-api :: functionalities/thread/thread_specific_break/TestThreadSpecificBreakpoint.py (288 of 1202) PASS: lldb-api :: functionalities/data-formatter/hexcaps/TestDataFormatterHexCaps.py (289 of 1202) PASS: lldb-api :: lang/objcxx/class-name-clash/TestNameClash.py (290 of 1202) PASS: lldb-api :: python_api/value/linked_list/TestValueAPILinkedList.py (291 of 1202) PASS: lldb-shell :: Breakpoint/single-file-split-dwarf.test (292 of 1202) PASS: lldb-api :: functionalities/data-formatter/data-formatter-objc/TestDataFormatterObjCNSBundle.py (293 of 1202) UNSUPPORTED: lldb-api :: macosx/thread-names/TestInterruptThreadNames.py (294 of 1202) PASS: lldb-api :: macosx/safe-to-func-call/TestSafeFuncCalls.py (295 of 1202) PASS: lldb-api :: lang/cpp/breakpoint-commands/TestCPPBreakpointCommands.py (296 of 1202) PASS: lldb-shell :: SymbolFile/DWARF/debug_ranges_and_rnglists.test (297 of 1202) PASS: lldb-shell :: Minidump/disassemble-no-module.yaml (298 of 1202) PASS: lldb-api :: functionalities/data-formatter/data-formatter-stl/libcxx/unique_ptr/TestDataFormatterLibcxxUniquePtr.py (299 of 1202) UNSUPPORTED: lldb-api :: functionalities/process_save_core/TestProcessSaveCore.py (300 of 1202) UNSUPPORTED: lldb-api :: python_api/disassemble-raw-data/TestDisassembleRawData.py (301 of 1202) PASS: lldb-shell :: Breakpoint/debug_rnglist_offset_pair.test (302 of 1202) PASS: lldb-api :: commands/platform/basic/TestPlatformCommand.py (303 of 1202) UNSUPPORTED: lldb-shell :: Reproducer/TestDiscard.test (304 of 1202) PASS: lldb-api :: lang/cpp/exceptions/TestCPPExceptionBreakpoints.py (305 of 1202) PASS: lldb-shell :: Minidump/memory-region.yaml (306 of 1202) PASS: lldb-api :: lang/cpp/this/TestCPPThis.py (307 of 1202) PASS: lldb-shell :: SymbolFile/NativePDB/globals-bss.cpp (308 of 1202) PASS: lldb-api :: functionalities/thread/backtrace_limit/TestBacktraceLimit.py (309 of 1202) UNSUPPORTED: lldb-shell :: SymbolFile/PDB/type-quals.test (310 of 1202) PASS: lldb-api :: lang/c/modules/TestCModules.py (311 of 1202) PASS: lldb-api :: python_api/process/TestProcessAPI.py (312 of 1202) PASS: lldb-api :: functionalities/thread/backtrace_all/TestBacktraceAll.py (313 of 1202) PASS: lldb-api :: lang/objc/objc_direct-methods/TestObjCDirectMethods.py (314 of 1202) PASS: lldb-api :: functionalities/plugins/python_os_plugin/TestPythonOSPlugin.py (315 of 1202) PASS: lldb-api :: commands/target/stop-hook/enable/TestTargetStopHookEnable.py (316 of 1202) PASS: lldb-api :: commands/target/stop-hooks/TestStopHooks.py (317 of 1202) PASS: lldb-api :: commands/expression/rdar42038760/TestScalarURem.py (318 of 1202) PASS: lldb-api :: lang/objc/objc-stepping/TestObjCStepping.py (319 of 1202) UNSUPPORTED: lldb-shell :: Register/x86-64-read.test (320 of 1202) UNSUPPORTED: lldb-shell :: SymbolFile/PDB/typedefs.test (321 of 1202) PASS: lldb-api :: lang/cpp/call-function/TestCallCPPFunction.py (322 of 1202) PASS: lldb-api :: functionalities/breakpoint/breakpoint_ids/TestBreakpointIDs.py (323 of 1202) PASS: lldb-shell :: Expr/TestIRMemoryMap.test (324 of 1202) PASS: lldb-api :: types/TestFloatTypes.py (325 of 1202) UNSUPPORTED: lldb-api :: commands/expression/completion-crash-invalid-iterator/TestInvalidIteratorCompletionCrash.py (326 of 1202) PASS: lldb-api :: commands/settings/use_source_cache/TestUseSourceCache.py (327 of 1202) PASS: lldb-api :: lang/mixed/TestMixedLanguages.py (328 of 1202) PASS: lldb-api :: lang/c/global_variables/TestGlobalVariables.py (329 of 1202) PASS: lldb-shell :: ObjectFile/ELF/duplicate-section.yaml (330 of 1202) PASS: lldb-api :: commands/expression/ir-interpreter-phi-nodes/TestIRInterpreterPHINodes.py (331 of 1202) PASS: lldb-api :: functionalities/breakpoint/breakpoint_by_file_colon_line/TestBreakpointByFileColonLine.py (332 of 1202) UNSUPPORTED: lldb-api :: macosx/macabi/TestMacABImacOSFramework.py (333 of 1202) PASS: lldb-api :: lang/cpp/accelerator-table/TestCPPAccelerator.py (334 of 1202) PASS: lldb-api :: lang/objc/objc-property/TestObjCProperty.py (335 of 1202) PASS: lldb-api :: lang/objcxx/objcxx-ivar-vector/TestIvarVector.py (336 of 1202) PASS: lldb-shell :: SymbolFile/DWARF/deterministic-build.cpp (337 of 1202) PASS: lldb-shell :: ObjectFile/PECOFF/sections.yaml (338 of 1202) UNSUPPORTED: lldb-api :: commands/expression/timeout/TestCallWithTimeout.py (339 of 1202) PASS: lldb-shell :: SymbolFile/DWARF/DW_AT_declaration-with-children.s (340 of 1202) PASS: lldb-api :: functionalities/stats_api/TestStatisticsAPI.py (341 of 1202) PASS: lldb-api :: functionalities/gdb_remote_client/TestIOSSimulator.py (342 of 1202) PASS: lldb-api :: commands/expression/formatters/TestFormatters.py (343 of 1202) UNSUPPORTED: lldb-api :: commands/settings/quoting/TestQuoting.py (344 of 1202) PASS: lldb-api :: python_api/value_var_update/TestValueVarUpdate.py (345 of 1202) PASS: lldb-api :: lang/cpp/offsetof/TestOffsetofCpp.py (346 of 1202) PASS: lldb-api :: lang/c/bitfields/TestBitfields.py (347 of 1202) PASS: lldb-shell :: SymbolFile/DWARF/debug-types-line-tables.s (348 of 1202) UNSUPPORTED: lldb-api :: commands/expression/import-std-module/vector-of-vectors/TestVectorOfVectorsFromStdModule.py (349 of 1202) PASS: lldb-api :: lang/objc/objc-super/TestObjCSuper.py (350 of 1202) PASS: lldb-shell :: Minidump/memory-region-from-module.yaml (351 of 1202) PASS: lldb-api :: commands/statistics/basic/TestStats.py (352 of 1202) UNSUPPORTED: lldb-api :: functionalities/breakpoint/serialize/TestBreakpointSerialization.py (353 of 1202) PASS: lldb-api :: functionalities/data-formatter/ptr_ref_typedef/TestPtrRef2Typedef.py (354 of 1202) UNSUPPORTED: lldb-api :: lang/objc/objc-dynamic-value/TestObjCDynamicValue.py (355 of 1202) PASS: lldb-api :: python_api/default-constructor/TestDefaultConstructorForAPIObjects.py (356 of 1202) PASS: lldb-api :: lang/cpp/stl/TestSTL.py (357 of 1202) UNSUPPORTED: lldb-api :: commands/expression/import-std-module/list-dbg-info-content/TestDbgInfoContentListFromStdModule.py (358 of 1202) UNSUPPORTED: lldb-shell :: SymbolFile/target-symbols-add-unwind.test (359 of 1202) PASS: lldb-api :: commands/watchpoints/watchpoint_disable/TestWatchpointDisable.py (360 of 1202) PASS: lldb-api :: functionalities/gdb_remote_client/TestGDBRemoteClient.py (361 of 1202) PASS: lldb-api :: functionalities/data-formatter/data-formatter-objc/nsindexpath/TestDataFormatterNSIndexPath.py (362 of 1202) PASS: lldb-shell :: Settings/TestStopCommandSourceOnError.test (363 of 1202) PASS: lldb-api :: macosx/nslog/TestDarwinNSLogOutput.py (364 of 1202) PASS: lldb-api :: commands/expression/call-function/TestCallUserDefinedFunction.py (365 of 1202) PASS: lldb-api :: commands/target/stop-hook/delete/TestTargetStopHookDelete.py (366 of 1202) PASS: lldb-api :: functionalities/thread/concurrent_events/TestConcurrentDelayedCrashWithBreakpointWatchpoint.py (367 of 1202) UNSUPPORTED: lldb-api :: macosx/function-starts/TestFunctionStarts.py (368 of 1202) PASS: lldb-api :: tools/lldb-server/TestGdbRemoteRegisterState.py (369 of 1202) PASS: lldb-api :: api/listeners/TestListener.py (370 of 1202) PASS: lldb-api :: lang/cpp/stl/TestStdCXXDisassembly.py (371 of 1202) PASS: lldb-shell :: SymbolFile/Breakpad/unwind-via-stack-win-no-memory-info.yaml (372 of 1202) PASS: lldb-shell :: ObjectFile/ELF/section-overlap.yaml (373 of 1202) PASS: lldb-api :: lang/objc/rdar-11355592/TestRdar11355592.py (374 of 1202) UNSUPPORTED: lldb-api :: tools/lldb-vscode/coreFile/TestVSCode_coreFile.py (375 of 1202) UNSUPPORTED: lldb-api :: python_api/process/read-mem-cstring/TestReadMemCString.py (376 of 1202) PASS: lldb-api :: lang/objc/foundation/TestFoundationDisassembly.py (377 of 1202) PASS: lldb-api :: commands/expression/dont_allow_jit/TestAllowJIT.py (378 of 1202) PASS: lldb-api :: python_api/function_symbol/TestSymbolAPI.py (379 of 1202) PASS: lldb-api :: lang/c/shared_lib/TestSharedLib.py (380 of 1202) PASS: lldb-api :: functionalities/gdb_remote_client/TestPlatformClient.py (381 of 1202) PASS: lldb-api :: functionalities/rerun/TestRerun.py (382 of 1202) PASS: lldb-shell :: ObjectFile/PECOFF/uuid.yaml (383 of 1202) PASS: lldb-api :: commands/command/delete/TestCommandDelete.py (384 of 1202) PASS: lldb-api :: macosx/indirect_symbol/TestIndirectSymbols.py (385 of 1202) PASS: lldb-api :: lang/cpp/global_operators/TestCppGlobalOperators.py (386 of 1202) PASS: lldb-api :: commands/expression/invalid-args/TestInvalidArgsExpression.py (387 of 1202) PASS: lldb-api :: commands/expression/unicode-in-variable/TestUnicodeInVariable.py (388 of 1202) PASS: lldb-api :: functionalities/inferior-crashing/recursive-inferior/TestRecursiveInferior.py (389 of 1202) PASS: lldb-api :: lang/cpp/signed_types/TestSignedTypes.py (390 of 1202) UNSUPPORTED: lldb-api :: commands/expression/macros/TestMacros.py (391 of 1202) PASS: lldb-api :: functionalities/data-formatter/data-formatter-objc/TestDataFormatterObjCCF.py (392 of 1202) PASS: lldb-shell :: Breakpoint/split-dwarf-5-addrbase.test (393 of 1202) UNSUPPORTED: lldb-shell :: Reproducer/TestCrash.test (394 of 1202) PASS: lldb-api :: functionalities/data-formatter/data-formatter-synth/TestDataFormatterSynth.py (395 of 1202) PASS: lldb-api :: functionalities/wrong_commands/TestWrongCommands.py (396 of 1202) PASS: lldb-api :: functionalities/data-formatter/data-formatter-objc/TestDataFormatterObjCPlain.py (397 of 1202) PASS: lldb-api :: functionalities/param_entry_vals/basic_entry_values/TestBasicEntryValues.py (398 of 1202) PASS: lldb-api :: commands/expression/regression-access-function-template-in-record/TestRegressionAccessFunctionTemplateInRecord.py (399 of 1202) PASS: lldb-shell :: ObjectFile/MachO/symtab.yaml (400 of 1202) PASS: lldb-api :: lang/c/function_types/TestFunctionTypes.py (401 of 1202) UNSUPPORTED: lldb-shell :: ExecControl/StopHook/stop-hook-threads.test (402 of 1202) PASS: lldb-api :: functionalities/limit-debug-info/TestLimitDebugInfo.py (403 of 1202) PASS: lldb-api :: lang/c/unicode/TestUnicodeSymbols.py (404 of 1202) PASS: lldb-api :: functionalities/avoids-fd-leak/TestFdLeak.py (405 of 1202) UNSUPPORTED: lldb-shell :: SymbolFile/NativePDB/typedefs.cpp (406 of 1202) PASS: lldb-api :: functionalities/thread/concurrent_events/TestConcurrentWatchBreakDelay.py (407 of 1202) PASS: lldb-api :: functionalities/data-formatter/data-formatter-stl/libcxx/vector/TestDataFormatterLibcxxVector.py (408 of 1202) PASS: lldb-api :: functionalities/data-formatter/data-formatter-stl/libcxx/initializerlist/TestInitializerList.py (409 of 1202) PASS: lldb-shell :: BuildScript/toolchain-clang.test (410 of 1202) PASS: lldb-api :: commands/expression/argument_passing_restrictions/TestArgumentPassingRestrictions.py (411 of 1202) PASS: lldb-api :: functionalities/tail_call_frames/ambiguous_tail_call_seq2/TestAmbiguousTailCallSeq2.py (412 of 1202) PASS: lldb-api :: lang/objc/modules-inline-functions/TestModulesInlineFunctions.py (413 of 1202) PASS: lldb-api :: commands/frame/diagnose/local-variable/TestLocalVariable.py (414 of 1202) PASS: lldb-api :: sanity/TestSettingSkipping.py (415 of 1202) PASS: lldb-api :: functionalities/data-formatter/data-formatter-objc/TestDataFormatterObjCNSError.py (416 of 1202) PASS: lldb-shell :: Commands/command-script-import.test (417 of 1202) UNSUPPORTED: lldb-api :: functionalities/breakpoint/breakpoint_command/TestBreakpointCommandsFromPython.py (418 of 1202) PASS: lldb-shell :: SymbolFile/Breakpad/stack-cfi-parsing.test (419 of 1202) PASS: lldb-api :: functionalities/data-formatter/format-propagation/TestFormatPropagation.py (420 of 1202) PASS: lldb-api :: lang/objc/forward-decl/TestForwardDecl.py (421 of 1202) PASS: lldb-api :: lang/objc/exceptions/TestObjCExceptions.py (422 of 1202) PASS: lldb-api :: terminal/TestEditline.py (423 of 1202) UNSUPPORTED: lldb-api :: lang/objc/rdar-12408181/TestRdar12408181.py (424 of 1202) PASS: lldb-api :: functionalities/data-formatter/data-formatter-stl/libcxx/variant/TestDataFormatterLibcxxVariant.py (425 of 1202) PASS: lldb-api :: functionalities/tail_call_frames/cross_dso/TestCrossDSOTailCalls.py (426 of 1202) PASS: lldb-api :: lang/cpp/breakpoint_in_member_func_w_non_primitive_params/TestBreakpointInMemberFuncWNonPrimitiveParams.py (427 of 1202) PASS: lldb-shell :: ObjectFile/ELF/base-address.yaml (428 of 1202) UNSUPPORTED: lldb-api :: tools/lldb-vscode/breakpoint/TestVSCode_setFunctionBreakpoints.py (429 of 1202) UNSUPPORTED: lldb-shell :: ScriptInterpreter/Lua/nested_sessions.test (430 of 1202) PASS: lldb-api :: functionalities/data-formatter/vector-types/TestVectorTypesFormatting.py (431 of 1202) PASS: lldb-api :: commands/expression/context-object-objc/TestContextObjectObjc.py (432 of 1202) PASS: lldb-api :: functionalities/thread/concurrent_events/TestConcurrentManyCrash.py (433 of 1202) PASS: lldb-api :: lang/cpp/namespace/TestNamespace.py (434 of 1202) PASS: lldb-api :: functionalities/thread/concurrent_events/TestConcurrentTwoBreakpointsOneDelaySignal.py (435 of 1202) UNSUPPORTED: lldb-api :: arm/breakpoint-it/TestBreakpointIt.py (436 of 1202) PASS: lldb-api :: commands/target/basic/TestTargetCommand.py (437 of 1202) PASS: lldb-api :: functionalities/gdb_remote_client/TestRegDefinitionInParts.py (438 of 1202) PASS: lldb-shell :: SymbolFile/DWARF/dwp.s (439 of 1202) PASS: lldb-api :: linux/builtin_trap/TestBuiltinTrap.py (440 of 1202) PASS: lldb-api :: commands/apropos/with-process/TestAproposWithProcess.py (441 of 1202) UNSUPPORTED: lldb-api :: commands/process/attach/attach_denied/TestAttachDenied.py (442 of 1202) PASS: lldb-api :: tools/lldb-server/TestGdbRemoteKill.py (443 of 1202) PASS: lldb-shell :: ObjectFile/MachO/subsections.yaml (444 of 1202) PASS: lldb-api :: lang/c/array_types/TestArrayTypes.py (445 of 1202) PASS: lldb-api :: lang/c/complex_int/TestComplexInt.py (446 of 1202) PASS: lldb-api :: python_api/signals/TestSignalsAPI.py (447 of 1202) PASS: lldb-api :: functionalities/data-formatter/data-formatter-smart-array/TestDataFormatterSmartArray.py (448 of 1202) PASS: lldb-shell :: Commands/command-backtrace.test (449 of 1202) PASS: lldb-api :: functionalities/completion/TestCompletion.py (450 of 1202) PASS: lldb-shell :: Commands/command-breakpoint-col.test (451 of 1202) PASS: lldb-api :: commands/register/register/register_command/TestRegisters.py (452 of 1202) PASS: lldb-api :: types/TestDoubleTypesExpr.py (453 of 1202) PASS: lldb-shell :: ObjectFile/ELF/build-id-case.yaml (454 of 1202) PASS: lldb-api :: functionalities/paths/TestPaths.py (455 of 1202) PASS: lldb-api :: commands/expression/completion/TestExprCompletion.py (456 of 1202) PASS: lldb-shell :: SymbolFile/DWARF/parallel-indexing-stress.s (457 of 1202) UNSUPPORTED: lldb-shell :: Register/x86-64-ymm16-write.test (458 of 1202) PASS: lldb-api :: lang/cpp/template-specialization-type/TestTemplateSpecializationType.py (459 of 1202) PASS: lldb-api :: functionalities/thread/concurrent_events/TestConcurrentDelayWatchBreak.py (460 of 1202) UNSUPPORTED: lldb-api :: commands/register/register/intel_xtended_registers/mpx_bound_violation/TestBoundViolation.py (461 of 1202) PASS: lldb-shell :: ObjectFile/Breakpad/uuid-matching-mac.test (462 of 1202) PASS: lldb-shell :: Driver/TestCommands.test (463 of 1202) PASS: lldb-api :: functionalities/breakpoint/breakpoint_by_line_and_column/TestBreakpointByLineAndColumn.py (464 of 1202) PASS: lldb-api :: functionalities/data-formatter/setvaluefromcstring/TestSetValueFromCString.py (465 of 1202) PASS: lldb-api :: functionalities/data-formatter/data-formatter-stl/libstdcpp/unique_ptr/invalid/TestDataFormatterInvalidStdUniquePtr.py (466 of 1202) PASS: lldb-api :: lang/objcxx/hide-runtime-values/TestObjCXXHideRuntimeValues.py (467 of 1202) UNSUPPORTED: lldb-shell :: ScriptInterpreter/Lua/watchpoint_callback.test (468 of 1202) PASS: lldb-api :: python_api/value/TestValueAPI.py (469 of 1202) PASS: lldb-api :: functionalities/step_scripted/TestStepScripted.py (470 of 1202) UNSUPPORTED: lldb-api :: functionalities/data-formatter/data-formatter-stl/libstdcpp/list/TestDataFormatterStdList.py (471 of 1202) PASS: lldb-api :: commands/watchpoints/watchpoint_commands/condition/TestWatchpointConditionCmd.py (472 of 1202) PASS: lldb-api :: functionalities/conditional_break/TestConditionalBreak.py (473 of 1202) PASS: lldb-shell :: Commands/command-disassemble.s (474 of 1202) PASS: lldb-api :: commands/expression/call-throws/TestCallThatThrows.py (475 of 1202) PASS: lldb-api :: commands/expression/class_template_specialization_empty_pack/TestClassTemplateSpecializationParametersHandling.py (476 of 1202) PASS: lldb-shell :: Settings/TestSettingsSet.test (477 of 1202) PASS: lldb-api :: commands/platform/file/read/TestPlatformFileRead.py (478 of 1202) UNSUPPORTED: lldb-shell :: Register/aarch64-fp-read.test (479 of 1202) UNSUPPORTED: lldb-api :: tools/lldb-vscode/breakpoint/TestVSCode_setExceptionBreakpoints.py (480 of 1202) UNSUPPORTED: lldb-api :: linux/thread/create_during_instruction_step/TestCreateDuringInstructionStep.py (481 of 1202) PASS: lldb-api :: commands/disassemble/basic/TestFrameDisassemble.py (482 of 1202) PASS: lldb-api :: commands/command/script/import/rdar-12586188/TestRdar12586188.py (483 of 1202) PASS: lldb-api :: python_api/breakpoint/TestBreakpointAPI.py (484 of 1202) UNSUPPORTED: lldb-api :: commands/expression/import-std-module/shared_ptr/TestSharedPtrFromStdModule.py (485 of 1202) PASS: lldb-api :: functionalities/fat_archives/TestFatArchives.py (486 of 1202) PASS: lldb-api :: lang/c/enum_types/TestEnumTypes.py (487 of 1202) PASS: lldb-api :: lang/c/unions/TestUnionMembers.py (488 of 1202) PASS: lldb-shell :: SymbolFile/NativePDB/function-types-calling-conv.cpp (489 of 1202) PASS: lldb-api :: arm/emulation/TestEmulations.py (490 of 1202) UNSUPPORTED: lldb-api :: functionalities/darwin_log/filter/regex/activity-chain/TestDarwinLogFilterRegexActivityChain.py (491 of 1202) PASS: lldb-shell :: Minidump/Windows/broken-unwind.test (492 of 1202) PASS: lldb-shell :: ObjectFile/ELF/section-addresses.yaml (493 of 1202) PASS: lldb-api :: commands/watchpoints/multiple_threads/TestWatchpointMultipleThreads.py (494 of 1202) PASS: lldb-api :: functionalities/inferior-crashing/recursive-inferior/TestRecursiveInferiorStep.py (495 of 1202) PASS: lldb-shell :: SymbolFile/DWARF/clang-ast-from-dwarf-unamed-and-anon-structs.cpp (496 of 1202) UNSUPPORTED: lldb-api :: commands/expression/unwind_expression/TestUnwindExpression.py (497 of 1202) PASS: lldb-api :: functionalities/tail_call_frames/disambiguate_paths_to_common_sink/TestDisambiguatePathsToCommonSink.py (498 of 1202) PASS: lldb-api :: functionalities/data-formatter/data-formatter-globals/TestDataFormatterGlobals.py (499 of 1202) PASS: lldb-shell :: ScriptInterpreter/None/none.test (500 of 1202) PASS: lldb-api :: lang/cpp/dynamic-value-same-basename/TestDynamicValueSameBase.py (501 of 1202) PASS: lldb-api :: tools/lldb-server/TestAppleSimulatorOSType.py (502 of 1202) PASS: lldb-shell :: ObjectFile/ELF/netbsd-exec-8.99.30-amd64.yaml (503 of 1202) PASS: lldb-api :: lang/c/offsetof/TestOffsetof.py (504 of 1202) UNSUPPORTED: lldb-api :: commands/process/launch/TestProcessLaunch.py (505 of 1202) PASS: lldb-api :: functionalities/postmortem/elf-core/thread_crash/TestLinuxCoreThreads.py (506 of 1202) PASS: lldb-shell :: SymbolFile/NativePDB/function-types-classes.cpp (507 of 1202) PASS: lldb-shell :: SymbolFile/DWARF/debug_ranges.s (508 of 1202) PASS: lldb-api :: functionalities/thread/concurrent_events/TestConcurrentNWatchNBreak.py (509 of 1202) PASS: lldb-shell :: SymbolFile/DWARF/find-basic-function.cpp (510 of 1202) PASS: lldb-api :: functionalities/postmortem/wow64_minidump/TestWow64MiniDump.py (511 of 1202) UNSUPPORTED: lldb-shell :: ScriptInterpreter/Python/sb_address_exception.test (512 of 1202) PASS: lldb-api :: commands/expression/persistent_ptr_update/TestPersistentPtrUpdate.py (513 of 1202) PASS: lldb-shell :: SymbolFile/DWARF/array-sizes.s (514 of 1202) PASS: lldb-shell :: SymbolFile/NativePDB/bitfields.cpp (515 of 1202) PASS: lldb-api :: commands/frame/select/TestFrameSelect.py (516 of 1202) PASS: lldb-api :: functionalities/dynamic_value_child_count/TestDynamicValueChildCount.py (517 of 1202) PASS: lldb-api :: lang/c/tls_globals/TestTlsGlobals.py (518 of 1202) PASS: lldb-api :: commands/watchpoints/watchpoint_count/TestWatchpointCount.py (519 of 1202) PASS: lldb-api :: functionalities/gdb_remote_client/TestGDBRemoteLoad.py (520 of 1202) PASS: lldb-api :: lang/c/complex/TestComplexC99.py (521 of 1202) PASS: lldb-api :: functionalities/breakpoint/inlined_breakpoints/TestInlinedBreakpoints.py (522 of 1202) UNSUPPORTED: lldb-api :: commands/expression/import-std-module/vector-bool/TestVectorBoolFromStdModule.py (523 of 1202) PASS: lldb-shell :: ObjectFile/MachO/lc_version_min.yaml (524 of 1202) PASS: lldb-shell :: ObjectFile/Breakpad/sections-trailing-func.test (525 of 1202) XFAIL: lldb-shell :: Register/x86-mm-xmm-read.test (526 of 1202) PASS: lldb-api :: functionalities/testid/TestTestId.py (527 of 1202) PASS: lldb-api :: commands/frame/diagnose/dereference-argument/TestDiagnoseDereferenceArgument.py (528 of 1202) PASS: lldb-shell :: ObjectFile/ELF/basic-info.yaml (529 of 1202) PASS: lldb-api :: lang/c/step-target/TestStepTarget.py (530 of 1202) PASS: lldb-api :: functionalities/gdb_remote_client/TestProcessConnect.py (531 of 1202) UNSUPPORTED: lldb-shell :: Reproducer/TestLuaImport.test (532 of 1202) PASS: lldb-shell :: SymbolFile/DWARF/debug_loclists-dwo.s (533 of 1202) PASS: lldb-api :: lang/c/struct_types/TestStructTypes.py (534 of 1202) PASS: lldb-api :: functionalities/value_md5_crash/TestValueMD5Crash.py (535 of 1202) UNSUPPORTED: lldb-shell :: Quit/TestQuitExitCodeHexA.test (536 of 1202) PASS: lldb-api :: functionalities/history/TestHistoryRecall.py (537 of 1202) PASS: lldb-api :: functionalities/gdb_remote_client/TestThreadSelectionBug.py (538 of 1202) PASS: lldb-api :: functionalities/breakpoint/objc/TestObjCBreakpoints.py (539 of 1202) UNSUPPORTED: lldb-shell :: Process/TestEnvironment.test (540 of 1202) PASS: lldb-api :: functionalities/pointer_num_children/TestPointerNumChildren.py (541 of 1202) PASS: lldb-api :: functionalities/breakpoint/cpp_exception/TestCPPExceptionBreakpoint.py (542 of 1202) PASS: lldb-shell :: Expr/TestMultilineExpr.test (543 of 1202) PASS: lldb-api :: functionalities/thread/state_after_expression/TestStateAfterExpression.py (544 of 1202) PASS: lldb-api :: commands/expression/import_base_class_when_class_has_derived_member/TestImportBaseClassWhenClassHasDerivedMember.py (545 of 1202) UNSUPPORTED: lldb-api :: functionalities/thread/multi_break/TestMultipleBreakpoints.py (546 of 1202) PASS: lldb-api :: functionalities/thread/concurrent_events/TestConcurrentSignalDelayBreak.py (547 of 1202) PASS: lldb-shell :: SymbolFile/DWARF/debug-names-compressed.cpp (548 of 1202) UNSUPPORTED: lldb-api :: functionalities/data-formatter/data-formatter-stl/libstdcpp/vbool/TestDataFormatterStdVBool.py (549 of 1202) PASS: lldb-api :: lang/objc/ivar-IMP/TestObjCiVarIMP.py (550 of 1202) PASS: lldb-shell :: SymbolFile/DWARF/static_scope.s (551 of 1202) PASS: lldb-api :: functionalities/gdb_remote_client/TestqOffsets.py (552 of 1202) PASS: lldb-shell :: SymbolFile/DWARF/dwp-separate-debug-file.cpp (553 of 1202) PASS: lldb-shell :: ObjectFile/Breakpad/discontiguous-sections.test (554 of 1202) PASS: lldb-api :: lang/objc/blocks/TestObjCIvarsInBlocks.py (555 of 1202) PASS: lldb-api :: functionalities/thread/concurrent_events/TestConcurrentCrashWithWatchpointBreakpointSignal.py (556 of 1202) UNSUPPORTED: lldb-shell :: Driver/TestCore.test (557 of 1202) PASS: lldb-shell :: SymbolFile/DWARF/module-ownership.mm (558 of 1202) UNSUPPORTED: lldb-api :: functionalities/data-formatter/data-formatter-stl/libstdcpp/vector/TestDataFormatterStdVector.py (559 of 1202) PASS: lldb-api :: lang/objc/conflicting-definition/TestConflictingDefinition.py (560 of 1202) PASS: lldb-api :: lang/objc/objc-baseclass-sbtype/TestObjCBaseClassSBType.py (561 of 1202) PASS: lldb-api :: functionalities/memory/find/TestMemoryFind.py (562 of 1202) UNSUPPORTED: lldb-shell :: Unwind/unwind-plan-dwarf-dump.test (563 of 1202) PASS: lldb-api :: commands/command/script_alias/TestCommandScriptAlias.py (564 of 1202) PASS: lldb-shell :: ObjectFile/PECOFF/export-dllfunc.yaml (565 of 1202) PASS: lldb-api :: functionalities/thread/thread_exit/TestThreadExit.py (566 of 1202) PASS: lldb-shell :: SymbolFile/symbol-binding.test (567 of 1202) PASS: lldb-api :: commands/platform/basic/TestPlatformPython.py (568 of 1202) PASS: lldb-api :: functionalities/tsan/cpp_global_location/TestTsanCPPGlobalLocation.py (569 of 1202) UNSUPPORTED: lldb-api :: tools/lldb-server/thread-name/TestGdbRemoteThreadName.py (570 of 1202) UNSUPPORTED: lldb-api :: benchmarks/turnaround/TestCompileRunToBreakpointTurnaround.py (571 of 1202) PASS: lldb-api :: lang/c/strings/TestCStrings.py (572 of 1202) PASS: lldb-api :: lang/objc/unicode-string/TestUnicodeString.py (573 of 1202) UNSUPPORTED: lldb-shell :: SymbolFile/NativePDB/ast-functions-msvc.cpp (574 of 1202) PASS: lldb-api :: lang/objc/objc-new-syntax/TestObjCNewSyntaxArray.py (575 of 1202) PASS: lldb-api :: commands/gui/invalid-args/TestInvalidArgsGui.py (576 of 1202) PASS: lldb-api :: functionalities/object-file/TestImageListMultiArchitecture.py (577 of 1202) PASS: lldb-api :: lang/objc/rdar-10967107/TestRdar10967107.py (578 of 1202) PASS: lldb-shell :: ObjectFile/PECOFF/symbol.yaml (579 of 1202) PASS: lldb-api :: functionalities/data-formatter/ostypeformatting/TestFormattersOsType.py (580 of 1202) PASS: lldb-shell :: SymbolFile/dissassemble-entry-point.s (581 of 1202) PASS: lldb-shell :: Breakpoint/split-dwarf5-debug-stroffsets.test (582 of 1202) PASS: lldb-api :: macosx/dyld-trie-symbols/TestDyldTrieSymbols.py (583 of 1202) PASS: lldb-shell :: Breakpoint/debug_rnglist_rlestartend.test (584 of 1202) UNSUPPORTED: lldb-api :: iohandler/resize/TestIOHandlerResizeNoEditline.py (585 of 1202) PASS: lldb-api :: functionalities/data-formatter/compactvectors/TestCompactVectors.py (586 of 1202) PASS: lldb-api :: functionalities/data-formatter/builtin-formats/TestBuiltinFormats.py (587 of 1202) PASS: lldb-shell :: SymbolFile/DWARF/debug_rnglists-dwo.s (588 of 1202) PASS: lldb-api :: commands/frame/diagnose/bad-reference/TestBadReference.py (589 of 1202) UNSUPPORTED: lldb-api :: commands/expression/import-std-module/shared_ptr-dbg-info-content/TestSharedPtrDbgInfoContentFromStdModule.py (590 of 1202) PASS: lldb-shell :: ObjectFile/Breakpad/breakpad-identification.test (591 of 1202) PASS: lldb-shell :: Settings/TestFrameFormatMangling.test (592 of 1202) PASS: lldb-api :: commands/frame/diagnose/array/TestArray.py (593 of 1202) PASS: lldb-api :: functionalities/data-formatter/cstring-utf8-summary/TestCstringUnicode.py (594 of 1202) PASS: lldb-api :: functionalities/tail_call_frames/thread_step_out_or_return/TestSteppingOutWithArtificialFrames.py (595 of 1202) PASS: lldb-api :: functionalities/set-data/TestSetData.py (596 of 1202) PASS: lldb-api :: functionalities/tail_call_frames/sbapi_support/TestTailCallFrameSBAPI.py (597 of 1202) PASS: lldb-api :: functionalities/thread/crash_during_step/TestCrashDuringStep.py (598 of 1202) PASS: lldb-api :: python_api/lldbutil/TestSwigVersion.py (599 of 1202) PASS: lldb-api :: tools/lldb-server/TestGdbRemoteAttach.py (600 of 1202) PASS: lldb-api :: functionalities/signal/raise/TestRaise.py (601 of 1202) PASS: lldb-shell :: ObjectFile/ELF/PT_LOAD-overlap.yaml (602 of 1202) UNSUPPORTED: lldb-api :: functionalities/darwin_log/filter/regex/message/TestDarwinLogFilterRegexMessage.py (603 of 1202) UNSUPPORTED: lldb-shell :: ScriptInterpreter/Lua/independent_state.test (604 of 1202) PASS: lldb-api :: python_api/value/change_values/TestChangeValueAPI.py (605 of 1202) PASS: lldb-api :: functionalities/unwind/noreturn/module-end/TestNoReturnModuleEnd.py (606 of 1202) PASS: lldb-shell :: Driver/TestSingleQuote.test (607 of 1202) UNSUPPORTED: lldb-shell :: SymbolFile/PDB/variables-locations.test (608 of 1202) PASS: lldb-api :: lang/objcxx/cxx-bridged-po/TestObjCXXBridgedPO.py (609 of 1202) UNSUPPORTED: lldb-shell :: SymbolFile/DWARF/debug_loc.s (610 of 1202) PASS: lldb-shell :: Breakpoint/dummy-target.test (611 of 1202) PASS: lldb-api :: python_api/value/empty_class/TestValueAPIEmptyClass.py (612 of 1202) PASS: lldb-api :: commands/reproducer/invalid-args/TestInvalidArgsReproducer.py (613 of 1202) PASS: lldb-api :: functionalities/thread/concurrent_events/TestConcurrentWatchpointWithDelayWatchpointThreads.py (614 of 1202) UNSUPPORTED: lldb-api :: functionalities/unwind/standard/TestStandardUnwind.py (615 of 1202) PASS: lldb-api :: python_api/thread/TestThreadAPI.py (616 of 1202) UNSUPPORTED: lldb-shell :: Reproducer/TestWorkingDir.test (617 of 1202) UNSUPPORTED: lldb-shell :: Reproducer/TestDSYM.test (618 of 1202) PASS: lldb-api :: commands/expression/import_builtin_fileid/TestImportBuiltinFileID.py (619 of 1202) UNSUPPORTED: lldb-api :: tools/lldb-server/platform-process-connect/TestPlatformProcessConnect.py (620 of 1202) PASS: lldb-api :: functionalities/thread/concurrent_events/TestConcurrentDelayedCrashWithBreakpointSignal.py (621 of 1202) PASS: lldb-api :: macosx/DBGSourcePathRemapping/TestDSYMSourcePathRemapping.py (622 of 1202) PASS: lldb-api :: functionalities/postmortem/minidump-new/TestMiniDumpUUID.py (623 of 1202) PASS: lldb-shell :: SymbolFile/DWARF/inline-function-address.ll (624 of 1202) PASS: lldb-api :: functionalities/gdb_remote_client/TestJLink6Armv7RegisterDefinition.py (625 of 1202) PASS: lldb-api :: functionalities/gdb_remote_client/TestStopPCs.py (626 of 1202) PASS: lldb-api :: macosx/save_crashlog/TestSaveCrashlog.py (627 of 1202) UNSUPPORTED: lldb-api :: functionalities/darwin_log/source/info/TestDarwinLogSourceInfo.py (628 of 1202) UNSUPPORTED: lldb-shell :: Unwind/eh-frame-augment-noop.test (629 of 1202) PASS: lldb-api :: functionalities/thread/concurrent_events/TestConcurrentManyBreakpoints.py (630 of 1202) PASS: lldb-api :: lang/c/local_variables/TestLocalVariables.py (631 of 1202) PASS: lldb-api :: python_api/exprpath_synthetic/TestExprPathSynthetic.py (632 of 1202) UNSUPPORTED: lldb-shell :: ScriptInterpreter/Lua/convenience_variables.test (633 of 1202) PASS: lldb-api :: functionalities/data-formatter/data-formatter-stl/libcxx/bitset/TestDataFormatterLibcxxBitset.py (634 of 1202) PASS: lldb-api :: functionalities/data-formatter/data-formatter-categories/TestDataFormatterCategories.py (635 of 1202) PASS: lldb-shell :: Breakpoint/case-sensitive.test (636 of 1202) PASS: lldb-shell :: Settings/TestFrameFormatColor.test (637 of 1202) PASS: lldb-api :: python_api/hello_world/TestHelloWorld.py (638 of 1202) PASS: lldb-api :: lang/cpp/type_lookup/TestCppTypeLookup.py (639 of 1202) UNSUPPORTED: lldb-api :: tools/lldb-vscode/step/TestVSCode_step.py (640 of 1202) PASS: lldb-api :: lang/objc/modules-auto-import/TestModulesAutoImport.py (641 of 1202) UNSUPPORTED: lldb-api :: functionalities/darwin_log/filter/regex/category/TestDarwinLogFilterRegexCategory.py (642 of 1202) PASS: lldb-shell :: SymbolFile/DWARF/find-function-regex.cpp (643 of 1202) UNSUPPORTED: lldb-api :: functionalities/tty/TestTerminal.py (644 of 1202) UNSUPPORTED: lldb-shell :: Reproducer/TestMultipleTargets.test (645 of 1202) PASS: lldb-api :: lang/c/forward/TestForwardDeclaration.py (646 of 1202) UNSUPPORTED: lldb-shell :: Register/x86-64-zmm-read.test (647 of 1202) PASS: lldb-api :: functionalities/unwind/noreturn/TestNoreturnUnwind.py (648 of 1202) UNSUPPORTED: lldb-api :: tools/lldb-vscode/launch/TestVSCode_launch.py (649 of 1202) PASS: lldb-api :: python_api/lldbutil/frame/TestFrameUtils.py (650 of 1202) PASS: lldb-api :: lang/objc/foundation/TestConstStrings.py (651 of 1202) UNSUPPORTED: lldb-shell :: SymbolFile/PDB/function-nested-block.test (652 of 1202) PASS: lldb-api :: commands/expression/radar_9531204/TestPrintfAfterUp.py (653 of 1202) PASS: lldb-api :: commands/watchpoints/watchpoint_set_command/TestWatchLocationWithWatchSet.py (654 of 1202) PASS: lldb-api :: tools/lldb-server/TestGdbRemoteProcessInfo.py (655 of 1202) PASS: lldb-shell :: Heap/heap-cstr.test (656 of 1202) PASS: lldb-api :: terminal/TestSTTYBeforeAndAfter.py (657 of 1202) PASS: lldb-api :: functionalities/postmortem/minidump/TestMiniDump.py (658 of 1202) UNSUPPORTED: lldb-api :: benchmarks/continue/TestBenchmarkContinue.py (659 of 1202) PASS: lldb-api :: functionalities/breakpoint/breakpoint_options/TestBreakpointOptions.py (660 of 1202) PASS: lldb-api :: lang/cpp/limit-debug-info/TestWithLimitDebugInfo.py (661 of 1202) PASS: lldb-shell :: BuildScript/modes.test (662 of 1202) PASS: lldb-api :: functionalities/var_path/TestVarPath.py (663 of 1202) XFAIL: lldb-shell :: Register/x86-mm-xmm-write.test (664 of 1202) UNSUPPORTED: lldb-api :: functionalities/process_group/TestChangeProcessGroup.py (665 of 1202) PASS: lldb-api :: commands/expression/scoped_enums/TestScopedEnumType.py (666 of 1202) PASS: lldb-api :: functionalities/data-formatter/data-formatter-stl/libcxx/list/loop/TestDataFormatterLibcxxListLoop.py (667 of 1202) PASS: lldb-api :: lang/objc/objc-dyn-sbtype/TestObjCDynamicSBType.py (668 of 1202) PASS: lldb-api :: lang/cpp/bitfields/TestCppBitfields.py (669 of 1202) PASS: lldb-api :: commands/expression/test/TestExprs2.py (670 of 1202) PASS: lldb-shell :: SymbolFile/DWARF/dir-separator-posix.s (671 of 1202) UNSUPPORTED: lldb-shell :: Reproducer/Modules/TestModuleCXX.test (672 of 1202) UNSUPPORTED: lldb-api :: tools/lldb-vscode/breakpoint-events/TestVSCode_breakpointEvents.py (673 of 1202) PASS: lldb-api :: functionalities/thread/concurrent_events/TestConcurrentTwoBreakpointThreads.py (674 of 1202) PASS: lldb-shell :: Driver/TestNoUseColor.test (675 of 1202) PASS: lldb-shell :: SymbolFile/DWARF/dwarf5-debug_line.s (676 of 1202) PASS: lldb-shell :: SymbolFile/DWARF/win-i386-line-table.s (677 of 1202) PASS: lldb-api :: lang/cpp/unicode-literals/TestUnicodeLiterals.py (678 of 1202) PASS: lldb-shell :: SymbolFile/DWARF/debug_aranges-empty-section.s (679 of 1202) UNSUPPORTED: lldb-api :: commands/expression/expr-in-syscall/TestExpressionInSyscall.py (680 of 1202) PASS: lldb-api :: driver/batch_mode/TestBatchMode.py (681 of 1202) PASS: lldb-api :: commands/breakpoint/command/list/TestBreakpointCommandList.py (682 of 1202) UNSUPPORTED: lldb-api :: functionalities/thread/create_during_step/TestCreateDuringStep.py (683 of 1202) PASS: lldb-api :: python_api/name_lookup/TestNameLookup.py (684 of 1202) PASS: lldb-shell :: SymbolFile/Breakpad/line-table-mixed-path-styles.test (685 of 1202) PASS: lldb-api :: tools/lldb-server/inferior-crash/TestGdbRemoteSegFault.py (686 of 1202) UNSUPPORTED: lldb-api :: python_api/event/TestEvents.py (687 of 1202) PASS: lldb-api :: iohandler/completion/TestIOHandlerCompletion.py (688 of 1202) PASS: lldb-shell :: SymbolFile/DWARF/dwarf5_locations.s (689 of 1202) PASS: lldb-shell :: SymbolFile/NativePDB/break-by-line.cpp (690 of 1202) PASS: lldb-api :: lang/cpp/bool/TestCPPBool.py (691 of 1202) PASS: lldb-api :: commands/watchpoints/watchpoint_commands/command/TestWatchpointCommandLLDB.py (692 of 1202) UNSUPPORTED: lldb-api :: commands/expression/import-std-module/vector/TestVectorFromStdModule.py (693 of 1202) UNSUPPORTED: lldb-shell :: Unwind/eh-frame-small-fde.test (694 of 1202) PASS: lldb-api :: functionalities/data-formatter/data-formatter-stl/libcxx/unordered/TestDataFormatterUnordered.py (695 of 1202) PASS: lldb-shell :: ObjectFile/ELF/PT_TLS-overlap-PT_LOAD.yaml (696 of 1202) PASS: lldb-api :: commands/watchpoints/watchpoint_size/TestWatchpointSizes.py (697 of 1202) PASS: lldb-api :: lang/cpp/typeof/TestTypeOfDeclTypeExpr.py (698 of 1202) PASS: lldb-api :: functionalities/tail_call_frames/cross_object/TestCrossObjectTailCalls.py (699 of 1202) PASS: lldb-api :: lang/objc/hidden-ivars/TestHiddenIvars.py (700 of 1202) PASS: lldb-shell :: Commands/command-regex-delete.test (701 of 1202) PASS: lldb-api :: functionalities/inline-stepping/TestInlineStepping.py (702 of 1202) PASS: lldb-shell :: SymbolFile/DWARF/debug-types-dwarf5.s (703 of 1202) PASS: lldb-api :: functionalities/data-formatter/type_summary_list_script/TestTypeSummaryListScript.py (704 of 1202) UNSUPPORTED: lldb-api :: lang/objc/modules/TestObjCModules.py (705 of 1202) UNSUPPORTED: lldb-api :: tools/lldb-vscode/breakpoint/TestVSCode_setBreakpoints.py (706 of 1202) PASS: lldb-shell :: ObjectFile/wasm/embedded-debug-sections.yaml (707 of 1202) PASS: lldb-api :: lang/cpp/this_class_type_mixing/TestThisClassTypeMixing.py (708 of 1202) UNSUPPORTED: lldb-api :: commands/expression/import-std-module/forward_list-dbg-info-content/TestDbgInfoContentForwardListFromStdModule.py (709 of 1202) PASS: lldb-api :: tools/lldb-server/commandline/TestStubSetSID.py (710 of 1202) UNSUPPORTED: lldb-api :: commands/expression/import-std-module/sysroot/TestStdModuleSysroot.py (711 of 1202) PASS: lldb-api :: lang/cpp/extern_c/TestExternCSymbols.py (712 of 1202) PASS: lldb-shell :: Process/Optimization.test (713 of 1202) PASS: lldb-api :: functionalities/data-formatter/data-formatter-stl/libcxx/iterator/TestDataFormatterLibccIterator.py (714 of 1202) PASS: lldb-shell :: Register/x86-64-gp-read.test (715 of 1202) PASS: lldb-api :: commands/add-dsym/uuid/TestAddDsymCommand.py (716 of 1202) UNSUPPORTED: lldb-api :: commands/register/register/intel_xtended_registers/mpx_offset_intersection/TestMPXOffsetIntersection.py (717 of 1202) PASS: lldb-api :: functionalities/target-new-solib-notifications/TestModuleLoadedNotifys.py (718 of 1202) PASS: lldb-api :: lang/objc/objc-ivar-offsets/TestObjCIvarOffsets.py (719 of 1202) PASS: lldb-api :: functionalities/gdb_remote_client/TestArmRegisterDefinition.py (720 of 1202) PASS: lldb-api :: types/TestCharTypeExpr.py (721 of 1202) PASS: lldb-api :: functionalities/postmortem/elf-core/gcore/TestGCore.py (722 of 1202) PASS: lldb-api :: tools/lldb-server/TestGdbRemote_vCont.py (723 of 1202) PASS: lldb-shell :: SymbolFile/DWARF/split-dwarf-multiple-cu.ll (724 of 1202) PASS: lldb-api :: commands/command/nested_alias/TestNestedAlias.py (725 of 1202) PASS: lldb-api :: commands/frame/var-scope/TestFrameVariableScope.py (726 of 1202) PASS: lldb-api :: functionalities/tsan/global_location/TestTsanGlobalLocation.py (727 of 1202) PASS: lldb-api :: lang/objc/foundation/TestObjCMethodsNSError.py (728 of 1202) PASS: lldb-api :: lang/cpp/unsigned_types/TestUnsignedTypes.py (729 of 1202) UNSUPPORTED: lldb-api :: lang/objc/modules-update/TestClangModulesUpdate.py (730 of 1202) UNSUPPORTED: lldb-shell :: ScriptInterpreter/Lua/breakpoint_callback.test (731 of 1202) PASS: lldb-api :: functionalities/type_lookup/TestTypeLookup.py (732 of 1202) UNSUPPORTED: lldb-api :: functionalities/breakpoint/hardware_breakpoints/hardware_breakpoint_on_multiple_threads/TestHWBreakMultiThread.py (733 of 1202) UNSUPPORTED: lldb-api :: functionalities/thread/state/TestThreadStates.py (734 of 1202) UNSUPPORTED: lldb-api :: benchmarks/frame_variable/TestFrameVariableResponse.py (735 of 1202) UNSUPPORTED: lldb-api :: commands/expression/import-std-module/unique_ptr-dbg-info-content/TestUniquePtrDbgInfoContent.py (736 of 1202) PASS: lldb-api :: lang/objc/variadic_methods/TestVariadicMethods.py (737 of 1202) PASS: lldb-api :: lang/c/stepping/TestThreadStepping.py (738 of 1202) PASS: lldb-shell :: SymbolFile/DWARF/childless-compile-unit.s (739 of 1202) UNSUPPORTED: lldb-shell :: Reproducer/TestSynchronous.test (740 of 1202) PASS: lldb-api :: functionalities/signal/handle-abrt/TestHandleAbort.py (741 of 1202) PASS: lldb-api :: commands/settings/TestSettings.py (742 of 1202) PASS: lldb-api :: lang/cpp/chained-calls/TestCppChainedCalls.py (743 of 1202) UNSUPPORTED: lldb-api :: functionalities/breakpoint/breakpoint_set_restart/TestBreakpointSetRestart.py (744 of 1202) PASS: lldb-shell :: ObjectFile/ELF/PT_LOAD-overlap-PT_TLS.yaml (745 of 1202) PASS: lldb-api :: python_api/module_section/TestModuleAndSection.py (746 of 1202) PASS: lldb-api :: api/command-return-object/TestSBCommandReturnObject.py (747 of 1202) UNSUPPORTED: lldb-api :: python_api/file_handle/TestFileHandle.py (748 of 1202) PASS: lldb-api :: python_api/sbvalue_const_addrof/TestSBValueConstAddrOf.py (749 of 1202) PASS: lldb-shell :: SymbolFile/DWARF/dir-separator-no-comp-dir-relative-name.s (750 of 1202) PASS: lldb-api :: functionalities/breakpoint/breakpoint_names/TestBreakpointNames.py (751 of 1202) PASS: lldb-api :: functionalities/data-formatter/data-formatter-objc/TestDataFormatterObjCNSURL.py (752 of 1202) PASS: lldb-shell :: Commands/command-target-modules-dump-sections.yaml (753 of 1202) PASS: lldb-api :: lang/cpp/char1632_t/TestChar1632T.py (754 of 1202) PASS: lldb-api :: commands/expression/persistent_types/TestNestedPersistentTypes.py (755 of 1202) PASS: lldb-api :: python_api/formatters/TestFormattersSBAPI.py (756 of 1202) PASS: lldb-shell :: ObjectFile/MachO/lc_build_version_notools.yaml (757 of 1202) PASS: lldb-shell :: Driver/TestUseColor.test (758 of 1202) PASS: lldb-api :: functionalities/breakpoint/breakpoint_callback_command_source/TestBreakpointCallbackCommandSource.py (759 of 1202) PASS: lldb-shell :: SymbolFile/Breakpad/symtab-macho.test (760 of 1202) PASS: lldb-api :: functionalities/data-formatter/boolreference/TestFormattersBoolRefPtr.py (761 of 1202) PASS: lldb-api :: commands/expression/options/TestExprOptions.py (762 of 1202) PASS: lldb-shell :: Quit/TestQuitExitCodeHex0.test (763 of 1202) PASS: lldb-shell :: ObjectFile/ELF/minidebuginfo-find-symbols.yaml (764 of 1202) PASS: lldb-api :: functionalities/asan/TestMemoryHistory.py (765 of 1202) PASS: lldb-api :: functionalities/thread/ignore_suspended/TestIgnoreSuspendedThread.py (766 of 1202) UNSUPPORTED: lldb-api :: functionalities/data-formatter/data-formatter-stl/libstdcpp/iterator/TestDataFormatterStdIterator.py (767 of 1202) PASS: lldb-api :: lang/objc/objc++/TestObjCXX.py (768 of 1202) UNSUPPORTED: lldb-shell :: Driver/TestFile.test (769 of 1202) PASS: lldb-api :: lang/cpp/diamond/TestDiamond.py (770 of 1202) UNSUPPORTED: lldb-api :: functionalities/deleted-executable/TestDeletedExecutable.py (771 of 1202) PASS: lldb-api :: commands/target/create-no-such-arch/TestNoSuchArch.py (772 of 1202) UNSUPPORTED: lldb-api :: tools/lldb-server/TestGdbRemote_vContThreads.py (773 of 1202) PASS: lldb-shell :: VSCode/TestOptions.test (774 of 1202) PASS: lldb-shell :: ObjectFile/PECOFF/basic-info.yaml (775 of 1202) UNSUPPORTED: lldb-shell :: Reproducer/Functionalities/TestStepping.test (776 of 1202) PASS: lldb-api :: lang/c/stepping/TestStepAndBreakpoints.py (777 of 1202) PASS: lldb-shell :: Unwind/eh-frame-dwarf-unwind.test (778 of 1202) PASS: lldb-api :: functionalities/ubsan/basic/TestUbsanBasic.py (779 of 1202) PASS: lldb-shell :: Breakpoint/implicit_const_form_support.test (780 of 1202) PASS: lldb-shell :: SymbolFile/DWARF/find-method-local-struct.cpp (781 of 1202) PASS: lldb-shell :: SymbolFile/Breakpad/stack-cfi-arm.yaml (782 of 1202) PASS: lldb-api :: macosx/duplicate-archive-members/TestDuplicateMembers.py (783 of 1202) UNSUPPORTED: lldb-api :: functionalities/unwind/ehframe/TestEhFrameUnwind.py (784 of 1202) UNSUPPORTED: lldb-api :: tools/lldb-server/registers-target-xml-reading/TestGdbRemoteTargetXmlPacket.py (785 of 1202) UNSUPPORTED: lldb-shell :: Reproducer/TestGDBRemoteRepro.test (786 of 1202) PASS: lldb-api :: commands/expression/namespace_local_var_same_name_cpp_and_c/TestNamespaceLocalVarSameNameCppAndC.py (787 of 1202) UNSUPPORTED: lldb-api :: functionalities/data-formatter/data-formatter-stl/libstdcpp/map/TestDataFormatterStdMap.py (788 of 1202) PASS: lldb-shell :: SymbolFile/NativePDB/nested-types.cpp (789 of 1202) PASS: lldb-api :: functionalities/tsan/basic/TestTsanBasic.py (790 of 1202) UNSUPPORTED: lldb-api :: python_api/sbdata/TestSBData.py (791 of 1202) UNSUPPORTED: lldb-shell :: Reproducer/TestDump.test (792 of 1202) PASS: lldb-api :: functionalities/data-formatter/data-formatter-stl/libcxx/multiset/TestDataFormatterLibcxxMultiSet.py (793 of 1202) PASS: lldb-api :: lang/cpp/multiple-inheritance/TestCppMultipleInheritance.py (794 of 1202) PASS: lldb-shell :: ObjectFile/PECOFF/basic-info-arm.yaml (795 of 1202) PASS: lldb-api :: macosx/add-dsym/TestAddDsymMidExecutionCommand.py (796 of 1202) UNSUPPORTED: lldb-api :: commands/process/attach-resume/TestAttachResume.py (797 of 1202) PASS: lldb-api :: functionalities/gdb_remote_client/TestRecognizeBreakpoint.py (798 of 1202) PASS: lldb-api :: commands/expression/radar_8638051/Test8638051.py (799 of 1202) PASS: lldb-shell :: SymbolFile/DWARF/find-variable-file.cpp (800 of 1202) UNSUPPORTED: lldb-api :: tools/lldb-vscode/completions/TestVSCode_completions.py (801 of 1202) PASS: lldb-api :: types/TestShortType.py (802 of 1202) PASS: lldb-api :: lang/objc/objc-static-method/TestObjCStaticMethod.py (803 of 1202) PASS: lldb-api :: lang/c/shared_lib_stripped_symbols/TestSharedLibStrippedSymbols.py (804 of 1202) PASS: lldb-api :: lang/objc/objc-new-syntax/TestObjCNewSyntaxLiteral.py (805 of 1202) PASS: lldb-api :: functionalities/breakpoint/cpp/TestCPPBreakpointLocations.py (806 of 1202) UNSUPPORTED: lldb-api :: linux/mix-dwo-and-regular-objects/TestMixedDwarfBinary.py (807 of 1202) PASS: lldb-api :: lang/cpp/operator-overload/TestOperatorOverload.py (808 of 1202) UNSUPPORTED: lldb-api :: macosx/simulator/TestSimulatorPlatform.py (809 of 1202) UNSUPPORTED: lldb-api :: python_api/interpreter/TestRunCommandInterpreterAPI.py (810 of 1202) PASS: lldb-api :: functionalities/inferior-crashing/TestInferiorCrashingStep.py (811 of 1202) PASS: lldb-api :: commands/expression/rdar44436068/Test128BitsInteger.py (812 of 1202) UNSUPPORTED: lldb-api :: tools/lldb-vscode/module/TestVSCode_module.py (813 of 1202) PASS: lldb-api :: functionalities/gdb_remote_client/TestTargetXMLArch.py (814 of 1202) UNSUPPORTED: lldb-api :: tools/lldb-vscode/disconnect/TestVSCode_disconnect.py (815 of 1202) UNSUPPORTED: lldb-api :: functionalities/inferior-changed/TestInferiorChanged.py (816 of 1202) PASS: lldb-api :: lang/cpp/rvalue-references/TestRvalueReferences.py (817 of 1202) PASS: lldb-api :: lang/cpp/global_variables/TestCPPGlobalVariables.py (818 of 1202) PASS: lldb-api :: lang/objc/modules-hash-mismatch/TestClangModulesHashMismatch.py (819 of 1202) PASS: lldb-shell :: SymbolFile/NativePDB/s_constant.cpp (820 of 1202) PASS: lldb-api :: commands/frame/recognizer/TestFrameRecognizer.py (821 of 1202) PASS: lldb-api :: python_api/frame/TestFrames.py (822 of 1202) PASS: lldb-api :: functionalities/breakpoint/address_breakpoints/TestAddressBreakpoints.py (823 of 1202) PASS: lldb-api :: functionalities/data-formatter/data-formatter-stl/libcxx/multimap/TestDataFormatterLibccMultiMap.py (824 of 1202) PASS: lldb-shell :: ObjectFile/wasm/basic.yaml (825 of 1202) PASS: lldb-api :: functionalities/process_crash_info/TestProcessCrashInfo.py (826 of 1202) PASS: lldb-api :: lang/objc/ptr_refs/TestPtrRefsObjC.py (827 of 1202) UNSUPPORTED: lldb-shell :: Reproducer/Functionalities/TestExpressionEvaluation.test (828 of 1202) PASS: lldb-api :: functionalities/data-formatter/data-formatter-objc/TestDataFormatterObjCNSData.py (829 of 1202) UNSUPPORTED: lldb-api :: commands/expression/import-std-module/conflicts/TestStdModuleWithConflicts.py (830 of 1202) PASS: lldb-shell :: SymbolFile/DWARF/dwarf5-index-is-used.cpp (831 of 1202) PASS: lldb-shell :: Commands/command-source.test (832 of 1202) UNSUPPORTED: lldb-shell :: Register/arm-gp-read.test (833 of 1202) UNSUPPORTED: lldb-api :: commands/watchpoints/variable_out_of_scope/TestWatchedVarHitWhenInScope.py (834 of 1202) PASS: lldb-api :: macosx/queues/TestQueues.py (835 of 1202) PASS: lldb-api :: lang/cpp/const_this/TestConstThis.py (836 of 1202) UNSUPPORTED: lldb-api :: python_api/symbol-context/TestSymbolContext.py (837 of 1202) PASS: lldb-api :: lang/objc/objc-ivar-protocols/TestIvarProtocols.py (838 of 1202) PASS: lldb-api :: lang/c/step_over_no_deadlock/TestStepOverDoesntBlock.py (839 of 1202) PASS: lldb-api :: functionalities/memory-region/TestMemoryRegion.py (840 of 1202) UNSUPPORTED: lldb-api :: linux/sepdebugsymlink/TestTargetSymbolsSepDebugSymlink.py (841 of 1202) PASS: lldb-shell :: Unwind/trap_frame_sym_ctx.test (842 of 1202) PASS: lldb-shell :: ObjectFile/PECOFF/disassemble-thumb.yaml (843 of 1202) PASS: lldb-shell :: ScriptInterpreter/Python/eof.test (844 of 1202) PASS: lldb-api :: functionalities/thread/step_until/TestStepUntil.py (845 of 1202) PASS: lldb-api :: functionalities/data-formatter/data-formatter-advanced/TestDataFormatterAdv.py (846 of 1202) UNSUPPORTED: lldb-api :: tools/lldb-vscode/stackTrace/TestVSCode_stackTrace.py (847 of 1202) PASS: lldb-api :: functionalities/postmortem/mach-core/TestMachCore.py (848 of 1202) UNSUPPORTED: lldb-api :: functionalities/darwin_log/source/debug/TestDarwinLogSourceDebug.py (849 of 1202) PASS: lldb-api :: commands/expression/deleting-implicit-copy-constructor/TestDeletingImplicitCopyConstructor.py (850 of 1202) PASS: lldb-api :: python_api/sbstructureddata/TestStructuredDataAPI.py (851 of 1202) PASS: lldb-api :: commands/expression/top-level/TestTopLevelExprs.py (852 of 1202) PASS: lldb-api :: functionalities/thread/concurrent_events/TestConcurrentSignalBreak.py (853 of 1202) PASS: lldb-api :: functionalities/non-overlapping-index-variable-i/TestIndexVariable.py (854 of 1202) PASS: lldb-api :: functionalities/data-formatter/data-formatter-caching/TestDataFormatterCaching.py (855 of 1202) PASS: lldb-shell :: SymbolFile/DWARF/debug-line-basic.s (856 of 1202) UNSUPPORTED: lldb-api :: lang/objc/foundation/TestRuntimeTypes.py (857 of 1202) UNSUPPORTED: lldb-shell :: Register/x86-64-zmm-write.test (858 of 1202) UNSUPPORTED: lldb-api :: android/platform/TestDefaultCacheLineSize.py (859 of 1202) PASS: lldb-api :: commands/expression/xvalue/TestXValuePrinting.py (860 of 1202) PASS: lldb-api :: commands/quit/TestQuit.py (861 of 1202) PASS: lldb-shell :: SymbolFile/DWARF/split-dwarf-inlining.cpp (862 of 1202) PASS: lldb-api :: api/check_public_api_headers/TestPublicAPIHeaders.py (863 of 1202) UNSUPPORTED: lldb-api :: functionalities/data-formatter/data-formatter-stl/libstdcpp/tuple/TestDataFormatterStdTuple.py (864 of 1202) PASS: lldb-api :: commands/expression/dollar-in-variable/TestDollarInVariable.py (865 of 1202) PASS: lldb-api :: commands/expression/pr35310/TestExprsBug35310.py (866 of 1202) PASS: lldb-api :: functionalities/jitloader_gdb/TestJITLoaderGDB.py (867 of 1202) PASS: lldb-api :: functionalities/breakpoint/scripted_bkpt/TestScriptedResolver.py (868 of 1202) PASS: lldb-api :: python_api/watchpoint/TestWatchpointIgnoreCount.py (869 of 1202) UNSUPPORTED: lldb-shell :: Register/x86-zmm-read.test (870 of 1202) PASS: lldb-api :: functionalities/thread/concurrent_events/TestConcurrentDelaySignalWatch.py (871 of 1202) PASS: lldb-api :: functionalities/breakpoint/breakpoint_conditions/TestBreakpointConditions.py (872 of 1202) PASS: lldb-shell :: SymbolFile/DWARF/gnu-style-compression.cpp (873 of 1202) UNSUPPORTED: lldb-api :: benchmarks/libcxxmap/TestBenchmarkLibcxxMap.py (874 of 1202) UNSUPPORTED: lldb-api :: tools/lldb-server/signal-filtering/TestGdbRemote_QPassSignals.py (875 of 1202) PASS: lldb-api :: functionalities/data-formatter/data-formatter-ptr-to-array/TestPtrToArrayFormatting.py (876 of 1202) PASS: lldb-api :: functionalities/data-formatter/data-formatter-enum-format/TestDataFormatterEnumFormat.py (877 of 1202) PASS: lldb-api :: functionalities/thread/concurrent_events/TestConcurrentWatchpointDelayWatchpointOneBreakpoint.py (878 of 1202) UNSUPPORTED: lldb-shell :: BuildScript/toolchain-msvc.test (879 of 1202) PASS: lldb-api :: lang/cpp/typedef/TestCppTypedef.py (880 of 1202) UNSUPPORTED: lldb-shell :: BuildScript/toolchain-clang-cl.test (881 of 1202) PASS: lldb-api :: functionalities/data-formatter/data-formatter-stl/libcxx/list/TestDataFormatterLibcxxList.py (882 of 1202) PASS: lldb-api :: python_api/section/TestSectionAPI.py (883 of 1202) PASS: lldb-api :: lang/objc/bitfield_ivars/TestBitfieldIvars.py (884 of 1202) PASS: lldb-api :: functionalities/multiword-commands/TestMultiWordCommands.py (885 of 1202) PASS: lldb-api :: commands/watchpoints/multiple_hits/TestMultipleHits.py (886 of 1202) PASS: lldb-api :: functionalities/data-formatter/typedef_array/TestTypedefArray.py (887 of 1202) PASS: lldb-shell :: ObjectFile/ELF/avr-basic-info.yaml (888 of 1202) PASS: lldb-api :: functionalities/thread/concurrent_events/TestConcurrentBreakpointOneDelayBreakpointThreads.py (889 of 1202) UNSUPPORTED: lldb-api :: functionalities/darwin_log/filter/regex/activity/TestDarwinLogFilterRegexActivity.py (890 of 1202) PASS: lldb-api :: commands/log/basic/TestLogging.py (891 of 1202) PASS: lldb-api :: functionalities/breakpoint/consecutive_breakpoints/TestConsecutiveBreakpoints.py (892 of 1202) PASS: lldb-api :: functionalities/data-formatter/data-formatter-named-summaries/TestDataFormatterNamedSummaries.py (893 of 1202) UNSUPPORTED: lldb-shell :: Expr/TestIRMemoryMapWindows.test (894 of 1202) PASS: lldb-shell :: Minidump/Windows/Sigsegv/sigsegv.test (895 of 1202) UNSUPPORTED: lldb-shell :: ObjectFile/ELF/minidebuginfo-no-lzma.yaml (896 of 1202) PASS: lldb-api :: commands/expression/inline-namespace/TestInlineNamespace.py (897 of 1202) PASS: lldb-api :: lang/cpp/frame-var-anon-unions/TestFrameVariableAnonymousUnions.py (898 of 1202) PASS: lldb-api :: python_api/sbvalue_persist/TestSBValuePersist.py (899 of 1202) PASS: lldb-api :: functionalities/data-formatter/poarray/TestPrintObjectArray.py (900 of 1202) UNSUPPORTED: lldb-shell :: Reproducer/TestDriverOptions.test (901 of 1202) PASS: lldb-api :: python_api/lldbutil/iter/TestLLDBIterator.py (902 of 1202) UNSUPPORTED: lldb-api :: functionalities/data-formatter/data-formatter-stl/libstdcpp/unique_ptr/TestDataFormatterStdUniquePtr.py (903 of 1202) PASS: lldb-api :: functionalities/thread/create_after_attach/TestCreateAfterAttach.py (904 of 1202) UNSUPPORTED: lldb-shell :: Process/Windows/exception_access_violation.cpp (905 of 1202) PASS: lldb-api :: lang/objc/objc-foundation-dictionary-empty/TestNSDictionary0.py (906 of 1202) UNSUPPORTED: lldb-shell :: SymbolFile/PDB/vbases.test (907 of 1202) PASS: lldb-shell :: Watchpoint/SetErrorCases.test (908 of 1202) PASS: lldb-api :: functionalities/thread/step_out/TestThreadStepOut.py (909 of 1202) PASS: lldb-api :: commands/command/source/TestCommandSource.py (910 of 1202) PASS: lldb-api :: functionalities/data-formatter/data-formatter-python-synth/TestDataFormatterPythonSynth.py (911 of 1202) UNSUPPORTED: lldb-api :: commands/expression/import-std-module/weak_ptr/TestWeakPtrFromStdModule.py (912 of 1202) PASS: lldb-api :: lang/objc/objc-checker/TestObjCCheckers.py (913 of 1202) PASS: lldb-shell :: SymbolFile/DWARF/DW_TAG_variable-invalid_location.s (914 of 1202) PASS: lldb-api :: lang/cpp/template/TestTemplateArgs.py (915 of 1202) UNSUPPORTED: lldb-api :: commands/expression/import-std-module/weak_ptr-dbg-info-content/TestDbgInfoContentWeakPtrFromStdModule.py (916 of 1202) PASS: lldb-api :: functionalities/pre_run_dylibs/TestPreRunDylibs.py (917 of 1202) UNSUPPORTED: lldb-shell :: SymbolFile/PDB/enums-layout.test (918 of 1202) PASS: lldb-api :: functionalities/tail_call_frames/unambiguous_sequence/TestUnambiguousTailCalls.py (919 of 1202) PASS: lldb-api :: functionalities/thread/concurrent_events/TestConcurrentTwoWatchpointsOneDelayBreakpoint.py (920 of 1202) UNSUPPORTED: lldb-api :: functionalities/darwin_log/filter/exact_match/subsystem/TestDarwinLogFilterMatchSubsystem.py (921 of 1202) PASS: lldb-api :: functionalities/data-formatter/type_summary_list_arg/TestTypeSummaryListArg.py (922 of 1202) UNSUPPORTED: lldb-api :: functionalities/breakpoint/hardware_breakpoints/write_memory_with_hw_breakpoint/TestWriteMemoryWithHWBreakpoint.py (923 of 1202) PASS: lldb-api :: iohandler/unicode/TestUnicode.py (924 of 1202) PASS: lldb-shell :: SymbolFile/DWARF/clang-ast-from-dwarf-objc-property.m (925 of 1202) PASS: lldb-api :: functionalities/exec/TestExec.py (926 of 1202) PASS: lldb-api :: commands/command/invalid-args/TestInvalidArgsCommand.py (927 of 1202) PASS: lldb-api :: lang/objc/objc-new-syntax/TestObjCNewSyntaxDictionary.py (928 of 1202) PASS: lldb-shell :: ObjectFile/ELF/netbsd-core-amd64.test (929 of 1202) PASS: lldb-api :: functionalities/unwind/zeroth_frame/TestZerothFrame.py (930 of 1202) PASS: lldb-api :: commands/expression/ignore-artificial-constructors/TestIgnoreArtificialConstructors.py (931 of 1202) PASS: lldb-api :: lang/cpp/virtual-functions/TestCppVirtualFunctions.py (932 of 1202) PASS: lldb-api :: python_api/sbplatform/TestSBPlatform.py (933 of 1202) PASS: lldb-api :: commands/target/stop-hook/disable/TestTargetStopHookDisable.py (934 of 1202) PASS: lldb-api :: lang/cpp/overloaded-functions/TestOverloadedFunctions.py (935 of 1202) PASS: lldb-api :: lang/cpp/class_types/TestClassTypes.py (936 of 1202) PASS: lldb-api :: lang/cpp/operators/TestCppOperators.py (937 of 1202) PASS: lldb-api :: commands/expression/context-object/TestContextObject.py (938 of 1202) UNSUPPORTED: lldb-api :: tools/lldb-server/TestGdbRemoteAuxvSupport.py (939 of 1202) PASS: lldb-api :: functionalities/data-formatter/user-format-vs-summary/TestUserFormatVsSummary.py (940 of 1202) PASS: lldb-shell :: SymbolFile/DWARF/find-basic-type.cpp (941 of 1202) UNSUPPORTED: lldb-shell :: Register/x86-ymm-read.test (942 of 1202) PASS: lldb-api :: commands/expression/weak_symbols/TestWeakSymbols.py (943 of 1202) PASS: lldb-api :: functionalities/data-formatter/nsarraysynth/TestNSArraySynthetic.py (944 of 1202) PASS: lldb-api :: lang/objc/foundation/TestObjCMethods.py (945 of 1202) PASS: lldb-api :: types/TestCharType.py (946 of 1202) PASS: lldb-api :: commands/watchpoints/watchpoint_commands/TestWatchpointCommands.py (947 of 1202) PASS: lldb-api :: functionalities/data-formatter/summary-string-onfail/Test-rdar-9974002.py (948 of 1202) UNSUPPORTED: lldb-api :: benchmarks/libcxxlist/TestBenchmarkLibcxxList.py (949 of 1202) PASS: lldb-api :: lang/cpp/modules-import/TestCXXModulesImport.py (950 of 1202) PASS: lldb-api :: python_api/findvalue_duplist/TestSBFrameFindValue.py (951 of 1202) UNSUPPORTED: lldb-shell :: SymbolFile/PDB/pointers.test (952 of 1202) PASS: lldb-api :: commands/frame/diagnose/inheritance/TestDiagnoseInheritance.py (953 of 1202) PASS: lldb-api :: functionalities/thread/concurrent_events/TestConcurrentManyWatchpoints.py (954 of 1202) PASS: lldb-shell :: Commands/CommandScriptImmediateOutput/CommandScriptImmediateOutputConsole.test (955 of 1202) PASS: lldb-shell :: ExecControl/StopHook/stop-hook.test (956 of 1202) UNSUPPORTED: lldb-api :: commands/expression/import-std-module/no-std-module/TestMissingStdModule.py (957 of 1202) PASS: lldb-api :: commands/frame/language/TestGuessLanguage.py (958 of 1202) PASS: lldb-api :: lang/cpp/nsimport/TestCppNsImport.py (959 of 1202) PASS: lldb-shell :: Minidump/breakpad-symbols.test (960 of 1202) PASS: lldb-api :: functionalities/ptr_refs/TestPtrRefs.py (961 of 1202) PASS: lldb-shell :: ObjectFile/ELF/section-types-edgecases.yaml (962 of 1202) UNSUPPORTED: lldb-api :: commands/expression/no-deadlock/TestExprDoesntBlock.py (963 of 1202) PASS: lldb-api :: functionalities/data-formatter/stringprinter/TestStringPrinter.py (964 of 1202) PASS: lldb-api :: commands/expression/call-function/TestCallStdStringFunction.py (965 of 1202) PASS: lldb-api :: functionalities/data-formatter/data-formatter-stl/libcxx/optional/TestDataFormatterLibcxxOptional.py (966 of 1202) PASS: lldb-api :: functionalities/load_unload/TestLoadUnload.py (967 of 1202) UNSUPPORTED: lldb-api :: benchmarks/stepping/TestSteppingSpeed.py (968 of 1202) PASS: lldb-api :: commands/frame/diagnose/complicated-expression/TestComplicatedExpression.py (969 of 1202) PASS: lldb-api :: types/TestIntegerTypeExpr.py (970 of 1202) PASS: lldb-api :: commands/expression/namespace_local_var_same_name_obj_c/TestNamespaceLocalVarSameNameObjC.py (971 of 1202) PASS: lldb-api :: commands/apropos/basic/TestApropos.py (972 of 1202) PASS: lldb-api :: types/TestIntegerType.py (973 of 1202) UNSUPPORTED: lldb-shell :: Watchpoint/netbsd-nouserdbregs.test (974 of 1202) PASS: lldb-api :: commands/expression/vector_of_enums/TestVectorOfEnums.py (975 of 1202) PASS: lldb-api :: functionalities/breakpoint/debugbreak/TestDebugBreak.py (976 of 1202) PASS: lldb-shell :: Quit/TestQuitExitCode0.test (977 of 1202) UNSUPPORTED: lldb-shell :: Quit/TestQuitExitCode30.test (978 of 1202) PASS: lldb-api :: functionalities/thread/concurrent_events/TestConcurrentCrashWithWatchpoint.py (979 of 1202) PASS: lldb-api :: functionalities/gdb_remote_client/TestRestartBug.py (980 of 1202) PASS: lldb-api :: functionalities/data-formatter/data-formatter-objc/cmtime/TestDataFormatterCMTime.py (981 of 1202) PASS: lldb-api :: functionalities/data-formatter/data-formatter-objc/nsstring/TestDataFormatterNSString.py (982 of 1202) PASS: lldb-api :: lang/cpp/class_static/TestStaticVariables.py (983 of 1202) PASS: lldb-api :: commands/process/launch-with-shellexpand/TestLaunchWithShellExpand.py (984 of 1202) PASS: lldb-api :: lang/cpp/class_types/TestClassTypesDisassembly.py (985 of 1202) PASS: lldb-api :: functionalities/data-formatter/data-formatter-skip-summary/TestDataFormatterSkipSummary.py (986 of 1202) PASS: lldb-shell :: BuildScript/script-args.test (987 of 1202) PASS: lldb-api :: lang/cpp/thread_local/TestThreadLocal.py (988 of 1202) PASS: lldb-api :: commands/frame/diagnose/dereference-function-return/TestDiagnoseDereferenceFunctionReturn.py (989 of 1202) PASS: lldb-api :: iohandler/resize/TestIOHandlerResize.py (990 of 1202) PASS: lldb-api :: lang/objc/objc-static-method-stripped/TestObjCStaticMethodStripped.py (991 of 1202) PASS: lldb-api :: tools/lldb-server/register-reading/TestGdbRemoteGPacket.py (992 of 1202) PASS: lldb-api :: functionalities/dead-strip/TestDeadStrip.py (993 of 1202) PASS: lldb-api :: commands/expression/ir-interpreter/TestIRInterpreter.py (994 of 1202) UNSUPPORTED: lldb-api :: functionalities/darwin_log/filter/regex/subsystem/TestDarwinLogFilterRegexSubsystem.py (995 of 1202) PASS: lldb-shell :: SymbolFile/DWARF/inline-function-address-shared.test (996 of 1202) PASS: lldb-api :: functionalities/data-formatter/data-formatter-objc/TestDataFormatterObjCNSContainer.py (997 of 1202) PASS: lldb-shell :: SymbolFile/DWARF/DW_OP_piece-smaller-than-struct.s (998 of 1202) UNSUPPORTED: lldb-api :: functionalities/darwin_log/filter/exact_match/activity/TestDarwinLogFilterMatchActivity.py (999 of 1202) PASS: lldb-shell :: Breakpoint/debug_rnglistx_rlex.test (1000 of 1202) PASS: lldb-api :: commands/expression/diagnostics/TestExprDiagnostics.py (1001 of 1202) PASS: lldb-api :: python_api/class_members/TestSBTypeClassMembers.py (1002 of 1202) UNSUPPORTED: lldb-api :: functionalities/postmortem/netbsd-core/TestNetBSDCore.py (1003 of 1202) PASS: lldb-api :: commands/expression/anonymous-struct/TestCallUserAnonTypedef.py (1004 of 1202) PASS: lldb-shell :: Recognizer/assert.test (1005 of 1202) PASS: lldb-api :: functionalities/data-formatter/nssetsynth/TestNSSetSynthetic.py (1006 of 1202) PASS: lldb-api :: sanity/TestModuleCacheSanity.py (1007 of 1202) PASS: lldb-api :: functionalities/gdb_remote_client/TestNoWatchpointSupportInfo.py (1008 of 1202) PASS: lldb-api :: tools/lldb-server/TestLldbGdbServer.py (1009 of 1202) PASS: lldb-api :: functionalities/data-formatter/synthupdate/TestSyntheticFilterRecompute.py (1010 of 1202) FAIL: lldb-shell :: Driver/TestError.test (1011 of 1202) ******************** TEST 'lldb-shell :: Driver/TestError.test' FAILED ******************** Script: -- : 'RUN: at line 1'; not /Users/buildslave/jenkins/workspace/lldb-cmake-reproducers/lldb-build/bin/lldb-repro replay --no-lldbinit -S /Users/buildslave/jenkins/workspace/lldb-cmake-reproducers/lldb-build/tools/lldb/test/Shell/lit-lldb-init --arch 2>&1 | /Users/buildslave/jenkins/workspace/lldb-cmake-reproducers/lldb-build/bin/FileCheck /Users/buildslave/jenkins/workspace/lldb-cmake-reproducers/llvm-project/lldb/test/Shell/Driver/TestError.test -- Exit Code: 1

Hide Details

Command Output (stderr): -- /Users/buildslave/jenkins/workspace/lldb-cmake-reproducers/llvm-project/lldb/test/Shell/Driver/TestError.test:2:8: error: CHECK: expected string not found in input CHECK: error: argument to '--arch' is missing ^ <stdin>:1:1: note: scanning from here error: reproducer replay failed: unable to load reproducer index ^ <stdin>:5:88: note: possible intended match here File "/Users/buildslave/jenkins/workspace/lldb-cmake-reproducers/lldb-build/bin/lldb-repro", line 65, in main ^

Hide Details

Input file: <stdin> Check file: /Users/buildslave/jenkins/workspace/lldb-cmake-reproducers/llvm-project/lldb/test/Shell/Driver/TestError.test

Hide Details

-dump-input=help explains the following input dump.

Hide Details

Input was: <<<<<< 1: error: reproducer replay failed: unable to load reproducer index check:2'0 X~~~~~~~~~~~~~~~~~~~~~~~~~~~~~~~~~~~~~~~~~~~~~~~~~~~~~~~~~~~~~~~ error: no match found 2: Traceback (most recent call last): check:2'0 ~~~~~~~~~~~~~~~~~~~~~~~~~~~~~~~~~~ 3: File "/Users/buildslave/jenkins/workspace/lldb-cmake-reproducers/lldb-build/bin/lldb-repro", line 77, in <module> check:2'0 ~~~~~~~~~~~~~~~~~~~~~~~~~~~~~~~~~~~~~~~~~~~~~~~~~~~~~~~~~~~~~~~~~~~~~~~~~~~~~~~~~~~~~~~~~~~~~~~~~~~~~~~~~~~~~~~~~~ 4: exit(main()) check:2'0 ~~~~~~~~~~~~~ 5: File "/Users/buildslave/jenkins/workspace/lldb-cmake-reproducers/lldb-build/bin/lldb-repro", line 65, in main check:2'0 ~~~~~~~~~~~~~~~~~~~~~~~~~~~~~~~~~~~~~~~~~~~~~~~~~~~~~~~~~~~~~~~~~~~~~~~~~~~~~~~~~~~~~~~~~~~~~~~~~~~~~~~~~~~~~~ check:2'1 ? possible intended match 6: with open(exit_code_path, 'r') as f: check:2'0 ~~~~~~~~~~~~~~~~~~~~~~~~~~~~~~~~~~~~~ 7: FileNotFoundError: [Errno 2] No such file or directory: '/var/folders/09/r4vw4v8n5kb67jl66zvlbljw0000gn/T/59bbd1c50faafe9cb6fa79fb0e4e9ccd/exit_code.txt' check:2'0 ~~~~~~~~~~~~~~~~~~~~~~~~~~~~~~~~~~~~~~~~~~~~~~~~~~~~~~~~~~~~~~~~~~~~~~~~~~~~~~~~~~~~~~~~~~~~~~~~~~~~~~~~~~~~~~~~~~~~~~~~~~~~~~~~~~~~~~~~~~~~~~~~~~~~~~~~~ >>>>>>

Hide Details

--

Hide Details

******************** UNSUPPORTED: lldb-shell :: SymbolFile/DWARF/split-dwarf-expression-eval-bug.cpp (1012 of 1202) UNSUPPORTED: lldb-api :: commands/expression/issue_11588/Test11588.py (1013 of 1202) PASS: lldb-shell :: SymbolFile/DWARF/find-basic-variable.cpp (1014 of 1202) PASS: lldb-api :: python_api/frame/get-variables/TestGetVariables.py (1015 of 1202) UNSUPPORTED: lldb-api :: lang/cpp/printf/TestPrintf.py (1016 of 1202) UNSUPPORTED: lldb-shell :: SymbolFile/PDB/compilands.test (1017 of 1202) PASS: lldb-api :: lang/objc/objc-class-method/TestObjCClassMethod.py (1018 of 1202) PASS: lldb-api :: macosx/find-dsym/bundle-with-dot-in-filename/TestBundleWithDotInFilename.py (1019 of 1202) PASS: lldb-api :: functionalities/data-formatter/nsdictionarysynth/TestNSDictionarySynthetic.py (1020 of 1202) PASS: lldb-api :: types/TestFloatTypesExpr.py (1021 of 1202) PASS: lldb-api :: lang/objc/objc-ivar-stripped/TestObjCIvarStripped.py (1022 of 1202) PASS: lldb-api :: lang/c/blocks/TestBlocks.py (1023 of 1202) PASS: lldb-shell :: SymbolFile/DWARF/find-inline-method.s (1024 of 1202) UNSUPPORTED: lldb-api :: arm/breakpoint-thumb-codesection/TestBreakpointThumbCodesection.py (1025 of 1202) PASS: lldb-api :: tools/lldb-server/TestGdbRemoteExpeditedRegisters.py (1026 of 1202) PASS: lldb-api :: lang/cpp/inlines/TestInlines.py (1027 of 1202) PASS: lldb-api :: functionalities/tsan/thread_numbers/TestTsanThreadNumbers.py (1028 of 1202) PASS: lldb-api :: functionalities/data-formatter/data-formatter-synthval/TestDataFormatterSynthVal.py (1029 of 1202) PASS: lldb-api :: lang/objc/modules-non-objc-target/TestObjCModulesNonObjCTarget.py (1030 of 1202) UNSUPPORTED: lldb-api :: commands/expression/import-std-module/forward_list/TestForwardListFromStdModule.py (1031 of 1202) PASS: lldb-api :: functionalities/breakpoint/breakpoint_command/TestBreakpointCommand.py (1032 of 1202) PASS: lldb-shell :: Quit/TestQuitExitCodeTooManyArgs.test (1033 of 1202) UNSUPPORTED: lldb-shell :: SymbolFile/PDB/calling-conventions.test (1034 of 1202) PASS: lldb-shell :: SymbolFile/DWARF/debug_line-relative_path.s (1035 of 1202) PASS: lldb-shell :: Settings/TestModuleCacheSanity.test (1036 of 1202) PASS: lldb-api :: lang/objc/foundation/TestObjCMethods2.py (1037 of 1202) PASS: lldb-shell :: ObjectFile/Breakpad/sections.test (1038 of 1202) UNSUPPORTED: lldb-shell :: Reproducer/TestFileRepro.test (1039 of 1202) UNSUPPORTED: lldb-shell :: SymbolFile/PDB/class-layout.test (1040 of 1202) PASS: lldb-api :: python_api/get-value-32bit-int/TestGetValue32BitInt.py (1041 of 1202) PASS: lldb-api :: python_api/symbol-context/two-files/TestSymbolContextTwoFiles.py (1042 of 1202) PASS: lldb-api :: lang/objc/radar-9691614/TestObjCMethodReturningBOOL.py (1043 of 1202) PASS: lldb-api :: functionalities/data-formatter/parray/TestPrintArray.py (1044 of 1202) PASS: lldb-api :: functionalities/thread/concurrent_events/TestConcurrentBreakpointsDelayedBreakpointOneWatchpoint.py (1045 of 1202) PASS: lldb-api :: functionalities/thread/concurrent_events/TestConcurrentSignalWatchBreak.py (1046 of 1202) PASS: lldb-api :: commands/expression/persistent_types/TestPersistentTypes.py (1047 of 1202) PASS: lldb-api :: functionalities/asan/TestReportData.py (1048 of 1202) PASS: lldb-api :: commands/target/select/TestTargetSelect.py (1049 of 1202) PASS: lldb-api :: functionalities/breakpoint/breakpoint_locations/TestBreakpointLocations.py (1050 of 1202) PASS: lldb-api :: python_api/sblaunchinfo/TestSBLaunchInfo.py (1051 of 1202) PASS: lldb-api :: functionalities/tail_call_frames/ambiguous_tail_call_seq1/TestAmbiguousTailCallSeq1.py (1052 of 1202) UNSUPPORTED: lldb-shell :: ScriptInterpreter/Lua/command_script_import.test (1053 of 1202) UNSUPPORTED: lldb-api :: functionalities/signal/TestSendSignal.py (1054 of 1202) UNSUPPORTED: lldb-shell :: Register/x86-64-ymm-read.test (1055 of 1202) PASS: lldb-shell :: Minidump/no-process-id.yaml (1056 of 1202) PASS: lldb-api :: lang/c/vla/TestVLA.py (1057 of 1202) PASS: lldb-shell :: SymbolFile/DWARF/debug-types-dwo-cross-reference.cpp (1058 of 1202) UNSUPPORTED: lldb-shell :: Register/x86-gp-write.test (1059 of 1202) PASS: lldb-api :: functionalities/backticks/TestBackticksWithoutATarget.py (1060 of 1202) PASS: lldb-api :: commands/expression/function_template_specialization_temp_args/TestFunctionTemplateSpecializationTempArgs.py (1061 of 1202) PASS: lldb-api :: functionalities/data-formatter/data-formatter-stl/libcxx/vbool/TestDataFormatterLibcxxVBool.py (1062 of 1202) PASS: lldb-api :: functionalities/thread/concurrent_events/TestConcurrentSignalWatch.py (1063 of 1202) PASS: lldb-api :: lang/cpp/alignas_base_class/TestAlignAsBaseClass.py (1064 of 1202) UNSUPPORTED: lldb-api :: tools/lldb-server/libraries-svr4/TestGdbRemoteLibrariesSvr4Support.py (1065 of 1202) PASS: lldb-api :: lang/cpp/gmodules-templates/TestGModules.py (1066 of 1202) PASS: lldb-api :: lang/cpp/virtual-overload/TestVirtualOverload.py (1067 of 1202) PASS: lldb-api :: commands/expression/fixits/TestFixIts.py (1068 of 1202) PASS: lldb-api :: lang/objc/modules-incomplete/TestIncompleteModules.py (1069 of 1202) PASS: lldb-api :: commands/expression/radar_9673664/TestExprHelpExamples.py (1070 of 1202) UNSUPPORTED: lldb-api :: commands/expression/import-std-module/deque-dbg-info-content/TestDbgInfoContentDequeFromStdModule.py (1071 of 1202) PASS: lldb-api :: lang/objc/real-definition/TestRealDefinition.py (1072 of 1202) PASS: lldb-api :: functionalities/data-formatter/synthcapping/TestSyntheticCapping.py (1073 of 1202) PASS: lldb-api :: functionalities/breakpoint/auto_continue/TestBreakpointAutoContinue.py (1074 of 1202) UNSUPPORTED: lldb-api :: tools/intel-features/intel-pt/test/TestIntelPTSimpleBinary.py (1075 of 1202) PASS: lldb-api :: commands/expression/two-files/TestObjCTypeQueryFromOtherCompileUnit.py (1076 of 1202) PASS: lldb-shell :: Quit/TestQuitExitCodeImplicit0.test (1077 of 1202) PASS: lldb-api :: commands/expression/call-function/TestCallBuiltinFunction.py (1078 of 1202) PASS: lldb-api :: lang/cpp/wchar_t/TestCxxWCharT.py (1079 of 1202) PASS: lldb-api :: lang/objc/orderedset/TestOrderedSet.py (1080 of 1202) PASS: lldb-api :: functionalities/abbreviation/TestAbbreviations.py (1081 of 1202) PASS: lldb-shell :: ObjectFile/PECOFF/dep-modules.yaml (1082 of 1202) PASS: lldb-api :: commands/expression/completion-in-lambda-and-unnamed-class/TestCompletionInLambdaAndUnnamedClass.py (1083 of 1202) PASS: lldb-shell :: Quit/TestQuitExitCodeNonInt.test (1084 of 1202) PASS: lldb-shell :: Commands/command-thread-select.test (1085 of 1202) PASS: lldb-api :: functionalities/abbreviation/TestCommonShortSpellings.py (1086 of 1202) PASS: lldb-shell :: SymbolFile/DWARF/DW_TAG_variable-DW_AT_const_value.s (1087 of 1202) PASS: lldb-api :: python_api/watchpoint/TestWatchpointIter.py (1088 of 1202) PASS: lldb-api :: commands/expression/save_jit_objects/TestSaveJITObjects.py (1089 of 1202) PASS: lldb-shell :: SymbolFile/DWARF/DW_AT_low_pc-addrx.s (1090 of 1202) PASS: lldb-api :: functionalities/data-formatter/refpointer-recursion/TestDataFormatterRefPtrRecursion.py (1091 of 1202) UNSUPPORTED: lldb-shell :: Reproducer/Functionalities/TestDataFormatter.test (1092 of 1202) UNSUPPORTED: lldb-api :: commands/watchpoints/hello_watchlocation/TestWatchLocation.py (1093 of 1202) PASS: lldb-shell :: Process/UnsupportedLanguage.test (1094 of 1202) PASS: lldb-api :: lang/objc/objc-runtime-ivars/TestRuntimeIvars.py (1095 of 1202) PASS: lldb-api :: tools/lldb-server/TestGdbRemoteHostInfo.py (1096 of 1202) PASS: lldb-api :: functionalities/thread/concurrent_events/TestConcurrentDelaySignalBreak.py (1097 of 1202) PASS: lldb-api :: commands/target/modules/search-paths/insert/TestTargetModulesSearchpathsInsert.py (1098 of 1202) UNSUPPORTED: lldb-shell :: SymbolFile/PDB/expressions.test (1099 of 1202) PASS: lldb-shell :: Unwind/thread-step-out-ret-addr-check.test (1100 of 1202) UNSUPPORTED: lldb-api :: commands/expression/import-std-module/basic/TestImportStdModule.py (1101 of 1202) PASS: lldb-shell :: SymbolFile/DWARF/debug-types-missing-signature.test (1102 of 1202) PASS: lldb-api :: lang/cpp/namespace_definitions/TestNamespaceDefinitions.py (1103 of 1202) XFAIL: lldb-shell :: Unwind/prefer-debug-over-eh-frame.test (1104 of 1202) UNSUPPORTED: lldb-shell :: SymbolFile/PDB/udt-layout.test (1105 of 1202) PASS: lldb-api :: functionalities/gdb_remote_client/TestNestedRegDefinitions.py (1106 of 1202) PASS: lldb-api :: functionalities/data-formatter/data-formatter-stl/libcxx/forward_list/TestDataFormatterLibcxxForwardList.py (1107 of 1202) PASS: lldb-api :: functionalities/data-formatter/data-formatter-objc/TestDataFormatterObjNSException.py (1108 of 1202) PASS: lldb-shell :: ObjectFile/ELF/section-types.yaml (1109 of 1202) PASS: lldb-shell :: SymbolFile/NativePDB/globals-fundamental.cpp (1110 of 1202) PASS: lldb-api :: functionalities/data-formatter/data-formatter-stl/libcxx/tuple/TestDataFormatterLibcxxTuple.py (1111 of 1202) PASS: lldb-shell :: ObjectFile/ELF/minidebuginfo-corrupt-xz.yaml (1112 of 1202) PASS: lldb-api :: commands/expression/persist_objc_pointeetype/TestPersistObjCPointeeType.py (1113 of 1202) UNSUPPORTED: lldb-shell :: Reproducer/TestReuseDirectory.test (1114 of 1202) PASS: lldb-api :: lang/cpp/covariant-return-types/TestCovariantReturnTypes.py (1115 of 1202) PASS: lldb-api :: lang/objc/single-entry-dictionary/TestObjCSingleEntryDictionary.py (1116 of 1202) PASS: lldb-api :: commands/watchpoints/watchpoint_on_vectors/TestValueOfVectorVariable.py (1117 of 1202) PASS: lldb-shell :: ObjectFile/wasm/stripped-debug-sections.yaml (1118 of 1202) PASS: lldb-api :: api/log/TestAPILog.py (1119 of 1202) UNSUPPORTED: lldb-shell :: ScriptInterpreter/Lua/quit.test (1120 of 1202) PASS: lldb-api :: lang/objc/global_ptrs/TestGlobalObjects.py (1121 of 1202) PASS: lldb-api :: commands/help/TestHelp.py (1122 of 1202) PASS: lldb-shell :: SymbolFile/DWARF/dwp-debug-types.s (1123 of 1202) UNSUPPORTED: lldb-api :: functionalities/darwin_log/filter/exact_match/message/TestDarwinLogFilterMatchMessage.py (1124 of 1202) UNSUPPORTED: lldb-api :: commands/expression/import-std-module/deque-basic/TestDequeFromStdModule.py (1125 of 1202) PASS: lldb-shell :: SymbolFile/DWARF/dwarf5-partial-index.cpp (1126 of 1202) PASS: lldb-api :: functionalities/data-formatter/data-formatter-objc/TestDataFormatterObjCExpr.py (1127 of 1202) PASS: lldb-shell :: ObjectFile/wasm/unified-debug-sections.yaml (1128 of 1202) PASS: lldb-api :: commands/expression/result_numbering/TestResultNumbering.py (1129 of 1202) UNSUPPORTED: lldb-shell :: Reproducer/TestPythonImport.test (1130 of 1202) PASS: lldb-api :: commands/platform/file/close/TestPlatformFileClose.py (1131 of 1202) PASS: lldb-api :: functionalities/data-formatter/data-formatter-stl/libcxx/function/TestLibCxxFunction.py (1132 of 1202) PASS: lldb-api :: python_api/lldbutil/iter/TestRegistersIterator.py (1133 of 1202) UNSUPPORTED: lldb-api :: functionalities/thread/thread_specific_break_plus_condition/TestThreadSpecificBpPlusCondition.py (1134 of 1202) PASS: lldb-shell :: Breakpoint/jitbp_elf.test (1135 of 1202) PASS: lldb-api :: lang/objc/self/TestObjCSelf.py (1136 of 1202) PASS: lldb-shell :: Commands/command-disassemble-process.yaml (1137 of 1202) PASS: lldb-shell :: SymbolFile/DWARF/dir-separator-windows.s (1138 of 1202) PASS: lldb-shell :: SymbolFile/DWARF/debug-types-basic.test (1139 of 1202) PASS: lldb-api :: functionalities/breakpoint/breakpoint_ignore_count/TestBreakpointIgnoreCount.py (1140 of 1202) PASS: lldb-api :: python_api/lldbutil/process/TestPrintStackTraces.py (1141 of 1202) PASS: lldb-api :: commands/watchpoints/hello_watchpoint/TestMyFirstWatchpoint.py (1142 of 1202) PASS: lldb-api :: types/TestShortTypeExpr.py (1143 of 1202) PASS: lldb-shell :: SymbolFile/NativePDB/ast-functions.cpp (1144 of 1202) PASS: lldb-shell :: Breakpoint/ppc64-localentry.test (1145 of 1202) PASS: lldb-api :: tools/lldb-server/TestGdbRemoteSingleStep.py (1146 of 1202) PASS: lldb-shell :: Minidump/Windows/find-module.test (1147 of 1202) UNSUPPORTED: lldb-shell :: Register/x86-64-xmm16-write.test (1148 of 1202) PASS: lldb-api :: functionalities/thread/num_threads/TestNumThreads.py (1149 of 1202) PASS: lldb-api :: macosx/lc-note/kern-ver-str/TestKernVerStrLCNOTE.py (1150 of 1202) PASS: lldb-api :: python_api/interpreter/TestCommandInterpreterAPI.py (1151 of 1202) PASS: lldb-api :: functionalities/tail_call_frames/thread_step_out_message/TestArtificialFrameStepOutMessage.py (1152 of 1202) PASS: lldb-api :: commands/expression/entry-bp/TestExprEntryBP.py (1153 of 1202) PASS: lldb-shell :: SymbolFile/DWARF/DW_OP_piece-struct.s (1154 of 1202) PASS: lldb-shell :: SymbolFile/NativePDB/global-classes.cpp (1155 of 1202) UNSUPPORTED: lldb-api :: python_api/disassemble-raw-data/TestDisassemble_VST1_64.py (1156 of 1202) PASS: lldb-api :: python_api/objc_type/TestObjCType.py (1157 of 1202) PASS: lldb-api :: python_api/watchpoint/watchlocation/TestTargetWatchAddress.py (1158 of 1202) PASS: lldb-shell :: ObjectFile/ELF/compressed-sections.yaml (1159 of 1202) PASS: lldb-shell :: Minidump/dump-all.test (1160 of 1202) UNSUPPORTED: lldb-api :: lang/objc/print-obj/TestPrintObj.py (1161 of 1202) UNSUPPORTED: lldb-shell :: Reproducer/Functionalities/TestImageList.test (1162 of 1202) UNSUPPORTED: lldb-shell :: Register/x86-zmm-write.test (1163 of 1202) PASS: lldb-api :: commands/gui/basic/TestGuiBasic.py (1164 of 1202) UNSUPPORTED: lldb-api :: lang/c/typedef/Testtypedef.py (1165 of 1202) PASS: lldb-api :: functionalities/multidebugger_commands/TestMultipleDebuggersCommands.py (1166 of 1202) PASS: lldb-api :: functionalities/mtc/simple/TestMTCSimple.py (1167 of 1202) PASS: lldb-api :: commands/watchpoints/step_over_watchpoint/TestStepOverWatchpoint.py (1168 of 1202) UNSUPPORTED: lldb-api :: commands/expression/import-std-module/empty-module/TestEmptyStdModule.py (1169 of 1202) PASS: lldb-api :: functionalities/optimized_code/TestNoASanExceptionAfterEvalOP_piece.py (1170 of 1202) PASS: lldb-shell :: SymbolFile/DWARF/find-qualified-variable.cpp (1171 of 1202) UNSUPPORTED: lldb-api :: functionalities/darwin_log/format/TestDarwinLogMessageFormat.py (1172 of 1202) PASS: lldb-api :: functionalities/data-formatter/varscript_formatting/TestDataFormatterVarScriptFormatting.py (1173 of 1202) PASS: lldb-shell :: Minidump/Windows/arm-fp-unwind.test (1174 of 1202) UNSUPPORTED: lldb-api :: functionalities/data-formatter/data-formatter-stl/libstdcpp/string/TestDataFormatterStdString.py (1175 of 1202) PASS: lldb-api :: python_api/watchpoint/watchlocation/TestSetWatchlocation.py (1176 of 1202) PASS: lldb-api :: functionalities/breakpoint/breakpoint_command/TestRegexpBreakCommand.py (1177 of 1202) PASS: lldb-api :: lang/cpp/llvm-style/TestLLVMStyle.py (1178 of 1202) PASS: lldb-shell :: SymbolFile/DWARF/debug-types-signature-loop.s (1179 of 1202) PASS: lldb-shell :: Settings/TestFrameFormatNoColor.test (1180 of 1202) UNSUPPORTED: lldb-shell :: ScriptInterpreter/Lua/lua.test (1181 of 1202) PASS: lldb-shell :: SymbolFile/Breakpad/line-table-edgecases.test (1182 of 1202) PASS: lldb-api :: lang/cpp/member-and-local-vars-with-same-name/TestMembersAndLocalsWithSameName.py (1183 of 1202) PASS: lldb-api :: functionalities/thread_plan/TestThreadPlanCommands.py (1184 of 1202) PASS: lldb-shell :: ObjectFile/PECOFF/basic-info-arm64.yaml (1185 of 1202) PASS: lldb-shell :: ObjectFile/PECOFF/sections-names.yaml (1186 of 1202) UNSUPPORTED: lldb-api :: functionalities/signal/handle-segv/TestHandleSegv.py (1187 of 1202) PASS: lldb-api :: functionalities/inferior-assert/TestInferiorAssert.py (1188 of 1202) PASS: lldb-api :: functionalities/tsan/thread_leak/TestTsanThreadLeak.py (1189 of 1202) PASS: lldb-api :: source-manager/TestSourceManager.py (1190 of 1202) UNSUPPORTED: lldb-api :: lang/cpp/static_members/TestCPPStaticMembers.py (1191 of 1202) PASS: lldb-api :: functionalities/data-formatter/data-formatter-cpp/TestDataFormatterCpp.py (1192 of 1202) PASS: lldb-api :: functionalities/data-formatter/data-formatter-stl/libcxx/queue/TestDataFormatterLibcxxQueue.py (1193 of 1202) PASS: lldb-api :: commands/expression/persistent_variables/TestPersistentVariables.py (1194 of 1202) PASS: lldb-api :: functionalities/data-formatter/data-formatter-objc/TestDataFormatterObjCKVO.py (1195 of 1202) PASS: lldb-api :: types/TestRecursiveTypes.py (1196 of 1202) PASS: lldb-api :: python_api/target/TestTargetAPI.py (1197 of 1202) PASS: lldb-api :: api/multithreaded/TestMultithreaded.py (1198 of 1202) PASS: lldb-api :: lang/c/anonymous/TestAnonymous.py (1199 of 1202) PASS: lldb-api :: lang/cpp/enum_types/TestCPP11EnumTypes.py (1200 of 1202) PASS: lldb-api :: types/TestLongTypes.py (1201 of 1202) PASS: lldb-api :: types/TestLongTypesExpr.py (1202 of 1202) Slowest Tests: -------------------------------------------------------------------------- 259.42s: lldb-api :: types/TestLongTypesExpr.py 252.37s: lldb-api :: types/TestLongTypes.py 210.36s: lldb-api :: functionalities/gdb_remote_client/TestGDBRemoteClient.py 162.60s: lldb-api :: types/TestIntegerTypeExpr.py 158.11s: lldb-api :: lang/cpp/enum_types/TestCPP11EnumTypes.py 144.37s: lldb-api :: lang/cpp/namespace/TestNamespaceLookup.py 130.41s: lldb-api :: types/TestCharTypeExpr.py 130.38s: lldb-api :: types/TestShortTypeExpr.py 126.54s: lldb-api :: types/TestShortType.py 126.42s: lldb-api :: types/TestCharType.py 126.24s: lldb-api :: types/TestIntegerType.py 120.38s: lldb-api :: functionalities/gdb_remote_client/TestProcessConnect.py 120.35s: lldb-api :: functionalities/gdb_remote_client/TestIOSSimulator.py 115.78s: lldb-api :: lang/c/anonymous/TestAnonymous.py 115.59s: lldb-api :: functionalities/inferior-crashing/TestInferiorCrashingStep.py 98.72s: lldb-api :: functionalities/inferior-assert/TestInferiorAssert.py 98.61s: lldb-api :: functionalities/breakpoint/breakpoint_conditions/TestBreakpointConditions.py 96.08s: lldb-api :: lang/objc/foundation/TestObjCMethods.py 92.44s: lldb-api :: lang/objc/hidden-ivars/TestHiddenIvars.py 90.36s: lldb-api :: functionalities/gdb_remote_client/TestGDBRemoteLoad.py

Hide Details

Tests Times: -------------------------------------------------------------------------- [ Range ] :: [ Percentage ] :: [ Count ] -------------------------------------------------------------------------- [240s,260s) :: [ ] :: [ 2/1202] [220s,240s) :: [ ] :: [ 0/1202] [200s,220s) :: [ ] :: [ 1/1202] [180s,200s) :: [ ] :: [ 0/1202] [160s,180s) :: [ ] :: [ 1/1202] [140s,160s) :: [ ] :: [ 2/1202] [120s,140s) :: [ ] :: [ 7/1202] [100s,120s) :: [ ] :: [ 2/1202] [ 80s,100s) :: [ ] :: [ 11/1202] [ 60s, 80s) :: [ ] :: [ 15/1202] [ 40s, 60s) :: [ ] :: [ 21/1202] [ 20s, 40s) :: [***** ] :: [ 154/1202] [ 0s, 20s) :: [******************************** ] :: [ 986/1202] -------------------------------------------------------------------------- ******************** Failed Tests (1): lldb-shell :: Driver/TestError.test

Hide Details

Hide Details

Testing Time: 1040.04s Unsupported : 262 Passed : 933 Expectedly Failed: 6 Failed : 1 FAILED: tools/lldb/test/CMakeFiles/check-lldb-reproducers cd /Users/buildslave/jenkins/workspace/lldb-cmake-reproducers/lldb-build/tools/lldb/test && /usr/local/Frameworks/Python.framework/Versions/3.7/bin/python3.7 /Users/buildslave/jenkins/workspace/lldb-cmake-reproducers/lldb-build/./bin/llvm-lit -v --time-tests --shuffle --xunit-xml-output=/Users/buildslave/jenkins/workspace/lldb-cmake-reproducers/test/results.xml -v --param lldb-run-with-repro=replay /Users/buildslave/jenkins/workspace/lldb-cmake-reproducers/lldb-build/tools/lldb/test/API /Users/buildslave/jenkins/workspace/lldb-cmake-reproducers/lldb-build/tools/lldb/test/Shell ninja: build stopped: cannot make progress due to previous errors. Command failed: Command '['/usr/local/bin/ninja', '-k', '0', '-v', 'check-lldb-reproducers']' returned non-zero exit status 1. Command: ['/usr/local/bin/ninja', '-k', '0', '-v', 'check-lldb-reproducers'] [Pipeline] } [Pipeline] // timeout [Pipeline] } [Pipeline] // stage [Pipeline] stage [Pipeline] { (Declarative: Post Actions) [Pipeline] scanForIssues [Clang (LLVM based)] Sleeping for 5 seconds due to JENKINS-32191... [Clang (LLVM based)] Parsing console log (workspace: '/Users/buildslave/jenkins/workspace/lldb-cmake-reproducers') [Clang (LLVM based)] Successfully parsed console log [Clang (LLVM based)] -> found 14 issues (skipped 93 duplicates) [Clang (LLVM based)] Post processing issues on 'green-dragon-23' with source code encoding 'UTF-8' [Clang (LLVM based)] Creating SCM blamer to obtain author and commit information for affected files [Clang (LLVM based)] Creating SCM miner to obtain statistics for affected repository files [Clang (LLVM based)] Resolving file names for all issues in source directory '/Users/buildslave/jenkins/workspace/lldb-cmake-reproducers' [Clang (LLVM based)] -> resolved paths in source directory (9 found, 0 not found) [Clang (LLVM based)] Resolving module names from module definitions (build.xml, pom.xml, or Manifest.mf files) [Clang (LLVM based)] -> resolved module names for 14 issues [Clang (LLVM based)] Resolving package names (or namespaces) by parsing the affected files [Clang (LLVM based)] -> resolved package names of 8 affected files [Clang (LLVM based)] No filter has been set, publishing all 13 issues [Clang (LLVM based)] Creating fingerprints for all affected code blocks to track issues over different builds [Clang (LLVM based)] -> created fingerprints for 13 issues (skipped 0 issues) [Clang (LLVM based)] Copying affected files to Jenkins' build folder '/Users/Shared/Jenkins/Home/jobs/lldb-cmake-reproducers/builds/197/files-with-issues' [Clang (LLVM based)] -> 6 copied, 2 not in workspace, 0 not-found, 0 with I/O error [Pipeline] junit Recording test results [Pipeline] } [Pipeline] // stage [Pipeline] } [Pipeline] // withEnv [Pipeline] } [Pipeline] // node [Pipeline] End of Pipeline ERROR: script returned exit code 1 Finished: FAILURE