FailedConsole Output

Skipping 8,603 KB.. Full Log
Platforms/MacOSX.platform/Developer/SDKs/MacOSX10.14.sdk -Wl,-search_paths_first -Wl,-headerpad_max_install_names -B /Applications/Xcode.app/Contents/Developer/Toolchains/XcodeDefault.xctoolchain/usr/bin SingleSource/Regression/C/gcc-c-torture/execute/ieee/CMakeFiles/GCC-C-execute-ieee-mzero2.dir/mzero2.c.o  -o SingleSource/Regression/C/gcc-c-torture/execute/ieee/GCC-C-execute-ieee-mzero2  -Wl,-no_pie && :
[7557/7672] : && /Users/buildslave/jenkins/workspace/test-suite-verify-machineinstrs-x86_64-O3/test-suite-build/tools/timeit --summary SingleSource/Regression/C/gcc-c-torture/execute/ieee/GCC-C-execute-ieee-mzero3.link.time /Users/buildslave/jenkins/workspace/test-suite-verify-machineinstrs-x86_64-O3/compiler/bin/clang -B /Applications/Xcode.app/Contents/Developer/Toolchains/XcodeDefault.xctoolchain/usr/bin    -Wno-unused-command-line-argument -mllvm -verify-machineinstrs -O3 -arch x86_64 -isysroot /Applications/Xcode.app/Contents/Developer/Platforms/MacOSX.platform/Developer/SDKs/MacOSX10.14.sdk -Wl,-search_paths_first -Wl,-headerpad_max_install_names -B /Applications/Xcode.app/Contents/Developer/Toolchains/XcodeDefault.xctoolchain/usr/bin SingleSource/Regression/C/gcc-c-torture/execute/ieee/CMakeFiles/GCC-C-execute-ieee-mzero3.dir/mzero3.c.o  -o SingleSource/Regression/C/gcc-c-torture/execute/ieee/GCC-C-execute-ieee-mzero3  -Wl,-no_pie && :
[7558/7672] /Users/buildslave/jenkins/workspace/test-suite-verify-machineinstrs-x86_64-O3/test-suite-build/tools/timeit --summary SingleSource/Regression/C/gcc-c-torture/execute/ieee/CMakeFiles/GCC-C-execute-ieee-mul-subnormal-single-1.dir/mul-subnormal-single-1.c.o.time /Users/buildslave/jenkins/workspace/test-suite-verify-machineinstrs-x86_64-O3/compiler/bin/clang -DNDEBUG  -B /Applications/Xcode.app/Contents/Developer/Toolchains/XcodeDefault.xctoolchain/usr/bin    -Wno-unused-command-line-argument -mllvm -verify-machineinstrs -O3 -arch x86_64 -isysroot /Applications/Xcode.app/Contents/Developer/Platforms/MacOSX.platform/Developer/SDKs/MacOSX10.14.sdk   -w -Werror=date-time -w -MD -MT SingleSource/Regression/C/gcc-c-torture/execute/ieee/CMakeFiles/GCC-C-execute-ieee-mul-subnormal-single-1.dir/mul-subnormal-single-1.c.o -MF SingleSource/Regression/C/gcc-c-torture/execute/ieee/CMakeFiles/GCC-C-execute-ieee-mul-subnormal-single-1.dir/mul-subnormal-single-1.c.o.d -o SingleSource/Regression/C/gcc-c-torture/execute/ieee/CMakeFiles/GCC-C-execute-ieee-mul-subnormal-single-1.dir/mul-subnormal-single-1.c.o   -c /Users/buildslave/jenkins/workspace/test-suite-verify-machineinstrs-x86_64-O3/test-suite/SingleSource/Regression/C/gcc-c-torture/execute/ieee/mul-subnormal-single-1.c
[7559/7672] /Users/buildslave/jenkins/workspace/test-suite-verify-machineinstrs-x86_64-O3/test-suite-build/tools/timeit --summary SingleSource/Regression/C/gcc-c-torture/execute/ieee/CMakeFiles/GCC-C-execute-ieee-fp-cmp-8e.dir/fp-cmp-8e.c.o.time /Users/buildslave/jenkins/workspace/test-suite-verify-machineinstrs-x86_64-O3/compiler/bin/clang -DNDEBUG  -B /Applications/Xcode.app/Contents/Developer/Toolchains/XcodeDefault.xctoolchain/usr/bin    -Wno-unused-command-line-argument -mllvm -verify-machineinstrs -O3 -arch x86_64 -isysroot /Applications/Xcode.app/Contents/Developer/Platforms/MacOSX.platform/Developer/SDKs/MacOSX10.14.sdk   -w -Werror=date-time -w -MD -MT SingleSource/Regression/C/gcc-c-torture/execute/ieee/CMakeFiles/GCC-C-execute-ieee-fp-cmp-8e.dir/fp-cmp-8e.c.o -MF SingleSource/Regression/C/gcc-c-torture/execute/ieee/CMakeFiles/GCC-C-execute-ieee-fp-cmp-8e.dir/fp-cmp-8e.c.o.d -o SingleSource/Regression/C/gcc-c-torture/execute/ieee/CMakeFiles/GCC-C-execute-ieee-fp-cmp-8e.dir/fp-cmp-8e.c.o   -c /Users/buildslave/jenkins/workspace/test-suite-verify-machineinstrs-x86_64-O3/test-suite/SingleSource/Regression/C/gcc-c-torture/execute/ieee/fp-cmp-8e.c
[7560/7672] /Users/buildslave/jenkins/workspace/test-suite-verify-machineinstrs-x86_64-O3/test-suite-build/tools/timeit --summary SingleSource/Regression/C/gcc-c-torture/execute/ieee/CMakeFiles/GCC-C-execute-ieee-inf-2.dir/inf-2.c.o.time /Users/buildslave/jenkins/workspace/test-suite-verify-machineinstrs-x86_64-O3/compiler/bin/clang -DNDEBUG  -B /Applications/Xcode.app/Contents/Developer/Toolchains/XcodeDefault.xctoolchain/usr/bin    -Wno-unused-command-line-argument -mllvm -verify-machineinstrs -O3 -arch x86_64 -isysroot /Applications/Xcode.app/Contents/Developer/Platforms/MacOSX.platform/Developer/SDKs/MacOSX10.14.sdk   -w -Werror=date-time -w -MD -MT SingleSource/Regression/C/gcc-c-torture/execute/ieee/CMakeFiles/GCC-C-execute-ieee-inf-2.dir/inf-2.c.o -MF SingleSource/Regression/C/gcc-c-torture/execute/ieee/CMakeFiles/GCC-C-execute-ieee-inf-2.dir/inf-2.c.o.d -o SingleSource/Regression/C/gcc-c-torture/execute/ieee/CMakeFiles/GCC-C-execute-ieee-inf-2.dir/inf-2.c.o   -c /Users/buildslave/jenkins/workspace/test-suite-verify-machineinstrs-x86_64-O3/test-suite/SingleSource/Regression/C/gcc-c-torture/execute/ieee/inf-2.c
[7561/7672] : && /Users/buildslave/jenkins/workspace/test-suite-verify-machineinstrs-x86_64-O3/test-suite-build/tools/timeit --summary SingleSource/Regression/C/gcc-c-torture/execute/ieee/GCC-C-execute-ieee-mul-subnormal-single-1.link.time /Users/buildslave/jenkins/workspace/test-suite-verify-machineinstrs-x86_64-O3/compiler/bin/clang -B /Applications/Xcode.app/Contents/Developer/Toolchains/XcodeDefault.xctoolchain/usr/bin    -Wno-unused-command-line-argument -mllvm -verify-machineinstrs -O3 -arch x86_64 -isysroot /Applications/Xcode.app/Contents/Developer/Platforms/MacOSX.platform/Developer/SDKs/MacOSX10.14.sdk -Wl,-search_paths_first -Wl,-headerpad_max_install_names -B /Applications/Xcode.app/Contents/Developer/Toolchains/XcodeDefault.xctoolchain/usr/bin SingleSource/Regression/C/gcc-c-torture/execute/ieee/CMakeFiles/GCC-C-execute-ieee-mul-subnormal-single-1.dir/mul-subnormal-single-1.c.o  -o SingleSource/Regression/C/gcc-c-torture/execute/ieee/GCC-C-execute-ieee-mul-subnormal-single-1  -Wl,-no_pie && :
[7562/7672] : && /Users/buildslave/jenkins/workspace/test-suite-verify-machineinstrs-x86_64-O3/test-suite-build/tools/timeit --summary SingleSource/Regression/C/gcc-c-torture/execute/ieee/GCC-C-execute-ieee-fp-cmp-8e.link.time /Users/buildslave/jenkins/workspace/test-suite-verify-machineinstrs-x86_64-O3/compiler/bin/clang -B /Applications/Xcode.app/Contents/Developer/Toolchains/XcodeDefault.xctoolchain/usr/bin    -Wno-unused-command-line-argument -mllvm -verify-machineinstrs -O3 -arch x86_64 -isysroot /Applications/Xcode.app/Contents/Developer/Platforms/MacOSX.platform/Developer/SDKs/MacOSX10.14.sdk -Wl,-search_paths_first -Wl,-headerpad_max_install_names -B /Applications/Xcode.app/Contents/Developer/Toolchains/XcodeDefault.xctoolchain/usr/bin SingleSource/Regression/C/gcc-c-torture/execute/ieee/CMakeFiles/GCC-C-execute-ieee-fp-cmp-8e.dir/fp-cmp-8e.c.o  -o SingleSource/Regression/C/gcc-c-torture/execute/ieee/GCC-C-execute-ieee-fp-cmp-8e  -Wl,-no_pie && :
[7563/7672] : && /Users/buildslave/jenkins/workspace/test-suite-verify-machineinstrs-x86_64-O3/test-suite-build/tools/timeit --summary SingleSource/Regression/C/gcc-c-torture/execute/ieee/GCC-C-execute-ieee-inf-2.link.time /Users/buildslave/jenkins/workspace/test-suite-verify-machineinstrs-x86_64-O3/compiler/bin/clang -B /Applications/Xcode.app/Contents/Developer/Toolchains/XcodeDefault.xctoolchain/usr/bin    -Wno-unused-command-line-argument -mllvm -verify-machineinstrs -O3 -arch x86_64 -isysroot /Applications/Xcode.app/Contents/Developer/Platforms/MacOSX.platform/Developer/SDKs/MacOSX10.14.sdk -Wl,-search_paths_first -Wl,-headerpad_max_install_names -B /Applications/Xcode.app/Contents/Developer/Toolchains/XcodeDefault.xctoolchain/usr/bin SingleSource/Regression/C/gcc-c-torture/execute/ieee/CMakeFiles/GCC-C-execute-ieee-inf-2.dir/inf-2.c.o  -o SingleSource/Regression/C/gcc-c-torture/execute/ieee/GCC-C-execute-ieee-inf-2  -Wl,-no_pie && :
[7564/7672] /Users/buildslave/jenkins/workspace/test-suite-verify-machineinstrs-x86_64-O3/test-suite-build/tools/timeit --summary SingleSource/Regression/C/gcc-c-torture/execute/ieee/CMakeFiles/GCC-C-execute-ieee-mzero6.dir/mzero6.c.o.time /Users/buildslave/jenkins/workspace/test-suite-verify-machineinstrs-x86_64-O3/compiler/bin/clang -DNDEBUG  -B /Applications/Xcode.app/Contents/Developer/Toolchains/XcodeDefault.xctoolchain/usr/bin    -Wno-unused-command-line-argument -mllvm -verify-machineinstrs -O3 -arch x86_64 -isysroot /Applications/Xcode.app/Contents/Developer/Platforms/MacOSX.platform/Developer/SDKs/MacOSX10.14.sdk   -w -Werror=date-time -w -MD -MT SingleSource/Regression/C/gcc-c-torture/execute/ieee/CMakeFiles/GCC-C-execute-ieee-mzero6.dir/mzero6.c.o -MF SingleSource/Regression/C/gcc-c-torture/execute/ieee/CMakeFiles/GCC-C-execute-ieee-mzero6.dir/mzero6.c.o.d -o SingleSource/Regression/C/gcc-c-torture/execute/ieee/CMakeFiles/GCC-C-execute-ieee-mzero6.dir/mzero6.c.o   -c /Users/buildslave/jenkins/workspace/test-suite-verify-machineinstrs-x86_64-O3/test-suite/SingleSource/Regression/C/gcc-c-torture/execute/ieee/mzero6.c
[7565/7672] /Users/buildslave/jenkins/workspace/test-suite-verify-machineinstrs-x86_64-O3/test-suite-build/tools/timeit --summary SingleSource/Regression/C/gcc-c-torture/execute/ieee/CMakeFiles/GCC-C-execute-ieee-fp-cmp-8l.dir/fp-cmp-8l.c.o.time /Users/buildslave/jenkins/workspace/test-suite-verify-machineinstrs-x86_64-O3/compiler/bin/clang -DNDEBUG  -B /Applications/Xcode.app/Contents/Developer/Toolchains/XcodeDefault.xctoolchain/usr/bin    -Wno-unused-command-line-argument -mllvm -verify-machineinstrs -O3 -arch x86_64 -isysroot /Applications/Xcode.app/Contents/Developer/Platforms/MacOSX.platform/Developer/SDKs/MacOSX10.14.sdk   -w -Werror=date-time -w -MD -MT SingleSource/Regression/C/gcc-c-torture/execute/ieee/CMakeFiles/GCC-C-execute-ieee-fp-cmp-8l.dir/fp-cmp-8l.c.o -MF SingleSource/Regression/C/gcc-c-torture/execute/ieee/CMakeFiles/GCC-C-execute-ieee-fp-cmp-8l.dir/fp-cmp-8l.c.o.d -o SingleSource/Regression/C/gcc-c-torture/execute/ieee/CMakeFiles/GCC-C-execute-ieee-fp-cmp-8l.dir/fp-cmp-8l.c.o   -c /Users/buildslave/jenkins/workspace/test-suite-verify-machineinstrs-x86_64-O3/test-suite/SingleSource/Regression/C/gcc-c-torture/execute/ieee/fp-cmp-8l.c
[7566/7672] : && /Users/buildslave/jenkins/workspace/test-suite-verify-machineinstrs-x86_64-O3/test-suite-build/tools/timeit --summary SingleSource/Regression/C/gcc-c-torture/execute/ieee/GCC-C-execute-ieee-mzero6.link.time /Users/buildslave/jenkins/workspace/test-suite-verify-machineinstrs-x86_64-O3/compiler/bin/clang -B /Applications/Xcode.app/Contents/Developer/Toolchains/XcodeDefault.xctoolchain/usr/bin    -Wno-unused-command-line-argument -mllvm -verify-machineinstrs -O3 -arch x86_64 -isysroot /Applications/Xcode.app/Contents/Developer/Platforms/MacOSX.platform/Developer/SDKs/MacOSX10.14.sdk -Wl,-search_paths_first -Wl,-headerpad_max_install_names -B /Applications/Xcode.app/Contents/Developer/Toolchains/XcodeDefault.xctoolchain/usr/bin SingleSource/Regression/C/gcc-c-torture/execute/ieee/CMakeFiles/GCC-C-execute-ieee-mzero6.dir/mzero6.c.o  -o SingleSource/Regression/C/gcc-c-torture/execute/ieee/GCC-C-execute-ieee-mzero6  -Wl,-no_pie && :
[7567/7672] /Users/buildslave/jenkins/workspace/test-suite-verify-machineinstrs-x86_64-O3/test-suite-build/tools/timeit --summary SingleSource/Regression/C/gcc-c-torture/execute/ieee/CMakeFiles/GCC-C-execute-ieee-fp-cmp-8f.dir/fp-cmp-8f.c.o.time /Users/buildslave/jenkins/workspace/test-suite-verify-machineinstrs-x86_64-O3/compiler/bin/clang -DNDEBUG  -B /Applications/Xcode.app/Contents/Developer/Toolchains/XcodeDefault.xctoolchain/usr/bin    -Wno-unused-command-line-argument -mllvm -verify-machineinstrs -O3 -arch x86_64 -isysroot /Applications/Xcode.app/Contents/Developer/Platforms/MacOSX.platform/Developer/SDKs/MacOSX10.14.sdk   -w -Werror=date-time -w -MD -MT SingleSource/Regression/C/gcc-c-torture/execute/ieee/CMakeFiles/GCC-C-execute-ieee-fp-cmp-8f.dir/fp-cmp-8f.c.o -MF SingleSource/Regression/C/gcc-c-torture/execute/ieee/CMakeFiles/GCC-C-execute-ieee-fp-cmp-8f.dir/fp-cmp-8f.c.o.d -o SingleSource/Regression/C/gcc-c-torture/execute/ieee/CMakeFiles/GCC-C-execute-ieee-fp-cmp-8f.dir/fp-cmp-8f.c.o   -c /Users/buildslave/jenkins/workspace/test-suite-verify-machineinstrs-x86_64-O3/test-suite/SingleSource/Regression/C/gcc-c-torture/execute/ieee/fp-cmp-8f.c
[7568/7672] : && /Users/buildslave/jenkins/workspace/test-suite-verify-machineinstrs-x86_64-O3/test-suite-build/tools/timeit --summary SingleSource/Regression/C/gcc-c-torture/execute/ieee/GCC-C-execute-ieee-fp-cmp-8l.link.time /Users/buildslave/jenkins/workspace/test-suite-verify-machineinstrs-x86_64-O3/compiler/bin/clang -B /Applications/Xcode.app/Contents/Developer/Toolchains/XcodeDefault.xctoolchain/usr/bin    -Wno-unused-command-line-argument -mllvm -verify-machineinstrs -O3 -arch x86_64 -isysroot /Applications/Xcode.app/Contents/Developer/Platforms/MacOSX.platform/Developer/SDKs/MacOSX10.14.sdk -Wl,-search_paths_first -Wl,-headerpad_max_install_names -B /Applications/Xcode.app/Contents/Developer/Toolchains/XcodeDefault.xctoolchain/usr/bin SingleSource/Regression/C/gcc-c-torture/execute/ieee/CMakeFiles/GCC-C-execute-ieee-fp-cmp-8l.dir/fp-cmp-8l.c.o  -o SingleSource/Regression/C/gcc-c-torture/execute/ieee/GCC-C-execute-ieee-fp-cmp-8l  -Wl,-no_pie && :
[7569/7672] : && /Users/buildslave/jenkins/workspace/test-suite-verify-machineinstrs-x86_64-O3/test-suite-build/tools/timeit --summary SingleSource/Regression/C/gcc-c-torture/execute/ieee/GCC-C-execute-ieee-fp-cmp-8f.link.time /Users/buildslave/jenkins/workspace/test-suite-verify-machineinstrs-x86_64-O3/compiler/bin/clang -B /Applications/Xcode.app/Contents/Developer/Toolchains/XcodeDefault.xctoolchain/usr/bin    -Wno-unused-command-line-argument -mllvm -verify-machineinstrs -O3 -arch x86_64 -isysroot /Applications/Xcode.app/Contents/Developer/Platforms/MacOSX.platform/Developer/SDKs/MacOSX10.14.sdk -Wl,-search_paths_first -Wl,-headerpad_max_install_names -B /Applications/Xcode.app/Contents/Developer/Toolchains/XcodeDefault.xctoolchain/usr/bin SingleSource/Regression/C/gcc-c-torture/execute/ieee/CMakeFiles/GCC-C-execute-ieee-fp-cmp-8f.dir/fp-cmp-8f.c.o  -o SingleSource/Regression/C/gcc-c-torture/execute/ieee/GCC-C-execute-ieee-fp-cmp-8f  -Wl,-no_pie && :
[7570/7672] /Users/buildslave/jenkins/workspace/test-suite-verify-machineinstrs-x86_64-O3/test-suite-build/tools/timeit --summary SingleSource/Regression/C/gcc-c-torture/execute/ieee/CMakeFiles/GCC-C-execute-ieee-920518-1.dir/920518-1.c.o.time /Users/buildslave/jenkins/workspace/test-suite-verify-machineinstrs-x86_64-O3/compiler/bin/clang -DNDEBUG  -B /Applications/Xcode.app/Contents/Developer/Toolchains/XcodeDefault.xctoolchain/usr/bin    -Wno-unused-command-line-argument -mllvm -verify-machineinstrs -O3 -arch x86_64 -isysroot /Applications/Xcode.app/Contents/Developer/Platforms/MacOSX.platform/Developer/SDKs/MacOSX10.14.sdk   -w -Werror=date-time -w -MD -MT SingleSource/Regression/C/gcc-c-torture/execute/ieee/CMakeFiles/GCC-C-execute-ieee-920518-1.dir/920518-1.c.o -MF SingleSource/Regression/C/gcc-c-torture/execute/ieee/CMakeFiles/GCC-C-execute-ieee-920518-1.dir/920518-1.c.o.d -o SingleSource/Regression/C/gcc-c-torture/execute/ieee/CMakeFiles/GCC-C-execute-ieee-920518-1.dir/920518-1.c.o   -c /Users/buildslave/jenkins/workspace/test-suite-verify-machineinstrs-x86_64-O3/test-suite/SingleSource/Regression/C/gcc-c-torture/execute/ieee/920518-1.c
[7571/7672] /Users/buildslave/jenkins/workspace/test-suite-verify-machineinstrs-x86_64-O3/test-suite-build/tools/timeit --summary SingleSource/Regression/C/gcc-c-torture/execute/ieee/CMakeFiles/GCC-C-execute-ieee-fp-cmp-6.dir/fp-cmp-6.c.o.time /Users/buildslave/jenkins/workspace/test-suite-verify-machineinstrs-x86_64-O3/compiler/bin/clang -DNDEBUG  -B /Applications/Xcode.app/Contents/Developer/Toolchains/XcodeDefault.xctoolchain/usr/bin    -Wno-unused-command-line-argument -mllvm -verify-machineinstrs -O3 -arch x86_64 -isysroot /Applications/Xcode.app/Contents/Developer/Platforms/MacOSX.platform/Developer/SDKs/MacOSX10.14.sdk   -w -Werror=date-time -w -MD -MT SingleSource/Regression/C/gcc-c-torture/execute/ieee/CMakeFiles/GCC-C-execute-ieee-fp-cmp-6.dir/fp-cmp-6.c.o -MF SingleSource/Regression/C/gcc-c-torture/execute/ieee/CMakeFiles/GCC-C-execute-ieee-fp-cmp-6.dir/fp-cmp-6.c.o.d -o SingleSource/Regression/C/gcc-c-torture/execute/ieee/CMakeFiles/GCC-C-execute-ieee-fp-cmp-6.dir/fp-cmp-6.c.o   -c /Users/buildslave/jenkins/workspace/test-suite-verify-machineinstrs-x86_64-O3/test-suite/SingleSource/Regression/C/gcc-c-torture/execute/ieee/fp-cmp-6.c
[7572/7672] : && /Users/buildslave/jenkins/workspace/test-suite-verify-machineinstrs-x86_64-O3/test-suite-build/tools/timeit --summary SingleSource/Regression/C/gcc-c-torture/execute/ieee/GCC-C-execute-ieee-920518-1.link.time /Users/buildslave/jenkins/workspace/test-suite-verify-machineinstrs-x86_64-O3/compiler/bin/clang -B /Applications/Xcode.app/Contents/Developer/Toolchains/XcodeDefault.xctoolchain/usr/bin    -Wno-unused-command-line-argument -mllvm -verify-machineinstrs -O3 -arch x86_64 -isysroot /Applications/Xcode.app/Contents/Developer/Platforms/MacOSX.platform/Developer/SDKs/MacOSX10.14.sdk -Wl,-search_paths_first -Wl,-headerpad_max_install_names -B /Applications/Xcode.app/Contents/Developer/Toolchains/XcodeDefault.xctoolchain/usr/bin SingleSource/Regression/C/gcc-c-torture/execute/ieee/CMakeFiles/GCC-C-execute-ieee-920518-1.dir/920518-1.c.o  -o SingleSource/Regression/C/gcc-c-torture/execute/ieee/GCC-C-execute-ieee-920518-1  -Wl,-no_pie && :
[7573/7672] /Users/buildslave/jenkins/workspace/test-suite-verify-machineinstrs-x86_64-O3/test-suite-build/tools/timeit --summary SingleSource/Regression/C/gcc-c-torture/execute/ieee/CMakeFiles/GCC-C-execute-ieee-20041213-1.dir/20041213-1.c.o.time /Users/buildslave/jenkins/workspace/test-suite-verify-machineinstrs-x86_64-O3/compiler/bin/clang -DNDEBUG  -B /Applications/Xcode.app/Contents/Developer/Toolchains/XcodeDefault.xctoolchain/usr/bin    -Wno-unused-command-line-argument -mllvm -verify-machineinstrs -O3 -arch x86_64 -isysroot /Applications/Xcode.app/Contents/Developer/Platforms/MacOSX.platform/Developer/SDKs/MacOSX10.14.sdk   -w -Werror=date-time -w -MD -MT SingleSource/Regression/C/gcc-c-torture/execute/ieee/CMakeFiles/GCC-C-execute-ieee-20041213-1.dir/20041213-1.c.o -MF SingleSource/Regression/C/gcc-c-torture/execute/ieee/CMakeFiles/GCC-C-execute-ieee-20041213-1.dir/20041213-1.c.o.d -o SingleSource/Regression/C/gcc-c-torture/execute/ieee/CMakeFiles/GCC-C-execute-ieee-20041213-1.dir/20041213-1.c.o   -c /Users/buildslave/jenkins/workspace/test-suite-verify-machineinstrs-x86_64-O3/test-suite/SingleSource/Regression/C/gcc-c-torture/execute/ieee/20041213-1.c
[7574/7672] : && /Users/buildslave/jenkins/workspace/test-suite-verify-machineinstrs-x86_64-O3/test-suite-build/tools/timeit --summary SingleSource/Regression/C/gcc-c-torture/execute/ieee/GCC-C-execute-ieee-fp-cmp-6.link.time /Users/buildslave/jenkins/workspace/test-suite-verify-machineinstrs-x86_64-O3/compiler/bin/clang -B /Applications/Xcode.app/Contents/Developer/Toolchains/XcodeDefault.xctoolchain/usr/bin    -Wno-unused-command-line-argument -mllvm -verify-machineinstrs -O3 -arch x86_64 -isysroot /Applications/Xcode.app/Contents/Developer/Platforms/MacOSX.platform/Developer/SDKs/MacOSX10.14.sdk -Wl,-search_paths_first -Wl,-headerpad_max_install_names -B /Applications/Xcode.app/Contents/Developer/Toolchains/XcodeDefault.xctoolchain/usr/bin SingleSource/Regression/C/gcc-c-torture/execute/ieee/CMakeFiles/GCC-C-execute-ieee-fp-cmp-6.dir/fp-cmp-6.c.o  -o SingleSource/Regression/C/gcc-c-torture/execute/ieee/GCC-C-execute-ieee-fp-cmp-6  -Wl,-no_pie && :
[7575/7672] : && /Users/buildslave/jenkins/workspace/test-suite-verify-machineinstrs-x86_64-O3/test-suite-build/tools/timeit --summary SingleSource/Regression/C/gcc-c-torture/execute/ieee/GCC-C-execute-ieee-20041213-1.link.time /Users/buildslave/jenkins/workspace/test-suite-verify-machineinstrs-x86_64-O3/compiler/bin/clang -B /Applications/Xcode.app/Contents/Developer/Toolchains/XcodeDefault.xctoolchain/usr/bin    -Wno-unused-command-line-argument -mllvm -verify-machineinstrs -O3 -arch x86_64 -isysroot /Applications/Xcode.app/Contents/Developer/Platforms/MacOSX.platform/Developer/SDKs/MacOSX10.14.sdk -Wl,-search_paths_first -Wl,-headerpad_max_install_names -B /Applications/Xcode.app/Contents/Developer/Toolchains/XcodeDefault.xctoolchain/usr/bin SingleSource/Regression/C/gcc-c-torture/execute/ieee/CMakeFiles/GCC-C-execute-ieee-20041213-1.dir/20041213-1.c.o  -o SingleSource/Regression/C/gcc-c-torture/execute/ieee/GCC-C-execute-ieee-20041213-1  -Wl,-no_pie -lm && :
[7576/7672] /Users/buildslave/jenkins/workspace/test-suite-verify-machineinstrs-x86_64-O3/test-suite-build/tools/timeit --summary SingleSource/Regression/C/gcc-c-torture/execute/ieee/CMakeFiles/GCC-C-execute-ieee-fp-cmp-4l.dir/fp-cmp-4l.c.o.time /Users/buildslave/jenkins/workspace/test-suite-verify-machineinstrs-x86_64-O3/compiler/bin/clang -DNDEBUG  -B /Applications/Xcode.app/Contents/Developer/Toolchains/XcodeDefault.xctoolchain/usr/bin    -Wno-unused-command-line-argument -mllvm -verify-machineinstrs -O3 -arch x86_64 -isysroot /Applications/Xcode.app/Contents/Developer/Platforms/MacOSX.platform/Developer/SDKs/MacOSX10.14.sdk   -w -Werror=date-time -w -MD -MT SingleSource/Regression/C/gcc-c-torture/execute/ieee/CMakeFiles/GCC-C-execute-ieee-fp-cmp-4l.dir/fp-cmp-4l.c.o -MF SingleSource/Regression/C/gcc-c-torture/execute/ieee/CMakeFiles/GCC-C-execute-ieee-fp-cmp-4l.dir/fp-cmp-4l.c.o.d -o SingleSource/Regression/C/gcc-c-torture/execute/ieee/CMakeFiles/GCC-C-execute-ieee-fp-cmp-4l.dir/fp-cmp-4l.c.o   -c /Users/buildslave/jenkins/workspace/test-suite-verify-machineinstrs-x86_64-O3/test-suite/SingleSource/Regression/C/gcc-c-torture/execute/ieee/fp-cmp-4l.c
[7577/7672] /Users/buildslave/jenkins/workspace/test-suite-verify-machineinstrs-x86_64-O3/test-suite-build/tools/timeit --summary SingleSource/Regression/C/gcc-c-torture/execute/ieee/CMakeFiles/GCC-C-execute-ieee-fp-cmp-5.dir/fp-cmp-5.c.o.time /Users/buildslave/jenkins/workspace/test-suite-verify-machineinstrs-x86_64-O3/compiler/bin/clang -DNDEBUG  -B /Applications/Xcode.app/Contents/Developer/Toolchains/XcodeDefault.xctoolchain/usr/bin    -Wno-unused-command-line-argument -mllvm -verify-machineinstrs -O3 -arch x86_64 -isysroot /Applications/Xcode.app/Contents/Developer/Platforms/MacOSX.platform/Developer/SDKs/MacOSX10.14.sdk   -w -Werror=date-time -w -MD -MT SingleSource/Regression/C/gcc-c-torture/execute/ieee/CMakeFiles/GCC-C-execute-ieee-fp-cmp-5.dir/fp-cmp-5.c.o -MF SingleSource/Regression/C/gcc-c-torture/execute/ieee/CMakeFiles/GCC-C-execute-ieee-fp-cmp-5.dir/fp-cmp-5.c.o.d -o SingleSource/Regression/C/gcc-c-torture/execute/ieee/CMakeFiles/GCC-C-execute-ieee-fp-cmp-5.dir/fp-cmp-5.c.o   -c /Users/buildslave/jenkins/workspace/test-suite-verify-machineinstrs-x86_64-O3/test-suite/SingleSource/Regression/C/gcc-c-torture/execute/ieee/fp-cmp-5.c
[7578/7672] : && /Users/buildslave/jenkins/workspace/test-suite-verify-machineinstrs-x86_64-O3/test-suite-build/tools/timeit --summary SingleSource/Regression/C/gcc-c-torture/execute/ieee/GCC-C-execute-ieee-fp-cmp-4l.link.time /Users/buildslave/jenkins/workspace/test-suite-verify-machineinstrs-x86_64-O3/compiler/bin/clang -B /Applications/Xcode.app/Contents/Developer/Toolchains/XcodeDefault.xctoolchain/usr/bin    -Wno-unused-command-line-argument -mllvm -verify-machineinstrs -O3 -arch x86_64 -isysroot /Applications/Xcode.app/Contents/Developer/Platforms/MacOSX.platform/Developer/SDKs/MacOSX10.14.sdk -Wl,-search_paths_first -Wl,-headerpad_max_install_names -B /Applications/Xcode.app/Contents/Developer/Toolchains/XcodeDefault.xctoolchain/usr/bin SingleSource/Regression/C/gcc-c-torture/execute/ieee/CMakeFiles/GCC-C-execute-ieee-fp-cmp-4l.dir/fp-cmp-4l.c.o  -o SingleSource/Regression/C/gcc-c-torture/execute/ieee/GCC-C-execute-ieee-fp-cmp-4l  -Wl,-no_pie && :
[7579/7672] : && /Users/buildslave/jenkins/workspace/test-suite-verify-machineinstrs-x86_64-O3/test-suite-build/tools/timeit --summary SingleSource/Regression/C/gcc-c-torture/execute/ieee/GCC-C-execute-ieee-fp-cmp-5.link.time /Users/buildslave/jenkins/workspace/test-suite-verify-machineinstrs-x86_64-O3/compiler/bin/clang -B /Applications/Xcode.app/Contents/Developer/Toolchains/XcodeDefault.xctoolchain/usr/bin    -Wno-unused-command-line-argument -mllvm -verify-machineinstrs -O3 -arch x86_64 -isysroot /Applications/Xcode.app/Contents/Developer/Platforms/MacOSX.platform/Developer/SDKs/MacOSX10.14.sdk -Wl,-search_paths_first -Wl,-headerpad_max_install_names -B /Applications/Xcode.app/Contents/Developer/Toolchains/XcodeDefault.xctoolchain/usr/bin SingleSource/Regression/C/gcc-c-torture/execute/ieee/CMakeFiles/GCC-C-execute-ieee-fp-cmp-5.dir/fp-cmp-5.c.o  -o SingleSource/Regression/C/gcc-c-torture/execute/ieee/GCC-C-execute-ieee-fp-cmp-5  -Wl,-no_pie && :
[7580/7672] /Users/buildslave/jenkins/workspace/test-suite-verify-machineinstrs-x86_64-O3/test-suite-build/tools/timeit --summary SingleSource/Regression/C/gcc-c-torture/execute/ieee/CMakeFiles/GCC-C-execute-ieee-copysign2.dir/copysign2.c.o.time /Users/buildslave/jenkins/workspace/test-suite-verify-machineinstrs-x86_64-O3/compiler/bin/clang -DNDEBUG  -B /Applications/Xcode.app/Contents/Developer/Toolchains/XcodeDefault.xctoolchain/usr/bin    -Wno-unused-command-line-argument -mllvm -verify-machineinstrs -O3 -arch x86_64 -isysroot /Applications/Xcode.app/Contents/Developer/Platforms/MacOSX.platform/Developer/SDKs/MacOSX10.14.sdk   -w -Werror=date-time -w -MD -MT SingleSource/Regression/C/gcc-c-torture/execute/ieee/CMakeFiles/GCC-C-execute-ieee-copysign2.dir/copysign2.c.o -MF SingleSource/Regression/C/gcc-c-torture/execute/ieee/CMakeFiles/GCC-C-execute-ieee-copysign2.dir/copysign2.c.o.d -o SingleSource/Regression/C/gcc-c-torture/execute/ieee/CMakeFiles/GCC-C-execute-ieee-copysign2.dir/copysign2.c.o   -c /Users/buildslave/jenkins/workspace/test-suite-verify-machineinstrs-x86_64-O3/test-suite/SingleSource/Regression/C/gcc-c-torture/execute/ieee/copysign2.c
[7581/7672] /Users/buildslave/jenkins/workspace/test-suite-verify-machineinstrs-x86_64-O3/test-suite-build/tools/timeit --summary SingleSource/Regression/C/gcc-c-torture/execute/ieee/CMakeFiles/GCC-C-execute-ieee-fp-cmp-4e.dir/fp-cmp-4e.c.o.time /Users/buildslave/jenkins/workspace/test-suite-verify-machineinstrs-x86_64-O3/compiler/bin/clang -DNDEBUG  -B /Applications/Xcode.app/Contents/Developer/Toolchains/XcodeDefault.xctoolchain/usr/bin    -Wno-unused-command-line-argument -mllvm -verify-machineinstrs -O3 -arch x86_64 -isysroot /Applications/Xcode.app/Contents/Developer/Platforms/MacOSX.platform/Developer/SDKs/MacOSX10.14.sdk   -w -Werror=date-time -w -MD -MT SingleSource/Regression/C/gcc-c-torture/execute/ieee/CMakeFiles/GCC-C-execute-ieee-fp-cmp-4e.dir/fp-cmp-4e.c.o -MF SingleSource/Regression/C/gcc-c-torture/execute/ieee/CMakeFiles/GCC-C-execute-ieee-fp-cmp-4e.dir/fp-cmp-4e.c.o.d -o SingleSource/Regression/C/gcc-c-torture/execute/ieee/CMakeFiles/GCC-C-execute-ieee-fp-cmp-4e.dir/fp-cmp-4e.c.o   -c /Users/buildslave/jenkins/workspace/test-suite-verify-machineinstrs-x86_64-O3/test-suite/SingleSource/Regression/C/gcc-c-torture/execute/ieee/fp-cmp-4e.c
[7582/7672] /Users/buildslave/jenkins/workspace/test-suite-verify-machineinstrs-x86_64-O3/test-suite-build/tools/timeit --summary SingleSource/Regression/C/gcc-c-torture/execute/ieee/CMakeFiles/GCC-C-execute-ieee-fp-cmp-1.dir/fp-cmp-1.c.o.time /Users/buildslave/jenkins/workspace/test-suite-verify-machineinstrs-x86_64-O3/compiler/bin/clang -DNDEBUG  -B /Applications/Xcode.app/Contents/Developer/Toolchains/XcodeDefault.xctoolchain/usr/bin    -Wno-unused-command-line-argument -mllvm -verify-machineinstrs -O3 -arch x86_64 -isysroot /Applications/Xcode.app/Contents/Developer/Platforms/MacOSX.platform/Developer/SDKs/MacOSX10.14.sdk   -w -Werror=date-time -w -MD -MT SingleSource/Regression/C/gcc-c-torture/execute/ieee/CMakeFiles/GCC-C-execute-ieee-fp-cmp-1.dir/fp-cmp-1.c.o -MF SingleSource/Regression/C/gcc-c-torture/execute/ieee/CMakeFiles/GCC-C-execute-ieee-fp-cmp-1.dir/fp-cmp-1.c.o.d -o SingleSource/Regression/C/gcc-c-torture/execute/ieee/CMakeFiles/GCC-C-execute-ieee-fp-cmp-1.dir/fp-cmp-1.c.o   -c /Users/buildslave/jenkins/workspace/test-suite-verify-machineinstrs-x86_64-O3/test-suite/SingleSource/Regression/C/gcc-c-torture/execute/ieee/fp-cmp-1.c
[7583/7672] : && /Users/buildslave/jenkins/workspace/test-suite-verify-machineinstrs-x86_64-O3/test-suite-build/tools/timeit --summary SingleSource/Regression/C/gcc-c-torture/execute/ieee/GCC-C-execute-ieee-copysign2.link.time /Users/buildslave/jenkins/workspace/test-suite-verify-machineinstrs-x86_64-O3/compiler/bin/clang -B /Applications/Xcode.app/Contents/Developer/Toolchains/XcodeDefault.xctoolchain/usr/bin    -Wno-unused-command-line-argument -mllvm -verify-machineinstrs -O3 -arch x86_64 -isysroot /Applications/Xcode.app/Contents/Developer/Platforms/MacOSX.platform/Developer/SDKs/MacOSX10.14.sdk -Wl,-search_paths_first -Wl,-headerpad_max_install_names -B /Applications/Xcode.app/Contents/Developer/Toolchains/XcodeDefault.xctoolchain/usr/bin SingleSource/Regression/C/gcc-c-torture/execute/ieee/CMakeFiles/GCC-C-execute-ieee-copysign2.dir/copysign2.c.o  -o SingleSource/Regression/C/gcc-c-torture/execute/ieee/GCC-C-execute-ieee-copysign2  -Wl,-no_pie && :
[7584/7672] : && /Users/buildslave/jenkins/workspace/test-suite-verify-machineinstrs-x86_64-O3/test-suite-build/tools/timeit --summary SingleSource/Regression/C/gcc-c-torture/execute/ieee/GCC-C-execute-ieee-fp-cmp-4e.link.time /Users/buildslave/jenkins/workspace/test-suite-verify-machineinstrs-x86_64-O3/compiler/bin/clang -B /Applications/Xcode.app/Contents/Developer/Toolchains/XcodeDefault.xctoolchain/usr/bin    -Wno-unused-command-line-argument -mllvm -verify-machineinstrs -O3 -arch x86_64 -isysroot /Applications/Xcode.app/Contents/Developer/Platforms/MacOSX.platform/Developer/SDKs/MacOSX10.14.sdk -Wl,-search_paths_first -Wl,-headerpad_max_install_names -B /Applications/Xcode.app/Contents/Developer/Toolchains/XcodeDefault.xctoolchain/usr/bin SingleSource/Regression/C/gcc-c-torture/execute/ieee/CMakeFiles/GCC-C-execute-ieee-fp-cmp-4e.dir/fp-cmp-4e.c.o  -o SingleSource/Regression/C/gcc-c-torture/execute/ieee/GCC-C-execute-ieee-fp-cmp-4e  -Wl,-no_pie && :
[7585/7672] : && /Users/buildslave/jenkins/workspace/test-suite-verify-machineinstrs-x86_64-O3/test-suite-build/tools/timeit --summary SingleSource/Regression/C/gcc-c-torture/execute/ieee/GCC-C-execute-ieee-fp-cmp-1.link.time /Users/buildslave/jenkins/workspace/test-suite-verify-machineinstrs-x86_64-O3/compiler/bin/clang -B /Applications/Xcode.app/Contents/Developer/Toolchains/XcodeDefault.xctoolchain/usr/bin    -Wno-unused-command-line-argument -mllvm -verify-machineinstrs -O3 -arch x86_64 -isysroot /Applications/Xcode.app/Contents/Developer/Platforms/MacOSX.platform/Developer/SDKs/MacOSX10.14.sdk -Wl,-search_paths_first -Wl,-headerpad_max_install_names -B /Applications/Xcode.app/Contents/Developer/Toolchains/XcodeDefault.xctoolchain/usr/bin SingleSource/Regression/C/gcc-c-torture/execute/ieee/CMakeFiles/GCC-C-execute-ieee-fp-cmp-1.dir/fp-cmp-1.c.o  -o SingleSource/Regression/C/gcc-c-torture/execute/ieee/GCC-C-execute-ieee-fp-cmp-1  -Wl,-no_pie && :
[7586/7672] /Users/buildslave/jenkins/workspace/test-suite-verify-machineinstrs-x86_64-O3/test-suite-build/tools/timeit --summary SingleSource/Regression/C/gcc-c-torture/execute/CMakeFiles/GCC-C-execute-20040709-2.dir/20040709-2.c.o.time /Users/buildslave/jenkins/workspace/test-suite-verify-machineinstrs-x86_64-O3/compiler/bin/clang -DNDEBUG  -B /Applications/Xcode.app/Contents/Developer/Toolchains/XcodeDefault.xctoolchain/usr/bin    -Wno-unused-command-line-argument -mllvm -verify-machineinstrs -O3 -arch x86_64 -isysroot /Applications/Xcode.app/Contents/Developer/Platforms/MacOSX.platform/Developer/SDKs/MacOSX10.14.sdk   -w -Werror=date-time -w -MD -MT SingleSource/Regression/C/gcc-c-torture/execute/CMakeFiles/GCC-C-execute-20040709-2.dir/20040709-2.c.o -MF SingleSource/Regression/C/gcc-c-torture/execute/CMakeFiles/GCC-C-execute-20040709-2.dir/20040709-2.c.o.d -o SingleSource/Regression/C/gcc-c-torture/execute/CMakeFiles/GCC-C-execute-20040709-2.dir/20040709-2.c.o   -c /Users/buildslave/jenkins/workspace/test-suite-verify-machineinstrs-x86_64-O3/test-suite/SingleSource/Regression/C/gcc-c-torture/execute/20040709-2.c
[7587/7672] /Users/buildslave/jenkins/workspace/test-suite-verify-machineinstrs-x86_64-O3/test-suite-build/tools/timeit --summary SingleSource/Regression/C/gcc-c-torture/execute/ieee/CMakeFiles/GCC-C-execute-ieee-inf-3.dir/inf-3.c.o.time /Users/buildslave/jenkins/workspace/test-suite-verify-machineinstrs-x86_64-O3/compiler/bin/clang -DNDEBUG  -B /Applications/Xcode.app/Contents/Developer/Toolchains/XcodeDefault.xctoolchain/usr/bin    -Wno-unused-command-line-argument -mllvm -verify-machineinstrs -O3 -arch x86_64 -isysroot /Applications/Xcode.app/Contents/Developer/Platforms/MacOSX.platform/Developer/SDKs/MacOSX10.14.sdk   -w -Werror=date-time -w -MD -MT SingleSource/Regression/C/gcc-c-torture/execute/ieee/CMakeFiles/GCC-C-execute-ieee-inf-3.dir/inf-3.c.o -MF SingleSource/Regression/C/gcc-c-torture/execute/ieee/CMakeFiles/GCC-C-execute-ieee-inf-3.dir/inf-3.c.o.d -o SingleSource/Regression/C/gcc-c-torture/execute/ieee/CMakeFiles/GCC-C-execute-ieee-inf-3.dir/inf-3.c.o   -c /Users/buildslave/jenkins/workspace/test-suite-verify-machineinstrs-x86_64-O3/test-suite/SingleSource/Regression/C/gcc-c-torture/execute/ieee/inf-3.c
[7588/7672] : && /Users/buildslave/jenkins/workspace/test-suite-verify-machineinstrs-x86_64-O3/test-suite-build/tools/timeit --summary SingleSource/Regression/C/gcc-c-torture/execute/GCC-C-execute-20040709-2.link.time /Users/buildslave/jenkins/workspace/test-suite-verify-machineinstrs-x86_64-O3/compiler/bin/clang -B /Applications/Xcode.app/Contents/Developer/Toolchains/XcodeDefault.xctoolchain/usr/bin    -Wno-unused-command-line-argument -mllvm -verify-machineinstrs -O3 -arch x86_64 -isysroot /Applications/Xcode.app/Contents/Developer/Platforms/MacOSX.platform/Developer/SDKs/MacOSX10.14.sdk -Wl,-search_paths_first -Wl,-headerpad_max_install_names -B /Applications/Xcode.app/Contents/Developer/Toolchains/XcodeDefault.xctoolchain/usr/bin SingleSource/Regression/C/gcc-c-torture/execute/CMakeFiles/GCC-C-execute-20040709-2.dir/20040709-2.c.o  -o SingleSource/Regression/C/gcc-c-torture/execute/GCC-C-execute-20040709-2  -Wl,-no_pie && :
[7589/7672] : && /Users/buildslave/jenkins/workspace/test-suite-verify-machineinstrs-x86_64-O3/test-suite-build/tools/timeit --summary SingleSource/Regression/C/gcc-c-torture/execute/ieee/GCC-C-execute-ieee-inf-3.link.time /Users/buildslave/jenkins/workspace/test-suite-verify-machineinstrs-x86_64-O3/compiler/bin/clang -B /Applications/Xcode.app/Contents/Developer/Toolchains/XcodeDefault.xctoolchain/usr/bin    -Wno-unused-command-line-argument -mllvm -verify-machineinstrs -O3 -arch x86_64 -isysroot /Applications/Xcode.app/Contents/Developer/Platforms/MacOSX.platform/Developer/SDKs/MacOSX10.14.sdk -Wl,-search_paths_first -Wl,-headerpad_max_install_names -B /Applications/Xcode.app/Contents/Developer/Toolchains/XcodeDefault.xctoolchain/usr/bin SingleSource/Regression/C/gcc-c-torture/execute/ieee/CMakeFiles/GCC-C-execute-ieee-inf-3.dir/inf-3.c.o  -o SingleSource/Regression/C/gcc-c-torture/execute/ieee/GCC-C-execute-ieee-inf-3  -Wl,-no_pie && :
[7590/7672] /Users/buildslave/jenkins/workspace/test-suite-verify-machineinstrs-x86_64-O3/test-suite-build/tools/timeit --summary SingleSource/Regression/C/gcc-c-torture/execute/ieee/CMakeFiles/GCC-C-execute-ieee-compare-fp-4.dir/compare-fp-4.c.o.time /Users/buildslave/jenkins/workspace/test-suite-verify-machineinstrs-x86_64-O3/compiler/bin/clang -DNDEBUG  -B /Applications/Xcode.app/Contents/Developer/Toolchains/XcodeDefault.xctoolchain/usr/bin    -Wno-unused-command-line-argument -mllvm -verify-machineinstrs -O3 -arch x86_64 -isysroot /Applications/Xcode.app/Contents/Developer/Platforms/MacOSX.platform/Developer/SDKs/MacOSX10.14.sdk   -w -Werror=date-time -w -MD -MT SingleSource/Regression/C/gcc-c-torture/execute/ieee/CMakeFiles/GCC-C-execute-ieee-compare-fp-4.dir/compare-fp-4.c.o -MF SingleSource/Regression/C/gcc-c-torture/execute/ieee/CMakeFiles/GCC-C-execute-ieee-compare-fp-4.dir/compare-fp-4.c.o.d -o SingleSource/Regression/C/gcc-c-torture/execute/ieee/CMakeFiles/GCC-C-execute-ieee-compare-fp-4.dir/compare-fp-4.c.o   -c /Users/buildslave/jenkins/workspace/test-suite-verify-machineinstrs-x86_64-O3/test-suite/SingleSource/Regression/C/gcc-c-torture/execute/ieee/compare-fp-4.c
[7591/7672] /Users/buildslave/jenkins/workspace/test-suite-verify-machineinstrs-x86_64-O3/test-suite-build/tools/timeit --summary SingleSource/Regression/C/gcc-c-torture/execute/ieee/CMakeFiles/GCC-C-execute-ieee-copysign1.dir/copysign1.c.o.time /Users/buildslave/jenkins/workspace/test-suite-verify-machineinstrs-x86_64-O3/compiler/bin/clang -DNDEBUG  -B /Applications/Xcode.app/Contents/Developer/Toolchains/XcodeDefault.xctoolchain/usr/bin    -Wno-unused-command-line-argument -mllvm -verify-machineinstrs -O3 -arch x86_64 -isysroot /Applications/Xcode.app/Contents/Developer/Platforms/MacOSX.platform/Developer/SDKs/MacOSX10.14.sdk   -w -Werror=date-time -w -MD -MT SingleSource/Regression/C/gcc-c-torture/execute/ieee/CMakeFiles/GCC-C-execute-ieee-copysign1.dir/copysign1.c.o -MF SingleSource/Regression/C/gcc-c-torture/execute/ieee/CMakeFiles/GCC-C-execute-ieee-copysign1.dir/copysign1.c.o.d -o SingleSource/Regression/C/gcc-c-torture/execute/ieee/CMakeFiles/GCC-C-execute-ieee-copysign1.dir/copysign1.c.o   -c /Users/buildslave/jenkins/workspace/test-suite-verify-machineinstrs-x86_64-O3/test-suite/SingleSource/Regression/C/gcc-c-torture/execute/ieee/copysign1.c
[7592/7672] /Users/buildslave/jenkins/workspace/test-suite-verify-machineinstrs-x86_64-O3/test-suite-build/tools/timeit --summary SingleSource/Regression/C/gcc-c-torture/execute/ieee/CMakeFiles/GCC-C-execute-ieee-compare-fp-3.dir/compare-fp-3.c.o.time /Users/buildslave/jenkins/workspace/test-suite-verify-machineinstrs-x86_64-O3/compiler/bin/clang -DNDEBUG  -B /Applications/Xcode.app/Contents/Developer/Toolchains/XcodeDefault.xctoolchain/usr/bin    -Wno-unused-command-line-argument -mllvm -verify-machineinstrs -O3 -arch x86_64 -isysroot /Applications/Xcode.app/Contents/Developer/Platforms/MacOSX.platform/Developer/SDKs/MacOSX10.14.sdk   -w -Werror=date-time -w -fno-trapping-math -MD -MT SingleSource/Regression/C/gcc-c-torture/execute/ieee/CMakeFiles/GCC-C-execute-ieee-compare-fp-3.dir/compare-fp-3.c.o -MF SingleSource/Regression/C/gcc-c-torture/execute/ieee/CMakeFiles/GCC-C-execute-ieee-compare-fp-3.dir/compare-fp-3.c.o.d -o SingleSource/Regression/C/gcc-c-torture/execute/ieee/CMakeFiles/GCC-C-execute-ieee-compare-fp-3.dir/compare-fp-3.c.o   -c /Users/buildslave/jenkins/workspace/test-suite-verify-machineinstrs-x86_64-O3/test-suite/SingleSource/Regression/C/gcc-c-torture/execute/ieee/compare-fp-3.c
[7593/7672] /Users/buildslave/jenkins/workspace/test-suite-verify-machineinstrs-x86_64-O3/test-suite-build/tools/timeit --summary SingleSource/Regression/C/gcc-c-torture/execute/ieee/CMakeFiles/GCC-C-execute-ieee-compare-fp-2.dir/compare-fp-2.c.o.time /Users/buildslave/jenkins/workspace/test-suite-verify-machineinstrs-x86_64-O3/compiler/bin/clang -DNDEBUG  -B /Applications/Xcode.app/Contents/Developer/Toolchains/XcodeDefault.xctoolchain/usr/bin    -Wno-unused-command-line-argument -mllvm -verify-machineinstrs -O3 -arch x86_64 -isysroot /Applications/Xcode.app/Contents/Developer/Platforms/MacOSX.platform/Developer/SDKs/MacOSX10.14.sdk   -w -Werror=date-time -w -MD -MT SingleSource/Regression/C/gcc-c-torture/execute/ieee/CMakeFiles/GCC-C-execute-ieee-compare-fp-2.dir/compare-fp-2.c.o -MF SingleSource/Regression/C/gcc-c-torture/execute/ieee/CMakeFiles/GCC-C-execute-ieee-compare-fp-2.dir/compare-fp-2.c.o.d -o SingleSource/Regression/C/gcc-c-torture/execute/ieee/CMakeFiles/GCC-C-execute-ieee-compare-fp-2.dir/compare-fp-2.c.o   -c /Users/buildslave/jenkins/workspace/test-suite-verify-machineinstrs-x86_64-O3/test-suite/SingleSource/Regression/C/gcc-c-torture/execute/ieee/compare-fp-2.c
[7594/7672] : && /Users/buildslave/jenkins/workspace/test-suite-verify-machineinstrs-x86_64-O3/test-suite-build/tools/timeit --summary SingleSource/Regression/C/gcc-c-torture/execute/ieee/GCC-C-execute-ieee-compare-fp-4.link.time /Users/buildslave/jenkins/workspace/test-suite-verify-machineinstrs-x86_64-O3/compiler/bin/clang -B /Applications/Xcode.app/Contents/Developer/Toolchains/XcodeDefault.xctoolchain/usr/bin    -Wno-unused-command-line-argument -mllvm -verify-machineinstrs -O3 -arch x86_64 -isysroot /Applications/Xcode.app/Contents/Developer/Platforms/MacOSX.platform/Developer/SDKs/MacOSX10.14.sdk -Wl,-search_paths_first -Wl,-headerpad_max_install_names -B /Applications/Xcode.app/Contents/Developer/Toolchains/XcodeDefault.xctoolchain/usr/bin SingleSource/Regression/C/gcc-c-torture/execute/ieee/CMakeFiles/GCC-C-execute-ieee-compare-fp-4.dir/compare-fp-4.c.o  -o SingleSource/Regression/C/gcc-c-torture/execute/ieee/GCC-C-execute-ieee-compare-fp-4  -Wl,-no_pie && :
[7595/7672] : && /Users/buildslave/jenkins/workspace/test-suite-verify-machineinstrs-x86_64-O3/test-suite-build/tools/timeit --summary SingleSource/Regression/C/gcc-c-torture/execute/ieee/GCC-C-execute-ieee-copysign1.link.time /Users/buildslave/jenkins/workspace/test-suite-verify-machineinstrs-x86_64-O3/compiler/bin/clang -B /Applications/Xcode.app/Contents/Developer/Toolchains/XcodeDefault.xctoolchain/usr/bin    -Wno-unused-command-line-argument -mllvm -verify-machineinstrs -O3 -arch x86_64 -isysroot /Applications/Xcode.app/Contents/Developer/Platforms/MacOSX.platform/Developer/SDKs/MacOSX10.14.sdk -Wl,-search_paths_first -Wl,-headerpad_max_install_names -B /Applications/Xcode.app/Contents/Developer/Toolchains/XcodeDefault.xctoolchain/usr/bin SingleSource/Regression/C/gcc-c-torture/execute/ieee/CMakeFiles/GCC-C-execute-ieee-copysign1.dir/copysign1.c.o  -o SingleSource/Regression/C/gcc-c-torture/execute/ieee/GCC-C-execute-ieee-copysign1  -Wl,-no_pie && :
[7596/7672] : && /Users/buildslave/jenkins/workspace/test-suite-verify-machineinstrs-x86_64-O3/test-suite-build/tools/timeit --summary SingleSource/Regression/C/gcc-c-torture/execute/ieee/GCC-C-execute-ieee-compare-fp-3.link.time /Users/buildslave/jenkins/workspace/test-suite-verify-machineinstrs-x86_64-O3/compiler/bin/clang -B /Applications/Xcode.app/Contents/Developer/Toolchains/XcodeDefault.xctoolchain/usr/bin    -Wno-unused-command-line-argument -mllvm -verify-machineinstrs -O3 -arch x86_64 -isysroot /Applications/Xcode.app/Contents/Developer/Platforms/MacOSX.platform/Developer/SDKs/MacOSX10.14.sdk -Wl,-search_paths_first -Wl,-headerpad_max_install_names -B /Applications/Xcode.app/Contents/Developer/Toolchains/XcodeDefault.xctoolchain/usr/bin SingleSource/Regression/C/gcc-c-torture/execute/ieee/CMakeFiles/GCC-C-execute-ieee-compare-fp-3.dir/compare-fp-3.c.o  -o SingleSource/Regression/C/gcc-c-torture/execute/ieee/GCC-C-execute-ieee-compare-fp-3  -Wl,-no_pie && :
[7597/7672] : && /Users/buildslave/jenkins/workspace/test-suite-verify-machineinstrs-x86_64-O3/test-suite-build/tools/timeit --summary SingleSource/Regression/C/gcc-c-torture/execute/ieee/GCC-C-execute-ieee-compare-fp-2.link.time /Users/buildslave/jenkins/workspace/test-suite-verify-machineinstrs-x86_64-O3/compiler/bin/clang -B /Applications/Xcode.app/Contents/Developer/Toolchains/XcodeDefault.xctoolchain/usr/bin    -Wno-unused-command-line-argument -mllvm -verify-machineinstrs -O3 -arch x86_64 -isysroot /Applications/Xcode.app/Contents/Developer/Platforms/MacOSX.platform/Developer/SDKs/MacOSX10.14.sdk -Wl,-search_paths_first -Wl,-headerpad_max_install_names -B /Applications/Xcode.app/Contents/Developer/Toolchains/XcodeDefault.xctoolchain/usr/bin SingleSource/Regression/C/gcc-c-torture/execute/ieee/CMakeFiles/GCC-C-execute-ieee-compare-fp-2.dir/compare-fp-2.c.o  -o SingleSource/Regression/C/gcc-c-torture/execute/ieee/GCC-C-execute-ieee-compare-fp-2  -Wl,-no_pie && :
[7598/7672] /Users/buildslave/jenkins/workspace/test-suite-verify-machineinstrs-x86_64-O3/test-suite-build/tools/timeit --summary SingleSource/Regression/C/gcc-c-torture/execute/ieee/CMakeFiles/GCC-C-execute-ieee-20010114-2.dir/20010114-2.c.o.time /Users/buildslave/jenkins/workspace/test-suite-verify-machineinstrs-x86_64-O3/compiler/bin/clang -DNDEBUG  -B /Applications/Xcode.app/Contents/Developer/Toolchains/XcodeDefault.xctoolchain/usr/bin    -Wno-unused-command-line-argument -mllvm -verify-machineinstrs -O3 -arch x86_64 -isysroot /Applications/Xcode.app/Contents/Developer/Platforms/MacOSX.platform/Developer/SDKs/MacOSX10.14.sdk   -w -Werror=date-time -w -MD -MT SingleSource/Regression/C/gcc-c-torture/execute/ieee/CMakeFiles/GCC-C-execute-ieee-20010114-2.dir/20010114-2.c.o -MF SingleSource/Regression/C/gcc-c-torture/execute/ieee/CMakeFiles/GCC-C-execute-ieee-20010114-2.dir/20010114-2.c.o.d -o SingleSource/Regression/C/gcc-c-torture/execute/ieee/CMakeFiles/GCC-C-execute-ieee-20010114-2.dir/20010114-2.c.o   -c /Users/buildslave/jenkins/workspace/test-suite-verify-machineinstrs-x86_64-O3/test-suite/SingleSource/Regression/C/gcc-c-torture/execute/ieee/20010114-2.c
[7599/7672] /Users/buildslave/jenkins/workspace/test-suite-verify-machineinstrs-x86_64-O3/test-suite-build/tools/timeit --summary SingleSource/Regression/C/gcc-c-torture/execute/ieee/CMakeFiles/GCC-C-execute-ieee-builtin-nan-1.dir/builtin-nan-1.c.o.time /Users/buildslave/jenkins/workspace/test-suite-verify-machineinstrs-x86_64-O3/compiler/bin/clang -DNDEBUG  -B /Applications/Xcode.app/Contents/Developer/Toolchains/XcodeDefault.xctoolchain/usr/bin    -Wno-unused-command-line-argument -mllvm -verify-machineinstrs -O3 -arch x86_64 -isysroot /Applications/Xcode.app/Contents/Developer/Platforms/MacOSX.platform/Developer/SDKs/MacOSX10.14.sdk   -w -Werror=date-time -w -MD -MT SingleSource/Regression/C/gcc-c-torture/execute/ieee/CMakeFiles/GCC-C-execute-ieee-builtin-nan-1.dir/builtin-nan-1.c.o -MF SingleSource/Regression/C/gcc-c-torture/execute/ieee/CMakeFiles/GCC-C-execute-ieee-builtin-nan-1.dir/builtin-nan-1.c.o.d -o SingleSource/Regression/C/gcc-c-torture/execute/ieee/CMakeFiles/GCC-C-execute-ieee-builtin-nan-1.dir/builtin-nan-1.c.o   -c /Users/buildslave/jenkins/workspace/test-suite-verify-machineinstrs-x86_64-O3/test-suite/SingleSource/Regression/C/gcc-c-torture/execute/ieee/builtin-nan-1.c
[7600/7672] /Users/buildslave/jenkins/workspace/test-suite-verify-machineinstrs-x86_64-O3/test-suite-build/tools/timeit --summary SingleSource/Regression/C/gcc-c-torture/execute/ieee/CMakeFiles/GCC-C-execute-ieee-hugeval.dir/hugeval.c.o.time /Users/buildslave/jenkins/workspace/test-suite-verify-machineinstrs-x86_64-O3/compiler/bin/clang -DNDEBUG  -B /Applications/Xcode.app/Contents/Developer/Toolchains/XcodeDefault.xctoolchain/usr/bin    -Wno-unused-command-line-argument -mllvm -verify-machineinstrs -O3 -arch x86_64 -isysroot /Applications/Xcode.app/Contents/Developer/Platforms/MacOSX.platform/Developer/SDKs/MacOSX10.14.sdk   -w -Werror=date-time -w -MD -MT SingleSource/Regression/C/gcc-c-torture/execute/ieee/CMakeFiles/GCC-C-execute-ieee-hugeval.dir/hugeval.c.o -MF SingleSource/Regression/C/gcc-c-torture/execute/ieee/CMakeFiles/GCC-C-execute-ieee-hugeval.dir/hugeval.c.o.d -o SingleSource/Regression/C/gcc-c-torture/execute/ieee/CMakeFiles/GCC-C-execute-ieee-hugeval.dir/hugeval.c.o   -c /Users/buildslave/jenkins/workspace/test-suite-verify-machineinstrs-x86_64-O3/test-suite/SingleSource/Regression/C/gcc-c-torture/execute/ieee/hugeval.c
[7601/7672] : && /Users/buildslave/jenkins/workspace/test-suite-verify-machineinstrs-x86_64-O3/test-suite-build/tools/timeit --summary SingleSource/Regression/C/gcc-c-torture/execute/ieee/GCC-C-execute-ieee-20010114-2.link.time /Users/buildslave/jenkins/workspace/test-suite-verify-machineinstrs-x86_64-O3/compiler/bin/clang -B /Applications/Xcode.app/Contents/Developer/Toolchains/XcodeDefault.xctoolchain/usr/bin    -Wno-unused-command-line-argument -mllvm -verify-machineinstrs -O3 -arch x86_64 -isysroot /Applications/Xcode.app/Contents/Developer/Platforms/MacOSX.platform/Developer/SDKs/MacOSX10.14.sdk -Wl,-search_paths_first -Wl,-headerpad_max_install_names -B /Applications/Xcode.app/Contents/Developer/Toolchains/XcodeDefault.xctoolchain/usr/bin SingleSource/Regression/C/gcc-c-torture/execute/ieee/CMakeFiles/GCC-C-execute-ieee-20010114-2.dir/20010114-2.c.o  -o SingleSource/Regression/C/gcc-c-torture/execute/ieee/GCC-C-execute-ieee-20010114-2  -Wl,-no_pie && :
[7602/7672] /Users/buildslave/jenkins/workspace/test-suite-verify-machineinstrs-x86_64-O3/test-suite-build/tools/timeit --summary SingleSource/Regression/C/gcc-c-torture/execute/ieee/CMakeFiles/GCC-C-execute-ieee-compare-fp-1.dir/compare-fp-1.c.o.time /Users/buildslave/jenkins/workspace/test-suite-verify-machineinstrs-x86_64-O3/compiler/bin/clang -DNDEBUG  -B /Applications/Xcode.app/Contents/Developer/Toolchains/XcodeDefault.xctoolchain/usr/bin    -Wno-unused-command-line-argument -mllvm -verify-machineinstrs -O3 -arch x86_64 -isysroot /Applications/Xcode.app/Contents/Developer/Platforms/MacOSX.platform/Developer/SDKs/MacOSX10.14.sdk   -w -Werror=date-time -w -MD -MT SingleSource/Regression/C/gcc-c-torture/execute/ieee/CMakeFiles/GCC-C-execute-ieee-compare-fp-1.dir/compare-fp-1.c.o -MF SingleSource/Regression/C/gcc-c-torture/execute/ieee/CMakeFiles/GCC-C-execute-ieee-compare-fp-1.dir/compare-fp-1.c.o.d -o SingleSource/Regression/C/gcc-c-torture/execute/ieee/CMakeFiles/GCC-C-execute-ieee-compare-fp-1.dir/compare-fp-1.c.o   -c /Users/buildslave/jenkins/workspace/test-suite-verify-machineinstrs-x86_64-O3/test-suite/SingleSource/Regression/C/gcc-c-torture/execute/ieee/compare-fp-1.c
[7603/7672] : && /Users/buildslave/jenkins/workspace/test-suite-verify-machineinstrs-x86_64-O3/test-suite-build/tools/timeit --summary SingleSource/Regression/C/gcc-c-torture/execute/ieee/GCC-C-execute-ieee-builtin-nan-1.link.time /Users/buildslave/jenkins/workspace/test-suite-verify-machineinstrs-x86_64-O3/compiler/bin/clang -B /Applications/Xcode.app/Contents/Developer/Toolchains/XcodeDefault.xctoolchain/usr/bin    -Wno-unused-command-line-argument -mllvm -verify-machineinstrs -O3 -arch x86_64 -isysroot /Applications/Xcode.app/Contents/Developer/Platforms/MacOSX.platform/Developer/SDKs/MacOSX10.14.sdk -Wl,-search_paths_first -Wl,-headerpad_max_install_names -B /Applications/Xcode.app/Contents/Developer/Toolchains/XcodeDefault.xctoolchain/usr/bin SingleSource/Regression/C/gcc-c-torture/execute/ieee/CMakeFiles/GCC-C-execute-ieee-builtin-nan-1.dir/builtin-nan-1.c.o  -o SingleSource/Regression/C/gcc-c-torture/execute/ieee/GCC-C-execute-ieee-builtin-nan-1  -Wl,-no_pie && :
[7604/7672] : && /Users/buildslave/jenkins/workspace/test-suite-verify-machineinstrs-x86_64-O3/test-suite-build/tools/timeit --summary SingleSource/Regression/C/gcc-c-torture/execute/ieee/GCC-C-execute-ieee-hugeval.link.time /Users/buildslave/jenkins/workspace/test-suite-verify-machineinstrs-x86_64-O3/compiler/bin/clang -B /Applications/Xcode.app/Contents/Developer/Toolchains/XcodeDefault.xctoolchain/usr/bin    -Wno-unused-command-line-argument -mllvm -verify-machineinstrs -O3 -arch x86_64 -isysroot /Applications/Xcode.app/Contents/Developer/Platforms/MacOSX.platform/Developer/SDKs/MacOSX10.14.sdk -Wl,-search_paths_first -Wl,-headerpad_max_install_names -B /Applications/Xcode.app/Contents/Developer/Toolchains/XcodeDefault.xctoolchain/usr/bin SingleSource/Regression/C/gcc-c-torture/execute/ieee/CMakeFiles/GCC-C-execute-ieee-hugeval.dir/hugeval.c.o  -o SingleSource/Regression/C/gcc-c-torture/execute/ieee/GCC-C-execute-ieee-hugeval  -Wl,-no_pie && :
[7605/7672] /Users/buildslave/jenkins/workspace/test-suite-verify-machineinstrs-x86_64-O3/test-suite-build/tools/timeit --summary SingleSource/Regression/C/gcc-c-torture/execute/ieee/CMakeFiles/GCC-C-execute-ieee-acc1.dir/acc1.c.o.time /Users/buildslave/jenkins/workspace/test-suite-verify-machineinstrs-x86_64-O3/compiler/bin/clang -DNDEBUG  -B /Applications/Xcode.app/Contents/Developer/Toolchains/XcodeDefault.xctoolchain/usr/bin    -Wno-unused-command-line-argument -mllvm -verify-machineinstrs -O3 -arch x86_64 -isysroot /Applications/Xcode.app/Contents/Developer/Platforms/MacOSX.platform/Developer/SDKs/MacOSX10.14.sdk   -w -Werror=date-time -w -MD -MT SingleSource/Regression/C/gcc-c-torture/execute/ieee/CMakeFiles/GCC-C-execute-ieee-acc1.dir/acc1.c.o -MF SingleSource/Regression/C/gcc-c-torture/execute/ieee/CMakeFiles/GCC-C-execute-ieee-acc1.dir/acc1.c.o.d -o SingleSource/Regression/C/gcc-c-torture/execute/ieee/CMakeFiles/GCC-C-execute-ieee-acc1.dir/acc1.c.o   -c /Users/buildslave/jenkins/workspace/test-suite-verify-machineinstrs-x86_64-O3/test-suite/SingleSource/Regression/C/gcc-c-torture/execute/ieee/acc1.c
[7606/7672] : && /Users/buildslave/jenkins/workspace/test-suite-verify-machineinstrs-x86_64-O3/test-suite-build/tools/timeit --summary SingleSource/Regression/C/gcc-c-torture/execute/ieee/GCC-C-execute-ieee-compare-fp-1.link.time /Users/buildslave/jenkins/workspace/test-suite-verify-machineinstrs-x86_64-O3/compiler/bin/clang -B /Applications/Xcode.app/Contents/Developer/Toolchains/XcodeDefault.xctoolchain/usr/bin    -Wno-unused-command-line-argument -mllvm -verify-machineinstrs -O3 -arch x86_64 -isysroot /Applications/Xcode.app/Contents/Developer/Platforms/MacOSX.platform/Developer/SDKs/MacOSX10.14.sdk -Wl,-search_paths_first -Wl,-headerpad_max_install_names -B /Applications/Xcode.app/Contents/Developer/Toolchains/XcodeDefault.xctoolchain/usr/bin SingleSource/Regression/C/gcc-c-torture/execute/ieee/CMakeFiles/GCC-C-execute-ieee-compare-fp-1.dir/compare-fp-1.c.o  -o SingleSource/Regression/C/gcc-c-torture/execute/ieee/GCC-C-execute-ieee-compare-fp-1  -Wl,-no_pie && :
[7607/7672] /Users/buildslave/jenkins/workspace/test-suite-verify-machineinstrs-x86_64-O3/test-suite-build/tools/timeit --summary SingleSource/Regression/C/gcc-c-torture/execute/ieee/CMakeFiles/GCC-C-execute-ieee-20030331-1.dir/20030331-1.c.o.time /Users/buildslave/jenkins/workspace/test-suite-verify-machineinstrs-x86_64-O3/compiler/bin/clang -DNDEBUG  -B /Applications/Xcode.app/Contents/Developer/Toolchains/XcodeDefault.xctoolchain/usr/bin    -Wno-unused-command-line-argument -mllvm -verify-machineinstrs -O3 -arch x86_64 -isysroot /Applications/Xcode.app/Contents/Developer/Platforms/MacOSX.platform/Developer/SDKs/MacOSX10.14.sdk   -w -Werror=date-time -w -MD -MT SingleSource/Regression/C/gcc-c-torture/execute/ieee/CMakeFiles/GCC-C-execute-ieee-20030331-1.dir/20030331-1.c.o -MF SingleSource/Regression/C/gcc-c-torture/execute/ieee/CMakeFiles/GCC-C-execute-ieee-20030331-1.dir/20030331-1.c.o.d -o SingleSource/Regression/C/gcc-c-torture/execute/ieee/CMakeFiles/GCC-C-execute-ieee-20030331-1.dir/20030331-1.c.o   -c /Users/buildslave/jenkins/workspace/test-suite-verify-machineinstrs-x86_64-O3/test-suite/SingleSource/Regression/C/gcc-c-torture/execute/ieee/20030331-1.c
[7608/7672] /Users/buildslave/jenkins/workspace/test-suite-verify-machineinstrs-x86_64-O3/test-suite-build/tools/timeit --summary SingleSource/Regression/C/gcc-c-torture/execute/ieee/CMakeFiles/GCC-C-execute-ieee-930529-1.dir/930529-1.c.o.time /Users/buildslave/jenkins/workspace/test-suite-verify-machineinstrs-x86_64-O3/compiler/bin/clang -DNDEBUG  -B /Applications/Xcode.app/Contents/Developer/Toolchains/XcodeDefault.xctoolchain/usr/bin    -Wno-unused-command-line-argument -mllvm -verify-machineinstrs -O3 -arch x86_64 -isysroot /Applications/Xcode.app/Contents/Developer/Platforms/MacOSX.platform/Developer/SDKs/MacOSX10.14.sdk   -w -Werror=date-time -w -MD -MT SingleSource/Regression/C/gcc-c-torture/execute/ieee/CMakeFiles/GCC-C-execute-ieee-930529-1.dir/930529-1.c.o -MF SingleSource/Regression/C/gcc-c-torture/execute/ieee/CMakeFiles/GCC-C-execute-ieee-930529-1.dir/930529-1.c.o.d -o SingleSource/Regression/C/gcc-c-torture/execute/ieee/CMakeFiles/GCC-C-execute-ieee-930529-1.dir/930529-1.c.o   -c /Users/buildslave/jenkins/workspace/test-suite-verify-machineinstrs-x86_64-O3/test-suite/SingleSource/Regression/C/gcc-c-torture/execute/ieee/930529-1.c
[7609/7672] : && /Users/buildslave/jenkins/workspace/test-suite-verify-machineinstrs-x86_64-O3/test-suite-build/tools/timeit --summary SingleSource/Regression/C/gcc-c-torture/execute/ieee/GCC-C-execute-ieee-acc1.link.time /Users/buildslave/jenkins/workspace/test-suite-verify-machineinstrs-x86_64-O3/compiler/bin/clang -B /Applications/Xcode.app/Contents/Developer/Toolchains/XcodeDefault.xctoolchain/usr/bin    -Wno-unused-command-line-argument -mllvm -verify-machineinstrs -O3 -arch x86_64 -isysroot /Applications/Xcode.app/Contents/Developer/Platforms/MacOSX.platform/Developer/SDKs/MacOSX10.14.sdk -Wl,-search_paths_first -Wl,-headerpad_max_install_names -B /Applications/Xcode.app/Contents/Developer/Toolchains/XcodeDefault.xctoolchain/usr/bin SingleSource/Regression/C/gcc-c-torture/execute/ieee/CMakeFiles/GCC-C-execute-ieee-acc1.dir/acc1.c.o  -o SingleSource/Regression/C/gcc-c-torture/execute/ieee/GCC-C-execute-ieee-acc1  -Wl,-no_pie && :
[7610/7672] /Users/buildslave/jenkins/workspace/test-suite-verify-machineinstrs-x86_64-O3/test-suite-build/tools/timeit --summary SingleSource/Regression/C/gcc-c-torture/execute/ieee/CMakeFiles/GCC-C-execute-ieee-pr29302-1.dir/pr29302-1.c.o.time /Users/buildslave/jenkins/workspace/test-suite-verify-machineinstrs-x86_64-O3/compiler/bin/clang -DNDEBUG  -B /Applications/Xcode.app/Contents/Developer/Toolchains/XcodeDefault.xctoolchain/usr/bin    -Wno-unused-command-line-argument -mllvm -verify-machineinstrs -O3 -arch x86_64 -isysroot /Applications/Xcode.app/Contents/Developer/Platforms/MacOSX.platform/Developer/SDKs/MacOSX10.14.sdk   -w -Werror=date-time -w -MD -MT SingleSource/Regression/C/gcc-c-torture/execute/ieee/CMakeFiles/GCC-C-execute-ieee-pr29302-1.dir/pr29302-1.c.o -MF SingleSource/Regression/C/gcc-c-torture/execute/ieee/CMakeFiles/GCC-C-execute-ieee-pr29302-1.dir/pr29302-1.c.o.d -o SingleSource/Regression/C/gcc-c-torture/execute/ieee/CMakeFiles/GCC-C-execute-ieee-pr29302-1.dir/pr29302-1.c.o   -c /Users/buildslave/jenkins/workspace/test-suite-verify-machineinstrs-x86_64-O3/test-suite/SingleSource/Regression/C/gcc-c-torture/execute/ieee/pr29302-1.c
[7611/7672] : && /Users/buildslave/jenkins/workspace/test-suite-verify-machineinstrs-x86_64-O3/test-suite-build/tools/timeit --summary SingleSource/Regression/C/gcc-c-torture/execute/ieee/GCC-C-execute-ieee-20030331-1.link.time /Users/buildslave/jenkins/workspace/test-suite-verify-machineinstrs-x86_64-O3/compiler/bin/clang -B /Applications/Xcode.app/Contents/Developer/Toolchains/XcodeDefault.xctoolchain/usr/bin    -Wno-unused-command-line-argument -mllvm -verify-machineinstrs -O3 -arch x86_64 -isysroot /Applications/Xcode.app/Contents/Developer/Platforms/MacOSX.platform/Developer/SDKs/MacOSX10.14.sdk -Wl,-search_paths_first -Wl,-headerpad_max_install_names -B /Applications/Xcode.app/Contents/Developer/Toolchains/XcodeDefault.xctoolchain/usr/bin SingleSource/Regression/C/gcc-c-torture/execute/ieee/CMakeFiles/GCC-C-execute-ieee-20030331-1.dir/20030331-1.c.o  -o SingleSource/Regression/C/gcc-c-torture/execute/ieee/GCC-C-execute-ieee-20030331-1  -Wl,-no_pie && :
[7612/7672] : && /Users/buildslave/jenkins/workspace/test-suite-verify-machineinstrs-x86_64-O3/test-suite-build/tools/timeit --summary SingleSource/Regression/C/gcc-c-torture/execute/ieee/GCC-C-execute-ieee-930529-1.link.time /Users/buildslave/jenkins/workspace/test-suite-verify-machineinstrs-x86_64-O3/compiler/bin/clang -B /Applications/Xcode.app/Contents/Developer/Toolchains/XcodeDefault.xctoolchain/usr/bin    -Wno-unused-command-line-argument -mllvm -verify-machineinstrs -O3 -arch x86_64 -isysroot /Applications/Xcode.app/Contents/Developer/Platforms/MacOSX.platform/Developer/SDKs/MacOSX10.14.sdk -Wl,-search_paths_first -Wl,-headerpad_max_install_names -B /Applications/Xcode.app/Contents/Developer/Toolchains/XcodeDefault.xctoolchain/usr/bin SingleSource/Regression/C/gcc-c-torture/execute/ieee/CMakeFiles/GCC-C-execute-ieee-930529-1.dir/930529-1.c.o  -o SingleSource/Regression/C/gcc-c-torture/execute/ieee/GCC-C-execute-ieee-930529-1  -Wl,-no_pie && :
[7613/7672] : && /Users/buildslave/jenkins/workspace/test-suite-verify-machineinstrs-x86_64-O3/test-suite-build/tools/timeit --summary SingleSource/Regression/C/gcc-c-torture/execute/ieee/GCC-C-execute-ieee-pr29302-1.link.time /Users/buildslave/jenkins/workspace/test-suite-verify-machineinstrs-x86_64-O3/compiler/bin/clang -B /Applications/Xcode.app/Contents/Developer/Toolchains/XcodeDefault.xctoolchain/usr/bin    -Wno-unused-command-line-argument -mllvm -verify-machineinstrs -O3 -arch x86_64 -isysroot /Applications/Xcode.app/Contents/Developer/Platforms/MacOSX.platform/Developer/SDKs/MacOSX10.14.sdk -Wl,-search_paths_first -Wl,-headerpad_max_install_names -B /Applications/Xcode.app/Contents/Developer/Toolchains/XcodeDefault.xctoolchain/usr/bin SingleSource/Regression/C/gcc-c-torture/execute/ieee/CMakeFiles/GCC-C-execute-ieee-pr29302-1.dir/pr29302-1.c.o  -o SingleSource/Regression/C/gcc-c-torture/execute/ieee/GCC-C-execute-ieee-pr29302-1  -Wl,-no_pie && :
[7614/7672] /Users/buildslave/jenkins/workspace/test-suite-verify-machineinstrs-x86_64-O3/test-suite-build/tools/timeit --summary SingleSource/Regression/C/gcc-c-torture/execute/ieee/CMakeFiles/GCC-C-execute-ieee-pr67218.dir/pr67218.c.o.time /Users/buildslave/jenkins/workspace/test-suite-verify-machineinstrs-x86_64-O3/compiler/bin/clang -DNDEBUG  -B /Applications/Xcode.app/Contents/Developer/Toolchains/XcodeDefault.xctoolchain/usr/bin    -Wno-unused-command-line-argument -mllvm -verify-machineinstrs -O3 -arch x86_64 -isysroot /Applications/Xcode.app/Contents/Developer/Platforms/MacOSX.platform/Developer/SDKs/MacOSX10.14.sdk   -w -Werror=date-time -w -MD -MT SingleSource/Regression/C/gcc-c-torture/execute/ieee/CMakeFiles/GCC-C-execute-ieee-pr67218.dir/pr67218.c.o -MF SingleSource/Regression/C/gcc-c-torture/execute/ieee/CMakeFiles/GCC-C-execute-ieee-pr67218.dir/pr67218.c.o.d -o SingleSource/Regression/C/gcc-c-torture/execute/ieee/CMakeFiles/GCC-C-execute-ieee-pr67218.dir/pr67218.c.o   -c /Users/buildslave/jenkins/workspace/test-suite-verify-machineinstrs-x86_64-O3/test-suite/SingleSource/Regression/C/gcc-c-torture/execute/ieee/pr67218.c
[7615/7672] /Users/buildslave/jenkins/workspace/test-suite-verify-machineinstrs-x86_64-O3/test-suite-build/tools/timeit --summary SingleSource/Regression/C/gcc-c-torture/execute/ieee/CMakeFiles/GCC-C-execute-ieee-20000320-1.dir/20000320-1.c.o.time /Users/buildslave/jenkins/workspace/test-suite-verify-machineinstrs-x86_64-O3/compiler/bin/clang -DNDEBUG  -B /Applications/Xcode.app/Contents/Developer/Toolchains/XcodeDefault.xctoolchain/usr/bin    -Wno-unused-command-line-argument -mllvm -verify-machineinstrs -O3 -arch x86_64 -isysroot /Applications/Xcode.app/Contents/Developer/Platforms/MacOSX.platform/Developer/SDKs/MacOSX10.14.sdk   -w -Werror=date-time -w -MD -MT SingleSource/Regression/C/gcc-c-torture/execute/ieee/CMakeFiles/GCC-C-execute-ieee-20000320-1.dir/20000320-1.c.o -MF SingleSource/Regression/C/gcc-c-torture/execute/ieee/CMakeFiles/GCC-C-execute-ieee-20000320-1.dir/20000320-1.c.o.d -o SingleSource/Regression/C/gcc-c-torture/execute/ieee/CMakeFiles/GCC-C-execute-ieee-20000320-1.dir/20000320-1.c.o   -c /Users/buildslave/jenkins/workspace/test-suite-verify-machineinstrs-x86_64-O3/test-suite/SingleSource/Regression/C/gcc-c-torture/execute/ieee/20000320-1.c
[7616/7672] /Users/buildslave/jenkins/workspace/test-suite-verify-machineinstrs-x86_64-O3/test-suite-build/tools/timeit --summary SingleSource/Regression/C/gcc-c-torture/execute/ieee/CMakeFiles/GCC-C-execute-ieee-20010226-1.dir/20010226-1.c.o.time /Users/buildslave/jenkins/workspace/test-suite-verify-machineinstrs-x86_64-O3/compiler/bin/clang -DNDEBUG  -B /Applications/Xcode.app/Contents/Developer/Toolchains/XcodeDefault.xctoolchain/usr/bin    -Wno-unused-command-line-argument -mllvm -verify-machineinstrs -O3 -arch x86_64 -isysroot /Applications/Xcode.app/Contents/Developer/Platforms/MacOSX.platform/Developer/SDKs/MacOSX10.14.sdk   -w -Werror=date-time -w -MD -MT SingleSource/Regression/C/gcc-c-torture/execute/ieee/CMakeFiles/GCC-C-execute-ieee-20010226-1.dir/20010226-1.c.o -MF SingleSource/Regression/C/gcc-c-torture/execute/ieee/CMakeFiles/GCC-C-execute-ieee-20010226-1.dir/20010226-1.c.o.d -o SingleSource/Regression/C/gcc-c-torture/execute/ieee/CMakeFiles/GCC-C-execute-ieee-20010226-1.dir/20010226-1.c.o   -c /Users/buildslave/jenkins/workspace/test-suite-verify-machineinstrs-x86_64-O3/test-suite/SingleSource/Regression/C/gcc-c-torture/execute/ieee/20010226-1.c
[7617/7672] : && /Users/buildslave/jenkins/workspace/test-suite-verify-machineinstrs-x86_64-O3/test-suite-build/tools/timeit --summary SingleSource/Regression/C/gcc-c-torture/execute/ieee/GCC-C-execute-ieee-pr67218.link.time /Users/buildslave/jenkins/workspace/test-suite-verify-machineinstrs-x86_64-O3/compiler/bin/clang -B /Applications/Xcode.app/Contents/Developer/Toolchains/XcodeDefault.xctoolchain/usr/bin    -Wno-unused-command-line-argument -mllvm -verify-machineinstrs -O3 -arch x86_64 -isysroot /Applications/Xcode.app/Contents/Developer/Platforms/MacOSX.platform/Developer/SDKs/MacOSX10.14.sdk -Wl,-search_paths_first -Wl,-headerpad_max_install_names -B /Applications/Xcode.app/Contents/Developer/Toolchains/XcodeDefault.xctoolchain/usr/bin SingleSource/Regression/C/gcc-c-torture/execute/ieee/CMakeFiles/GCC-C-execute-ieee-pr67218.dir/pr67218.c.o  -o SingleSource/Regression/C/gcc-c-torture/execute/ieee/GCC-C-execute-ieee-pr67218  -Wl,-no_pie && :
[7618/7672] /Users/buildslave/jenkins/workspace/test-suite-verify-machineinstrs-x86_64-O3/test-suite-build/tools/timeit --summary SingleSource/Regression/C/gcc-c-torture/execute/ieee/CMakeFiles/GCC-C-execute-ieee-pr30704.dir/pr30704.c.o.time /Users/buildslave/jenkins/workspace/test-suite-verify-machineinstrs-x86_64-O3/compiler/bin/clang -DNDEBUG  -B /Applications/Xcode.app/Contents/Developer/Toolchains/XcodeDefault.xctoolchain/usr/bin    -Wno-unused-command-line-argument -mllvm -verify-machineinstrs -O3 -arch x86_64 -isysroot /Applications/Xcode.app/Contents/Developer/Platforms/MacOSX.platform/Developer/SDKs/MacOSX10.14.sdk   -w -Werror=date-time -w -MD -MT SingleSource/Regression/C/gcc-c-torture/execute/ieee/CMakeFiles/GCC-C-execute-ieee-pr30704.dir/pr30704.c.o -MF SingleSource/Regression/C/gcc-c-torture/execute/ieee/CMakeFiles/GCC-C-execute-ieee-pr30704.dir/pr30704.c.o.d -o SingleSource/Regression/C/gcc-c-torture/execute/ieee/CMakeFiles/GCC-C-execute-ieee-pr30704.dir/pr30704.c.o   -c /Users/buildslave/jenkins/workspace/test-suite-verify-machineinstrs-x86_64-O3/test-suite/SingleSource/Regression/C/gcc-c-torture/execute/ieee/pr30704.c
[7619/7672] : && /Users/buildslave/jenkins/workspace/test-suite-verify-machineinstrs-x86_64-O3/test-suite-build/tools/timeit --summary SingleSource/Regression/C/gcc-c-torture/execute/ieee/GCC-C-execute-ieee-20000320-1.link.time /Users/buildslave/jenkins/workspace/test-suite-verify-machineinstrs-x86_64-O3/compiler/bin/clang -B /Applications/Xcode.app/Contents/Developer/Toolchains/XcodeDefault.xctoolchain/usr/bin    -Wno-unused-command-line-argument -mllvm -verify-machineinstrs -O3 -arch x86_64 -isysroot /Applications/Xcode.app/Contents/Developer/Platforms/MacOSX.platform/Developer/SDKs/MacOSX10.14.sdk -Wl,-search_paths_first -Wl,-headerpad_max_install_names -B /Applications/Xcode.app/Contents/Developer/Toolchains/XcodeDefault.xctoolchain/usr/bin SingleSource/Regression/C/gcc-c-torture/execute/ieee/CMakeFiles/GCC-C-execute-ieee-20000320-1.dir/20000320-1.c.o  -o SingleSource/Regression/C/gcc-c-torture/execute/ieee/GCC-C-execute-ieee-20000320-1  -Wl,-no_pie && :
[7620/7672] : && /Users/buildslave/jenkins/workspace/test-suite-verify-machineinstrs-x86_64-O3/test-suite-build/tools/timeit --summary SingleSource/Regression/C/gcc-c-torture/execute/ieee/GCC-C-execute-ieee-20010226-1.link.time /Users/buildslave/jenkins/workspace/test-suite-verify-machineinstrs-x86_64-O3/compiler/bin/clang -B /Applications/Xcode.app/Contents/Developer/Toolchains/XcodeDefault.xctoolchain/usr/bin    -Wno-unused-command-line-argument -mllvm -verify-machineinstrs -O3 -arch x86_64 -isysroot /Applications/Xcode.app/Contents/Developer/Platforms/MacOSX.platform/Developer/SDKs/MacOSX10.14.sdk -Wl,-search_paths_first -Wl,-headerpad_max_install_names -B /Applications/Xcode.app/Contents/Developer/Toolchains/XcodeDefault.xctoolchain/usr/bin SingleSource/Regression/C/gcc-c-torture/execute/ieee/CMakeFiles/GCC-C-execute-ieee-20010226-1.dir/20010226-1.c.o  -o SingleSource/Regression/C/gcc-c-torture/execute/ieee/GCC-C-execute-ieee-20010226-1  -Wl,-no_pie && :
[7621/7672] : && /Users/buildslave/jenkins/workspace/test-suite-verify-machineinstrs-x86_64-O3/test-suite-build/tools/timeit --summary SingleSource/Regression/C/gcc-c-torture/execute/ieee/GCC-C-execute-ieee-pr30704.link.time /Users/buildslave/jenkins/workspace/test-suite-verify-machineinstrs-x86_64-O3/compiler/bin/clang -B /Applications/Xcode.app/Contents/Developer/Toolchains/XcodeDefault.xctoolchain/usr/bin    -Wno-unused-command-line-argument -mllvm -verify-machineinstrs -O3 -arch x86_64 -isysroot /Applications/Xcode.app/Contents/Developer/Platforms/MacOSX.platform/Developer/SDKs/MacOSX10.14.sdk -Wl,-search_paths_first -Wl,-headerpad_max_install_names -B /Applications/Xcode.app/Contents/Developer/Toolchains/XcodeDefault.xctoolchain/usr/bin SingleSource/Regression/C/gcc-c-torture/execute/ieee/CMakeFiles/GCC-C-execute-ieee-pr30704.dir/pr30704.c.o  -o SingleSource/Regression/C/gcc-c-torture/execute/ieee/GCC-C-execute-ieee-pr30704  -Wl,-no_pie && :
[7622/7672] /Users/buildslave/jenkins/workspace/test-suite-verify-machineinstrs-x86_64-O3/test-suite-build/tools/timeit --summary SingleSource/Regression/C/gcc-c-torture/execute/ieee/CMakeFiles/GCC-C-execute-ieee-fp-cmp-8.dir/fp-cmp-8.c.o.time /Users/buildslave/jenkins/workspace/test-suite-verify-machineinstrs-x86_64-O3/compiler/bin/clang -DNDEBUG  -B /Applications/Xcode.app/Contents/Developer/Toolchains/XcodeDefault.xctoolchain/usr/bin    -Wno-unused-command-line-argument -mllvm -verify-machineinstrs -O3 -arch x86_64 -isysroot /Applications/Xcode.app/Contents/Developer/Platforms/MacOSX.platform/Developer/SDKs/MacOSX10.14.sdk   -w -Werror=date-time -w -MD -MT SingleSource/Regression/C/gcc-c-torture/execute/ieee/CMakeFiles/GCC-C-execute-ieee-fp-cmp-8.dir/fp-cmp-8.c.o -MF SingleSource/Regression/C/gcc-c-torture/execute/ieee/CMakeFiles/GCC-C-execute-ieee-fp-cmp-8.dir/fp-cmp-8.c.o.d -o SingleSource/Regression/C/gcc-c-torture/execute/ieee/CMakeFiles/GCC-C-execute-ieee-fp-cmp-8.dir/fp-cmp-8.c.o   -c /Users/buildslave/jenkins/workspace/test-suite-verify-machineinstrs-x86_64-O3/test-suite/SingleSource/Regression/C/gcc-c-torture/execute/ieee/fp-cmp-8.c
[7623/7672] /Users/buildslave/jenkins/workspace/test-suite-verify-machineinstrs-x86_64-O3/test-suite-build/tools/timeit --summary SingleSource/Regression/C/gcc-c-torture/execute/ieee/CMakeFiles/GCC-C-execute-ieee-pr38016.dir/pr38016.c.o.time /Users/buildslave/jenkins/workspace/test-suite-verify-machineinstrs-x86_64-O3/compiler/bin/clang -DNDEBUG  -B /Applications/Xcode.app/Contents/Developer/Toolchains/XcodeDefault.xctoolchain/usr/bin    -Wno-unused-command-line-argument -mllvm -verify-machineinstrs -O3 -arch x86_64 -isysroot /Applications/Xcode.app/Contents/Developer/Platforms/MacOSX.platform/Developer/SDKs/MacOSX10.14.sdk   -w -Werror=date-time -w -MD -MT SingleSource/Regression/C/gcc-c-torture/execute/ieee/CMakeFiles/GCC-C-execute-ieee-pr38016.dir/pr38016.c.o -MF SingleSource/Regression/C/gcc-c-torture/execute/ieee/CMakeFiles/GCC-C-execute-ieee-pr38016.dir/pr38016.c.o.d -o SingleSource/Regression/C/gcc-c-torture/execute/ieee/CMakeFiles/GCC-C-execute-ieee-pr38016.dir/pr38016.c.o   -c /Users/buildslave/jenkins/workspace/test-suite-verify-machineinstrs-x86_64-O3/test-suite/SingleSource/Regression/C/gcc-c-torture/execute/ieee/pr38016.c
[7624/7672] /Users/buildslave/jenkins/workspace/test-suite-verify-machineinstrs-x86_64-O3/test-suite-build/tools/timeit --summary SingleSource/Regression/C/gcc-c-torture/execute/ieee/CMakeFiles/GCC-C-execute-ieee-fp-cmp-3.dir/fp-cmp-3.c.o.time /Users/buildslave/jenkins/workspace/test-suite-verify-machineinstrs-x86_64-O3/compiler/bin/clang -DNDEBUG  -B /Applications/Xcode.app/Contents/Developer/Toolchains/XcodeDefault.xctoolchain/usr/bin    -Wno-unused-command-line-argument -mllvm -verify-machineinstrs -O3 -arch x86_64 -isysroot /Applications/Xcode.app/Contents/Developer/Platforms/MacOSX.platform/Developer/SDKs/MacOSX10.14.sdk   -w -Werror=date-time -w -MD -MT SingleSource/Regression/C/gcc-c-torture/execute/ieee/CMakeFiles/GCC-C-execute-ieee-fp-cmp-3.dir/fp-cmp-3.c.o -MF SingleSource/Regression/C/gcc-c-torture/execute/ieee/CMakeFiles/GCC-C-execute-ieee-fp-cmp-3.dir/fp-cmp-3.c.o.d -o SingleSource/Regression/C/gcc-c-torture/execute/ieee/CMakeFiles/GCC-C-execute-ieee-fp-cmp-3.dir/fp-cmp-3.c.o   -c /Users/buildslave/jenkins/workspace/test-suite-verify-machineinstrs-x86_64-O3/test-suite/SingleSource/Regression/C/gcc-c-torture/execute/ieee/fp-cmp-3.c
[7625/7672] /Users/buildslave/jenkins/workspace/test-suite-verify-machineinstrs-x86_64-O3/test-suite-build/tools/timeit --summary SingleSource/Regression/C/gcc-c-torture/execute/ieee/CMakeFiles/GCC-C-execute-ieee-920810-1.dir/920810-1.c.o.time /Users/buildslave/jenkins/workspace/test-suite-verify-machineinstrs-x86_64-O3/compiler/bin/clang -DNDEBUG  -B /Applications/Xcode.app/Contents/Developer/Toolchains/XcodeDefault.xctoolchain/usr/bin    -Wno-unused-command-line-argument -mllvm -verify-machineinstrs -O3 -arch x86_64 -isysroot /Applications/Xcode.app/Contents/Developer/Platforms/MacOSX.platform/Developer/SDKs/MacOSX10.14.sdk   -w -Werror=date-time -w -MD -MT SingleSource/Regression/C/gcc-c-torture/execute/ieee/CMakeFiles/GCC-C-execute-ieee-920810-1.dir/920810-1.c.o -MF SingleSource/Regression/C/gcc-c-torture/execute/ieee/CMakeFiles/GCC-C-execute-ieee-920810-1.dir/920810-1.c.o.d -o SingleSource/Regression/C/gcc-c-torture/execute/ieee/CMakeFiles/GCC-C-execute-ieee-920810-1.dir/920810-1.c.o   -c /Users/buildslave/jenkins/workspace/test-suite-verify-machineinstrs-x86_64-O3/test-suite/SingleSource/Regression/C/gcc-c-torture/execute/ieee/920810-1.c
[7626/7672] : && /Users/buildslave/jenkins/workspace/test-suite-verify-machineinstrs-x86_64-O3/test-suite-build/tools/timeit --summary SingleSource/Regression/C/gcc-c-torture/execute/ieee/GCC-C-execute-ieee-pr38016.link.time /Users/buildslave/jenkins/workspace/test-suite-verify-machineinstrs-x86_64-O3/compiler/bin/clang -B /Applications/Xcode.app/Contents/Developer/Toolchains/XcodeDefault.xctoolchain/usr/bin    -Wno-unused-command-line-argument -mllvm -verify-machineinstrs -O3 -arch x86_64 -isysroot /Applications/Xcode.app/Contents/Developer/Platforms/MacOSX.platform/Developer/SDKs/MacOSX10.14.sdk -Wl,-search_paths_first -Wl,-headerpad_max_install_names -B /Applications/Xcode.app/Contents/Developer/Toolchains/XcodeDefault.xctoolchain/usr/bin SingleSource/Regression/C/gcc-c-torture/execute/ieee/CMakeFiles/GCC-C-execute-ieee-pr38016.dir/pr38016.c.o  -o SingleSource/Regression/C/gcc-c-torture/execute/ieee/GCC-C-execute-ieee-pr38016  -Wl,-no_pie && :
[7627/7672] : && /Users/buildslave/jenkins/workspace/test-suite-verify-machineinstrs-x86_64-O3/test-suite-build/tools/timeit --summary SingleSource/Regression/C/gcc-c-torture/execute/ieee/GCC-C-execute-ieee-fp-cmp-8.link.time /Users/buildslave/jenkins/workspace/test-suite-verify-machineinstrs-x86_64-O3/compiler/bin/clang -B /Applications/Xcode.app/Contents/Developer/Toolchains/XcodeDefault.xctoolchain/usr/bin    -Wno-unused-command-line-argument -mllvm -verify-machineinstrs -O3 -arch x86_64 -isysroot /Applications/Xcode.app/Contents/Developer/Platforms/MacOSX.platform/Developer/SDKs/MacOSX10.14.sdk -Wl,-search_paths_first -Wl,-headerpad_max_install_names -B /Applications/Xcode.app/Contents/Developer/Toolchains/XcodeDefault.xctoolchain/usr/bin SingleSource/Regression/C/gcc-c-torture/execute/ieee/CMakeFiles/GCC-C-execute-ieee-fp-cmp-8.dir/fp-cmp-8.c.o  -o SingleSource/Regression/C/gcc-c-torture/execute/ieee/GCC-C-execute-ieee-fp-cmp-8  -Wl,-no_pie && :
[7628/7672] : && /Users/buildslave/jenkins/workspace/test-suite-verify-machineinstrs-x86_64-O3/test-suite-build/tools/timeit --summary SingleSource/Regression/C/gcc-c-torture/execute/ieee/GCC-C-execute-ieee-920810-1.link.time /Users/buildslave/jenkins/workspace/test-suite-verify-machineinstrs-x86_64-O3/compiler/bin/clang -B /Applications/Xcode.app/Contents/Developer/Toolchains/XcodeDefault.xctoolchain/usr/bin    -Wno-unused-command-line-argument -mllvm -verify-machineinstrs -O3 -arch x86_64 -isysroot /Applications/Xcode.app/Contents/Developer/Platforms/MacOSX.platform/Developer/SDKs/MacOSX10.14.sdk -Wl,-search_paths_first -Wl,-headerpad_max_install_names -B /Applications/Xcode.app/Contents/Developer/Toolchains/XcodeDefault.xctoolchain/usr/bin SingleSource/Regression/C/gcc-c-torture/execute/ieee/CMakeFiles/GCC-C-execute-ieee-920810-1.dir/920810-1.c.o  -o SingleSource/Regression/C/gcc-c-torture/execute/ieee/GCC-C-execute-ieee-920810-1  -Wl,-no_pie && :
[7629/7672] : && /Users/buildslave/jenkins/workspace/test-suite-verify-machineinstrs-x86_64-O3/test-suite-build/tools/timeit --summary SingleSource/Regression/C/gcc-c-torture/execute/ieee/GCC-C-execute-ieee-fp-cmp-3.link.time /Users/buildslave/jenkins/workspace/test-suite-verify-machineinstrs-x86_64-O3/compiler/bin/clang -B /Applications/Xcode.app/Contents/Developer/Toolchains/XcodeDefault.xctoolchain/usr/bin    -Wno-unused-command-line-argument -mllvm -verify-machineinstrs -O3 -arch x86_64 -isysroot /Applications/Xcode.app/Contents/Developer/Platforms/MacOSX.platform/Developer/SDKs/MacOSX10.14.sdk -Wl,-search_paths_first -Wl,-headerpad_max_install_names -B /Applications/Xcode.app/Contents/Developer/Toolchains/XcodeDefault.xctoolchain/usr/bin SingleSource/Regression/C/gcc-c-torture/execute/ieee/CMakeFiles/GCC-C-execute-ieee-fp-cmp-3.dir/fp-cmp-3.c.o  -o SingleSource/Regression/C/gcc-c-torture/execute/ieee/GCC-C-execute-ieee-fp-cmp-3  -Wl,-no_pie && :
[7630/7672] /Users/buildslave/jenkins/workspace/test-suite-verify-machineinstrs-x86_64-O3/test-suite-build/tools/timeit --summary SingleSource/Regression/C/gcc-c-torture/execute/ieee/CMakeFiles/GCC-C-execute-ieee-20001122-1.dir/20001122-1.c.o.time /Users/buildslave/jenkins/workspace/test-suite-verify-machineinstrs-x86_64-O3/compiler/bin/clang -DNDEBUG  -B /Applications/Xcode.app/Contents/Developer/Toolchains/XcodeDefault.xctoolchain/usr/bin    -Wno-unused-command-line-argument -mllvm -verify-machineinstrs -O3 -arch x86_64 -isysroot /Applications/Xcode.app/Contents/Developer/Platforms/MacOSX.platform/Developer/SDKs/MacOSX10.14.sdk   -w -Werror=date-time -w -MD -MT SingleSource/Regression/C/gcc-c-torture/execute/ieee/CMakeFiles/GCC-C-execute-ieee-20001122-1.dir/20001122-1.c.o -MF SingleSource/Regression/C/gcc-c-torture/execute/ieee/CMakeFiles/GCC-C-execute-ieee-20001122-1.dir/20001122-1.c.o.d -o SingleSource/Regression/C/gcc-c-torture/execute/ieee/CMakeFiles/GCC-C-execute-ieee-20001122-1.dir/20001122-1.c.o   -c /Users/buildslave/jenkins/workspace/test-suite-verify-machineinstrs-x86_64-O3/test-suite/SingleSource/Regression/C/gcc-c-torture/execute/ieee/20001122-1.c
[7631/7672] /Users/buildslave/jenkins/workspace/test-suite-verify-machineinstrs-x86_64-O3/test-suite-build/tools/timeit --summary SingleSource/Regression/C/gcc-c-torture/execute/ieee/CMakeFiles/GCC-C-execute-ieee-acc2.dir/acc2.c.o.time /Users/buildslave/jenkins/workspace/test-suite-verify-machineinstrs-x86_64-O3/compiler/bin/clang -DNDEBUG  -B /Applications/Xcode.app/Contents/Developer/Toolchains/XcodeDefault.xctoolchain/usr/bin    -Wno-unused-command-line-argument -mllvm -verify-machineinstrs -O3 -arch x86_64 -isysroot /Applications/Xcode.app/Contents/Developer/Platforms/MacOSX.platform/Developer/SDKs/MacOSX10.14.sdk   -w -Werror=date-time -w -MD -MT SingleSource/Regression/C/gcc-c-torture/execute/ieee/CMakeFiles/GCC-C-execute-ieee-acc2.dir/acc2.c.o -MF SingleSource/Regression/C/gcc-c-torture/execute/ieee/CMakeFiles/GCC-C-execute-ieee-acc2.dir/acc2.c.o.d -o SingleSource/Regression/C/gcc-c-torture/execute/ieee/CMakeFiles/GCC-C-execute-ieee-acc2.dir/acc2.c.o   -c /Users/buildslave/jenkins/workspace/test-suite-verify-machineinstrs-x86_64-O3/test-suite/SingleSource/Regression/C/gcc-c-torture/execute/ieee/acc2.c
[7632/7672] /Users/buildslave/jenkins/workspace/test-suite-verify-machineinstrs-x86_64-O3/test-suite-build/tools/timeit --summary SingleSource/Regression/C/gcc-c-torture/execute/ieee/CMakeFiles/GCC-C-execute-ieee-fp-cmp-2.dir/fp-cmp-2.c.o.time /Users/buildslave/jenkins/workspace/test-suite-verify-machineinstrs-x86_64-O3/compiler/bin/clang -DNDEBUG  -B /Applications/Xcode.app/Contents/Developer/Toolchains/XcodeDefault.xctoolchain/usr/bin    -Wno-unused-command-line-argument -mllvm -verify-machineinstrs -O3 -arch x86_64 -isysroot /Applications/Xcode.app/Contents/Developer/Platforms/MacOSX.platform/Developer/SDKs/MacOSX10.14.sdk   -w -Werror=date-time -w -MD -MT SingleSource/Regression/C/gcc-c-torture/execute/ieee/CMakeFiles/GCC-C-execute-ieee-fp-cmp-2.dir/fp-cmp-2.c.o -MF SingleSource/Regression/C/gcc-c-torture/execute/ieee/CMakeFiles/GCC-C-execute-ieee-fp-cmp-2.dir/fp-cmp-2.c.o.d -o SingleSource/Regression/C/gcc-c-torture/execute/ieee/CMakeFiles/GCC-C-execute-ieee-fp-cmp-2.dir/fp-cmp-2.c.o   -c /Users/buildslave/jenkins/workspace/test-suite-verify-machineinstrs-x86_64-O3/test-suite/SingleSource/Regression/C/gcc-c-torture/execute/ieee/fp-cmp-2.c
[7633/7672] : && /Users/buildslave/jenkins/workspace/test-suite-verify-machineinstrs-x86_64-O3/test-suite-build/tools/timeit --summary SingleSource/Regression/C/gcc-c-torture/execute/ieee/GCC-C-execute-ieee-20001122-1.link.time /Users/buildslave/jenkins/workspace/test-suite-verify-machineinstrs-x86_64-O3/compiler/bin/clang -B /Applications/Xcode.app/Contents/Developer/Toolchains/XcodeDefault.xctoolchain/usr/bin    -Wno-unused-command-line-argument -mllvm -verify-machineinstrs -O3 -arch x86_64 -isysroot /Applications/Xcode.app/Contents/Developer/Platforms/MacOSX.platform/Developer/SDKs/MacOSX10.14.sdk -Wl,-search_paths_first -Wl,-headerpad_max_install_names -B /Applications/Xcode.app/Contents/Developer/Toolchains/XcodeDefault.xctoolchain/usr/bin SingleSource/Regression/C/gcc-c-torture/execute/ieee/CMakeFiles/GCC-C-execute-ieee-20001122-1.dir/20001122-1.c.o  -o SingleSource/Regression/C/gcc-c-torture/execute/ieee/GCC-C-execute-ieee-20001122-1  -Wl,-no_pie && :
[7634/7672] /Users/buildslave/jenkins/workspace/test-suite-verify-machineinstrs-x86_64-O3/test-suite-build/tools/timeit --summary SingleSource/Regression/C/gcc-c-torture/execute/ieee/CMakeFiles/GCC-C-execute-ieee-fp-cmp-4f.dir/fp-cmp-4f.c.o.time /Users/buildslave/jenkins/workspace/test-suite-verify-machineinstrs-x86_64-O3/compiler/bin/clang -DNDEBUG  -B /Applications/Xcode.app/Contents/Developer/Toolchains/XcodeDefault.xctoolchain/usr/bin    -Wno-unused-command-line-argument -mllvm -verify-machineinstrs -O3 -arch x86_64 -isysroot /Applications/Xcode.app/Contents/Developer/Platforms/MacOSX.platform/Developer/SDKs/MacOSX10.14.sdk   -w -Werror=date-time -w -MD -MT SingleSource/Regression/C/gcc-c-torture/execute/ieee/CMakeFiles/GCC-C-execute-ieee-fp-cmp-4f.dir/fp-cmp-4f.c.o -MF SingleSource/Regression/C/gcc-c-torture/execute/ieee/CMakeFiles/GCC-C-execute-ieee-fp-cmp-4f.dir/fp-cmp-4f.c.o.d -o SingleSource/Regression/C/gcc-c-torture/execute/ieee/CMakeFiles/GCC-C-execute-ieee-fp-cmp-4f.dir/fp-cmp-4f.c.o   -c /Users/buildslave/jenkins/workspace/test-suite-verify-machineinstrs-x86_64-O3/test-suite/SingleSource/Regression/C/gcc-c-torture/execute/ieee/fp-cmp-4f.c
[7635/7672] : && /Users/buildslave/jenkins/workspace/test-suite-verify-machineinstrs-x86_64-O3/test-suite-build/tools/timeit --summary SingleSource/Regression/C/gcc-c-torture/execute/ieee/GCC-C-execute-ieee-acc2.link.time /Users/buildslave/jenkins/workspace/test-suite-verify-machineinstrs-x86_64-O3/compiler/bin/clang -B /Applications/Xcode.app/Contents/Developer/Toolchains/XcodeDefault.xctoolchain/usr/bin    -Wno-unused-command-line-argument -mllvm -verify-machineinstrs -O3 -arch x86_64 -isysroot /Applications/Xcode.app/Contents/Developer/Platforms/MacOSX.platform/Developer/SDKs/MacOSX10.14.sdk -Wl,-search_paths_first -Wl,-headerpad_max_install_names -B /Applications/Xcode.app/Contents/Developer/Toolchains/XcodeDefault.xctoolchain/usr/bin SingleSource/Regression/C/gcc-c-torture/execute/ieee/CMakeFiles/GCC-C-execute-ieee-acc2.dir/acc2.c.o  -o SingleSource/Regression/C/gcc-c-torture/execute/ieee/GCC-C-execute-ieee-acc2  -Wl,-no_pie && :
[7636/7672] : && /Users/buildslave/jenkins/workspace/test-suite-verify-machineinstrs-x86_64-O3/test-suite-build/tools/timeit --summary SingleSource/Regression/C/gcc-c-torture/execute/ieee/GCC-C-execute-ieee-fp-cmp-2.link.time /Users/buildslave/jenkins/workspace/test-suite-verify-machineinstrs-x86_64-O3/compiler/bin/clang -B /Applications/Xcode.app/Contents/Developer/Toolchains/XcodeDefault.xctoolchain/usr/bin    -Wno-unused-command-line-argument -mllvm -verify-machineinstrs -O3 -arch x86_64 -isysroot /Applications/Xcode.app/Contents/Developer/Platforms/MacOSX.platform/Developer/SDKs/MacOSX10.14.sdk -Wl,-search_paths_first -Wl,-headerpad_max_install_names -B /Applications/Xcode.app/Contents/Developer/Toolchains/XcodeDefault.xctoolchain/usr/bin SingleSource/Regression/C/gcc-c-torture/execute/ieee/CMakeFiles/GCC-C-execute-ieee-fp-cmp-2.dir/fp-cmp-2.c.o  -o SingleSource/Regression/C/gcc-c-torture/execute/ieee/GCC-C-execute-ieee-fp-cmp-2  -Wl,-no_pie && :
[7637/7672] /Users/buildslave/jenkins/workspace/test-suite-verify-machineinstrs-x86_64-O3/test-suite-build/tools/timeit --summary SingleSource/Regression/C/gcc-c-torture/execute/ieee/CMakeFiles/GCC-C-execute-ieee-minuszero.dir/minuszero.c.o.time /Users/buildslave/jenkins/workspace/test-suite-verify-machineinstrs-x86_64-O3/compiler/bin/clang -DNDEBUG  -B /Applications/Xcode.app/Contents/Developer/Toolchains/XcodeDefault.xctoolchain/usr/bin    -Wno-unused-command-line-argument -mllvm -verify-machineinstrs -O3 -arch x86_64 -isysroot /Applications/Xcode.app/Contents/Developer/Platforms/MacOSX.platform/Developer/SDKs/MacOSX10.14.sdk   -w -Werror=date-time -w -MD -MT SingleSource/Regression/C/gcc-c-torture/execute/ieee/CMakeFiles/GCC-C-execute-ieee-minuszero.dir/minuszero.c.o -MF SingleSource/Regression/C/gcc-c-torture/execute/ieee/CMakeFiles/GCC-C-execute-ieee-minuszero.dir/minuszero.c.o.d -o SingleSource/Regression/C/gcc-c-torture/execute/ieee/CMakeFiles/GCC-C-execute-ieee-minuszero.dir/minuszero.c.o   -c /Users/buildslave/jenkins/workspace/test-suite-verify-machineinstrs-x86_64-O3/test-suite/SingleSource/Regression/C/gcc-c-torture/execute/ieee/minuszero.c
[7638/7672] : && /Users/buildslave/jenkins/workspace/test-suite-verify-machineinstrs-x86_64-O3/test-suite-build/tools/timeit --summary SingleSource/Regression/C/gcc-c-torture/execute/ieee/GCC-C-execute-ieee-fp-cmp-4f.link.time /Users/buildslave/jenkins/workspace/test-suite-verify-machineinstrs-x86_64-O3/compiler/bin/clang -B /Applications/Xcode.app/Contents/Developer/Toolchains/XcodeDefault.xctoolchain/usr/bin    -Wno-unused-command-line-argument -mllvm -verify-machineinstrs -O3 -arch x86_64 -isysroot /Applications/Xcode.app/Contents/Developer/Platforms/MacOSX.platform/Developer/SDKs/MacOSX10.14.sdk -Wl,-search_paths_first -Wl,-headerpad_max_install_names -B /Applications/Xcode.app/Contents/Developer/Toolchains/XcodeDefault.xctoolchain/usr/bin SingleSource/Regression/C/gcc-c-torture/execute/ieee/CMakeFiles/GCC-C-execute-ieee-fp-cmp-4f.dir/fp-cmp-4f.c.o  -o SingleSource/Regression/C/gcc-c-torture/execute/ieee/GCC-C-execute-ieee-fp-cmp-4f  -Wl,-no_pie && :
[7639/7672] /Users/buildslave/jenkins/workspace/test-suite-verify-machineinstrs-x86_64-O3/test-suite-build/tools/timeit --summary SingleSource/Regression/C/gcc-c-torture/execute/ieee/CMakeFiles/GCC-C-execute-ieee-inf-1.dir/inf-1.c.o.time /Users/buildslave/jenkins/workspace/test-suite-verify-machineinstrs-x86_64-O3/compiler/bin/clang -DNDEBUG  -B /Applications/Xcode.app/Contents/Developer/Toolchains/XcodeDefault.xctoolchain/usr/bin    -Wno-unused-command-line-argument -mllvm -verify-machineinstrs -O3 -arch x86_64 -isysroot /Applications/Xcode.app/Contents/Developer/Platforms/MacOSX.platform/Developer/SDKs/MacOSX10.14.sdk   -w -Werror=date-time -w -MD -MT SingleSource/Regression/C/gcc-c-torture/execute/ieee/CMakeFiles/GCC-C-execute-ieee-inf-1.dir/inf-1.c.o -MF SingleSource/Regression/C/gcc-c-torture/execute/ieee/CMakeFiles/GCC-C-execute-ieee-inf-1.dir/inf-1.c.o.d -o SingleSource/Regression/C/gcc-c-torture/execute/ieee/CMakeFiles/GCC-C-execute-ieee-inf-1.dir/inf-1.c.o   -c /Users/buildslave/jenkins/workspace/test-suite-verify-machineinstrs-x86_64-O3/test-suite/SingleSource/Regression/C/gcc-c-torture/execute/ieee/inf-1.c
[7640/7672] /Users/buildslave/jenkins/workspace/test-suite-verify-machineinstrs-x86_64-O3/test-suite-build/tools/timeit --summary SingleSource/Regression/C/gcc-c-torture/execute/ieee/CMakeFiles/GCC-C-execute-ieee-980619-1.dir/980619-1.c.o.time /Users/buildslave/jenkins/workspace/test-suite-verify-machineinstrs-x86_64-O3/compiler/bin/clang -DNDEBUG  -B /Applications/Xcode.app/Contents/Developer/Toolchains/XcodeDefault.xctoolchain/usr/bin    -Wno-unused-command-line-argument -mllvm -verify-machineinstrs -O3 -arch x86_64 -isysroot /Applications/Xcode.app/Contents/Developer/Platforms/MacOSX.platform/Developer/SDKs/MacOSX10.14.sdk   -w -Werror=date-time -w -MD -MT SingleSource/Regression/C/gcc-c-torture/execute/ieee/CMakeFiles/GCC-C-execute-ieee-980619-1.dir/980619-1.c.o -MF SingleSource/Regression/C/gcc-c-torture/execute/ieee/CMakeFiles/GCC-C-execute-ieee-980619-1.dir/980619-1.c.o.d -o SingleSource/Regression/C/gcc-c-torture/execute/ieee/CMakeFiles/GCC-C-execute-ieee-980619-1.dir/980619-1.c.o   -c /Users/buildslave/jenkins/workspace/test-suite-verify-machineinstrs-x86_64-O3/test-suite/SingleSource/Regression/C/gcc-c-torture/execute/ieee/980619-1.c
[7641/7672] : && /Users/buildslave/jenkins/workspace/test-suite-verify-machineinstrs-x86_64-O3/test-suite-build/tools/timeit --summary SingleSource/Regression/C/gcc-c-torture/execute/ieee/GCC-C-execute-ieee-minuszero.link.time /Users/buildslave/jenkins/workspace/test-suite-verify-machineinstrs-x86_64-O3/compiler/bin/clang -B /Applications/Xcode.app/Contents/Developer/Toolchains/XcodeDefault.xctoolchain/usr/bin    -Wno-unused-command-line-argument -mllvm -verify-machineinstrs -O3 -arch x86_64 -isysroot /Applications/Xcode.app/Contents/Developer/Platforms/MacOSX.platform/Developer/SDKs/MacOSX10.14.sdk -Wl,-search_paths_first -Wl,-headerpad_max_install_names -B /Applications/Xcode.app/Contents/Developer/Toolchains/XcodeDefault.xctoolchain/usr/bin SingleSource/Regression/C/gcc-c-torture/execute/ieee/CMakeFiles/GCC-C-execute-ieee-minuszero.dir/minuszero.c.o  -o SingleSource/Regression/C/gcc-c-torture/execute/ieee/GCC-C-execute-ieee-minuszero  -Wl,-no_pie && :
[7642/7672] /Users/buildslave/jenkins/workspace/test-suite-verify-machineinstrs-x86_64-O3/test-suite-build/tools/timeit --summary SingleSource/Regression/C++/CMakeFiles/Regression-C++-global_type.dir/global_type.cpp.o.time /Users/buildslave/jenkins/workspace/test-suite-verify-machineinstrs-x86_64-O3/compiler/bin/clang++  -DNDEBUG  -B /Applications/Xcode.app/Contents/Developer/Toolchains/XcodeDefault.xctoolchain/usr/bin    -Wno-unused-command-line-argument -mllvm -verify-machineinstrs -O3 -arch x86_64 -isysroot /Applications/Xcode.app/Contents/Developer/Platforms/MacOSX.platform/Developer/SDKs/MacOSX10.14.sdk   -w -Werror=date-time -MD -MT SingleSource/Regression/C++/CMakeFiles/Regression-C++-global_type.dir/global_type.cpp.o -MF SingleSource/Regression/C++/CMakeFiles/Regression-C++-global_type.dir/global_type.cpp.o.d -o SingleSource/Regression/C++/CMakeFiles/Regression-C++-global_type.dir/global_type.cpp.o -c /Users/buildslave/jenkins/workspace/test-suite-verify-machineinstrs-x86_64-O3/test-suite/SingleSource/Regression/C++/global_type.cpp
[7643/7672] : && /Users/buildslave/jenkins/workspace/test-suite-verify-machineinstrs-x86_64-O3/test-suite-build/tools/timeit --summary SingleSource/Regression/C/gcc-c-torture/execute/ieee/GCC-C-execute-ieee-inf-1.link.time /Users/buildslave/jenkins/workspace/test-suite-verify-machineinstrs-x86_64-O3/compiler/bin/clang -B /Applications/Xcode.app/Contents/Developer/Toolchains/XcodeDefault.xctoolchain/usr/bin    -Wno-unused-command-line-argument -mllvm -verify-machineinstrs -O3 -arch x86_64 -isysroot /Applications/Xcode.app/Contents/Developer/Platforms/MacOSX.platform/Developer/SDKs/MacOSX10.14.sdk -Wl,-search_paths_first -Wl,-headerpad_max_install_names -B /Applications/Xcode.app/Contents/Developer/Toolchains/XcodeDefault.xctoolchain/usr/bin SingleSource/Regression/C/gcc-c-torture/execute/ieee/CMakeFiles/GCC-C-execute-ieee-inf-1.dir/inf-1.c.o  -o SingleSource/Regression/C/gcc-c-torture/execute/ieee/GCC-C-execute-ieee-inf-1  -Wl,-no_pie && :
[7644/7672] : && /Users/buildslave/jenkins/workspace/test-suite-verify-machineinstrs-x86_64-O3/test-suite-build/tools/timeit --summary SingleSource/Regression/C/gcc-c-torture/execute/ieee/GCC-C-execute-ieee-980619-1.link.time /Users/buildslave/jenkins/workspace/test-suite-verify-machineinstrs-x86_64-O3/compiler/bin/clang -B /Applications/Xcode.app/Contents/Developer/Toolchains/XcodeDefault.xctoolchain/usr/bin    -Wno-unused-command-line-argument -mllvm -verify-machineinstrs -O3 -arch x86_64 -isysroot /Applications/Xcode.app/Contents/Developer/Platforms/MacOSX.platform/Developer/SDKs/MacOSX10.14.sdk -Wl,-search_paths_first -Wl,-headerpad_max_install_names -B /Applications/Xcode.app/Contents/Developer/Toolchains/XcodeDefault.xctoolchain/usr/bin SingleSource/Regression/C/gcc-c-torture/execute/ieee/CMakeFiles/GCC-C-execute-ieee-980619-1.dir/980619-1.c.o  -o SingleSource/Regression/C/gcc-c-torture/execute/ieee/GCC-C-execute-ieee-980619-1  -Wl,-no_pie && :
[7645/7672] : && /Users/buildslave/jenkins/workspace/test-suite-verify-machineinstrs-x86_64-O3/test-suite-build/tools/timeit --summary SingleSource/Regression/C++/Regression-C++-global_type.link.time /Users/buildslave/jenkins/workspace/test-suite-verify-machineinstrs-x86_64-O3/compiler/bin/clang++  -B /Applications/Xcode.app/Contents/Developer/Toolchains/XcodeDefault.xctoolchain/usr/bin    -Wno-unused-command-line-argument -mllvm -verify-machineinstrs -O3 -arch x86_64 -isysroot /Applications/Xcode.app/Contents/Developer/Platforms/MacOSX.platform/Developer/SDKs/MacOSX10.14.sdk -Wl,-search_paths_first -Wl,-headerpad_max_install_names -B /Applications/Xcode.app/Contents/Developer/Toolchains/XcodeDefault.xctoolchain/usr/bin SingleSource/Regression/C++/CMakeFiles/Regression-C++-global_type.dir/global_type.cpp.o  -o SingleSource/Regression/C++/Regression-C++-global_type  -Wl,-no_pie -lstdc++ && cd /Users/buildslave/jenkins/workspace/test-suite-verify-machineinstrs-x86_64-O3/test-suite-build/SingleSource/Regression/C++ && /usr/local/Cellar/cmake/3.13.1/bin/cmake -E create_symlink /Users/buildslave/jenkins/workspace/test-suite-verify-machineinstrs-x86_64-O3/test-suite/SingleSource/Regression/C++/global_type.reference_output /Users/buildslave/jenkins/workspace/test-suite-verify-machineinstrs-x86_64-O3/test-suite-build/SingleSource/Regression/C++/global_type.reference_output
[7646/7672] /Users/buildslave/jenkins/workspace/test-suite-verify-machineinstrs-x86_64-O3/test-suite-build/tools/timeit --summary SingleSource/Regression/C++/CMakeFiles/Regression-C++-short_circuit_dtor.dir/short_circuit_dtor.cpp.o.time /Users/buildslave/jenkins/workspace/test-suite-verify-machineinstrs-x86_64-O3/compiler/bin/clang++  -DNDEBUG  -B /Applications/Xcode.app/Contents/Developer/Toolchains/XcodeDefault.xctoolchain/usr/bin    -Wno-unused-command-line-argument -mllvm -verify-machineinstrs -O3 -arch x86_64 -isysroot /Applications/Xcode.app/Contents/Developer/Platforms/MacOSX.platform/Developer/SDKs/MacOSX10.14.sdk   -w -Werror=date-time -MD -MT SingleSource/Regression/C++/CMakeFiles/Regression-C++-short_circuit_dtor.dir/short_circuit_dtor.cpp.o -MF SingleSource/Regression/C++/CMakeFiles/Regression-C++-short_circuit_dtor.dir/short_circuit_dtor.cpp.o.d -o SingleSource/Regression/C++/CMakeFiles/Regression-C++-short_circuit_dtor.dir/short_circuit_dtor.cpp.o -c /Users/buildslave/jenkins/workspace/test-suite-verify-machineinstrs-x86_64-O3/test-suite/SingleSource/Regression/C++/short_circuit_dtor.cpp
[7647/7672] /Users/buildslave/jenkins/workspace/test-suite-verify-machineinstrs-x86_64-O3/test-suite-build/tools/timeit --summary SingleSource/Regression/C++/CMakeFiles/Regression-C++-pointer_member.dir/pointer_member.cpp.o.time /Users/buildslave/jenkins/workspace/test-suite-verify-machineinstrs-x86_64-O3/compiler/bin/clang++  -DNDEBUG  -B /Applications/Xcode.app/Contents/Developer/Toolchains/XcodeDefault.xctoolchain/usr/bin    -Wno-unused-command-line-argument -mllvm -verify-machineinstrs -O3 -arch x86_64 -isysroot /Applications/Xcode.app/Contents/Developer/Platforms/MacOSX.platform/Developer/SDKs/MacOSX10.14.sdk   -w -Werror=date-time -MD -MT SingleSource/Regression/C++/CMakeFiles/Regression-C++-pointer_member.dir/pointer_member.cpp.o -MF SingleSource/Regression/C++/CMakeFiles/Regression-C++-pointer_member.dir/pointer_member.cpp.o.d -o SingleSource/Regression/C++/CMakeFiles/Regression-C++-pointer_member.dir/pointer_member.cpp.o -c /Users/buildslave/jenkins/workspace/test-suite-verify-machineinstrs-x86_64-O3/test-suite/SingleSource/Regression/C++/pointer_member.cpp
[7648/7672] /Users/buildslave/jenkins/workspace/test-suite-verify-machineinstrs-x86_64-O3/test-suite-build/tools/timeit --summary SingleSource/Regression/C++/CMakeFiles/Regression-C++-pointer_method2.dir/pointer_method2.cpp.o.time /Users/buildslave/jenkins/workspace/test-suite-verify-machineinstrs-x86_64-O3/compiler/bin/clang++  -DNDEBUG  -B /Applications/Xcode.app/Contents/Developer/Toolchains/XcodeDefault.xctoolchain/usr/bin    -Wno-unused-command-line-argument -mllvm -verify-machineinstrs -O3 -arch x86_64 -isysroot /Applications/Xcode.app/Contents/Developer/Platforms/MacOSX.platform/Developer/SDKs/MacOSX10.14.sdk   -w -Werror=date-time -MD -MT SingleSource/Regression/C++/CMakeFiles/Regression-C++-pointer_method2.dir/pointer_method2.cpp.o -MF SingleSource/Regression/C++/CMakeFiles/Regression-C++-pointer_method2.dir/pointer_method2.cpp.o.d -o SingleSource/Regression/C++/CMakeFiles/Regression-C++-pointer_method2.dir/pointer_method2.cpp.o -c /Users/buildslave/jenkins/workspace/test-suite-verify-machineinstrs-x86_64-O3/test-suite/SingleSource/Regression/C++/pointer_method2.cpp
[7649/7672] /Users/buildslave/jenkins/workspace/test-suite-verify-machineinstrs-x86_64-O3/test-suite-build/tools/timeit --summary SingleSource/Regression/C++/CMakeFiles/Regression-C++-2003-06-08-BaseType.dir/2003-06-08-BaseType.cpp.o.time /Users/buildslave/jenkins/workspace/test-suite-verify-machineinstrs-x86_64-O3/compiler/bin/clang++  -DNDEBUG  -B /Applications/Xcode.app/Contents/Developer/Toolchains/XcodeDefault.xctoolchain/usr/bin    -Wno-unused-command-line-argument -mllvm -verify-machineinstrs -O3 -arch x86_64 -isysroot /Applications/Xcode.app/Contents/Developer/Platforms/MacOSX.platform/Developer/SDKs/MacOSX10.14.sdk   -w -Werror=date-time -MD -MT SingleSource/Regression/C++/CMakeFiles/Regression-C++-2003-06-08-BaseType.dir/2003-06-08-BaseType.cpp.o -MF SingleSource/Regression/C++/CMakeFiles/Regression-C++-2003-06-08-BaseType.dir/2003-06-08-BaseType.cpp.o.d -o SingleSource/Regression/C++/CMakeFiles/Regression-C++-2003-06-08-BaseType.dir/2003-06-08-BaseType.cpp.o -c /Users/buildslave/jenkins/workspace/test-suite-verify-machineinstrs-x86_64-O3/test-suite/SingleSource/Regression/C++/2003-06-08-BaseType.cpp
[7650/7672] : && /Users/buildslave/jenkins/workspace/test-suite-verify-machineinstrs-x86_64-O3/test-suite-build/tools/timeit --summary SingleSource/Regression/C++/Regression-C++-short_circuit_dtor.link.time /Users/buildslave/jenkins/workspace/test-suite-verify-machineinstrs-x86_64-O3/compiler/bin/clang++  -B /Applications/Xcode.app/Contents/Developer/Toolchains/XcodeDefault.xctoolchain/usr/bin    -Wno-unused-command-line-argument -mllvm -verify-machineinstrs -O3 -arch x86_64 -isysroot /Applications/Xcode.app/Contents/Developer/Platforms/MacOSX.platform/Developer/SDKs/MacOSX10.14.sdk -Wl,-search_paths_first -Wl,-headerpad_max_install_names -B /Applications/Xcode.app/Contents/Developer/Toolchains/XcodeDefault.xctoolchain/usr/bin SingleSource/Regression/C++/CMakeFiles/Regression-C++-short_circuit_dtor.dir/short_circuit_dtor.cpp.o  -o SingleSource/Regression/C++/Regression-C++-short_circuit_dtor  -Wl,-no_pie -lstdc++ && cd /Users/buildslave/jenkins/workspace/test-suite-verify-machineinstrs-x86_64-O3/test-suite-build/SingleSource/Regression/C++ && /usr/local/Cellar/cmake/3.13.1/bin/cmake -E create_symlink /Users/buildslave/jenkins/workspace/test-suite-verify-machineinstrs-x86_64-O3/test-suite/SingleSource/Regression/C++/short_circuit_dtor.reference_output /Users/buildslave/jenkins/workspace/test-suite-verify-machineinstrs-x86_64-O3/test-suite-build/SingleSource/Regression/C++/short_circuit_dtor.reference_output
[7651/7672] : && /Users/buildslave/jenkins/workspace/test-suite-verify-machineinstrs-x86_64-O3/test-suite-build/tools/timeit --summary SingleSource/Regression/C++/Regression-C++-pointer_member.link.time /Users/buildslave/jenkins/workspace/test-suite-verify-machineinstrs-x86_64-O3/compiler/bin/clang++  -B /Applications/Xcode.app/Contents/Developer/Toolchains/XcodeDefault.xctoolchain/usr/bin    -Wno-unused-command-line-argument -mllvm -verify-machineinstrs -O3 -arch x86_64 -isysroot /Applications/Xcode.app/Contents/Developer/Platforms/MacOSX.platform/Developer/SDKs/MacOSX10.14.sdk -Wl,-search_paths_first -Wl,-headerpad_max_install_names -B /Applications/Xcode.app/Contents/Developer/Toolchains/XcodeDefault.xctoolchain/usr/bin SingleSource/Regression/C++/CMakeFiles/Regression-C++-pointer_member.dir/pointer_member.cpp.o  -o SingleSource/Regression/C++/Regression-C++-pointer_member  -Wl,-no_pie -lstdc++ && cd /Users/buildslave/jenkins/workspace/test-suite-verify-machineinstrs-x86_64-O3/test-suite-build/SingleSource/Regression/C++ && /usr/local/Cellar/cmake/3.13.1/bin/cmake -E create_symlink /Users/buildslave/jenkins/workspace/test-suite-verify-machineinstrs-x86_64-O3/test-suite/SingleSource/Regression/C++/pointer_member.reference_output /Users/buildslave/jenkins/workspace/test-suite-verify-machineinstrs-x86_64-O3/test-suite-build/SingleSource/Regression/C++/pointer_member.reference_output
[7652/7672] : && /Users/buildslave/jenkins/workspace/test-suite-verify-machineinstrs-x86_64-O3/test-suite-build/tools/timeit --summary SingleSource/Regression/C++/Regression-C++-pointer_method2.link.time /Users/buildslave/jenkins/workspace/test-suite-verify-machineinstrs-x86_64-O3/compiler/bin/clang++  -B /Applications/Xcode.app/Contents/Developer/Toolchains/XcodeDefault.xctoolchain/usr/bin    -Wno-unused-command-line-argument -mllvm -verify-machineinstrs -O3 -arch x86_64 -isysroot /Applications/Xcode.app/Contents/Developer/Platforms/MacOSX.platform/Developer/SDKs/MacOSX10.14.sdk -Wl,-search_paths_first -Wl,-headerpad_max_install_names -B /Applications/Xcode.app/Contents/Developer/Toolchains/XcodeDefault.xctoolchain/usr/bin SingleSource/Regression/C++/CMakeFiles/Regression-C++-pointer_method2.dir/pointer_method2.cpp.o  -o SingleSource/Regression/C++/Regression-C++-pointer_method2  -Wl,-no_pie -lstdc++ && cd /Users/buildslave/jenkins/workspace/test-suite-verify-machineinstrs-x86_64-O3/test-suite-build/SingleSource/Regression/C++ && /usr/local/Cellar/cmake/3.13.1/bin/cmake -E create_symlink /Users/buildslave/jenkins/workspace/test-suite-verify-machineinstrs-x86_64-O3/test-suite/SingleSource/Regression/C++/pointer_method2.reference_output /Users/buildslave/jenkins/workspace/test-suite-verify-machineinstrs-x86_64-O3/test-suite-build/SingleSource/Regression/C++/pointer_method2.reference_output
[7653/7672] : && /Users/buildslave/jenkins/workspace/test-suite-verify-machineinstrs-x86_64-O3/test-suite-build/tools/timeit --summary SingleSource/Regression/C++/Regression-C++-2003-06-08-BaseType.link.time /Users/buildslave/jenkins/workspace/test-suite-verify-machineinstrs-x86_64-O3/compiler/bin/clang++  -B /Applications/Xcode.app/Contents/Developer/Toolchains/XcodeDefault.xctoolchain/usr/bin    -Wno-unused-command-line-argument -mllvm -verify-machineinstrs -O3 -arch x86_64 -isysroot /Applications/Xcode.app/Contents/Developer/Platforms/MacOSX.platform/Developer/SDKs/MacOSX10.14.sdk -Wl,-search_paths_first -Wl,-headerpad_max_install_names -B /Applications/Xcode.app/Contents/Developer/Toolchains/XcodeDefault.xctoolchain/usr/bin SingleSource/Regression/C++/CMakeFiles/Regression-C++-2003-06-08-BaseType.dir/2003-06-08-BaseType.cpp.o  -o SingleSource/Regression/C++/Regression-C++-2003-06-08-BaseType  -Wl,-no_pie -lstdc++ && cd /Users/buildslave/jenkins/workspace/test-suite-verify-machineinstrs-x86_64-O3/test-suite-build/SingleSource/Regression/C++ && /usr/local/Cellar/cmake/3.13.1/bin/cmake -E create_symlink /Users/buildslave/jenkins/workspace/test-suite-verify-machineinstrs-x86_64-O3/test-suite/SingleSource/Regression/C++/2003-06-08-BaseType.reference_output /Users/buildslave/jenkins/workspace/test-suite-verify-machineinstrs-x86_64-O3/test-suite-build/SingleSource/Regression/C++/2003-06-08-BaseType.reference_output
[7654/7672] /Users/buildslave/jenkins/workspace/test-suite-verify-machineinstrs-x86_64-O3/test-suite-build/tools/timeit --summary SingleSource/Regression/C++/CMakeFiles/Regression-C++-2011-03-28-Bitfield.dir/2011-03-28-Bitfield.cpp.o.time /Users/buildslave/jenkins/workspace/test-suite-verify-machineinstrs-x86_64-O3/compiler/bin/clang++  -DNDEBUG  -B /Applications/Xcode.app/Contents/Developer/Toolchains/XcodeDefault.xctoolchain/usr/bin    -Wno-unused-command-line-argument -mllvm -verify-machineinstrs -O3 -arch x86_64 -isysroot /Applications/Xcode.app/Contents/Developer/Platforms/MacOSX.platform/Developer/SDKs/MacOSX10.14.sdk   -w -Werror=date-time -MD -MT SingleSource/Regression/C++/CMakeFiles/Regression-C++-2011-03-28-Bitfield.dir/2011-03-28-Bitfield.cpp.o -MF SingleSource/Regression/C++/CMakeFiles/Regression-C++-2011-03-28-Bitfield.dir/2011-03-28-Bitfield.cpp.o.d -o SingleSource/Regression/C++/CMakeFiles/Regression-C++-2011-03-28-Bitfield.dir/2011-03-28-Bitfield.cpp.o -c /Users/buildslave/jenkins/workspace/test-suite-verify-machineinstrs-x86_64-O3/test-suite/SingleSource/Regression/C++/2011-03-28-Bitfield.cpp
[7655/7672] /Users/buildslave/jenkins/workspace/test-suite-verify-machineinstrs-x86_64-O3/test-suite-build/tools/timeit --summary SingleSource/Regression/C++/CMakeFiles/Regression-C++-2003-09-29-NonPODsByValue.dir/2003-09-29-NonPODsByValue.cpp.o.time /Users/buildslave/jenkins/workspace/test-suite-verify-machineinstrs-x86_64-O3/compiler/bin/clang++  -DNDEBUG  -B /Applications/Xcode.app/Contents/Developer/Toolchains/XcodeDefault.xctoolchain/usr/bin    -Wno-unused-command-line-argument -mllvm -verify-machineinstrs -O3 -arch x86_64 -isysroot /Applications/Xcode.app/Contents/Developer/Platforms/MacOSX.platform/Developer/SDKs/MacOSX10.14.sdk   -w -Werror=date-time -MD -MT SingleSource/Regression/C++/CMakeFiles/Regression-C++-2003-09-29-NonPODsByValue.dir/2003-09-29-NonPODsByValue.cpp.o -MF SingleSource/Regression/C++/CMakeFiles/Regression-C++-2003-09-29-NonPODsByValue.dir/2003-09-29-NonPODsByValue.cpp.o.d -o SingleSource/Regression/C++/CMakeFiles/Regression-C++-2003-09-29-NonPODsByValue.dir/2003-09-29-NonPODsByValue.cpp.o -c /Users/buildslave/jenkins/workspace/test-suite-verify-machineinstrs-x86_64-O3/test-suite/SingleSource/Regression/C++/2003-09-29-NonPODsByValue.cpp
[7656/7672] /Users/buildslave/jenkins/workspace/test-suite-verify-machineinstrs-x86_64-O3/test-suite-build/tools/timeit --summary SingleSource/Regression/C++/CMakeFiles/Regression-C++-2008-01-29-ParamAliasesReturn.dir/2008-01-29-ParamAliasesReturn.cpp.o.time /Users/buildslave/jenkins/workspace/test-suite-verify-machineinstrs-x86_64-O3/compiler/bin/clang++  -DNDEBUG  -B /Applications/Xcode.app/Contents/Developer/Toolchains/XcodeDefault.xctoolchain/usr/bin    -Wno-unused-command-line-argument -mllvm -verify-machineinstrs -O3 -arch x86_64 -isysroot /Applications/Xcode.app/Contents/Developer/Platforms/MacOSX.platform/Developer/SDKs/MacOSX10.14.sdk   -w -Werror=date-time -MD -MT SingleSource/Regression/C++/CMakeFiles/Regression-C++-2008-01-29-ParamAliasesReturn.dir/2008-01-29-ParamAliasesReturn.cpp.o -MF SingleSource/Regression/C++/CMakeFiles/Regression-C++-2008-01-29-ParamAliasesReturn.dir/2008-01-29-ParamAliasesReturn.cpp.o.d -o SingleSource/Regression/C++/CMakeFiles/Regression-C++-2008-01-29-ParamAliasesReturn.dir/2008-01-29-ParamAliasesReturn.cpp.o -c /Users/buildslave/jenkins/workspace/test-suite-verify-machineinstrs-x86_64-O3/test-suite/SingleSource/Regression/C++/2008-01-29-ParamAliasesReturn.cpp
[7657/7672] /Users/buildslave/jenkins/workspace/test-suite-verify-machineinstrs-x86_64-O3/test-suite-build/tools/timeit --summary SingleSource/Regression/C++/CMakeFiles/Regression-C++-pointer_method.dir/pointer_method.cpp.o.time /Users/buildslave/jenkins/workspace/test-suite-verify-machineinstrs-x86_64-O3/compiler/bin/clang++  -DNDEBUG  -B /Applications/Xcode.app/Contents/Developer/Toolchains/XcodeDefault.xctoolchain/usr/bin    -Wno-unused-command-line-argument -mllvm -verify-machineinstrs -O3 -arch x86_64 -isysroot /Applications/Xcode.app/Contents/Developer/Platforms/MacOSX.platform/Developer/SDKs/MacOSX10.14.sdk   -w -Werror=date-time -MD -MT SingleSource/Regression/C++/CMakeFiles/Regression-C++-pointer_method.dir/pointer_method.cpp.o -MF SingleSource/Regression/C++/CMakeFiles/Regression-C++-pointer_method.dir/pointer_method.cpp.o.d -o SingleSource/Regression/C++/CMakeFiles/Regression-C++-pointer_method.dir/pointer_method.cpp.o -c /Users/buildslave/jenkins/workspace/test-suite-verify-machineinstrs-x86_64-O3/test-suite/SingleSource/Regression/C++/pointer_method.cpp
[7658/7672] : && /Users/buildslave/jenkins/workspace/test-suite-verify-machineinstrs-x86_64-O3/test-suite-build/tools/timeit --summary SingleSource/Regression/C++/Regression-C++-2011-03-28-Bitfield.link.time /Users/buildslave/jenkins/workspace/test-suite-verify-machineinstrs-x86_64-O3/compiler/bin/clang++  -B /Applications/Xcode.app/Contents/Developer/Toolchains/XcodeDefault.xctoolchain/usr/bin    -Wno-unused-command-line-argument -mllvm -verify-machineinstrs -O3 -arch x86_64 -isysroot /Applications/Xcode.app/Contents/Developer/Platforms/MacOSX.platform/Developer/SDKs/MacOSX10.14.sdk -Wl,-search_paths_first -Wl,-headerpad_max_install_names -B /Applications/Xcode.app/Contents/Developer/Toolchains/XcodeDefault.xctoolchain/usr/bin SingleSource/Regression/C++/CMakeFiles/Regression-C++-2011-03-28-Bitfield.dir/2011-03-28-Bitfield.cpp.o  -o SingleSource/Regression/C++/Regression-C++-2011-03-28-Bitfield  -Wl,-no_pie -lstdc++ && cd /Users/buildslave/jenkins/workspace/test-suite-verify-machineinstrs-x86_64-O3/test-suite-build/SingleSource/Regression/C++ && /usr/local/Cellar/cmake/3.13.1/bin/cmake -E create_symlink /Users/buildslave/jenkins/workspace/test-suite-verify-machineinstrs-x86_64-O3/test-suite/SingleSource/Regression/C++/2011-03-28-Bitfield.reference_output /Users/buildslave/jenkins/workspace/test-suite-verify-machineinstrs-x86_64-O3/test-suite-build/SingleSource/Regression/C++/2011-03-28-Bitfield.reference_output
[7659/7672] : && /Users/buildslave/jenkins/workspace/test-suite-verify-machineinstrs-x86_64-O3/test-suite-build/tools/timeit --summary SingleSource/Regression/C++/Regression-C++-2003-09-29-NonPODsByValue.link.time /Users/buildslave/jenkins/workspace/test-suite-verify-machineinstrs-x86_64-O3/compiler/bin/clang++  -B /Applications/Xcode.app/Contents/Developer/Toolchains/XcodeDefault.xctoolchain/usr/bin    -Wno-unused-command-line-argument -mllvm -verify-machineinstrs -O3 -arch x86_64 -isysroot /Applications/Xcode.app/Contents/Developer/Platforms/MacOSX.platform/Developer/SDKs/MacOSX10.14.sdk -Wl,-search_paths_first -Wl,-headerpad_max_install_names -B /Applications/Xcode.app/Contents/Developer/Toolchains/XcodeDefault.xctoolchain/usr/bin SingleSource/Regression/C++/CMakeFiles/Regression-C++-2003-09-29-NonPODsByValue.dir/2003-09-29-NonPODsByValue.cpp.o  -o SingleSource/Regression/C++/Regression-C++-2003-09-29-NonPODsByValue  -Wl,-no_pie -lstdc++ && cd /Users/buildslave/jenkins/workspace/test-suite-verify-machineinstrs-x86_64-O3/test-suite-build/SingleSource/Regression/C++ && /usr/local/Cellar/cmake/3.13.1/bin/cmake -E create_symlink /Users/buildslave/jenkins/workspace/test-suite-verify-machineinstrs-x86_64-O3/test-suite/SingleSource/Regression/C++/2003-09-29-NonPODsByValue.reference_output /Users/buildslave/jenkins/workspace/test-suite-verify-machineinstrs-x86_64-O3/test-suite-build/SingleSource/Regression/C++/2003-09-29-NonPODsByValue.reference_output
[7660/7672] : && /Users/buildslave/jenkins/workspace/test-suite-verify-machineinstrs-x86_64-O3/test-suite-build/tools/timeit --summary SingleSource/Regression/C++/Regression-C++-2008-01-29-ParamAliasesReturn.link.time /Users/buildslave/jenkins/workspace/test-suite-verify-machineinstrs-x86_64-O3/compiler/bin/clang++  -B /Applications/Xcode.app/Contents/Developer/Toolchains/XcodeDefault.xctoolchain/usr/bin    -Wno-unused-command-line-argument -mllvm -verify-machineinstrs -O3 -arch x86_64 -isysroot /Applications/Xcode.app/Contents/Developer/Platforms/MacOSX.platform/Developer/SDKs/MacOSX10.14.sdk -Wl,-search_paths_first -Wl,-headerpad_max_install_names -B /Applications/Xcode.app/Contents/Developer/Toolchains/XcodeDefault.xctoolchain/usr/bin SingleSource/Regression/C++/CMakeFiles/Regression-C++-2008-01-29-ParamAliasesReturn.dir/2008-01-29-ParamAliasesReturn.cpp.o  -o SingleSource/Regression/C++/Regression-C++-2008-01-29-ParamAliasesReturn  -Wl,-no_pie -lstdc++ && cd /Users/buildslave/jenkins/workspace/test-suite-verify-machineinstrs-x86_64-O3/test-suite-build/SingleSource/Regression/C++ && /usr/local/Cellar/cmake/3.13.1/bin/cmake -E create_symlink /Users/buildslave/jenkins/workspace/test-suite-verify-machineinstrs-x86_64-O3/test-suite/SingleSource/Regression/C++/2008-01-29-ParamAliasesReturn.reference_output /Users/buildslave/jenkins/workspace/test-suite-verify-machineinstrs-x86_64-O3/test-suite-build/SingleSource/Regression/C++/2008-01-29-ParamAliasesReturn.reference_output
[7661/7672] : && /Users/buildslave/jenkins/workspace/test-suite-verify-machineinstrs-x86_64-O3/test-suite-build/tools/timeit --summary SingleSource/Regression/C++/Regression-C++-pointer_method.link.time /Users/buildslave/jenkins/workspace/test-suite-verify-machineinstrs-x86_64-O3/compiler/bin/clang++  -B /Applications/Xcode.app/Contents/Developer/Toolchains/XcodeDefault.xctoolchain/usr/bin    -Wno-unused-command-line-argument -mllvm -verify-machineinstrs -O3 -arch x86_64 -isysroot /Applications/Xcode.app/Contents/Developer/Platforms/MacOSX.platform/Developer/SDKs/MacOSX10.14.sdk -Wl,-search_paths_first -Wl,-headerpad_max_install_names -B /Applications/Xcode.app/Contents/Developer/Toolchains/XcodeDefault.xctoolchain/usr/bin SingleSource/Regression/C++/CMakeFiles/Regression-C++-pointer_method.dir/pointer_method.cpp.o  -o SingleSource/Regression/C++/Regression-C++-pointer_method  -Wl,-no_pie -lstdc++ && cd /Users/buildslave/jenkins/workspace/test-suite-verify-machineinstrs-x86_64-O3/test-suite-build/SingleSource/Regression/C++ && /usr/local/Cellar/cmake/3.13.1/bin/cmake -E create_symlink /Users/buildslave/jenkins/workspace/test-suite-verify-machineinstrs-x86_64-O3/test-suite/SingleSource/Regression/C++/pointer_method.reference_output /Users/buildslave/jenkins/workspace/test-suite-verify-machineinstrs-x86_64-O3/test-suite-build/SingleSource/Regression/C++/pointer_method.reference_output
[7662/7672] /Users/buildslave/jenkins/workspace/test-suite-verify-machineinstrs-x86_64-O3/test-suite-build/tools/timeit --summary SingleSource/Regression/C++/CMakeFiles/Regression-C++-2003-08-20-EnumSizeProblem.dir/2003-08-20-EnumSizeProblem.cpp.o.time /Users/buildslave/jenkins/workspace/test-suite-verify-machineinstrs-x86_64-O3/compiler/bin/clang++  -DNDEBUG  -B /Applications/Xcode.app/Contents/Developer/Toolchains/XcodeDefault.xctoolchain/usr/bin    -Wno-unused-command-line-argument -mllvm -verify-machineinstrs -O3 -arch x86_64 -isysroot /Applications/Xcode.app/Contents/Developer/Platforms/MacOSX.platform/Developer/SDKs/MacOSX10.14.sdk   -w -Werror=date-time -MD -MT SingleSource/Regression/C++/CMakeFiles/Regression-C++-2003-08-20-EnumSizeProblem.dir/2003-08-20-EnumSizeProblem.cpp.o -MF SingleSource/Regression/C++/CMakeFiles/Regression-C++-2003-08-20-EnumSizeProblem.dir/2003-08-20-EnumSizeProblem.cpp.o.d -o SingleSource/Regression/C++/CMakeFiles/Regression-C++-2003-08-20-EnumSizeProblem.dir/2003-08-20-EnumSizeProblem.cpp.o -c /Users/buildslave/jenkins/workspace/test-suite-verify-machineinstrs-x86_64-O3/test-suite/SingleSource/Regression/C++/2003-08-20-EnumSizeProblem.cpp
[7663/7672] /Users/buildslave/jenkins/workspace/test-suite-verify-machineinstrs-x86_64-O3/test-suite-build/tools/timeit --summary SingleSource/Regression/C++/CMakeFiles/Regression-C++-2003-06-13-Crasher.dir/2003-06-13-Crasher.cpp.o.time /Users/buildslave/jenkins/workspace/test-suite-verify-machineinstrs-x86_64-O3/compiler/bin/clang++  -DNDEBUG  -B /Applications/Xcode.app/Contents/Developer/Toolchains/XcodeDefault.xctoolchain/usr/bin    -Wno-unused-command-line-argument -mllvm -verify-machineinstrs -O3 -arch x86_64 -isysroot /Applications/Xcode.app/Contents/Developer/Platforms/MacOSX.platform/Developer/SDKs/MacOSX10.14.sdk   -w -Werror=date-time -MD -MT SingleSource/Regression/C++/CMakeFiles/Regression-C++-2003-06-13-Crasher.dir/2003-06-13-Crasher.cpp.o -MF SingleSource/Regression/C++/CMakeFiles/Regression-C++-2003-06-13-Crasher.dir/2003-06-13-Crasher.cpp.o.d -o SingleSource/Regression/C++/CMakeFiles/Regression-C++-2003-06-13-Crasher.dir/2003-06-13-Crasher.cpp.o -c /Users/buildslave/jenkins/workspace/test-suite-verify-machineinstrs-x86_64-O3/test-suite/SingleSource/Regression/C++/2003-06-13-Crasher.cpp
[7664/7672] : && /Users/buildslave/jenkins/workspace/test-suite-verify-machineinstrs-x86_64-O3/test-suite-build/tools/timeit --summary SingleSource/Regression/C++/Regression-C++-2003-08-20-EnumSizeProblem.link.time /Users/buildslave/jenkins/workspace/test-suite-verify-machineinstrs-x86_64-O3/compiler/bin/clang++  -B /Applications/Xcode.app/Contents/Developer/Toolchains/XcodeDefault.xctoolchain/usr/bin    -Wno-unused-command-line-argument -mllvm -verify-machineinstrs -O3 -arch x86_64 -isysroot /Applications/Xcode.app/Contents/Developer/Platforms/MacOSX.platform/Developer/SDKs/MacOSX10.14.sdk -Wl,-search_paths_first -Wl,-headerpad_max_install_names -B /Applications/Xcode.app/Contents/Developer/Toolchains/XcodeDefault.xctoolchain/usr/bin SingleSource/Regression/C++/CMakeFiles/Regression-C++-2003-08-20-EnumSizeProblem.dir/2003-08-20-EnumSizeProblem.cpp.o  -o SingleSource/Regression/C++/Regression-C++-2003-08-20-EnumSizeProblem  -Wl,-no_pie -lstdc++ && cd /Users/buildslave/jenkins/workspace/test-suite-verify-machineinstrs-x86_64-O3/test-suite-build/SingleSource/Regression/C++ && /usr/local/Cellar/cmake/3.13.1/bin/cmake -E create_symlink /Users/buildslave/jenkins/workspace/test-suite-verify-machineinstrs-x86_64-O3/test-suite/SingleSource/Regression/C++/2003-08-20-EnumSizeProblem.reference_output /Users/buildslave/jenkins/workspace/test-suite-verify-machineinstrs-x86_64-O3/test-suite-build/SingleSource/Regression/C++/2003-08-20-EnumSizeProblem.reference_output
[7665/7672] /Users/buildslave/jenkins/workspace/test-suite-verify-machineinstrs-x86_64-O3/test-suite-build/tools/timeit --summary SingleSource/Regression/C++/CMakeFiles/Regression-C++-global_ctor.dir/global_ctor.cpp.o.time /Users/buildslave/jenkins/workspace/test-suite-verify-machineinstrs-x86_64-O3/compiler/bin/clang++  -DNDEBUG  -B /Applications/Xcode.app/Contents/Developer/Toolchains/XcodeDefault.xctoolchain/usr/bin    -Wno-unused-command-line-argument -mllvm -verify-machineinstrs -O3 -arch x86_64 -isysroot /Applications/Xcode.app/Contents/Developer/Platforms/MacOSX.platform/Developer/SDKs/MacOSX10.14.sdk   -w -Werror=date-time -MD -MT SingleSource/Regression/C++/CMakeFiles/Regression-C++-global_ctor.dir/global_ctor.cpp.o -MF SingleSource/Regression/C++/CMakeFiles/Regression-C++-global_ctor.dir/global_ctor.cpp.o.d -o SingleSource/Regression/C++/CMakeFiles/Regression-C++-global_ctor.dir/global_ctor.cpp.o -c /Users/buildslave/jenkins/workspace/test-suite-verify-machineinstrs-x86_64-O3/test-suite/SingleSource/Regression/C++/global_ctor.cpp
[7666/7672] : && /Users/buildslave/jenkins/workspace/test-suite-verify-machineinstrs-x86_64-O3/test-suite-build/tools/timeit --summary SingleSource/Regression/C++/Regression-C++-2003-06-13-Crasher.link.time /Users/buildslave/jenkins/workspace/test-suite-verify-machineinstrs-x86_64-O3/compiler/bin/clang++  -B /Applications/Xcode.app/Contents/Developer/Toolchains/XcodeDefault.xctoolchain/usr/bin    -Wno-unused-command-line-argument -mllvm -verify-machineinstrs -O3 -arch x86_64 -isysroot /Applications/Xcode.app/Contents/Developer/Platforms/MacOSX.platform/Developer/SDKs/MacOSX10.14.sdk -Wl,-search_paths_first -Wl,-headerpad_max_install_names -B /Applications/Xcode.app/Contents/Developer/Toolchains/XcodeDefault.xctoolchain/usr/bin SingleSource/Regression/C++/CMakeFiles/Regression-C++-2003-06-13-Crasher.dir/2003-06-13-Crasher.cpp.o  -o SingleSource/Regression/C++/Regression-C++-2003-06-13-Crasher  -Wl,-no_pie -lstdc++ && cd /Users/buildslave/jenkins/workspace/test-suite-verify-machineinstrs-x86_64-O3/test-suite-build/SingleSource/Regression/C++ && /usr/local/Cellar/cmake/3.13.1/bin/cmake -E create_symlink /Users/buildslave/jenkins/workspace/test-suite-verify-machineinstrs-x86_64-O3/test-suite/SingleSource/Regression/C++/2003-06-13-Crasher.reference_output /Users/buildslave/jenkins/workspace/test-suite-verify-machineinstrs-x86_64-O3/test-suite-build/SingleSource/Regression/C++/2003-06-13-Crasher.reference_output
[7667/7672] : && /Users/buildslave/jenkins/workspace/test-suite-verify-machineinstrs-x86_64-O3/test-suite-build/tools/timeit --summary SingleSource/Regression/C++/Regression-C++-global_ctor.link.time /Users/buildslave/jenkins/workspace/test-suite-verify-machineinstrs-x86_64-O3/compiler/bin/clang++  -B /Applications/Xcode.app/Contents/Developer/Toolchains/XcodeDefault.xctoolchain/usr/bin    -Wno-unused-command-line-argument -mllvm -verify-machineinstrs -O3 -arch x86_64 -isysroot /Applications/Xcode.app/Contents/Developer/Platforms/MacOSX.platform/Developer/SDKs/MacOSX10.14.sdk -Wl,-search_paths_first -Wl,-headerpad_max_install_names -B /Applications/Xcode.app/Contents/Developer/Toolchains/XcodeDefault.xctoolchain/usr/bin SingleSource/Regression/C++/CMakeFiles/Regression-C++-global_ctor.dir/global_ctor.cpp.o  -o SingleSource/Regression/C++/Regression-C++-global_ctor  -Wl,-no_pie -lstdc++ && cd /Users/buildslave/jenkins/workspace/test-suite-verify-machineinstrs-x86_64-O3/test-suite-build/SingleSource/Regression/C++ && /usr/local/Cellar/cmake/3.13.1/bin/cmake -E create_symlink /Users/buildslave/jenkins/workspace/test-suite-verify-machineinstrs-x86_64-O3/test-suite/SingleSource/Regression/C++/global_ctor.reference_output /Users/buildslave/jenkins/workspace/test-suite-verify-machineinstrs-x86_64-O3/test-suite-build/SingleSource/Regression/C++/global_ctor.reference_output
[7668/7672] /Users/buildslave/jenkins/workspace/test-suite-verify-machineinstrs-x86_64-O3/test-suite-build/tools/timeit --summary SingleSource/Regression/C++/CMakeFiles/Regression-C++-BuiltinTypeInfo.dir/BuiltinTypeInfo.cpp.o.time /Users/buildslave/jenkins/workspace/test-suite-verify-machineinstrs-x86_64-O3/compiler/bin/clang++  -DNDEBUG  -B /Applications/Xcode.app/Contents/Developer/Toolchains/XcodeDefault.xctoolchain/usr/bin    -Wno-unused-command-line-argument -mllvm -verify-machineinstrs -O3 -arch x86_64 -isysroot /Applications/Xcode.app/Contents/Developer/Platforms/MacOSX.platform/Developer/SDKs/MacOSX10.14.sdk   -w -Werror=date-time -MD -MT SingleSource/Regression/C++/CMakeFiles/Regression-C++-BuiltinTypeInfo.dir/BuiltinTypeInfo.cpp.o -MF SingleSource/Regression/C++/CMakeFiles/Regression-C++-BuiltinTypeInfo.dir/BuiltinTypeInfo.cpp.o.d -o SingleSource/Regression/C++/CMakeFiles/Regression-C++-BuiltinTypeInfo.dir/BuiltinTypeInfo.cpp.o -c /Users/buildslave/jenkins/workspace/test-suite-verify-machineinstrs-x86_64-O3/test-suite/SingleSource/Regression/C++/BuiltinTypeInfo.cpp
[7669/7672] : && /Users/buildslave/jenkins/workspace/test-suite-verify-machineinstrs-x86_64-O3/test-suite-build/tools/timeit --summary SingleSource/Regression/C++/Regression-C++-BuiltinTypeInfo.link.time /Users/buildslave/jenkins/workspace/test-suite-verify-machineinstrs-x86_64-O3/compiler/bin/clang++  -B /Applications/Xcode.app/Contents/Developer/Toolchains/XcodeDefault.xctoolchain/usr/bin    -Wno-unused-command-line-argument -mllvm -verify-machineinstrs -O3 -arch x86_64 -isysroot /Applications/Xcode.app/Contents/Developer/Platforms/MacOSX.platform/Developer/SDKs/MacOSX10.14.sdk -Wl,-search_paths_first -Wl,-headerpad_max_install_names -B /Applications/Xcode.app/Contents/Developer/Toolchains/XcodeDefault.xctoolchain/usr/bin SingleSource/Regression/C++/CMakeFiles/Regression-C++-BuiltinTypeInfo.dir/BuiltinTypeInfo.cpp.o  -o SingleSource/Regression/C++/Regression-C++-BuiltinTypeInfo  -Wl,-no_pie -lstdc++ && cd /Users/buildslave/jenkins/workspace/test-suite-verify-machineinstrs-x86_64-O3/test-suite-build/SingleSource/Regression/C++ && /usr/local/Cellar/cmake/3.13.1/bin/cmake -E create_symlink /Users/buildslave/jenkins/workspace/test-suite-verify-machineinstrs-x86_64-O3/test-suite/SingleSource/Regression/C++/BuiltinTypeInfo.reference_output /Users/buildslave/jenkins/workspace/test-suite-verify-machineinstrs-x86_64-O3/test-suite-build/SingleSource/Regression/C++/BuiltinTypeInfo.reference_output
[7670/7672] /Users/buildslave/jenkins/workspace/test-suite-verify-machineinstrs-x86_64-O3/test-suite-build/tools/timeit --summary MultiSource/Benchmarks/MiBench/consumer-typeset/CMakeFiles/consumer-typeset.dir/z19.c.o.time /Users/buildslave/jenkins/workspace/test-suite-verify-machineinstrs-x86_64-O3/compiler/bin/clang -DNDEBUG  -B /Applications/Xcode.app/Contents/Developer/Toolchains/XcodeDefault.xctoolchain/usr/bin    -Wno-unused-command-line-argument -mllvm -verify-machineinstrs -O3 -arch x86_64 -isysroot /Applications/Xcode.app/Contents/Developer/Platforms/MacOSX.platform/Developer/SDKs/MacOSX10.14.sdk   -w -Werror=date-time -DOS_UNIX=1 -DOS_DOS=0 -DOS_MAC=0 -DDB_FIX=0 -DUSE_STAT=1 -DSAFE_DFT=0 -DCOLLATE=1 -DLIB_DIR=\"lout.lib\" -DFONT_DIR=\"font\" -DMAPS_DIR=\"maps\" -DINCL_DIR=\"include\" -DDATA_DIR=\"data\" -DHYPH_DIR=\"hyph\" -DLOCALE_DIR=\"locale\" -DCHAR_IN=1 -DCHAR_OUT=0 -DLOCALE_ON=1 -DASSERT_ON=1 -DDEBUG_ON=0 -DPDF_COMPRESSION=0 -D_FORTIFY_SOURCE=0 -MD -MT MultiSource/Benchmarks/MiBench/consumer-typeset/CMakeFiles/consumer-typeset.dir/z19.c.o -MF MultiSource/Benchmarks/MiBench/consumer-typeset/CMakeFiles/consumer-typeset.dir/z19.c.o.d -o MultiSource/Benchmarks/MiBench/consumer-typeset/CMakeFiles/consumer-typeset.dir/z19.c.o   -c /Users/buildslave/jenkins/workspace/test-suite-verify-machineinstrs-x86_64-O3/test-suite/MultiSource/Benchmarks/MiBench/consumer-typeset/z19.c
FAILED: MultiSource/Benchmarks/MiBench/consumer-typeset/CMakeFiles/consumer-typeset.dir/z19.c.o 
/Users/buildslave/jenkins/workspace/test-suite-verify-machineinstrs-x86_64-O3/test-suite-build/tools/timeit --summary MultiSource/Benchmarks/MiBench/consumer-typeset/CMakeFiles/consumer-typeset.dir/z19.c.o.time /Users/buildslave/jenkins/workspace/test-suite-verify-machineinstrs-x86_64-O3/compiler/bin/clang -DNDEBUG  -B /Applications/Xcode.app/Contents/Developer/Toolchains/XcodeDefault.xctoolchain/usr/bin    -Wno-unused-command-line-argument -mllvm -verify-machineinstrs -O3 -arch x86_64 -isysroot /Applications/Xcode.app/Contents/Developer/Platforms/MacOSX.platform/Developer/SDKs/MacOSX10.14.sdk   -w -Werror=date-time -DOS_UNIX=1 -DOS_DOS=0 -DOS_MAC=0 -DDB_FIX=0 -DUSE_STAT=1 -DSAFE_DFT=0 -DCOLLATE=1 -DLIB_DIR=\"lout.lib\" -DFONT_DIR=\"font\" -DMAPS_DIR=\"maps\" -DINCL_DIR=\"include\" -DDATA_DIR=\"data\" -DHYPH_DIR=\"hyph\" -DLOCALE_DIR=\"locale\" -DCHAR_IN=1 -DCHAR_OUT=0 -DLOCALE_ON=1 -DASSERT_ON=1 -DDEBUG_ON=0 -DPDF_COMPRESSION=0 -D_FORTIFY_SOURCE=0 -MD -MT MultiSource/Benchmarks/MiBench/consumer-typeset/CMakeFiles/consumer-typeset.dir/z19.c.o -MF MultiSource/Benchmarks/MiBench/consumer-typeset/CMakeFiles/consumer-typeset.dir/z19.c.o.d -o MultiSource/Benchmarks/MiBench/consumer-typeset/CMakeFiles/consumer-typeset.dir/z19.c.o   -c /Users/buildslave/jenkins/workspace/test-suite-verify-machineinstrs-x86_64-O3/test-suite/MultiSource/Benchmarks/MiBench/consumer-typeset/z19.c
Assertion failed: (N <= capacity()), function set_size, file /Users/buildslave/jenkins/workspace/clang-stage1-RA/llvm-project/llvm/include/llvm/ADT/SmallVector.h, line 67.
Stack dump:
0.	Program arguments: /Users/buildslave/jenkins/workspace/test-suite-verify-machineinstrs-x86_64-O3/compiler/bin/clang-10 -cc1 -triple x86_64-apple-macosx10.14.0 -Wdeprecated-objc-isa-usage -Werror=deprecated-objc-isa-usage -emit-obj -disable-free -main-file-name z19.c -mrelocation-model pic -pic-level 2 -mthread-model posix -mframe-pointer=all -fno-rounding-math -masm-verbose -munwind-tables -target-sdk-version=10.14 -target-cpu penryn -dwarf-column-info -debugger-tuning=lldb -target-linker-version 409.12 -resource-dir /Users/buildslave/jenkins/workspace/test-suite-verify-machineinstrs-x86_64-O3/compiler/lib/clang/10.0.0 -dependency-file MultiSource/Benchmarks/MiBench/consumer-typeset/CMakeFiles/consumer-typeset.dir/z19.c.o.d -MT MultiSource/Benchmarks/MiBench/consumer-typeset/CMakeFiles/consumer-typeset.dir/z19.c.o -sys-header-deps -isysroot /Applications/Xcode.app/Contents/Developer/Platforms/MacOSX.platform/Developer/SDKs/MacOSX10.14.sdk -D NDEBUG -D OS_UNIX=1 -D OS_DOS=0 -D OS_MAC=0 -D DB_FIX=0 -D USE_STAT=1 -D SAFE_DFT=0 -D COLLATE=1 -D LIB_DIR="lout.lib" -D FONT_DIR="font" -D MAPS_DIR="maps" -D INCL_DIR="include" -D DATA_DIR="data" -D HYPH_DIR="hyph" -D LOCALE_DIR="locale" -D CHAR_IN=1 -D CHAR_OUT=0 -D LOCALE_ON=1 -D ASSERT_ON=1 -D DEBUG_ON=0 -D PDF_COMPRESSION=0 -D _FORTIFY_SOURCE=0 -internal-isystem /Applications/Xcode.app/Contents/Developer/Platforms/MacOSX.platform/Developer/SDKs/MacOSX10.14.sdk/usr/local/include -internal-isystem /Users/buildslave/jenkins/workspace/test-suite-verify-machineinstrs-x86_64-O3/compiler/lib/clang/10.0.0/include -internal-externc-isystem /Applications/Xcode.app/Contents/Developer/Platforms/MacOSX.platform/Developer/SDKs/MacOSX10.14.sdk/usr/include -O3 -Wno-unused-command-line-argument -Werror=date-time -w -fdebug-compilation-dir /Users/buildslave/jenkins/workspace/test-suite-verify-machineinstrs-x86_64-O3/test-suite-build -ferror-limit 19 -fmessage-length 0 -stack-protector 1 -fblocks -fencode-extended-block-signature -fregister-global-dtors-with-atexit -fgnuc-version=4.2.1 -fobjc-runtime=macosx-10.14.0 -fmax-type-align=16 -fdiagnostics-show-option -vectorize-loops -vectorize-slp -mllvm -verify-machineinstrs -o MultiSource/Benchmarks/MiBench/consumer-typeset/CMakeFiles/consumer-typeset.dir/z19.c.o -x c /Users/buildslave/jenkins/workspace/test-suite-verify-machineinstrs-x86_64-O3/test-suite/MultiSource/Benchmarks/MiBench/consumer-typeset/z19.c 
1.	<eof> parser at end of file
2.	Per-module optimization passes
3.	Running pass 'Function Pass Manager' on module '/Users/buildslave/jenkins/workspace/test-suite-verify-machineinstrs-x86_64-O3/test-suite/MultiSource/Benchmarks/MiBench/consumer-typeset/z19.c'.
4.	Running pass 'Combine redundant instructions' on function '@SearchGalley'
0  clang-10                 0x00000001031503c8 llvm::sys::PrintStackTrace(llvm::raw_ostream&) + 40
1  clang-10                 0x000000010314f545 llvm::sys::RunSignalHandlers() + 85
2  clang-10                 0x00000001031509dc SignalHandler(int) + 268
3  libsystem_platform.dylib 0x00007fff6009bb3d _sigtramp + 29
4  libsystem_platform.dylib 000000000000000000 _sigtramp + 18446603338904913120
5  libsystem_c.dylib        0x00007fff5ff5a1c9 abort + 127
6  libsystem_c.dylib        0x00007fff5ff22868 basename_r + 0
7  clang-10                 0x0000000102bb9fa0 llvm::InstCombiner::foldVectorBinop(llvm::BinaryOperator&) + 0
8  clang-10                 0x0000000102bc528b llvm::InstCombineWorklist::AddUsersToWorkList(llvm::Instruction&) + 43
9  clang-10                 0x0000000102bb8ae2 llvm::InstCombiner::replaceInstUsesWith(llvm::Instruction&, llvm::Value*) + 50
10 clang-10                 0x0000000102c18e84 llvm::InstCombiner::optimizeBitCastFromPhi(llvm::CastInst&, llvm::PHINode*) + 3204
11 clang-10                 0x0000000102c1a3f5 llvm::InstCombiner::visitBitCast(llvm::BitCastInst&) + 4581
12 clang-10                 0x0000000102bc39e5 llvm::InstCombiner::run() + 1365
13 clang-10                 0x0000000102bc685b combineInstructionsOverFunction(llvm::Function&, llvm::InstCombineWorklist&, llvm::AAResults*, llvm::AssumptionCache&, llvm::TargetLibraryInfo&, llvm::DominatorTree&, llvm::OptimizationRemarkEmitter&, llvm::BlockFrequencyInfo*, llvm::ProfileSummaryInfo*, bool, unsigned int, llvm::LoopInfo*) + 4443
14 clang-10                 0x0000000102bc7239 llvm::InstructionCombiningPass::runOnFunction(llvm::Function&) + 937
15 clang-10                 0x0000000102a29faa llvm::FPPassManager::runOnFunction(llvm::Function&) + 826
16 clang-10                 0x0000000102a2a2f3 llvm::FPPassManager::runOnModule(llvm::Module&) + 67
17 clang-10                 0x0000000102a2a7c6 llvm::legacy::PassManagerImpl::run(llvm::Module&) + 902
18 clang-10                 0x000000010337ebff clang::EmitBackendOutput(clang::DiagnosticsEngine&, clang::HeaderSearchOptions const&, clang::CodeGenOptions const&, clang::TargetOptions const&, clang::LangOptions const&, llvm::DataLayout const&, llvm::Module*, clang::BackendAction, std::__1::unique_ptr<llvm::raw_pwrite_stream, std::__1::default_delete<llvm::raw_pwrite_stream> >) + 14959
19 clang-10                 0x000000010362e07c clang::BackendConsumer::HandleTranslationUnit(clang::ASTContext&) + 1100
20 clang-10                 0x00000001045d8453 clang::ParseAST(clang::Sema&, bool, bool) + 643
21 clang-10                 0x00000001038e3004 clang::FrontendAction::Execute() + 84
22 clang-10                 0x000000010388df25 clang::CompilerInstance::ExecuteAction(clang::FrontendAction&) + 1573
23 clang-10                 0x00000001039597bf clang::ExecuteCompilerInvocation(clang::CompilerInstance*) + 1759
24 clang-10                 0x00000001013f3e26 cc1_main(llvm::ArrayRef<char const*>, char const*, void*) + 2438
25 clang-10                 0x00000001013f1543 main + 10931
26 libdyld.dylib            0x00007fff5feb2085 start + 1
clang-10: error: unable to execute command: Abort trap: 6
clang-10: error: clang frontend command failed due to signal (use -v to see invocation)
clang version 10.0.0 (https://github.com/llvm/llvm-project.git ff429c5eaf79529aacdc15582c90c0915080e082)
Target: x86_64-apple-darwin18.0.0
Thread model: posix
InstalledDir: /Users/buildslave/jenkins/workspace/test-suite-verify-machineinstrs-x86_64-O3/compiler/bin
clang-10: note: diagnostic msg: PLEASE submit a bug report to https://bugs.llvm.org/ and include the crash backtrace, preprocessed source, and associated run script.
clang-10: note: diagnostic msg: 
********************

Hide Details

PLEASE ATTACH THE FOLLOWING FILES TO THE BUG REPORT: Preprocessed source(s) and associated run script(s) are located at: clang-10: note: diagnostic msg: /var/folders/09/r4vw4v8n5kb67jl66zvlbljw0000gn/T/z19-cde687.c clang-10: note: diagnostic msg: /var/folders/09/r4vw4v8n5kb67jl66zvlbljw0000gn/T/z19-cde687.sh clang-10: note: diagnostic msg: Crash backtrace is located in clang-10: note: diagnostic msg: /Users/buildslave/Library/Logs/DiagnosticReports/clang-10_<YYYY-MM-DD-HHMMSS>_<hostname>.crash clang-10: note: diagnostic msg: (choose the .crash file that corresponds to your crash) clang-10: note: diagnostic msg:

Hide Details

******************** [7671/7672] /Users/buildslave/jenkins/workspace/test-suite-verify-machineinstrs-x86_64-O3/test-suite-build/tools/timeit --summary MultiSource/Benchmarks/MiBench/consumer-typeset/CMakeFiles/consumer-typeset.dir/z03.c.o.time /Users/buildslave/jenkins/workspace/test-suite-verify-machineinstrs-x86_64-O3/compiler/bin/clang -DNDEBUG -B /Applications/Xcode.app/Contents/Developer/Toolchains/XcodeDefault.xctoolchain/usr/bin -Wno-unused-command-line-argument -mllvm -verify-machineinstrs -O3 -arch x86_64 -isysroot /Applications/Xcode.app/Contents/Developer/Platforms/MacOSX.platform/Developer/SDKs/MacOSX10.14.sdk -w -Werror=date-time -DOS_UNIX=1 -DOS_DOS=0 -DOS_MAC=0 -DDB_FIX=0 -DUSE_STAT=1 -DSAFE_DFT=0 -DCOLLATE=1 -DLIB_DIR=\"lout.lib\" -DFONT_DIR=\"font\" -DMAPS_DIR=\"maps\" -DINCL_DIR=\"include\" -DDATA_DIR=\"data\" -DHYPH_DIR=\"hyph\" -DLOCALE_DIR=\"locale\" -DCHAR_IN=1 -DCHAR_OUT=0 -DLOCALE_ON=1 -DASSERT_ON=1 -DDEBUG_ON=0 -DPDF_COMPRESSION=0 -D_FORTIFY_SOURCE=0 -MD -MT MultiSource/Benchmarks/MiBench/consumer-typeset/CMakeFiles/consumer-typeset.dir/z03.c.o -MF MultiSource/Benchmarks/MiBench/consumer-typeset/CMakeFiles/consumer-typeset.dir/z03.c.o.d -o MultiSource/Benchmarks/MiBench/consumer-typeset/CMakeFiles/consumer-typeset.dir/z03.c.o -c /Users/buildslave/jenkins/workspace/test-suite-verify-machineinstrs-x86_64-O3/test-suite/MultiSource/Benchmarks/MiBench/consumer-typeset/z03.c FAILED: MultiSource/Benchmarks/MiBench/consumer-typeset/CMakeFiles/consumer-typeset.dir/z03.c.o /Users/buildslave/jenkins/workspace/test-suite-verify-machineinstrs-x86_64-O3/test-suite-build/tools/timeit --summary MultiSource/Benchmarks/MiBench/consumer-typeset/CMakeFiles/consumer-typeset.dir/z03.c.o.time /Users/buildslave/jenkins/workspace/test-suite-verify-machineinstrs-x86_64-O3/compiler/bin/clang -DNDEBUG -B /Applications/Xcode.app/Contents/Developer/Toolchains/XcodeDefault.xctoolchain/usr/bin -Wno-unused-command-line-argument -mllvm -verify-machineinstrs -O3 -arch x86_64 -isysroot /Applications/Xcode.app/Contents/Developer/Platforms/MacOSX.platform/Developer/SDKs/MacOSX10.14.sdk -w -Werror=date-time -DOS_UNIX=1 -DOS_DOS=0 -DOS_MAC=0 -DDB_FIX=0 -DUSE_STAT=1 -DSAFE_DFT=0 -DCOLLATE=1 -DLIB_DIR=\"lout.lib\" -DFONT_DIR=\"font\" -DMAPS_DIR=\"maps\" -DINCL_DIR=\"include\" -DDATA_DIR=\"data\" -DHYPH_DIR=\"hyph\" -DLOCALE_DIR=\"locale\" -DCHAR_IN=1 -DCHAR_OUT=0 -DLOCALE_ON=1 -DASSERT_ON=1 -DDEBUG_ON=0 -DPDF_COMPRESSION=0 -D_FORTIFY_SOURCE=0 -MD -MT MultiSource/Benchmarks/MiBench/consumer-typeset/CMakeFiles/consumer-typeset.dir/z03.c.o -MF MultiSource/Benchmarks/MiBench/consumer-typeset/CMakeFiles/consumer-typeset.dir/z03.c.o.d -o MultiSource/Benchmarks/MiBench/consumer-typeset/CMakeFiles/consumer-typeset.dir/z03.c.o -c /Users/buildslave/jenkins/workspace/test-suite-verify-machineinstrs-x86_64-O3/test-suite/MultiSource/Benchmarks/MiBench/consumer-typeset/z03.c Assertion failed: (N <= capacity()), function set_size, file /Users/buildslave/jenkins/workspace/clang-stage1-RA/llvm-project/llvm/include/llvm/ADT/SmallVector.h, line 67. Stack dump: 0. Program arguments: /Users/buildslave/jenkins/workspace/test-suite-verify-machineinstrs-x86_64-O3/compiler/bin/clang-10 -cc1 -triple x86_64-apple-macosx10.14.0 -Wdeprecated-objc-isa-usage -Werror=deprecated-objc-isa-usage -emit-obj -disable-free -main-file-name z03.c -mrelocation-model pic -pic-level 2 -mthread-model posix -mframe-pointer=all -fno-rounding-math -masm-verbose -munwind-tables -target-sdk-version=10.14 -target-cpu penryn -dwarf-column-info -debugger-tuning=lldb -target-linker-version 409.12 -resource-dir /Users/buildslave/jenkins/workspace/test-suite-verify-machineinstrs-x86_64-O3/compiler/lib/clang/10.0.0 -dependency-file MultiSource/Benchmarks/MiBench/consumer-typeset/CMakeFiles/consumer-typeset.dir/z03.c.o.d -MT MultiSource/Benchmarks/MiBench/consumer-typeset/CMakeFiles/consumer-typeset.dir/z03.c.o -sys-header-deps -isysroot /Applications/Xcode.app/Contents/Developer/Platforms/MacOSX.platform/Developer/SDKs/MacOSX10.14.sdk -D NDEBUG -D OS_UNIX=1 -D OS_DOS=0 -D OS_MAC=0 -D DB_FIX=0 -D USE_STAT=1 -D SAFE_DFT=0 -D COLLATE=1 -D LIB_DIR="lout.lib" -D FONT_DIR="font" -D MAPS_DIR="maps" -D INCL_DIR="include" -D DATA_DIR="data" -D HYPH_DIR="hyph" -D LOCALE_DIR="locale" -D CHAR_IN=1 -D CHAR_OUT=0 -D LOCALE_ON=1 -D ASSERT_ON=1 -D DEBUG_ON=0 -D PDF_COMPRESSION=0 -D _FORTIFY_SOURCE=0 -internal-isystem /Applications/Xcode.app/Contents/Developer/Platforms/MacOSX.platform/Developer/SDKs/MacOSX10.14.sdk/usr/local/include -internal-isystem /Users/buildslave/jenkins/workspace/test-suite-verify-machineinstrs-x86_64-O3/compiler/lib/clang/10.0.0/include -internal-externc-isystem /Applications/Xcode.app/Contents/Developer/Platforms/MacOSX.platform/Developer/SDKs/MacOSX10.14.sdk/usr/include -O3 -Wno-unused-command-line-argument -Werror=date-time -w -fdebug-compilation-dir /Users/buildslave/jenkins/workspace/test-suite-verify-machineinstrs-x86_64-O3/test-suite-build -ferror-limit 19 -fmessage-length 0 -stack-protector 1 -fblocks -fencode-extended-block-signature -fregister-global-dtors-with-atexit -fgnuc-version=4.2.1 -fobjc-runtime=macosx-10.14.0 -fmax-type-align=16 -fdiagnostics-show-option -vectorize-loops -vectorize-slp -mllvm -verify-machineinstrs -o MultiSource/Benchmarks/MiBench/consumer-typeset/CMakeFiles/consumer-typeset.dir/z03.c.o -x c /Users/buildslave/jenkins/workspace/test-suite-verify-machineinstrs-x86_64-O3/test-suite/MultiSource/Benchmarks/MiBench/consumer-typeset/z03.c 1. <eof> parser at end of file 2. Per-module optimization passes 3. Running pass 'Function Pass Manager' on module '/Users/buildslave/jenkins/workspace/test-suite-verify-machineinstrs-x86_64-O3/test-suite/MultiSource/Benchmarks/MiBench/consumer-typeset/z03.c'. 4. Running pass 'Combine redundant instructions' on function '@SearchPath' 0 clang-10 0x000000010fe473c8 llvm::sys::PrintStackTrace(llvm::raw_ostream&) + 40 1 clang-10 0x000000010fe46545 llvm::sys::RunSignalHandlers() + 85 2 clang-10 0x000000010fe479dc SignalHandler(int) + 268 3 libsystem_platform.dylib 0x00007fff6009bb3d _sigtramp + 29 4 libsystem_platform.dylib 000000000000000000 _sigtramp + 18446603338904913120 5 libsystem_c.dylib 0x00007fff5ff5a1c9 abort + 127 6 libsystem_c.dylib 0x00007fff5ff22868 basename_r + 0 7 clang-10 0x000000010f8b0fa0 llvm::InstCombiner::foldVectorBinop(llvm::BinaryOperator&) + 0 8 clang-10 0x000000010f8bc28b llvm::InstCombineWorklist::AddUsersToWorkList(llvm::Instruction&) + 43 9 clang-10 0x000000010f8afae2 llvm::InstCombiner::replaceInstUsesWith(llvm::Instruction&, llvm::Value*) + 50 10 clang-10 0x000000010f90fe84 llvm::InstCombiner::optimizeBitCastFromPhi(llvm::CastInst&, llvm::PHINode*) + 3204 11 clang-10 0x000000010f9113f5 llvm::InstCombiner::visitBitCast(llvm::BitCastInst&) + 4581 12 clang-10 0x000000010f8ba9e5 llvm::InstCombiner::run() + 1365 13 clang-10 0x000000010f8bd85b combineInstructionsOverFunction(llvm::Function&, llvm::InstCombineWorklist&, llvm::AAResults*, llvm::AssumptionCache&, llvm::TargetLibraryInfo&, llvm::DominatorTree&, llvm::OptimizationRemarkEmitter&, llvm::BlockFrequencyInfo*, llvm::ProfileSummaryInfo*, bool, unsigned int, llvm::LoopInfo*) + 4443 14 clang-10 0x000000010f8be239 llvm::InstructionCombiningPass::runOnFunction(llvm::Function&) + 937 15 clang-10 0x000000010f720faa llvm::FPPassManager::runOnFunction(llvm::Function&) + 826 16 clang-10 0x000000010f7212f3 llvm::FPPassManager::runOnModule(llvm::Module&) + 67 17 clang-10 0x000000010f7217c6 llvm::legacy::PassManagerImpl::run(llvm::Module&) + 902 18 clang-10 0x0000000110075bff clang::EmitBackendOutput(clang::DiagnosticsEngine&, clang::HeaderSearchOptions const&, clang::CodeGenOptions const&, clang::TargetOptions const&, clang::LangOptions const&, llvm::DataLayout const&, llvm::Module*, clang::BackendAction, std::__1::unique_ptr<llvm::raw_pwrite_stream, std::__1::default_delete<llvm::raw_pwrite_stream> >) + 14959 19 clang-10 0x000000011032507c clang::BackendConsumer::HandleTranslationUnit(clang::ASTContext&) + 1100 20 clang-10 0x00000001112cf453 clang::ParseAST(clang::Sema&, bool, bool) + 643 21 clang-10 0x00000001105da004 clang::FrontendAction::Execute() + 84 22 clang-10 0x0000000110584f25 clang::CompilerInstance::ExecuteAction(clang::FrontendAction&) + 1573 23 clang-10 0x00000001106507bf clang::ExecuteCompilerInvocation(clang::CompilerInstance*) + 1759 24 clang-10 0x000000010e0eae26 cc1_main(llvm::ArrayRef<char const*>, char const*, void*) + 2438 25 clang-10 0x000000010e0e8543 main + 10931 26 libdyld.dylib 0x00007fff5feb2085 start + 1 clang-10: error: unable to execute command: Abort trap: 6 clang-10: error: clang frontend command failed due to signal (use -v to see invocation) clang version 10.0.0 (https://github.com/llvm/llvm-project.git ff429c5eaf79529aacdc15582c90c0915080e082) Target: x86_64-apple-darwin18.0.0 Thread model: posix InstalledDir: /Users/buildslave/jenkins/workspace/test-suite-verify-machineinstrs-x86_64-O3/compiler/bin clang-10: note: diagnostic msg: PLEASE submit a bug report to https://bugs.llvm.org/ and include the crash backtrace, preprocessed source, and associated run script. clang-10: note: diagnostic msg: ********************

Hide Details

PLEASE ATTACH THE FOLLOWING FILES TO THE BUG REPORT: Preprocessed source(s) and associated run script(s) are located at: clang-10: note: diagnostic msg: /var/folders/09/r4vw4v8n5kb67jl66zvlbljw0000gn/T/z03-baf2b8.c clang-10: note: diagnostic msg: /var/folders/09/r4vw4v8n5kb67jl66zvlbljw0000gn/T/z03-baf2b8.sh clang-10: note: diagnostic msg: Crash backtrace is located in clang-10: note: diagnostic msg: /Users/buildslave/Library/Logs/DiagnosticReports/clang-10_<YYYY-MM-DD-HHMMSS>_<hostname>.crash clang-10: note: diagnostic msg: (choose the .crash file that corresponds to your crash) clang-10: note: diagnostic msg:

Hide Details

******************** ninja: build stopped: cannot make progress due to previous errors. *Build failed!* (return code 1) [Pipeline] } [Pipeline] // stage [Pipeline] stage [Pipeline] { (post) [Pipeline] sh + curl http://labmaster2:8080/green/job/test-suite-verify-machineinstrs-x86_64-O3/6569/consoleText -s + config/zorg/jenkins/inspect_log.py [Pipeline] readFile [Pipeline] readTrusted [Pipeline] } [Pipeline] // stage [Pipeline] } [Pipeline] // node sh: line 1: 87914 Terminated: 15 sleep 3 [Pipeline] End of Pipeline java.io.IOException: error=24, Too many open files at java.lang.UNIXProcess.forkAndExec(Native Method) at java.lang.UNIXProcess.<init>(UNIXProcess.java:247) at java.lang.ProcessImpl.start(ProcessImpl.java:134) at java.lang.ProcessBuilder.start(ProcessBuilder.java:1029) Caused: java.io.IOException: Cannot run program "git" (in directory "/Users/Shared/Jenkins/Home/caches/git-3fa462dcefbe3aa069c6330cbefe32bf"): error=24, Too many open files at java.lang.ProcessBuilder.start(ProcessBuilder.java:1048) at hudson.Proc$LocalProc.<init>(Proc.java:249) at hudson.Proc$LocalProc.<init>(Proc.java:218) at hudson.Launcher$LocalLauncher.launch(Launcher.java:937) at hudson.Launcher$ProcStarter.start(Launcher.java:455) at org.jenkinsci.plugins.gitclient.CliGitAPIImpl.launchCommandIn(CliGitAPIImpl.java:2168) Caused: hudson.plugins.git.GitException: Error performing command: git init /Users/Shared/Jenkins/Home/caches/git-3fa462dcefbe3aa069c6330cbefe32bf at org.jenkinsci.plugins.gitclient.CliGitAPIImpl.launchCommandIn(CliGitAPIImpl.java:2179) at org.jenkinsci.plugins.gitclient.CliGitAPIImpl.launchCommandIn(CliGitAPIImpl.java:2140) at org.jenkinsci.plugins.gitclient.CliGitAPIImpl.launchCommandIn(CliGitAPIImpl.java:2136) at org.jenkinsci.plugins.gitclient.CliGitAPIImpl.launchCommand(CliGitAPIImpl.java:1741) at org.jenkinsci.plugins.gitclient.CliGitAPIImpl$5.execute(CliGitAPIImpl.java:914) Caused: hudson.plugins.git.GitException: Could not init /Users/Shared/Jenkins/Home/caches/git-3fa462dcefbe3aa069c6330cbefe32bf at org.jenkinsci.plugins.gitclient.CliGitAPIImpl$5.execute(CliGitAPIImpl.java:916) at org.jenkinsci.plugins.gitclient.CliGitAPIImpl.init(CliGitAPIImpl.java:315) at hudson.plugins.git.GitAPI.init(GitAPI.java:217) at jenkins.plugins.git.GitSCMFileSystem$BuilderImpl.build(GitSCMFileSystem.java:336) at jenkins.scm.api.SCMFileSystem.of(SCMFileSystem.java:197) at jenkins.scm.api.SCMFileSystem.of(SCMFileSystem.java:173) at org.jenkinsci.plugins.workflow.multibranch.ReadTrustedStep$Execution.run(ReadTrustedStep.java:101) at org.jenkinsci.plugins.workflow.multibranch.ReadTrustedStep$Execution.run(ReadTrustedStep.java:82) at org.jenkinsci.plugins.workflow.steps.AbstractSynchronousNonBlockingStepExecution$1$1.call(AbstractSynchronousNonBlockingStepExecution.java:47) at hudson.security.ACL.impersonate(ACL.java:290) at org.jenkinsci.plugins.workflow.steps.AbstractSynchronousNonBlockingStepExecution$1.run(AbstractSynchronousNonBlockingStepExecution.java:44) at java.util.concurrent.Executors$RunnableAdapter.call(Executors.java:511) at java.util.concurrent.FutureTask.run(FutureTask.java:266) at java.util.concurrent.ThreadPoolExecutor.runWorker(ThreadPoolExecutor.java:1149) at java.util.concurrent.ThreadPoolExecutor$Worker.run(ThreadPoolExecutor.java:624) at java.lang.Thread.run(Thread.java:748) Finished: FAILURE