Started 1 hr 20 min ago
Took 1 hr 14 min

Failed Build clang-d362233-g31c7a2fd5c9-t13305-b13305.tar.gz (Aug 3, 2020 9:32:26 AM)

Issues

Found 3 issues:
Ninja target: aarch64_neon_intrinsics.c.o
[3501/11531] /Users/buildslave/jenkins/workspace/test-suite-verify-machineinstrs-aarch64-globalisel-O0-g/test-suite-build/tools/timeit --summary Bitcode/simd_ops/CMakeFiles/simd_ops_test_op_ld4_129.dir/AArch64_scalar_tests/scalar_test_op_ld4_129.bc.o.time /Users/buildslave/jenkins/workspace/test-suite-verify-machineinstrs-aarch64-globalisel-O0-g/compiler/bin/clang++  -DNDEBUG  -B /Applications/Xcode.app/Contents/Developer/Toolchains/XcodeDefault.xctoolchain/usr/bin    -Wno-unused-command-line-argument -mllvm -verify-machineinstrs -O0 -g -arch arm64 -isysroot /Applications/Xcode.app/Contents/Developer/Platforms/iPhoneOS.platform/Developer/SDKs/iPhoneOS13.5.sdk   -w -Werror=date-time -MD -MT Bitcode/simd_ops/CMakeFiles/simd_ops_test_op_ld4_129.dir/AArch64_scalar_tests/scalar_test_op_ld4_129.bc.o -MF Bitcode/simd_ops/CMakeFiles/simd_ops_test_op_ld4_129.dir/AArch64_scalar_tests/scalar_test_op_ld4_129.bc.o.d -o Bitcode/simd_ops/CMakeFiles/simd_ops_test_op_ld4_129.dir/AArch64_scalar_tests/scalar_test_op_ld4_129.bc.o -c /Users/buildslave/jenkins/workspace/test-suite-verify-machineinstrs-aarch64-globalisel-O0-g/test-suite/Bitcode/simd_ops/AArch64_scalar_tests/scalar_test_op_ld4_129.bc
[3502/11531] /Users/buildslave/jenkins/workspace/test-suite-verify-machineinstrs-aarch64-globalisel-O0-g/test-suite-build/tools/timeit --summary Bitcode/simd_ops/CMakeFiles/simd_ops_test_op_ld4_457.dir/AArch64_halide_runtime.bc.o.time /Users/buildslave/jenkins/workspace/test-suite-verify-machineinstrs-aarch64-globalisel-O0-g/compiler/bin/clang++  -DNDEBUG  -B /Applications/Xcode.app/Contents/Developer/Toolchains/XcodeDefault.xctoolchain/usr/bin    -Wno-unused-command-line-argument -mllvm -verify-machineinstrs -O0 -g -arch arm64 -isysroot /Applications/Xcode.app/Contents/Developer/Platforms/iPhoneOS.platform/Developer/SDKs/iPhoneOS13.5.sdk   -w -Werror=date-time -MD -MT Bitcode/simd_ops/CMakeFiles/simd_ops_test_op_ld4_457.dir/AArch64_halide_runtime.bc.o -MF Bitcode/simd_ops/CMakeFiles/simd_ops_test_op_ld4_457.dir/AArch64_halide_runtime.bc.o.d -o Bitcode/simd_ops/CMakeFiles/simd_ops_test_op_ld4_457.dir/AArch64_halide_runtime.bc.o -c /Users/buildslave/jenkins/workspace/test-suite-verify-machineinstrs-aarch64-globalisel-O0-g/test-suite/Bitcode/simd_ops/AArch64_halide_runtime.bc
[3503/11531] /Users/buildslave/jenkins/workspace/test-suite-verify-machineinstrs-aarch64-globalisel-O0-g/test-suite-build/tools/timeit --summary Bitcode/simd_ops/CMakeFiles/simd_ops_test_op_sqshrn_241.dir/AArch64_tests/test_op_sqshrn_241.bc.o.time /Users/buildslave/jenkins/workspace/test-suite-verify-machineinstrs-aarch64-globalisel-O0-g/compiler/bin/clang++  -DNDEBUG  -B /Applications/Xcode.app/Contents/Developer/Toolchains/XcodeDefault.xctoolchain/usr/bin    -Wno-unused-command-line-argument -mllvm -verify-machineinstrs -O0 -g -arch arm64 -isysroot /Applications/Xcode.app/Contents/Developer/Platforms/iPhoneOS.platform/Developer/SDKs/iPhoneOS13.5.sdk   -w -Werror=date-time -MD -MT Bitcode/simd_ops/CMakeFiles/simd_ops_test_op_sqshrn_241.dir/AArch64_tests/test_op_sqshrn_241.bc.o -MF Bitcode/simd_ops/CMakeFiles/simd_ops_test_op_sqshrn_241.dir/AArch64_tests/test_op_sqshrn_241.bc.o.d -o Bitcode/simd_ops/CMakeFiles/simd_ops_test_op_sqshrn_241.dir/AArch64_tests/test_op_sqshrn_241.bc.o -c /Users/buildslave/jenkins/workspace/test-suite-verify-machineinstrs-aarch64-globalisel-O0-g/test-suite/Bitcode/simd_ops/AArch64_tests/test_op_sqshrn_241.bc
[3504/11531] /Users/buildslave/jenkins/workspace/test-suite-verify-machineinstrs-aarch64-globalisel-O0-g/test-suite-build/tools/timeit --summary Bitcode/simd_ops/CMakeFiles/simd_ops_test_op_uqadd_218.dir/AArch64_halide_runtime.bc.o.time /Users/buildslave/jenkins/workspace/test-suite-verify-machineinstrs-aarch64-globalisel-O0-g/compiler/bin/clang++  -DNDEBUG  -B /Applications/Xcode.app/Contents/Developer/Toolchains/XcodeDefault.xctoolchain/usr/bin    -Wno-unused-command-line-argument -mllvm -verify-machineinstrs -O0 -g -arch arm64 -isysroot /Applications/Xcode.app/Contents/Developer/Platforms/iPhoneOS.platform/Developer/SDKs/iPhoneOS13.5.sdk   -w -Werror=date-time -MD -MT Bitcode/simd_ops/CMakeFiles/simd_ops_test_op_uqadd_218.dir/AArch64_halide_runtime.bc.o -MF Bitcode/simd_ops/CMakeFiles/simd_ops_test_op_uqadd_218.dir/AArch64_halide_runtime.bc.o.d -o Bitcode/simd_ops/CMakeFiles/simd_ops_test_op_uqadd_218.dir/AArch64_halide_runtime.bc.o -c /Users/buildslave/jenkins/workspace/test-suite-verify-machineinstrs-aarch64-globalisel-O0-g/test-suite/Bitcode/simd_ops/AArch64_halide_runtime.bc
[3505/11531] /Users/buildslave/jenkins/workspace/test-suite-verify-machineinstrs-aarch64-globalisel-O0-g/test-suite-build/tools/timeit --summary SingleSource/UnitTests/Vector/AArch64/CMakeFiles/aarch64_neon_intrinsics.dir/aarch64_neon_intrinsics.c.o.time /Users/buildslave/jenkins/workspace/test-suite-verify-machineinstrs-aarch64-globalisel-O0-g/compiler/bin/clang -DNDEBUG  -B /Applications/Xcode.app/Contents/Developer/Toolchains/XcodeDefault.xctoolchain/usr/bin    -Wno-unused-command-line-argument -mllvm -verify-machineinstrs -O0 -g -arch arm64 -isysroot /Applications/Xcode.app/Contents/Developer/Platforms/iPhoneOS.platform/Developer/SDKs/iPhoneOS13.5.sdk   -w -Werror=date-time -std=c99 -MD -MT SingleSource/UnitTests/Vector/AArch64/CMakeFiles/aarch64_neon_intrinsics.dir/aarch64_neon_intrinsics.c.o -MF SingleSource/UnitTests/Vector/AArch64/CMakeFiles/aarch64_neon_intrinsics.dir/aarch64_neon_intrinsics.c.o.d -o SingleSource/UnitTests/Vector/AArch64/CMakeFiles/aarch64_neon_intrinsics.dir/aarch64_neon_intrinsics.c.o   -c /Users/buildslave/jenkins/workspace/test-suite-verify-machineinstrs-aarch64-globalisel-O0-g/test-suite/SingleSource/UnitTests/Vector/AArch64/aarch64_neon_intrinsics.c
FAILED: SingleSource/UnitTests/Vector/AArch64/CMakeFiles/aarch64_neon_intrinsics.dir/aarch64_neon_intrinsics.c.o 
/Users/buildslave/jenkins/workspace/test-suite-verify-machineinstrs-aarch64-globalisel-O0-g/test-suite-build/tools/timeit --summary SingleSource/UnitTests/Vector/AArch64/CMakeFiles/aarch64_neon_intrinsics.dir/aarch64_neon_intrinsics.c.o.time /Users/buildslave/jenkins/workspace/test-suite-verify-machineinstrs-aarch64-globalisel-O0-g/compiler/bin/clang -DNDEBUG  -B /Applications/Xcode.app/Contents/Developer/Toolchains/XcodeDefault.xctoolchain/usr/bin    -Wno-unused-command-line-argument -mllvm -verify-machineinstrs -O0 -g -arch arm64 -isysroot /Applications/Xcode.app/Contents/Developer/Platforms/iPhoneOS.platform/Developer/SDKs/iPhoneOS13.5.sdk   -w -Werror=date-time -std=c99 -MD -MT SingleSource/UnitTests/Vector/AArch64/CMakeFiles/aarch64_neon_intrinsics.dir/aarch64_neon_intrinsics.c.o -MF SingleSource/UnitTests/Vector/AArch64/CMakeFiles/aarch64_neon_intrinsics.dir/aarch64_neon_intrinsics.c.o.d -o SingleSource/UnitTests/Vector/AArch64/CMakeFiles/aarch64_neon_intrinsics.dir/aarch64_neon_intrinsics.c.o   -c /Users/buildslave/jenkins/workspace/test-suite-verify-machineinstrs-aarch64-globalisel-O0-g/test-suite/SingleSource/UnitTests/Vector/AArch64/aarch64_neon_intrinsics.c
fatal error: error in backend: Cannot select: intrinsic %llvm.aarch64.neon.fcvtzs
Fatal Error: error in backend: Cannot select: intrinsic %llvm.aarch64.neon.fcvtzs
[3503/11531] /Users/buildslave/jenkins/workspace/test-suite-verify-machineinstrs-aarch64-globalisel-O0-g/test-suite-build/tools/timeit --summary Bitcode/simd_ops/CMakeFiles/simd_ops_test_op_sqshrn_241.dir/AArch64_tests/test_op_sqshrn_241.bc.o.time /Users/buildslave/jenkins/workspace/test-suite-verify-machineinstrs-aarch64-globalisel-O0-g/compiler/bin/clang++  -DNDEBUG  -B /Applications/Xcode.app/Contents/Developer/Toolchains/XcodeDefault.xctoolchain/usr/bin    -Wno-unused-command-line-argument -mllvm -verify-machineinstrs -O0 -g -arch arm64 -isysroot /Applications/Xcode.app/Contents/Developer/Platforms/iPhoneOS.platform/Developer/SDKs/iPhoneOS13.5.sdk   -w -Werror=date-time -MD -MT Bitcode/simd_ops/CMakeFiles/simd_ops_test_op_sqshrn_241.dir/AArch64_tests/test_op_sqshrn_241.bc.o -MF Bitcode/simd_ops/CMakeFiles/simd_ops_test_op_sqshrn_241.dir/AArch64_tests/test_op_sqshrn_241.bc.o.d -o Bitcode/simd_ops/CMakeFiles/simd_ops_test_op_sqshrn_241.dir/AArch64_tests/test_op_sqshrn_241.bc.o -c /Users/buildslave/jenkins/workspace/test-suite-verify-machineinstrs-aarch64-globalisel-O0-g/test-suite/Bitcode/simd_ops/AArch64_tests/test_op_sqshrn_241.bc
[3504/11531] /Users/buildslave/jenkins/workspace/test-suite-verify-machineinstrs-aarch64-globalisel-O0-g/test-suite-build/tools/timeit --summary Bitcode/simd_ops/CMakeFiles/simd_ops_test_op_uqadd_218.dir/AArch64_halide_runtime.bc.o.time /Users/buildslave/jenkins/workspace/test-suite-verify-machineinstrs-aarch64-globalisel-O0-g/compiler/bin/clang++  -DNDEBUG  -B /Applications/Xcode.app/Contents/Developer/Toolchains/XcodeDefault.xctoolchain/usr/bin    -Wno-unused-command-line-argument -mllvm -verify-machineinstrs -O0 -g -arch arm64 -isysroot /Applications/Xcode.app/Contents/Developer/Platforms/iPhoneOS.platform/Developer/SDKs/iPhoneOS13.5.sdk   -w -Werror=date-time -MD -MT Bitcode/simd_ops/CMakeFiles/simd_ops_test_op_uqadd_218.dir/AArch64_halide_runtime.bc.o -MF Bitcode/simd_ops/CMakeFiles/simd_ops_test_op_uqadd_218.dir/AArch64_halide_runtime.bc.o.d -o Bitcode/simd_ops/CMakeFiles/simd_ops_test_op_uqadd_218.dir/AArch64_halide_runtime.bc.o -c /Users/buildslave/jenkins/workspace/test-suite-verify-machineinstrs-aarch64-globalisel-O0-g/test-suite/Bitcode/simd_ops/AArch64_halide_runtime.bc
[3505/11531] /Users/buildslave/jenkins/workspace/test-suite-verify-machineinstrs-aarch64-globalisel-O0-g/test-suite-build/tools/timeit --summary SingleSource/UnitTests/Vector/AArch64/CMakeFiles/aarch64_neon_intrinsics.dir/aarch64_neon_intrinsics.c.o.time /Users/buildslave/jenkins/workspace/test-suite-verify-machineinstrs-aarch64-globalisel-O0-g/compiler/bin/clang -DNDEBUG  -B /Applications/Xcode.app/Contents/Developer/Toolchains/XcodeDefault.xctoolchain/usr/bin    -Wno-unused-command-line-argument -mllvm -verify-machineinstrs -O0 -g -arch arm64 -isysroot /Applications/Xcode.app/Contents/Developer/Platforms/iPhoneOS.platform/Developer/SDKs/iPhoneOS13.5.sdk   -w -Werror=date-time -std=c99 -MD -MT SingleSource/UnitTests/Vector/AArch64/CMakeFiles/aarch64_neon_intrinsics.dir/aarch64_neon_intrinsics.c.o -MF SingleSource/UnitTests/Vector/AArch64/CMakeFiles/aarch64_neon_intrinsics.dir/aarch64_neon_intrinsics.c.o.d -o SingleSource/UnitTests/Vector/AArch64/CMakeFiles/aarch64_neon_intrinsics.dir/aarch64_neon_intrinsics.c.o   -c /Users/buildslave/jenkins/workspace/test-suite-verify-machineinstrs-aarch64-globalisel-O0-g/test-suite/SingleSource/UnitTests/Vector/AArch64/aarch64_neon_intrinsics.c
FAILED: SingleSource/UnitTests/Vector/AArch64/CMakeFiles/aarch64_neon_intrinsics.dir/aarch64_neon_intrinsics.c.o 
/Users/buildslave/jenkins/workspace/test-suite-verify-machineinstrs-aarch64-globalisel-O0-g/test-suite-build/tools/timeit --summary SingleSource/UnitTests/Vector/AArch64/CMakeFiles/aarch64_neon_intrinsics.dir/aarch64_neon_intrinsics.c.o.time /Users/buildslave/jenkins/workspace/test-suite-verify-machineinstrs-aarch64-globalisel-O0-g/compiler/bin/clang -DNDEBUG  -B /Applications/Xcode.app/Contents/Developer/Toolchains/XcodeDefault.xctoolchain/usr/bin    -Wno-unused-command-line-argument -mllvm -verify-machineinstrs -O0 -g -arch arm64 -isysroot /Applications/Xcode.app/Contents/Developer/Platforms/iPhoneOS.platform/Developer/SDKs/iPhoneOS13.5.sdk   -w -Werror=date-time -std=c99 -MD -MT SingleSource/UnitTests/Vector/AArch64/CMakeFiles/aarch64_neon_intrinsics.dir/aarch64_neon_intrinsics.c.o -MF SingleSource/UnitTests/Vector/AArch64/CMakeFiles/aarch64_neon_intrinsics.dir/aarch64_neon_intrinsics.c.o.d -o SingleSource/UnitTests/Vector/AArch64/CMakeFiles/aarch64_neon_intrinsics.dir/aarch64_neon_intrinsics.c.o   -c /Users/buildslave/jenkins/workspace/test-suite-verify-machineinstrs-aarch64-globalisel-O0-g/test-suite/SingleSource/UnitTests/Vector/AArch64/aarch64_neon_intrinsics.c
fatal error: error in backend: Cannot select: intrinsic %llvm.aarch64.neon.fcvtzs
PLEASE submit a bug report to https://bugs.llvm.org/ and include the crash backtrace, preprocessed source, and associated run script.
Stack dump:
Error: clang frontend command failed with exit code 70 (use -v to see invocation)
31 clang         0x00000001036c7c2d clang::driver::Compilation::ExecuteCommand(clang::driver::Command const&, clang::driver::Command const*&) const + 221
32 clang         0x00000001036c804d clang::driver::Compilation::ExecuteJobs(clang::driver::JobList const&, llvm::SmallVectorImpl<std::__1::pair<int, clang::driver::Command const*> >&) const + 125
33 clang         0x00000001036dc63c clang::driver::Driver::ExecuteCompilation(clang::driver::Compilation&, llvm::SmallVectorImpl<std::__1::pair<int, clang::driver::Command const*> >&) + 204
34 clang         0x000000010124ccd5 main + 10389
35 libdyld.dylib 0x00007fff696f7cc9 start + 1
clang-12: error: clang frontend command failed with exit code 70 (use -v to see invocation)
clang version 12.0.0 (https://github.com/llvm/llvm-project.git 31c7a2fd5c9a5b980768bd06354517d99ac8fe87)
Target: aarch64-apple-darwin19.5.0

Build Log

Changes
  1. [InstCombine] reduce xor-of-or's bitwise logic (PR46955); 2nd try (details)
  2. [NFC][APInt][DenseMapInfo] Move DenseMapAPIntKeyInfo into DenseMap.h as DenseMapInfo<APInt> (details)
  3. [DWARFYAML] Implement the .debug_loclists section. (details)
  4. [analyzer][tests] Fix SATest update functionality (details)
  5. [FPEnv] Don't transform FSUB(-0,X)->FNEG(X) in SelectionDAGBuilder. (details)

Started by upstream project relay-test-suite-verify-machineinstrs build number 8527
originally caused by:

This run spent:

  • 58 min waiting;
  • 1 hr 14 min build duration;
  • 1 hr 14 min total from scheduled to completion.
Revision: 876b25ef8b5d00888ed99df4586db7870760f5f5
  • refs/remotes/origin/master
Revision: 31c7a2fd5c9a5b980768bd06354517d99ac8fe87
  • detached
Revision: 554f0722ae0daaab3abb7fd2205a9f00ce787cf0
  • refs/remotes/origin/master
Revision: fcb9c5033da6654740fb885300fabbf25713aab1
  • refs/remotes/origin/master

Identified problems

Compile Error

This build failed because of a compile error. Below is a list of all errors in the build log:
Indication 1

Ninja target failed

Below is a link to the first failed ninja target.
Indication 2