Started 25 days ago
Took 1 hr 14 min

Failed Build clang-d379621-g9325b8da1702-t18562-b18562.tar.gz (Feb 11, 2021 12:40:36 AM)

Issues

Found 3 issues:
Ninja target: PowerParser.cc.o
[3530/7672] : && /Users/buildslave/jenkins/workspace/test-suite-verify-machineinstrs-x86_64h-O3/test-suite-build/tools/timeit --summary MultiSource/Benchmarks/DOE-ProxyApps-C/RSBench/rsbench.link.time /Users/buildslave/jenkins/workspace/test-suite-verify-machineinstrs-x86_64h-O3/compiler/bin/clang -B /Applications/Xcode.app/Contents/Developer/Toolchains/XcodeDefault.xctoolchain/usr/bin    -Wno-unused-command-line-argument -mllvm -verify-machineinstrs -O3 -arch x86_64h -isysroot /Applications/Xcode.app/Contents/Developer/Platforms/MacOSX.platform/Developer/SDKs/MacOSX10.15.sdk -Wl,-search_paths_first -Wl,-headerpad_max_install_names -B /Applications/Xcode.app/Contents/Developer/Toolchains/XcodeDefault.xctoolchain/usr/bin MultiSource/Benchmarks/DOE-ProxyApps-C/RSBench/CMakeFiles/rsbench.dir/glibc_compat_rand.c.o MultiSource/Benchmarks/DOE-ProxyApps-C/RSBench/CMakeFiles/rsbench.dir/init.c.o MultiSource/Benchmarks/DOE-ProxyApps-C/RSBench/CMakeFiles/rsbench.dir/io.c.o MultiSource/Benchmarks/DOE-ProxyApps-C/RSBench/CMakeFiles/rsbench.dir/main.c.o MultiSource/Benchmarks/DOE-ProxyApps-C/RSBench/CMakeFiles/rsbench.dir/material.c.o MultiSource/Benchmarks/DOE-ProxyApps-C/RSBench/CMakeFiles/rsbench.dir/utils.c.o MultiSource/Benchmarks/DOE-ProxyApps-C/RSBench/CMakeFiles/rsbench.dir/xs_kernel.c.o  -o MultiSource/Benchmarks/DOE-ProxyApps-C/RSBench/rsbench  -Wl,-no_pie -lm && cd /Users/buildslave/jenkins/workspace/test-suite-verify-machineinstrs-x86_64h-O3/test-suite-build/MultiSource/Benchmarks/DOE-ProxyApps-C/RSBench && /usr/local/Cellar/cmake/3.17.2/bin/cmake -E create_symlink /Users/buildslave/jenkins/workspace/test-suite-verify-machineinstrs-x86_64h-O3/test-suite/MultiSource/Benchmarks/DOE-ProxyApps-C/RSBench/rsbench.reference_output /Users/buildslave/jenkins/workspace/test-suite-verify-machineinstrs-x86_64h-O3/test-suite-build/MultiSource/Benchmarks/DOE-ProxyApps-C/RSBench/rsbench.reference_output
[3531/7672] /Users/buildslave/jenkins/workspace/test-suite-verify-machineinstrs-x86_64h-O3/test-suite-build/tools/timeit --summary MultiSource/Benchmarks/DOE-ProxyApps-C/SimpleMOC/CMakeFiles/SimpleMOC.dir/io.c.o.time /Users/buildslave/jenkins/workspace/test-suite-verify-machineinstrs-x86_64h-O3/compiler/bin/clang -DNDEBUG  -B /Applications/Xcode.app/Contents/Developer/Toolchains/XcodeDefault.xctoolchain/usr/bin    -Wno-unused-command-line-argument -mllvm -verify-machineinstrs -O3 -arch x86_64h -isysroot /Applications/Xcode.app/Contents/Developer/Platforms/MacOSX.platform/Developer/SDKs/MacOSX10.15.sdk   -w -Werror=date-time -std=gnu99 -MD -MT MultiSource/Benchmarks/DOE-ProxyApps-C/SimpleMOC/CMakeFiles/SimpleMOC.dir/io.c.o -MF MultiSource/Benchmarks/DOE-ProxyApps-C/SimpleMOC/CMakeFiles/SimpleMOC.dir/io.c.o.d -o MultiSource/Benchmarks/DOE-ProxyApps-C/SimpleMOC/CMakeFiles/SimpleMOC.dir/io.c.o   -c /Users/buildslave/jenkins/workspace/test-suite-verify-machineinstrs-x86_64h-O3/test-suite/MultiSource/Benchmarks/DOE-ProxyApps-C/SimpleMOC/io.c
[3532/7672] /Users/buildslave/jenkins/workspace/test-suite-verify-machineinstrs-x86_64h-O3/test-suite-build/tools/timeit --summary MultiSource/Benchmarks/DOE-ProxyApps-C/SimpleMOC/CMakeFiles/SimpleMOC.dir/test.c.o.time /Users/buildslave/jenkins/workspace/test-suite-verify-machineinstrs-x86_64h-O3/compiler/bin/clang -DNDEBUG  -B /Applications/Xcode.app/Contents/Developer/Toolchains/XcodeDefault.xctoolchain/usr/bin    -Wno-unused-command-line-argument -mllvm -verify-machineinstrs -O3 -arch x86_64h -isysroot /Applications/Xcode.app/Contents/Developer/Platforms/MacOSX.platform/Developer/SDKs/MacOSX10.15.sdk   -w -Werror=date-time -std=gnu99 -MD -MT MultiSource/Benchmarks/DOE-ProxyApps-C/SimpleMOC/CMakeFiles/SimpleMOC.dir/test.c.o -MF MultiSource/Benchmarks/DOE-ProxyApps-C/SimpleMOC/CMakeFiles/SimpleMOC.dir/test.c.o.d -o MultiSource/Benchmarks/DOE-ProxyApps-C/SimpleMOC/CMakeFiles/SimpleMOC.dir/test.c.o   -c /Users/buildslave/jenkins/workspace/test-suite-verify-machineinstrs-x86_64h-O3/test-suite/MultiSource/Benchmarks/DOE-ProxyApps-C/SimpleMOC/test.c
[3533/7672] /Users/buildslave/jenkins/workspace/test-suite-verify-machineinstrs-x86_64h-O3/test-suite-build/tools/timeit --summary MultiSource/Benchmarks/DOE-ProxyApps-C/miniGMG/CMakeFiles/miniGMG.dir/operators.ompif.c.o.time /Users/buildslave/jenkins/workspace/test-suite-verify-machineinstrs-x86_64h-O3/compiler/bin/clang -DNDEBUG  -B /Applications/Xcode.app/Contents/Developer/Toolchains/XcodeDefault.xctoolchain/usr/bin    -Wno-unused-command-line-argument -mllvm -verify-machineinstrs -O3 -arch x86_64h -isysroot /Applications/Xcode.app/Contents/Developer/Platforms/MacOSX.platform/Developer/SDKs/MacOSX10.15.sdk   -w -Werror=date-time -D__PRINT_NORM -MD -MT MultiSource/Benchmarks/DOE-ProxyApps-C/miniGMG/CMakeFiles/miniGMG.dir/operators.ompif.c.o -MF MultiSource/Benchmarks/DOE-ProxyApps-C/miniGMG/CMakeFiles/miniGMG.dir/operators.ompif.c.o.d -o MultiSource/Benchmarks/DOE-ProxyApps-C/miniGMG/CMakeFiles/miniGMG.dir/operators.ompif.c.o   -c /Users/buildslave/jenkins/workspace/test-suite-verify-machineinstrs-x86_64h-O3/test-suite/MultiSource/Benchmarks/DOE-ProxyApps-C/miniGMG/operators.ompif.c
[3534/7672] /Users/buildslave/jenkins/workspace/test-suite-verify-machineinstrs-x86_64h-O3/test-suite-build/tools/timeit --summary MultiSource/Benchmarks/DOE-ProxyApps-C++/CLAMR/CMakeFiles/CLAMR.dir/PowerParser.cc.o.time /Users/buildslave/jenkins/workspace/test-suite-verify-machineinstrs-x86_64h-O3/compiler/bin/clang++  -DNDEBUG  -B /Applications/Xcode.app/Contents/Developer/Toolchains/XcodeDefault.xctoolchain/usr/bin    -Wno-unused-command-line-argument -mllvm -verify-machineinstrs -O3 -arch x86_64h -isysroot /Applications/Xcode.app/Contents/Developer/Platforms/MacOSX.platform/Developer/SDKs/MacOSX10.15.sdk   -w -Werror=date-time -MD -MT MultiSource/Benchmarks/DOE-ProxyApps-C++/CLAMR/CMakeFiles/CLAMR.dir/PowerParser.cc.o -MF MultiSource/Benchmarks/DOE-ProxyApps-C++/CLAMR/CMakeFiles/CLAMR.dir/PowerParser.cc.o.d -o MultiSource/Benchmarks/DOE-ProxyApps-C++/CLAMR/CMakeFiles/CLAMR.dir/PowerParser.cc.o -c /Users/buildslave/jenkins/workspace/test-suite-verify-machineinstrs-x86_64h-O3/test-suite/MultiSource/Benchmarks/DOE-ProxyApps-C++/CLAMR/PowerParser.cc
FAILED: MultiSource/Benchmarks/DOE-ProxyApps-C++/CLAMR/CMakeFiles/CLAMR.dir/PowerParser.cc.o 
/Users/buildslave/jenkins/workspace/test-suite-verify-machineinstrs-x86_64h-O3/test-suite-build/tools/timeit --summary MultiSource/Benchmarks/DOE-ProxyApps-C++/CLAMR/CMakeFiles/CLAMR.dir/PowerParser.cc.o.time /Users/buildslave/jenkins/workspace/test-suite-verify-machineinstrs-x86_64h-O3/compiler/bin/clang++  -DNDEBUG  -B /Applications/Xcode.app/Contents/Developer/Toolchains/XcodeDefault.xctoolchain/usr/bin    -Wno-unused-command-line-argument -mllvm -verify-machineinstrs -O3 -arch x86_64h -isysroot /Applications/Xcode.app/Contents/Developer/Platforms/MacOSX.platform/Developer/SDKs/MacOSX10.15.sdk   -w -Werror=date-time -MD -MT MultiSource/Benchmarks/DOE-ProxyApps-C++/CLAMR/CMakeFiles/CLAMR.dir/PowerParser.cc.o -MF MultiSource/Benchmarks/DOE-ProxyApps-C++/CLAMR/CMakeFiles/CLAMR.dir/PowerParser.cc.o.d -o MultiSource/Benchmarks/DOE-ProxyApps-C++/CLAMR/CMakeFiles/CLAMR.dir/PowerParser.cc.o -c /Users/buildslave/jenkins/workspace/test-suite-verify-machineinstrs-x86_64h-O3/test-suite/MultiSource/Benchmarks/DOE-ProxyApps-C++/CLAMR/PowerParser.cc
Instruction does not dominate all uses!
Fatal Error: error in backend: Broken function found, compilation aborted!
/Users/buildslave/jenkins/workspace/test-suite-verify-machineinstrs-x86_64h-O3/test-suite-build/tools/timeit --summary MultiSource/Benchmarks/DOE-ProxyApps-C++/CLAMR/CMakeFiles/CLAMR.dir/PowerParser.cc.o.time /Users/buildslave/jenkins/workspace/test-suite-verify-machineinstrs-x86_64h-O3/compiler/bin/clang++  -DNDEBUG  -B /Applications/Xcode.app/Contents/Developer/Toolchains/XcodeDefault.xctoolchain/usr/bin    -Wno-unused-command-line-argument -mllvm -verify-machineinstrs -O3 -arch x86_64h -isysroot /Applications/Xcode.app/Contents/Developer/Platforms/MacOSX.platform/Developer/SDKs/MacOSX10.15.sdk   -w -Werror=date-time -MD -MT MultiSource/Benchmarks/DOE-ProxyApps-C++/CLAMR/CMakeFiles/CLAMR.dir/PowerParser.cc.o -MF MultiSource/Benchmarks/DOE-ProxyApps-C++/CLAMR/CMakeFiles/CLAMR.dir/PowerParser.cc.o.d -o MultiSource/Benchmarks/DOE-ProxyApps-C++/CLAMR/CMakeFiles/CLAMR.dir/PowerParser.cc.o -c /Users/buildslave/jenkins/workspace/test-suite-verify-machineinstrs-x86_64h-O3/test-suite/MultiSource/Benchmarks/DOE-ProxyApps-C++/CLAMR/PowerParser.cc
Instruction does not dominate all uses!
  %math = extractvalue { i64, i1 } %87, 0
  %indvars.iv = phi i64 [ %38, %for.body21.preheader ], [ %math, %_ZNSt3__112basic_stringIcNS_11char_traitsIcEENS_9allocatorIcEEED1Ev.exit148 ]
in function _ZN2PP11PowerParser17remove_dup_scalarEi
fatal error: error in backend: Broken function found, compilation aborted!
PLEASE submit a bug report to https://bugs.llvm.org/ and include the crash backtrace, preprocessed source, and associated run script.
Stack dump:
Error: clang frontend command failed with exit code 70 (use -v to see invocation)
25 clang++       0x000000010db3c83d clang::driver::Compilation::ExecuteCommand(clang::driver::Command const&, clang::driver::Command const*&) const + 221
26 clang++       0x000000010db3cd6d clang::driver::Compilation::ExecuteJobs(clang::driver::JobList const&, llvm::SmallVectorImpl<std::__1::pair<int, clang::driver::Command const*> >&) const + 125
27 clang++       0x000000010db5330c clang::driver::Driver::ExecuteCompilation(clang::driver::Compilation&, llvm::SmallVectorImpl<std::__1::pair<int, clang::driver::Command const*> >&) + 204
28 clang++       0x000000010b3ff11b main + 10251
29 libdyld.dylib 0x00007fff71684cc9 start + 1
clang-13: error: clang frontend command failed with exit code 70 (use -v to see invocation)
clang version 13.0.0 (https://github.com/llvm/llvm-project.git 9325b8da1702238f15f837b6e07f099baf4dcd94)
Target: x86_64h-apple-darwin19.5.0

Build Log

Changes
  1. NFC comment-only cleanups (details)
  2. NFC; fix typo in comment (details)
  3. [NFC] Don't pass redundant arguments (details)
  4. [mlir][Linalg] Add conv ops with TF definition. (details)

Started by upstream project relay-test-suite-verify-machineinstrs build number 9266
originally caused by:

This run spent:

  • 50 min waiting;
  • 1 hr 14 min build duration;
  • 1 hr 14 min total from scheduled to completion.
Revision: a5620382beb1d8c12232790aec476837e382c315
  • refs/remotes/origin/main
Revision: 9325b8da1702238f15f837b6e07f099baf4dcd94
  • detached
Revision: f48d431f44610e339d00a33d57564c6029c4ff43
  • refs/remotes/origin/main
Revision: efb2e01b23f098f82bab3701c983d41711a2a3bb
  • refs/remotes/origin/main

Identified problems

Ninja target failed

Below is a link to the first failed ninja target.
Indication 1

Compile Error

This build failed because of a compile error. Below is a list of all errors in the build log:
Indication 2