FailedConsole Output

Skipping 1,034 KB.. Full Log
eFiles/RTSanitizerCommonLibc.iossim.dir/sanitizer_allocator_checks.cpp.o projects/compiler-rt/lib/sanitizer_common/CMakeFiles/RTSanitizerCommonLibc.iossim.dir/sanitizer_linux_libcdep.cpp.o projects/compiler-rt/lib/sanitizer_common/CMakeFiles/RTSanitizerCommonLibc.iossim.dir/sanitizer_mac_libcdep.cpp.o projects/compiler-rt/lib/sanitizer_common/CMakeFiles/RTSanitizerCommonLibc.iossim.dir/sanitizer_posix_libcdep.cpp.o projects/compiler-rt/lib/sanitizer_common/CMakeFiles/RTSanitizerCommonLibc.iossim.dir/sanitizer_stoptheworld_linux_libcdep.cpp.o projects/compiler-rt/lib/sanitizer_common/CMakeFiles/RTSanitizerCommonLibc.iossim.dir/sanitizer_stoptheworld_netbsd_libcdep.cpp.o projects/compiler-rt/lib/sanitizer_common/CMakeFiles/RTSanitizerCommonCoverage.iossim.dir/sancov_flags.cpp.o projects/compiler-rt/lib/sanitizer_common/CMakeFiles/RTSanitizerCommonCoverage.iossim.dir/sanitizer_coverage_fuchsia.cpp.o projects/compiler-rt/lib/sanitizer_common/CMakeFiles/RTSanitizerCommonCoverage.iossim.dir/sanitizer_coverage_libcdep_new.cpp.o projects/compiler-rt/lib/sanitizer_common/CMakeFiles/RTSanitizerCommonCoverage.iossim.dir/sanitizer_coverage_win_sections.cpp.o projects/compiler-rt/lib/sanitizer_common/CMakeFiles/RTSanitizerCommonSymbolizer.iossim.dir/sanitizer_allocator_report.cpp.o projects/compiler-rt/lib/sanitizer_common/CMakeFiles/RTSanitizerCommonSymbolizer.iossim.dir/sanitizer_stackdepot.cpp.o projects/compiler-rt/lib/sanitizer_common/CMakeFiles/RTSanitizerCommonSymbolizer.iossim.dir/sanitizer_stacktrace.cpp.o projects/compiler-rt/lib/sanitizer_common/CMakeFiles/RTSanitizerCommonSymbolizer.iossim.dir/sanitizer_stacktrace_libcdep.cpp.o projects/compiler-rt/lib/sanitizer_common/CMakeFiles/RTSanitizerCommonSymbolizer.iossim.dir/sanitizer_stacktrace_printer.cpp.o projects/compiler-rt/lib/sanitizer_common/CMakeFiles/RTSanitizerCommonSymbolizer.iossim.dir/sanitizer_stacktrace_sparc.cpp.o projects/compiler-rt/lib/sanitizer_common/CMakeFiles/RTSanitizerCommonSymbolizer.iossim.dir/sanitizer_symbolizer.cpp.o projects/compiler-rt/lib/sanitizer_common/CMakeFiles/RTSanitizerCommonSymbolizer.iossim.dir/sanitizer_symbolizer_libbacktrace.cpp.o projects/compiler-rt/lib/sanitizer_common/CMakeFiles/RTSanitizerCommonSymbolizer.iossim.dir/sanitizer_symbolizer_libcdep.cpp.o projects/compiler-rt/lib/sanitizer_common/CMakeFiles/RTSanitizerCommonSymbolizer.iossim.dir/sanitizer_symbolizer_mac.cpp.o projects/compiler-rt/lib/sanitizer_common/CMakeFiles/RTSanitizerCommonSymbolizer.iossim.dir/sanitizer_symbolizer_markup.cpp.o projects/compiler-rt/lib/sanitizer_common/CMakeFiles/RTSanitizerCommonSymbolizer.iossim.dir/sanitizer_symbolizer_posix_libcdep.cpp.o projects/compiler-rt/lib/sanitizer_common/CMakeFiles/RTSanitizerCommonSymbolizer.iossim.dir/sanitizer_symbolizer_report.cpp.o projects/compiler-rt/lib/sanitizer_common/CMakeFiles/RTSanitizerCommonSymbolizer.iossim.dir/sanitizer_symbolizer_win.cpp.o projects/compiler-rt/lib/sanitizer_common/CMakeFiles/RTSanitizerCommonSymbolizer.iossim.dir/sanitizer_unwind_linux_libcdep.cpp.o projects/compiler-rt/lib/sanitizer_common/CMakeFiles/RTSanitizerCommonSymbolizer.iossim.dir/sanitizer_unwind_win.cpp.o projects/compiler-rt/lib/lsan/CMakeFiles/RTLSanCommon.iossim.dir/lsan_common.cpp.o projects/compiler-rt/lib/lsan/CMakeFiles/RTLSanCommon.iossim.dir/lsan_common_fuchsia.cpp.o projects/compiler-rt/lib/lsan/CMakeFiles/RTLSanCommon.iossim.dir/lsan_common_linux.cpp.o projects/compiler-rt/lib/lsan/CMakeFiles/RTLSanCommon.iossim.dir/lsan_common_mac.cpp.o projects/compiler-rt/lib/ubsan/CMakeFiles/RTUbsan.iossim.dir/ubsan_diag.cpp.o projects/compiler-rt/lib/ubsan/CMakeFiles/RTUbsan.iossim.dir/ubsan_init.cpp.o projects/compiler-rt/lib/ubsan/CMakeFiles/RTUbsan.iossim.dir/ubsan_flags.cpp.o projects/compiler-rt/lib/ubsan/CMakeFiles/RTUbsan.iossim.dir/ubsan_handlers.cpp.o projects/compiler-rt/lib/ubsan/CMakeFiles/RTUbsan.iossim.dir/ubsan_monitor.cpp.o projects/compiler-rt/lib/ubsan/CMakeFiles/RTUbsan.iossim.dir/ubsan_value.cpp.o projects/compiler-rt/lib/ubsan/CMakeFiles/RTUbsan.iossim.dir/ubsan_handlers_cxx.cpp.o projects/compiler-rt/lib/ubsan/CMakeFiles/RTUbsan.iossim.dir/ubsan_type_hash.cpp.o projects/compiler-rt/lib/ubsan/CMakeFiles/RTUbsan.iossim.dir/ubsan_type_hash_itanium.cpp.o projects/compiler-rt/lib/ubsan/CMakeFiles/RTUbsan.iossim.dir/ubsan_type_hash_win.cpp.o  -Wl,-rpath,@loader_path/../lib && cd /Users/buildslave/jenkins/workspace/lldb-cmake/lldb-build/lib/clang/12.0.99/lib/darwin && codesign --sign - /Users/buildslave/jenkins/workspace/lldb-cmake/lldb-build/lib/clang/12.0.99/lib/darwin/libclang_rt.asan_iossim_dynamic.dylib
[475/3587] /Users/buildslave/jenkins/workspace/lldb-cmake/host-compiler/bin/clang++  -DASAN_DYNAMIC=1 -D_DEBUG -D__STDC_CONSTANT_MACROS -D__STDC_FORMAT_MACROS -D__STDC_LIMIT_MACROS -Iprojects/compiler-rt/lib/asan -I/Users/buildslave/jenkins/workspace/lldb-cmake/llvm-project/compiler-rt/lib/asan -I/Applications/Xcode.app/Contents/Developer/Platforms/MacOSX.platform/Developer/SDKs/MacOSX10.15.sdk/usr/include/libxml2 -Iinclude -I/Users/buildslave/jenkins/workspace/lldb-cmake/llvm-project/llvm/include -I/Users/buildslave/jenkins/workspace/lldb-cmake/llvm-project/compiler-rt/lib/asan/.. -Wdocumentation -fPIC -fvisibility-inlines-hidden -Werror=date-time -Werror=unguarded-availability-new -fmodules -fmodules-cache-path=/Users/buildslave/jenkins/workspace/lldb-cmake/lldb-build/module.cache -fcxx-modules -Xclang -fmodules-local-submodule-visibility -Wall -Wextra -Wno-unused-parameter -Wwrite-strings -Wcast-qual -Wmissing-field-initializers -pedantic -Wno-long-long -Wimplicit-fallthrough -Wcovered-switch-default -Wno-noexcept-type -Wnon-virtual-dtor -Wdelete-non-virtual-dtor -Wsuggest-override -Wstring-conversion -fdiagnostics-color -Wall -std=c++14 -Wno-unused-parameter -O3  -arch x86_64 -arch x86_64h -isysroot /Applications/Xcode.app/Contents/Developer/Platforms/MacOSX.platform/Developer/SDKs/MacOSX10.15.sdk    -stdlib=libc++ -mmacosx-version-min=10.10 -isysroot /Applications/Xcode.app/Contents/Developer/Platforms/MacOSX.platform/Developer/SDKs/MacOSX10.15.sdk -fPIC -fno-builtin -fno-exceptions -funwind-tables -fno-stack-protector -fno-sanitize=safe-stack -fvisibility=hidden -fno-lto -O3 -gline-tables-only -fno-modules -Wno-gnu -Wno-variadic-macros -Wno-c99-extensions -Wno-non-virtual-dtor -fno-rtti -ftls-model=initial-exec -UNDEBUG -std=c++14 -MD -MT projects/compiler-rt/lib/asan/CMakeFiles/RTAsan_dynamic.osx.dir/asan_interceptors.cpp.o -MF projects/compiler-rt/lib/asan/CMakeFiles/RTAsan_dynamic.osx.dir/asan_interceptors.cpp.o.d -o projects/compiler-rt/lib/asan/CMakeFiles/RTAsan_dynamic.osx.dir/asan_interceptors.cpp.o -c /Users/buildslave/jenkins/workspace/lldb-cmake/llvm-project/compiler-rt/lib/asan/asan_interceptors.cpp
clang-12: warning: argument unused during compilation: '-fmodules-cache-path=/Users/buildslave/jenkins/workspace/lldb-cmake/lldb-build/module.cache' [-Wunused-command-line-argument]
clang-12: warning: argument unused during compilation: '-fcxx-modules' [-Wunused-command-line-argument]
[476/3587] : && /Users/buildslave/jenkins/workspace/lldb-cmake/host-compiler/bin/clang++ -Wdocumentation -fPIC -fvisibility-inlines-hidden -Werror=date-time -Werror=unguarded-availability-new -fmodules -fmodules-cache-path=/Users/buildslave/jenkins/workspace/lldb-cmake/lldb-build/module.cache -fcxx-modules -Xclang -fmodules-local-submodule-visibility -Wall -Wextra -Wno-unused-parameter -Wwrite-strings -Wcast-qual -Wmissing-field-initializers -pedantic -Wno-long-long -Wimplicit-fallthrough -Wcovered-switch-default -Wno-noexcept-type -Wnon-virtual-dtor -Wdelete-non-virtual-dtor -Wsuggest-override -Wstring-conversion -fdiagnostics-color -Wall -std=c++14 -Wno-unused-parameter -O3 -arch x86_64 -arch x86_64h -isysroot /Applications/Xcode.app/Contents/Developer/Platforms/MacOSX.platform/Developer/SDKs/MacOSX10.15.sdk -dynamiclib -Wl,-headerpad_max_install_names -stdlib=libc++ -lc++ -lc++abi -fapplication-extension -mmacosx-version-min=10.10 -isysroot /Applications/Xcode.app/Contents/Developer/Platforms/MacOSX.platform/Developer/SDKs/MacOSX10.15.sdk -Wl,-U,___asan_default_options -Wl,-U,___asan_default_suppressions -Wl,-U,___asan_on_error -Wl,-U,___asan_set_shadow_00 -Wl,-U,___asan_set_shadow_f1 -Wl,-U,___asan_set_shadow_f2 -Wl,-U,___asan_set_shadow_f3 -Wl,-U,___asan_set_shadow_f4 -Wl,-U,___asan_set_shadow_f5 -Wl,-U,___asan_set_shadow_f6 -Wl,-U,___asan_set_shadow_f7 -Wl,-U,___asan_set_shadow_f8 -Wl,-U,___lsan_default_options -Wl,-U,___lsan_default_suppressions -Wl,-U,___lsan_is_turned_off -Wl,-U,___ubsan_default_options -Wl,-U,___sanitizer_free_hook -Wl,-U,___sanitizer_malloc_hook -Wl,-U,___sanitizer_report_error_summary -Wl,-U,___sanitizer_sandbox_on_notify -Wl,-U,___sanitizer_symbolize_code -Wl,-U,___sanitizer_symbolize_data -Wl,-U,___sanitizer_symbolize_demangle -Wl,-U,___sanitizer_symbolize_flush -Wl,-U,___start_xray_fn_idx -Wl,-U,___start_xray_instr_map -Wl,-U,___stop_xray_fn_idx -Wl,-U,___stop_xray_instr_map -o lib/clang/12.0.99/lib/darwin/libclang_rt.asan_osx_dynamic.dylib -install_name @rpath/libclang_rt.asan_osx_dynamic.dylib projects/compiler-rt/lib/asan/CMakeFiles/RTAsan_dynamic.osx.dir/asan_allocator.cpp.o projects/compiler-rt/lib/asan/CMakeFiles/RTAsan_dynamic.osx.dir/asan_activation.cpp.o projects/compiler-rt/lib/asan/CMakeFiles/RTAsan_dynamic.osx.dir/asan_debugging.cpp.o projects/compiler-rt/lib/asan/CMakeFiles/RTAsan_dynamic.osx.dir/asan_descriptions.cpp.o projects/compiler-rt/lib/asan/CMakeFiles/RTAsan_dynamic.osx.dir/asan_errors.cpp.o projects/compiler-rt/lib/asan/CMakeFiles/RTAsan_dynamic.osx.dir/asan_fake_stack.cpp.o projects/compiler-rt/lib/asan/CMakeFiles/RTAsan_dynamic.osx.dir/asan_flags.cpp.o projects/compiler-rt/lib/asan/CMakeFiles/RTAsan_dynamic.osx.dir/asan_fuchsia.cpp.o projects/compiler-rt/lib/asan/CMakeFiles/RTAsan_dynamic.osx.dir/asan_globals.cpp.o projects/compiler-rt/lib/asan/CMakeFiles/RTAsan_dynamic.osx.dir/asan_globals_win.cpp.o projects/compiler-rt/lib/asan/CMakeFiles/RTAsan_dynamic.osx.dir/asan_interceptors.cpp.o projects/compiler-rt/lib/asan/CMakeFiles/RTAsan_dynamic.osx.dir/asan_interceptors_memintrinsics.cpp.o projects/compiler-rt/lib/asan/CMakeFiles/RTAsan_dynamic.osx.dir/asan_linux.cpp.o projects/compiler-rt/lib/asan/CMakeFiles/RTAsan_dynamic.osx.dir/asan_mac.cpp.o projects/compiler-rt/lib/asan/CMakeFiles/RTAsan_dynamic.osx.dir/asan_malloc_linux.cpp.o projects/compiler-rt/lib/asan/CMakeFiles/RTAsan_dynamic.osx.dir/asan_malloc_mac.cpp.o projects/compiler-rt/lib/asan/CMakeFiles/RTAsan_dynamic.osx.dir/asan_malloc_win.cpp.o projects/compiler-rt/lib/asan/CMakeFiles/RTAsan_dynamic.osx.dir/asan_memory_profile.cpp.o projects/compiler-rt/lib/asan/CMakeFiles/RTAsan_dynamic.osx.dir/asan_poisoning.cpp.o projects/compiler-rt/lib/asan/CMakeFiles/RTAsan_dynamic.osx.dir/asan_posix.cpp.o projects/compiler-rt/lib/asan/CMakeFiles/RTAsan_dynamic.osx.dir/asan_premap_shadow.cpp.o projects/compiler-rt/lib/asan/CMakeFiles/RTAsan_dynamic.osx.dir/asan_report.cpp.o projects/compiler-rt/lib/asan/CMakeFiles/RTAsan_dynamic.osx.dir/asan_rtems.cpp.o projects/compiler-rt/lib/asan/CMakeFiles/RTAsan_dynamic.osx.dir/asan_rtl.cpp.o projects/compiler-rt/lib/asan/CMakeFiles/RTAsan_dynamic.osx.dir/asan_shadow_setup.cpp.o projects/compiler-rt/lib/asan/CMakeFiles/RTAsan_dynamic.osx.dir/asan_stack.cpp.o projects/compiler-rt/lib/asan/CMakeFiles/RTAsan_dynamic.osx.dir/asan_stats.cpp.o projects/compiler-rt/lib/asan/CMakeFiles/RTAsan_dynamic.osx.dir/asan_suppressions.cpp.o projects/compiler-rt/lib/asan/CMakeFiles/RTAsan_dynamic.osx.dir/asan_thread.cpp.o projects/compiler-rt/lib/asan/CMakeFiles/RTAsan_dynamic.osx.dir/asan_win.cpp.o projects/compiler-rt/lib/asan/CMakeFiles/RTAsan_dynamic.osx.dir/asan_new_delete.cpp.o projects/compiler-rt/lib/interception/CMakeFiles/RTInterception.osx.dir/interception_linux.cpp.o projects/compiler-rt/lib/interception/CMakeFiles/RTInterception.osx.dir/interception_mac.cpp.o projects/compiler-rt/lib/interception/CMakeFiles/RTInterception.osx.dir/interception_win.cpp.o projects/compiler-rt/lib/interception/CMakeFiles/RTInterception.osx.dir/interception_type_test.cpp.o projects/compiler-rt/lib/sanitizer_common/CMakeFiles/RTSanitizerCommon.osx.dir/sanitizer_allocator.cpp.o projects/compiler-rt/lib/sanitizer_common/CMakeFiles/RTSanitizerCommon.osx.dir/sanitizer_common.cpp.o projects/compiler-rt/lib/sanitizer_common/CMakeFiles/RTSanitizerCommon.osx.dir/sanitizer_deadlock_detector1.cpp.o projects/compiler-rt/lib/sanitizer_common/CMakeFiles/RTSanitizerCommon.osx.dir/sanitizer_deadlock_detector2.cpp.o projects/compiler-rt/lib/sanitizer_common/CMakeFiles/RTSanitizerCommon.osx.dir/sanitizer_errno.cpp.o projects/compiler-rt/lib/sanitizer_common/CMakeFiles/RTSanitizerCommon.osx.dir/sanitizer_file.cpp.o projects/compiler-rt/lib/sanitizer_common/CMakeFiles/RTSanitizerCommon.osx.dir/sanitizer_flags.cpp.o projects/compiler-rt/lib/sanitizer_common/CMakeFiles/RTSanitizerCommon.osx.dir/sanitizer_flag_parser.cpp.o projects/compiler-rt/lib/sanitizer_common/CMakeFiles/RTSanitizerCommon.osx.dir/sanitizer_fuchsia.cpp.o projects/compiler-rt/lib/sanitizer_common/CMakeFiles/RTSanitizerCommon.osx.dir/sanitizer_libc.cpp.o projects/compiler-rt/lib/sanitizer_common/CMakeFiles/RTSanitizerCommon.osx.dir/sanitizer_libignore.cpp.o projects/compiler-rt/lib/sanitizer_common/CMakeFiles/RTSanitizerCommon.osx.dir/sanitizer_linux.cpp.o projects/compiler-rt/lib/sanitizer_common/CMakeFiles/RTSanitizerCommon.osx.dir/sanitizer_linux_s390.cpp.o projects/compiler-rt/lib/sanitizer_common/CMakeFiles/RTSanitizerCommon.osx.dir/sanitizer_mac.cpp.o projects/compiler-rt/lib/sanitizer_common/CMakeFiles/RTSanitizerCommon.osx.dir/sanitizer_netbsd.cpp.o projects/compiler-rt/lib/sanitizer_common/CMakeFiles/RTSanitizerCommon.osx.dir/sanitizer_openbsd.cpp.o projects/compiler-rt/lib/sanitizer_common/CMakeFiles/RTSanitizerCommon.osx.dir/sanitizer_persistent_allocator.cpp.o projects/compiler-rt/lib/sanitizer_common/CMakeFiles/RTSanitizerCommon.osx.dir/sanitizer_platform_limits_freebsd.cpp.o projects/compiler-rt/lib/sanitizer_common/CMakeFiles/RTSanitizerCommon.osx.dir/sanitizer_platform_limits_linux.cpp.o projects/compiler-rt/lib/sanitizer_common/CMakeFiles/RTSanitizerCommon.osx.dir/sanitizer_platform_limits_netbsd.cpp.o projects/compiler-rt/lib/sanitizer_common/CMakeFiles/RTSanitizerCommon.osx.dir/sanitizer_platform_limits_openbsd.cpp.o projects/compiler-rt/lib/sanitizer_common/CMakeFiles/RTSanitizerCommon.osx.dir/sanitizer_platform_limits_posix.cpp.o projects/compiler-rt/lib/sanitizer_common/CMakeFiles/RTSanitizerCommon.osx.dir/sanitizer_platform_limits_solaris.cpp.o projects/compiler-rt/lib/sanitizer_common/CMakeFiles/RTSanitizerCommon.osx.dir/sanitizer_posix.cpp.o projects/compiler-rt/lib/sanitizer_common/CMakeFiles/RTSanitizerCommon.osx.dir/sanitizer_printf.cpp.o projects/compiler-rt/lib/sanitizer_common/CMakeFiles/RTSanitizerCommon.osx.dir/sanitizer_procmaps_common.cpp.o projects/compiler-rt/lib/sanitizer_common/CMakeFiles/RTSanitizerCommon.osx.dir/sanitizer_procmaps_bsd.cpp.o projects/compiler-rt/lib/sanitizer_common/CMakeFiles/RTSanitizerCommon.osx.dir/sanitizer_procmaps_fuchsia.cpp.o projects/compiler-rt/lib/sanitizer_common/CMakeFiles/RTSanitizerCommon.osx.dir/sanitizer_procmaps_linux.cpp.o projects/compiler-rt/lib/sanitizer_common/CMakeFiles/RTSanitizerCommon.osx.dir/sanitizer_procmaps_mac.cpp.o projects/compiler-rt/lib/sanitizer_common/CMakeFiles/RTSanitizerCommon.osx.dir/sanitizer_procmaps_solaris.cpp.o projects/compiler-rt/lib/sanitizer_common/CMakeFiles/RTSanitizerCommon.osx.dir/sanitizer_rtems.cpp.o projects/compiler-rt/lib/sanitizer_common/CMakeFiles/RTSanitizerCommon.osx.dir/sanitizer_solaris.cpp.o projects/compiler-rt/lib/sanitizer_common/CMakeFiles/RTSanitizerCommon.osx.dir/sanitizer_stoptheworld_fuchsia.cpp.o projects/compiler-rt/lib/sanitizer_common/CMakeFiles/RTSanitizerCommon.osx.dir/sanitizer_stoptheworld_mac.cpp.o projects/compiler-rt/lib/sanitizer_common/CMakeFiles/RTSanitizerCommon.osx.dir/sanitizer_suppressions.cpp.o projects/compiler-rt/lib/sanitizer_common/CMakeFiles/RTSanitizerCommon.osx.dir/sanitizer_tls_get_addr.cpp.o projects/compiler-rt/lib/sanitizer_common/CMakeFiles/RTSanitizerCommon.osx.dir/sanitizer_thread_registry.cpp.o projects/compiler-rt/lib/sanitizer_common/CMakeFiles/RTSanitizerCommon.osx.dir/sanitizer_type_traits.cpp.o projects/compiler-rt/lib/sanitizer_common/CMakeFiles/RTSanitizerCommon.osx.dir/sanitizer_win.cpp.o projects/compiler-rt/lib/sanitizer_common/CMakeFiles/RTSanitizerCommon.osx.dir/sanitizer_termination.cpp.o projects/compiler-rt/lib/sanitizer_common/CMakeFiles/RTSanitizerCommonLibc.osx.dir/sanitizer_common_libcdep.cpp.o projects/compiler-rt/lib/sanitizer_common/CMakeFiles/RTSanitizerCommonLibc.osx.dir/sanitizer_allocator_checks.cpp.o projects/compiler-rt/lib/sanitizer_common/CMakeFiles/RTSanitizerCommonLibc.osx.dir/sanitizer_linux_libcdep.cpp.o projects/compiler-rt/lib/sanitizer_common/CMakeFiles/RTSanitizerCommonLibc.osx.dir/sanitizer_mac_libcdep.cpp.o projects/compiler-rt/lib/sanitizer_common/CMakeFiles/RTSanitizerCommonLibc.osx.dir/sanitizer_posix_libcdep.cpp.o projects/compiler-rt/lib/sanitizer_common/CMakeFiles/RTSanitizerCommonLibc.osx.dir/sanitizer_stoptheworld_linux_libcdep.cpp.o projects/compiler-rt/lib/sanitizer_common/CMakeFiles/RTSanitizerCommonLibc.osx.dir/sanitizer_stoptheworld_netbsd_libcdep.cpp.o projects/compiler-rt/lib/sanitizer_common/CMakeFiles/RTSanitizerCommonCoverage.osx.dir/sancov_flags.cpp.o projects/compiler-rt/lib/sanitizer_common/CMakeFiles/RTSanitizerCommonCoverage.osx.dir/sanitizer_coverage_fuchsia.cpp.o projects/compiler-rt/lib/sanitizer_common/CMakeFiles/RTSanitizerCommonCoverage.osx.dir/sanitizer_coverage_libcdep_new.cpp.o projects/compiler-rt/lib/sanitizer_common/CMakeFiles/RTSanitizerCommonCoverage.osx.dir/sanitizer_coverage_win_sections.cpp.o projects/compiler-rt/lib/sanitizer_common/CMakeFiles/RTSanitizerCommonSymbolizer.osx.dir/sanitizer_allocator_report.cpp.o projects/compiler-rt/lib/sanitizer_common/CMakeFiles/RTSanitizerCommonSymbolizer.osx.dir/sanitizer_stackdepot.cpp.o projects/compiler-rt/lib/sanitizer_common/CMakeFiles/RTSanitizerCommonSymbolizer.osx.dir/sanitizer_stacktrace.cpp.o projects/compiler-rt/lib/sanitizer_common/CMakeFiles/RTSanitizerCommonSymbolizer.osx.dir/sanitizer_stacktrace_libcdep.cpp.o projects/compiler-rt/lib/sanitizer_common/CMakeFiles/RTSanitizerCommonSymbolizer.osx.dir/sanitizer_stacktrace_printer.cpp.o projects/compiler-rt/lib/sanitizer_common/CMakeFiles/RTSanitizerCommonSymbolizer.osx.dir/sanitizer_stacktrace_sparc.cpp.o projects/compiler-rt/lib/sanitizer_common/CMakeFiles/RTSanitizerCommonSymbolizer.osx.dir/sanitizer_symbolizer.cpp.o projects/compiler-rt/lib/sanitizer_common/CMakeFiles/RTSanitizerCommonSymbolizer.osx.dir/sanitizer_symbolizer_libbacktrace.cpp.o projects/compiler-rt/lib/sanitizer_common/CMakeFiles/RTSanitizerCommonSymbolizer.osx.dir/sanitizer_symbolizer_libcdep.cpp.o projects/compiler-rt/lib/sanitizer_common/CMakeFiles/RTSanitizerCommonSymbolizer.osx.dir/sanitizer_symbolizer_mac.cpp.o projects/compiler-rt/lib/sanitizer_common/CMakeFiles/RTSanitizerCommonSymbolizer.osx.dir/sanitizer_symbolizer_markup.cpp.o projects/compiler-rt/lib/sanitizer_common/CMakeFiles/RTSanitizerCommonSymbolizer.osx.dir/sanitizer_symbolizer_posix_libcdep.cpp.o projects/compiler-rt/lib/sanitizer_common/CMakeFiles/RTSanitizerCommonSymbolizer.osx.dir/sanitizer_symbolizer_report.cpp.o projects/compiler-rt/lib/sanitizer_common/CMakeFiles/RTSanitizerCommonSymbolizer.osx.dir/sanitizer_symbolizer_win.cpp.o projects/compiler-rt/lib/sanitizer_common/CMakeFiles/RTSanitizerCommonSymbolizer.osx.dir/sanitizer_unwind_linux_libcdep.cpp.o projects/compiler-rt/lib/sanitizer_common/CMakeFiles/RTSanitizerCommonSymbolizer.osx.dir/sanitizer_unwind_win.cpp.o projects/compiler-rt/lib/lsan/CMakeFiles/RTLSanCommon.osx.dir/lsan_common.cpp.o projects/compiler-rt/lib/lsan/CMakeFiles/RTLSanCommon.osx.dir/lsan_common_fuchsia.cpp.o projects/compiler-rt/lib/lsan/CMakeFiles/RTLSanCommon.osx.dir/lsan_common_linux.cpp.o projects/compiler-rt/lib/lsan/CMakeFiles/RTLSanCommon.osx.dir/lsan_common_mac.cpp.o projects/compiler-rt/lib/ubsan/CMakeFiles/RTUbsan.osx.dir/ubsan_diag.cpp.o projects/compiler-rt/lib/ubsan/CMakeFiles/RTUbsan.osx.dir/ubsan_init.cpp.o projects/compiler-rt/lib/ubsan/CMakeFiles/RTUbsan.osx.dir/ubsan_flags.cpp.o projects/compiler-rt/lib/ubsan/CMakeFiles/RTUbsan.osx.dir/ubsan_handlers.cpp.o projects/compiler-rt/lib/ubsan/CMakeFiles/RTUbsan.osx.dir/ubsan_monitor.cpp.o projects/compiler-rt/lib/ubsan/CMakeFiles/RTUbsan.osx.dir/ubsan_value.cpp.o projects/compiler-rt/lib/ubsan/CMakeFiles/RTUbsan.osx.dir/ubsan_handlers_cxx.cpp.o projects/compiler-rt/lib/ubsan/CMakeFiles/RTUbsan.osx.dir/ubsan_type_hash.cpp.o projects/compiler-rt/lib/ubsan/CMakeFiles/RTUbsan.osx.dir/ubsan_type_hash_itanium.cpp.o projects/compiler-rt/lib/ubsan/CMakeFiles/RTUbsan.osx.dir/ubsan_type_hash_win.cpp.o  -Wl,-rpath,@loader_path/../lib && cd /Users/buildslave/jenkins/workspace/lldb-cmake/lldb-build/lib/clang/12.0.99/lib/darwin && codesign --sign - /Users/buildslave/jenkins/workspace/lldb-cmake/lldb-build/lib/clang/12.0.99/lib/darwin/libclang_rt.asan_osx_dynamic.dylib
[477/3587] : && "/Applications/Xcode.app/Contents/Developer/Toolchains/XcodeDefault.xctoolchain/usr/bin/libtool" -static -no_warning_for_no_symbols -o projects/compiler-rt/lib/asan/tests/libRTAsanTest.x86_64.a  projects/compiler-rt/lib/asan/CMakeFiles/RTAsan_dynamic.osx.dir/asan_allocator.cpp.o projects/compiler-rt/lib/asan/CMakeFiles/RTAsan_dynamic.osx.dir/asan_activation.cpp.o projects/compiler-rt/lib/asan/CMakeFiles/RTAsan_dynamic.osx.dir/asan_debugging.cpp.o projects/compiler-rt/lib/asan/CMakeFiles/RTAsan_dynamic.osx.dir/asan_descriptions.cpp.o projects/compiler-rt/lib/asan/CMakeFiles/RTAsan_dynamic.osx.dir/asan_errors.cpp.o projects/compiler-rt/lib/asan/CMakeFiles/RTAsan_dynamic.osx.dir/asan_fake_stack.cpp.o projects/compiler-rt/lib/asan/CMakeFiles/RTAsan_dynamic.osx.dir/asan_flags.cpp.o projects/compiler-rt/lib/asan/CMakeFiles/RTAsan_dynamic.osx.dir/asan_fuchsia.cpp.o projects/compiler-rt/lib/asan/CMakeFiles/RTAsan_dynamic.osx.dir/asan_globals.cpp.o projects/compiler-rt/lib/asan/CMakeFiles/RTAsan_dynamic.osx.dir/asan_globals_win.cpp.o projects/compiler-rt/lib/asan/CMakeFiles/RTAsan_dynamic.osx.dir/asan_interceptors.cpp.o projects/compiler-rt/lib/asan/CMakeFiles/RTAsan_dynamic.osx.dir/asan_interceptors_memintrinsics.cpp.o projects/compiler-rt/lib/asan/CMakeFiles/RTAsan_dynamic.osx.dir/asan_linux.cpp.o projects/compiler-rt/lib/asan/CMakeFiles/RTAsan_dynamic.osx.dir/asan_mac.cpp.o projects/compiler-rt/lib/asan/CMakeFiles/RTAsan_dynamic.osx.dir/asan_malloc_linux.cpp.o projects/compiler-rt/lib/asan/CMakeFiles/RTAsan_dynamic.osx.dir/asan_malloc_mac.cpp.o projects/compiler-rt/lib/asan/CMakeFiles/RTAsan_dynamic.osx.dir/asan_malloc_win.cpp.o projects/compiler-rt/lib/asan/CMakeFiles/RTAsan_dynamic.osx.dir/asan_memory_profile.cpp.o projects/compiler-rt/lib/asan/CMakeFiles/RTAsan_dynamic.osx.dir/asan_poisoning.cpp.o projects/compiler-rt/lib/asan/CMakeFiles/RTAsan_dynamic.osx.dir/asan_posix.cpp.o projects/compiler-rt/lib/asan/CMakeFiles/RTAsan_dynamic.osx.dir/asan_premap_shadow.cpp.o projects/compiler-rt/lib/asan/CMakeFiles/RTAsan_dynamic.osx.dir/asan_report.cpp.o projects/compiler-rt/lib/asan/CMakeFiles/RTAsan_dynamic.osx.dir/asan_rtems.cpp.o projects/compiler-rt/lib/asan/CMakeFiles/RTAsan_dynamic.osx.dir/asan_rtl.cpp.o projects/compiler-rt/lib/asan/CMakeFiles/RTAsan_dynamic.osx.dir/asan_shadow_setup.cpp.o projects/compiler-rt/lib/asan/CMakeFiles/RTAsan_dynamic.osx.dir/asan_stack.cpp.o projects/compiler-rt/lib/asan/CMakeFiles/RTAsan_dynamic.osx.dir/asan_stats.cpp.o projects/compiler-rt/lib/asan/CMakeFiles/RTAsan_dynamic.osx.dir/asan_suppressions.cpp.o projects/compiler-rt/lib/asan/CMakeFiles/RTAsan_dynamic.osx.dir/asan_thread.cpp.o projects/compiler-rt/lib/asan/CMakeFiles/RTAsan_dynamic.osx.dir/asan_win.cpp.o projects/compiler-rt/lib/asan/CMakeFiles/RTAsan_dynamic.osx.dir/asan_new_delete.cpp.o projects/compiler-rt/lib/interception/CMakeFiles/RTInterception.osx.dir/interception_linux.cpp.o projects/compiler-rt/lib/interception/CMakeFiles/RTInterception.osx.dir/interception_mac.cpp.o projects/compiler-rt/lib/interception/CMakeFiles/RTInterception.osx.dir/interception_win.cpp.o projects/compiler-rt/lib/interception/CMakeFiles/RTInterception.osx.dir/interception_type_test.cpp.o projects/compiler-rt/lib/sanitizer_common/CMakeFiles/RTSanitizerCommon.osx.dir/sanitizer_allocator.cpp.o projects/compiler-rt/lib/sanitizer_common/CMakeFiles/RTSanitizerCommon.osx.dir/sanitizer_common.cpp.o projects/compiler-rt/lib/sanitizer_common/CMakeFiles/RTSanitizerCommon.osx.dir/sanitizer_deadlock_detector1.cpp.o projects/compiler-rt/lib/sanitizer_common/CMakeFiles/RTSanitizerCommon.osx.dir/sanitizer_deadlock_detector2.cpp.o projects/compiler-rt/lib/sanitizer_common/CMakeFiles/RTSanitizerCommon.osx.dir/sanitizer_errno.cpp.o projects/compiler-rt/lib/sanitizer_common/CMakeFiles/RTSanitizerCommon.osx.dir/sanitizer_file.cpp.o projects/compiler-rt/lib/sanitizer_common/CMakeFiles/RTSanitizerCommon.osx.dir/sanitizer_flags.cpp.o projects/compiler-rt/lib/sanitizer_common/CMakeFiles/RTSanitizerCommon.osx.dir/sanitizer_flag_parser.cpp.o projects/compiler-rt/lib/sanitizer_common/CMakeFiles/RTSanitizerCommon.osx.dir/sanitizer_fuchsia.cpp.o projects/compiler-rt/lib/sanitizer_common/CMakeFiles/RTSanitizerCommon.osx.dir/sanitizer_libc.cpp.o projects/compiler-rt/lib/sanitizer_common/CMakeFiles/RTSanitizerCommon.osx.dir/sanitizer_libignore.cpp.o projects/compiler-rt/lib/sanitizer_common/CMakeFiles/RTSanitizerCommon.osx.dir/sanitizer_linux.cpp.o projects/compiler-rt/lib/sanitizer_common/CMakeFiles/RTSanitizerCommon.osx.dir/sanitizer_linux_s390.cpp.o projects/compiler-rt/lib/sanitizer_common/CMakeFiles/RTSanitizerCommon.osx.dir/sanitizer_mac.cpp.o projects/compiler-rt/lib/sanitizer_common/CMakeFiles/RTSanitizerCommon.osx.dir/sanitizer_netbsd.cpp.o projects/compiler-rt/lib/sanitizer_common/CMakeFiles/RTSanitizerCommon.osx.dir/sanitizer_openbsd.cpp.o projects/compiler-rt/lib/sanitizer_common/CMakeFiles/RTSanitizerCommon.osx.dir/sanitizer_persistent_allocator.cpp.o projects/compiler-rt/lib/sanitizer_common/CMakeFiles/RTSanitizerCommon.osx.dir/sanitizer_platform_limits_freebsd.cpp.o projects/compiler-rt/lib/sanitizer_common/CMakeFiles/RTSanitizerCommon.osx.dir/sanitizer_platform_limits_linux.cpp.o projects/compiler-rt/lib/sanitizer_common/CMakeFiles/RTSanitizerCommon.osx.dir/sanitizer_platform_limits_netbsd.cpp.o projects/compiler-rt/lib/sanitizer_common/CMakeFiles/RTSanitizerCommon.osx.dir/sanitizer_platform_limits_openbsd.cpp.o projects/compiler-rt/lib/sanitizer_common/CMakeFiles/RTSanitizerCommon.osx.dir/sanitizer_platform_limits_posix.cpp.o projects/compiler-rt/lib/sanitizer_common/CMakeFiles/RTSanitizerCommon.osx.dir/sanitizer_platform_limits_solaris.cpp.o projects/compiler-rt/lib/sanitizer_common/CMakeFiles/RTSanitizerCommon.osx.dir/sanitizer_posix.cpp.o projects/compiler-rt/lib/sanitizer_common/CMakeFiles/RTSanitizerCommon.osx.dir/sanitizer_printf.cpp.o projects/compiler-rt/lib/sanitizer_common/CMakeFiles/RTSanitizerCommon.osx.dir/sanitizer_procmaps_common.cpp.o projects/compiler-rt/lib/sanitizer_common/CMakeFiles/RTSanitizerCommon.osx.dir/sanitizer_procmaps_bsd.cpp.o projects/compiler-rt/lib/sanitizer_common/CMakeFiles/RTSanitizerCommon.osx.dir/sanitizer_procmaps_fuchsia.cpp.o projects/compiler-rt/lib/sanitizer_common/CMakeFiles/RTSanitizerCommon.osx.dir/sanitizer_procmaps_linux.cpp.o projects/compiler-rt/lib/sanitizer_common/CMakeFiles/RTSanitizerCommon.osx.dir/sanitizer_procmaps_mac.cpp.o projects/compiler-rt/lib/sanitizer_common/CMakeFiles/RTSanitizerCommon.osx.dir/sanitizer_procmaps_solaris.cpp.o projects/compiler-rt/lib/sanitizer_common/CMakeFiles/RTSanitizerCommon.osx.dir/sanitizer_rtems.cpp.o projects/compiler-rt/lib/sanitizer_common/CMakeFiles/RTSanitizerCommon.osx.dir/sanitizer_solaris.cpp.o projects/compiler-rt/lib/sanitizer_common/CMakeFiles/RTSanitizerCommon.osx.dir/sanitizer_stoptheworld_fuchsia.cpp.o projects/compiler-rt/lib/sanitizer_common/CMakeFiles/RTSanitizerCommon.osx.dir/sanitizer_stoptheworld_mac.cpp.o projects/compiler-rt/lib/sanitizer_common/CMakeFiles/RTSanitizerCommon.osx.dir/sanitizer_suppressions.cpp.o projects/compiler-rt/lib/sanitizer_common/CMakeFiles/RTSanitizerCommon.osx.dir/sanitizer_tls_get_addr.cpp.o projects/compiler-rt/lib/sanitizer_common/CMakeFiles/RTSanitizerCommon.osx.dir/sanitizer_thread_registry.cpp.o projects/compiler-rt/lib/sanitizer_common/CMakeFiles/RTSanitizerCommon.osx.dir/sanitizer_type_traits.cpp.o projects/compiler-rt/lib/sanitizer_common/CMakeFiles/RTSanitizerCommon.osx.dir/sanitizer_win.cpp.o projects/compiler-rt/lib/sanitizer_common/CMakeFiles/RTSanitizerCommon.osx.dir/sanitizer_termination.cpp.o projects/compiler-rt/lib/sanitizer_common/CMakeFiles/RTSanitizerCommonLibc.osx.dir/sanitizer_common_libcdep.cpp.o projects/compiler-rt/lib/sanitizer_common/CMakeFiles/RTSanitizerCommonLibc.osx.dir/sanitizer_allocator_checks.cpp.o projects/compiler-rt/lib/sanitizer_common/CMakeFiles/RTSanitizerCommonLibc.osx.dir/sanitizer_linux_libcdep.cpp.o projects/compiler-rt/lib/sanitizer_common/CMakeFiles/RTSanitizerCommonLibc.osx.dir/sanitizer_mac_libcdep.cpp.o projects/compiler-rt/lib/sanitizer_common/CMakeFiles/RTSanitizerCommonLibc.osx.dir/sanitizer_posix_libcdep.cpp.o projects/compiler-rt/lib/sanitizer_common/CMakeFiles/RTSanitizerCommonLibc.osx.dir/sanitizer_stoptheworld_linux_libcdep.cpp.o projects/compiler-rt/lib/sanitizer_common/CMakeFiles/RTSanitizerCommonLibc.osx.dir/sanitizer_stoptheworld_netbsd_libcdep.cpp.o projects/compiler-rt/lib/sanitizer_common/CMakeFiles/RTSanitizerCommonCoverage.osx.dir/sancov_flags.cpp.o projects/compiler-rt/lib/sanitizer_common/CMakeFiles/RTSanitizerCommonCoverage.osx.dir/sanitizer_coverage_fuchsia.cpp.o projects/compiler-rt/lib/sanitizer_common/CMakeFiles/RTSanitizerCommonCoverage.osx.dir/sanitizer_coverage_libcdep_new.cpp.o projects/compiler-rt/lib/sanitizer_common/CMakeFiles/RTSanitizerCommonCoverage.osx.dir/sanitizer_coverage_win_sections.cpp.o projects/compiler-rt/lib/sanitizer_common/CMakeFiles/RTSanitizerCommonSymbolizer.osx.dir/sanitizer_allocator_report.cpp.o projects/compiler-rt/lib/sanitizer_common/CMakeFiles/RTSanitizerCommonSymbolizer.osx.dir/sanitizer_stackdepot.cpp.o projects/compiler-rt/lib/sanitizer_common/CMakeFiles/RTSanitizerCommonSymbolizer.osx.dir/sanitizer_stacktrace.cpp.o projects/compiler-rt/lib/sanitizer_common/CMakeFiles/RTSanitizerCommonSymbolizer.osx.dir/sanitizer_stacktrace_libcdep.cpp.o projects/compiler-rt/lib/sanitizer_common/CMakeFiles/RTSanitizerCommonSymbolizer.osx.dir/sanitizer_stacktrace_printer.cpp.o projects/compiler-rt/lib/sanitizer_common/CMakeFiles/RTSanitizerCommonSymbolizer.osx.dir/sanitizer_stacktrace_sparc.cpp.o projects/compiler-rt/lib/sanitizer_common/CMakeFiles/RTSanitizerCommonSymbolizer.osx.dir/sanitizer_symbolizer.cpp.o projects/compiler-rt/lib/sanitizer_common/CMakeFiles/RTSanitizerCommonSymbolizer.osx.dir/sanitizer_symbolizer_libbacktrace.cpp.o projects/compiler-rt/lib/sanitizer_common/CMakeFiles/RTSanitizerCommonSymbolizer.osx.dir/sanitizer_symbolizer_libcdep.cpp.o projects/compiler-rt/lib/sanitizer_common/CMakeFiles/RTSanitizerCommonSymbolizer.osx.dir/sanitizer_symbolizer_mac.cpp.o projects/compiler-rt/lib/sanitizer_common/CMakeFiles/RTSanitizerCommonSymbolizer.osx.dir/sanitizer_symbolizer_markup.cpp.o projects/compiler-rt/lib/sanitizer_common/CMakeFiles/RTSanitizerCommonSymbolizer.osx.dir/sanitizer_symbolizer_posix_libcdep.cpp.o projects/compiler-rt/lib/sanitizer_common/CMakeFiles/RTSanitizerCommonSymbolizer.osx.dir/sanitizer_symbolizer_report.cpp.o projects/compiler-rt/lib/sanitizer_common/CMakeFiles/RTSanitizerCommonSymbolizer.osx.dir/sanitizer_symbolizer_win.cpp.o projects/compiler-rt/lib/sanitizer_common/CMakeFiles/RTSanitizerCommonSymbolizer.osx.dir/sanitizer_unwind_linux_libcdep.cpp.o projects/compiler-rt/lib/sanitizer_common/CMakeFiles/RTSanitizerCommonSymbolizer.osx.dir/sanitizer_unwind_win.cpp.o projects/compiler-rt/lib/lsan/CMakeFiles/RTLSanCommon.osx.dir/lsan_common.cpp.o projects/compiler-rt/lib/lsan/CMakeFiles/RTLSanCommon.osx.dir/lsan_common_fuchsia.cpp.o projects/compiler-rt/lib/lsan/CMakeFiles/RTLSanCommon.osx.dir/lsan_common_linux.cpp.o projects/compiler-rt/lib/lsan/CMakeFiles/RTLSanCommon.osx.dir/lsan_common_mac.cpp.o projects/compiler-rt/lib/ubsan/CMakeFiles/RTUbsan.osx.dir/ubsan_diag.cpp.o projects/compiler-rt/lib/ubsan/CMakeFiles/RTUbsan.osx.dir/ubsan_init.cpp.o projects/compiler-rt/lib/ubsan/CMakeFiles/RTUbsan.osx.dir/ubsan_flags.cpp.o projects/compiler-rt/lib/ubsan/CMakeFiles/RTUbsan.osx.dir/ubsan_handlers.cpp.o projects/compiler-rt/lib/ubsan/CMakeFiles/RTUbsan.osx.dir/ubsan_monitor.cpp.o projects/compiler-rt/lib/ubsan/CMakeFiles/RTUbsan.osx.dir/ubsan_value.cpp.o projects/compiler-rt/lib/ubsan/CMakeFiles/RTUbsan.osx.dir/ubsan_handlers_cxx.cpp.o projects/compiler-rt/lib/ubsan/CMakeFiles/RTUbsan.osx.dir/ubsan_type_hash.cpp.o projects/compiler-rt/lib/ubsan/CMakeFiles/RTUbsan.osx.dir/ubsan_type_hash_itanium.cpp.o projects/compiler-rt/lib/ubsan/CMakeFiles/RTUbsan.osx.dir/ubsan_type_hash_win.cpp.o && :
[478/3587] /Users/buildslave/jenkins/workspace/lldb-cmake/host-compiler/bin/clang++  -D_DEBUG -D__STDC_CONSTANT_MACROS -D__STDC_FORMAT_MACROS -D__STDC_LIMIT_MACROS -Iprojects/compiler-rt/lib/fuzzer -I/Users/buildslave/jenkins/workspace/lldb-cmake/llvm-project/compiler-rt/lib/fuzzer -I/Applications/Xcode.app/Contents/Developer/Platforms/MacOSX.platform/Developer/SDKs/MacOSX10.15.sdk/usr/include/libxml2 -Iinclude -I/Users/buildslave/jenkins/workspace/lldb-cmake/llvm-project/llvm/include -I/Users/buildslave/jenkins/workspace/lldb-cmake/llvm-project/compiler-rt/lib/fuzzer/../../include -Wdocumentation -fPIC -fvisibility-inlines-hidden -Werror=date-time -Werror=unguarded-availability-new -fmodules -fmodules-cache-path=/Users/buildslave/jenkins/workspace/lldb-cmake/lldb-build/module.cache -fcxx-modules -Xclang -fmodules-local-submodule-visibility -Wall -Wextra -Wno-unused-parameter -Wwrite-strings -Wcast-qual -Wmissing-field-initializers -pedantic -Wno-long-long -Wimplicit-fallthrough -Wcovered-switch-default -Wno-noexcept-type -Wnon-virtual-dtor -Wdelete-non-virtual-dtor -Wsuggest-override -Wstring-conversion -fdiagnostics-color -Wall -std=c++14 -Wno-unused-parameter -O3  -arch x86_64 -arch x86_64h -isysroot /Applications/Xcode.app/Contents/Developer/Platforms/MacOSX.platform/Developer/SDKs/MacOSX10.15.sdk    -stdlib=libc++ -mmacosx-version-min=10.10 -isysroot /Applications/Xcode.app/Contents/Developer/Platforms/MacOSX.platform/Developer/SDKs/MacOSX10.15.sdk -fPIC -fno-builtin -fno-exceptions -funwind-tables -fno-stack-protector -fno-sanitize=safe-stack -fvisibility=hidden -fno-lto -O3 -gline-tables-only -fno-modules -Wno-gnu -Wno-variadic-macros -Wno-c99-extensions -Wno-non-virtual-dtor -fno-omit-frame-pointer -UNDEBUG -std=c++14 -MD -MT projects/compiler-rt/lib/fuzzer/CMakeFiles/RTfuzzer.osx.dir/FuzzerSHA1.cpp.o -MF projects/compiler-rt/lib/fuzzer/CMakeFiles/RTfuzzer.osx.dir/FuzzerSHA1.cpp.o.d -o projects/compiler-rt/lib/fuzzer/CMakeFiles/RTfuzzer.osx.dir/FuzzerSHA1.cpp.o -c /Users/buildslave/jenkins/workspace/lldb-cmake/llvm-project/compiler-rt/lib/fuzzer/FuzzerSHA1.cpp
clang-12: warning: argument unused during compilation: '-fmodules-cache-path=/Users/buildslave/jenkins/workspace/lldb-cmake/lldb-build/module.cache' [-Wunused-command-line-argument]
clang-12: warning: argument unused during compilation: '-fcxx-modules' [-Wunused-command-line-argument]
[479/3587] /Users/buildslave/jenkins/workspace/lldb-cmake/host-compiler/bin/clang++  -D_DEBUG -D__STDC_CONSTANT_MACROS -D__STDC_FORMAT_MACROS -D__STDC_LIMIT_MACROS -Iprojects/compiler-rt/lib/fuzzer -I/Users/buildslave/jenkins/workspace/lldb-cmake/llvm-project/compiler-rt/lib/fuzzer -I/Applications/Xcode.app/Contents/Developer/Platforms/MacOSX.platform/Developer/SDKs/MacOSX10.15.sdk/usr/include/libxml2 -Iinclude -I/Users/buildslave/jenkins/workspace/lldb-cmake/llvm-project/llvm/include -I/Users/buildslave/jenkins/workspace/lldb-cmake/llvm-project/compiler-rt/lib/fuzzer/../../include -Wdocumentation -fPIC -fvisibility-inlines-hidden -Werror=date-time -Werror=unguarded-availability-new -fmodules -fmodules-cache-path=/Users/buildslave/jenkins/workspace/lldb-cmake/lldb-build/module.cache -fcxx-modules -Xclang -fmodules-local-submodule-visibility -Wall -Wextra -Wno-unused-parameter -Wwrite-strings -Wcast-qual -Wmissing-field-initializers -pedantic -Wno-long-long -Wimplicit-fallthrough -Wcovered-switch-default -Wno-noexcept-type -Wnon-virtual-dtor -Wdelete-non-virtual-dtor -Wsuggest-override -Wstring-conversion -fdiagnostics-color -Wall -std=c++14 -Wno-unused-parameter -O3  -arch x86_64 -arch x86_64h -isysroot /Applications/Xcode.app/Contents/Developer/Platforms/MacOSX.platform/Developer/SDKs/MacOSX10.15.sdk    -stdlib=libc++ -mmacosx-version-min=10.10 -isysroot /Applications/Xcode.app/Contents/Developer/Platforms/MacOSX.platform/Developer/SDKs/MacOSX10.15.sdk -fPIC -fno-builtin -fno-exceptions -funwind-tables -fno-stack-protector -fno-sanitize=safe-stack -fvisibility=hidden -fno-lto -O3 -gline-tables-only -fno-modules -Wno-gnu -Wno-variadic-macros -Wno-c99-extensions -Wno-non-virtual-dtor -fno-omit-frame-pointer -UNDEBUG -std=c++14 -MD -MT projects/compiler-rt/lib/fuzzer/CMakeFiles/RTfuzzer.osx.dir/FuzzerMutate.cpp.o -MF projects/compiler-rt/lib/fuzzer/CMakeFiles/RTfuzzer.osx.dir/FuzzerMutate.cpp.o.d -o projects/compiler-rt/lib/fuzzer/CMakeFiles/RTfuzzer.osx.dir/FuzzerMutate.cpp.o -c /Users/buildslave/jenkins/workspace/lldb-cmake/llvm-project/compiler-rt/lib/fuzzer/FuzzerMutate.cpp
clang-12: warning: argument unused during compilation: '-fmodules-cache-path=/Users/buildslave/jenkins/workspace/lldb-cmake/lldb-build/module.cache' [-Wunused-command-line-argument]
clang-12: warning: argument unused during compilation: '-fcxx-modules' [-Wunused-command-line-argument]
[480/3587] /Users/buildslave/jenkins/workspace/lldb-cmake/host-compiler/bin/clang++  -D_DEBUG -D__STDC_CONSTANT_MACROS -D__STDC_FORMAT_MACROS -D__STDC_LIMIT_MACROS -Iprojects/compiler-rt/lib/fuzzer -I/Users/buildslave/jenkins/workspace/lldb-cmake/llvm-project/compiler-rt/lib/fuzzer -I/Applications/Xcode.app/Contents/Developer/Platforms/MacOSX.platform/Developer/SDKs/MacOSX10.15.sdk/usr/include/libxml2 -Iinclude -I/Users/buildslave/jenkins/workspace/lldb-cmake/llvm-project/llvm/include -I/Users/buildslave/jenkins/workspace/lldb-cmake/llvm-project/compiler-rt/lib/fuzzer/../../include -Wdocumentation -fPIC -fvisibility-inlines-hidden -Werror=date-time -Werror=unguarded-availability-new -fmodules -fmodules-cache-path=/Users/buildslave/jenkins/workspace/lldb-cmake/lldb-build/module.cache -fcxx-modules -Xclang -fmodules-local-submodule-visibility -Wall -Wextra -Wno-unused-parameter -Wwrite-strings -Wcast-qual -Wmissing-field-initializers -pedantic -Wno-long-long -Wimplicit-fallthrough -Wcovered-switch-default -Wno-noexcept-type -Wnon-virtual-dtor -Wdelete-non-virtual-dtor -Wsuggest-override -Wstring-conversion -fdiagnostics-color -Wall -std=c++14 -Wno-unused-parameter -O3  -arch x86_64 -arch x86_64h -isysroot /Applications/Xcode.app/Contents/Developer/Platforms/MacOSX.platform/Developer/SDKs/MacOSX10.15.sdk    -stdlib=libc++ -mmacosx-version-min=10.10 -isysroot /Applications/Xcode.app/Contents/Developer/Platforms/MacOSX.platform/Developer/SDKs/MacOSX10.15.sdk -fPIC -fno-builtin -fno-exceptions -funwind-tables -fno-stack-protector -fno-sanitize=safe-stack -fvisibility=hidden -fno-lto -O3 -gline-tables-only -fno-modules -Wno-gnu -Wno-variadic-macros -Wno-c99-extensions -Wno-non-virtual-dtor -fno-omit-frame-pointer -UNDEBUG -std=c++14 -MD -MT projects/compiler-rt/lib/fuzzer/CMakeFiles/RTfuzzer.osx.dir/FuzzerUtilDarwin.cpp.o -MF projects/compiler-rt/lib/fuzzer/CMakeFiles/RTfuzzer.osx.dir/FuzzerUtilDarwin.cpp.o.d -o projects/compiler-rt/lib/fuzzer/CMakeFiles/RTfuzzer.osx.dir/FuzzerUtilDarwin.cpp.o -c /Users/buildslave/jenkins/workspace/lldb-cmake/llvm-project/compiler-rt/lib/fuzzer/FuzzerUtilDarwin.cpp
clang-12: warning: argument unused during compilation: '-fmodules-cache-path=/Users/buildslave/jenkins/workspace/lldb-cmake/lldb-build/module.cache' [-Wunused-command-line-argument]
clang-12: warning: argument unused during compilation: '-fcxx-modules' [-Wunused-command-line-argument]
[481/3587] /Users/buildslave/jenkins/workspace/lldb-cmake/host-compiler/bin/clang++  -D_DEBUG -D__STDC_CONSTANT_MACROS -D__STDC_FORMAT_MACROS -D__STDC_LIMIT_MACROS -Iprojects/compiler-rt/lib/fuzzer -I/Users/buildslave/jenkins/workspace/lldb-cmake/llvm-project/compiler-rt/lib/fuzzer -I/Applications/Xcode.app/Contents/Developer/Platforms/MacOSX.platform/Developer/SDKs/MacOSX10.15.sdk/usr/include/libxml2 -Iinclude -I/Users/buildslave/jenkins/workspace/lldb-cmake/llvm-project/llvm/include -I/Users/buildslave/jenkins/workspace/lldb-cmake/llvm-project/compiler-rt/lib/fuzzer/../../include -Wdocumentation -fPIC -fvisibility-inlines-hidden -Werror=date-time -Werror=unguarded-availability-new -fmodules -fmodules-cache-path=/Users/buildslave/jenkins/workspace/lldb-cmake/lldb-build/module.cache -fcxx-modules -Xclang -fmodules-local-submodule-visibility -Wall -Wextra -Wno-unused-parameter -Wwrite-strings -Wcast-qual -Wmissing-field-initializers -pedantic -Wno-long-long -Wimplicit-fallthrough -Wcovered-switch-default -Wno-noexcept-type -Wnon-virtual-dtor -Wdelete-non-virtual-dtor -Wsuggest-override -Wstring-conversion -fdiagnostics-color -Wall -std=c++14 -Wno-unused-parameter -O3  -arch x86_64 -arch x86_64h -isysroot /Applications/Xcode.app/Contents/Developer/Platforms/MacOSX.platform/Developer/SDKs/MacOSX10.15.sdk    -stdlib=libc++ -mmacosx-version-min=10.10 -isysroot /Applications/Xcode.app/Contents/Developer/Platforms/MacOSX.platform/Developer/SDKs/MacOSX10.15.sdk -fPIC -fno-builtin -fno-exceptions -funwind-tables -fno-stack-protector -fno-sanitize=safe-stack -fvisibility=hidden -fno-lto -O3 -gline-tables-only -fno-modules -Wno-gnu -Wno-variadic-macros -Wno-c99-extensions -Wno-non-virtual-dtor -fno-omit-frame-pointer -UNDEBUG -std=c++14 -MD -MT projects/compiler-rt/lib/fuzzer/CMakeFiles/RTfuzzer.osx.dir/FuzzerDataFlowTrace.cpp.o -MF projects/compiler-rt/lib/fuzzer/CMakeFiles/RTfuzzer.osx.dir/FuzzerDataFlowTrace.cpp.o.d -o projects/compiler-rt/lib/fuzzer/CMakeFiles/RTfuzzer.osx.dir/FuzzerDataFlowTrace.cpp.o -c /Users/buildslave/jenkins/workspace/lldb-cmake/llvm-project/compiler-rt/lib/fuzzer/FuzzerDataFlowTrace.cpp
clang-12: warning: argument unused during compilation: '-fmodules-cache-path=/Users/buildslave/jenkins/workspace/lldb-cmake/lldb-build/module.cache' [-Wunused-command-line-argument]
clang-12: warning: argument unused during compilation: '-fcxx-modules' [-Wunused-command-line-argument]
[482/3587] /Users/buildslave/jenkins/workspace/lldb-cmake/host-compiler/bin/clang++  -D_DEBUG -D__STDC_CONSTANT_MACROS -D__STDC_FORMAT_MACROS -D__STDC_LIMIT_MACROS -Iprojects/compiler-rt/lib/fuzzer -I/Users/buildslave/jenkins/workspace/lldb-cmake/llvm-project/compiler-rt/lib/fuzzer -I/Applications/Xcode.app/Contents/Developer/Platforms/MacOSX.platform/Developer/SDKs/MacOSX10.15.sdk/usr/include/libxml2 -Iinclude -I/Users/buildslave/jenkins/workspace/lldb-cmake/llvm-project/llvm/include -I/Users/buildslave/jenkins/workspace/lldb-cmake/llvm-project/compiler-rt/lib/fuzzer/../../include -Wdocumentation -fPIC -fvisibility-inlines-hidden -Werror=date-time -Werror=unguarded-availability-new -fmodules -fmodules-cache-path=/Users/buildslave/jenkins/workspace/lldb-cmake/lldb-build/module.cache -fcxx-modules -Xclang -fmodules-local-submodule-visibility -Wall -Wextra -Wno-unused-parameter -Wwrite-strings -Wcast-qual -Wmissing-field-initializers -pedantic -Wno-long-long -Wimplicit-fallthrough -Wcovered-switch-default -Wno-noexcept-type -Wnon-virtual-dtor -Wdelete-non-virtual-dtor -Wsuggest-override -Wstring-conversion -fdiagnostics-color -Wall -std=c++14 -Wno-unused-parameter -O3  -arch x86_64 -isysroot /Applications/Xcode.app/Contents/Developer/Platforms/MacOSX.platform/Developer/SDKs/MacOSX10.15.sdk    -stdlib=libc++ -mios-simulator-version-min=9.0 -isysroot /Applications/Xcode.app/Contents/Developer/Platforms/iPhoneSimulator.platform/Developer/SDKs/iPhoneSimulator13.5.sdk -fPIC -fno-builtin -fno-exceptions -funwind-tables -fno-stack-protector -fno-sanitize=safe-stack -fvisibility=hidden -fno-lto -O3 -gline-tables-only -fno-modules -Wno-gnu -Wno-variadic-macros -Wno-c99-extensions -Wno-non-virtual-dtor -fno-omit-frame-pointer -UNDEBUG -std=c++14 -MD -MT projects/compiler-rt/lib/fuzzer/CMakeFiles/RTfuzzer.iossim.dir/FuzzerCrossOver.cpp.o -MF projects/compiler-rt/lib/fuzzer/CMakeFiles/RTfuzzer.iossim.dir/FuzzerCrossOver.cpp.o.d -o projects/compiler-rt/lib/fuzzer/CMakeFiles/RTfuzzer.iossim.dir/FuzzerCrossOver.cpp.o -c /Users/buildslave/jenkins/workspace/lldb-cmake/llvm-project/compiler-rt/lib/fuzzer/FuzzerCrossOver.cpp
clang-12: warning: argument unused during compilation: '-fmodules-cache-path=/Users/buildslave/jenkins/workspace/lldb-cmake/lldb-build/module.cache' [-Wunused-command-line-argument]
clang-12: warning: argument unused during compilation: '-fcxx-modules' [-Wunused-command-line-argument]
[483/3587] /Users/buildslave/jenkins/workspace/lldb-cmake/host-compiler/bin/clang++  -D_DEBUG -D__STDC_CONSTANT_MACROS -D__STDC_FORMAT_MACROS -D__STDC_LIMIT_MACROS -Iprojects/compiler-rt/lib/fuzzer -I/Users/buildslave/jenkins/workspace/lldb-cmake/llvm-project/compiler-rt/lib/fuzzer -I/Applications/Xcode.app/Contents/Developer/Platforms/MacOSX.platform/Developer/SDKs/MacOSX10.15.sdk/usr/include/libxml2 -Iinclude -I/Users/buildslave/jenkins/workspace/lldb-cmake/llvm-project/llvm/include -I/Users/buildslave/jenkins/workspace/lldb-cmake/llvm-project/compiler-rt/lib/fuzzer/../../include -Wdocumentation -fPIC -fvisibility-inlines-hidden -Werror=date-time -Werror=unguarded-availability-new -fmodules -fmodules-cache-path=/Users/buildslave/jenkins/workspace/lldb-cmake/lldb-build/module.cache -fcxx-modules -Xclang -fmodules-local-submodule-visibility -Wall -Wextra -Wno-unused-parameter -Wwrite-strings -Wcast-qual -Wmissing-field-initializers -pedantic -Wno-long-long -Wimplicit-fallthrough -Wcovered-switch-default -Wno-noexcept-type -Wnon-virtual-dtor -Wdelete-non-virtual-dtor -Wsuggest-override -Wstring-conversion -fdiagnostics-color -Wall -std=c++14 -Wno-unused-parameter -O3  -arch x86_64 -arch x86_64h -isysroot /Applications/Xcode.app/Contents/Developer/Platforms/MacOSX.platform/Developer/SDKs/MacOSX10.15.sdk    -stdlib=libc++ -mmacosx-version-min=10.10 -isysroot /Applications/Xcode.app/Contents/Developer/Platforms/MacOSX.platform/Developer/SDKs/MacOSX10.15.sdk -fPIC -fno-builtin -fno-exceptions -funwind-tables -fno-stack-protector -fno-sanitize=safe-stack -fvisibility=hidden -fno-lto -O3 -gline-tables-only -fno-modules -Wno-gnu -Wno-variadic-macros -Wno-c99-extensions -Wno-non-virtual-dtor -fno-omit-frame-pointer -UNDEBUG -std=c++14 -MD -MT projects/compiler-rt/lib/fuzzer/CMakeFiles/RTfuzzer.osx.dir/FuzzerUtil.cpp.o -MF projects/compiler-rt/lib/fuzzer/CMakeFiles/RTfuzzer.osx.dir/FuzzerUtil.cpp.o.d -o projects/compiler-rt/lib/fuzzer/CMakeFiles/RTfuzzer.osx.dir/FuzzerUtil.cpp.o -c /Users/buildslave/jenkins/workspace/lldb-cmake/llvm-project/compiler-rt/lib/fuzzer/FuzzerUtil.cpp
clang-12: warning: argument unused during compilation: '-fmodules-cache-path=/Users/buildslave/jenkins/workspace/lldb-cmake/lldb-build/module.cache' [-Wunused-command-line-argument]
clang-12: warning: argument unused during compilation: '-fcxx-modules' [-Wunused-command-line-argument]
[484/3587] /Users/buildslave/jenkins/workspace/lldb-cmake/host-compiler/bin/clang++  -D_DEBUG -D__STDC_CONSTANT_MACROS -D__STDC_FORMAT_MACROS -D__STDC_LIMIT_MACROS -Iprojects/compiler-rt/lib/fuzzer -I/Users/buildslave/jenkins/workspace/lldb-cmake/llvm-project/compiler-rt/lib/fuzzer -I/Applications/Xcode.app/Contents/Developer/Platforms/MacOSX.platform/Developer/SDKs/MacOSX10.15.sdk/usr/include/libxml2 -Iinclude -I/Users/buildslave/jenkins/workspace/lldb-cmake/llvm-project/llvm/include -I/Users/buildslave/jenkins/workspace/lldb-cmake/llvm-project/compiler-rt/lib/fuzzer/../../include -Wdocumentation -fPIC -fvisibility-inlines-hidden -Werror=date-time -Werror=unguarded-availability-new -fmodules -fmodules-cache-path=/Users/buildslave/jenkins/workspace/lldb-cmake/lldb-build/module.cache -fcxx-modules -Xclang -fmodules-local-submodule-visibility -Wall -Wextra -Wno-unused-parameter -Wwrite-strings -Wcast-qual -Wmissing-field-initializers -pedantic -Wno-long-long -Wimplicit-fallthrough -Wcovered-switch-default -Wno-noexcept-type -Wnon-virtual-dtor -Wdelete-non-virtual-dtor -Wsuggest-override -Wstring-conversion -fdiagnostics-color -Wall -std=c++14 -Wno-unused-parameter -O3  -arch x86_64 -isysroot /Applications/Xcode.app/Contents/Developer/Platforms/MacOSX.platform/Developer/SDKs/MacOSX10.15.sdk    -stdlib=libc++ -mios-simulator-version-min=9.0 -isysroot /Applications/Xcode.app/Contents/Developer/Platforms/iPhoneSimulator.platform/Developer/SDKs/iPhoneSimulator13.5.sdk -fPIC -fno-builtin -fno-exceptions -funwind-tables -fno-stack-protector -fno-sanitize=safe-stack -fvisibility=hidden -fno-lto -O3 -gline-tables-only -fno-modules -Wno-gnu -Wno-variadic-macros -Wno-c99-extensions -Wno-non-virtual-dtor -fno-omit-frame-pointer -UNDEBUG -std=c++14 -MD -MT projects/compiler-rt/lib/fuzzer/CMakeFiles/RTfuzzer.iossim.dir/FuzzerExtraCounters.cpp.o -MF projects/compiler-rt/lib/fuzzer/CMakeFiles/RTfuzzer.iossim.dir/FuzzerExtraCounters.cpp.o.d -o projects/compiler-rt/lib/fuzzer/CMakeFiles/RTfuzzer.iossim.dir/FuzzerExtraCounters.cpp.o -c /Users/buildslave/jenkins/workspace/lldb-cmake/llvm-project/compiler-rt/lib/fuzzer/FuzzerExtraCounters.cpp
clang-12: warning: argument unused during compilation: '-fmodules-cache-path=/Users/buildslave/jenkins/workspace/lldb-cmake/lldb-build/module.cache' [-Wunused-command-line-argument]
clang-12: warning: argument unused during compilation: '-fcxx-modules' [-Wunused-command-line-argument]
[485/3587] /Users/buildslave/jenkins/workspace/lldb-cmake/host-compiler/bin/clang++  -D_DEBUG -D__STDC_CONSTANT_MACROS -D__STDC_FORMAT_MACROS -D__STDC_LIMIT_MACROS -Iprojects/compiler-rt/lib/fuzzer -I/Users/buildslave/jenkins/workspace/lldb-cmake/llvm-project/compiler-rt/lib/fuzzer -I/Applications/Xcode.app/Contents/Developer/Platforms/MacOSX.platform/Developer/SDKs/MacOSX10.15.sdk/usr/include/libxml2 -Iinclude -I/Users/buildslave/jenkins/workspace/lldb-cmake/llvm-project/llvm/include -I/Users/buildslave/jenkins/workspace/lldb-cmake/llvm-project/compiler-rt/lib/fuzzer/../../include -Wdocumentation -fPIC -fvisibility-inlines-hidden -Werror=date-time -Werror=unguarded-availability-new -fmodules -fmodules-cache-path=/Users/buildslave/jenkins/workspace/lldb-cmake/lldb-build/module.cache -fcxx-modules -Xclang -fmodules-local-submodule-visibility -Wall -Wextra -Wno-unused-parameter -Wwrite-strings -Wcast-qual -Wmissing-field-initializers -pedantic -Wno-long-long -Wimplicit-fallthrough -Wcovered-switch-default -Wno-noexcept-type -Wnon-virtual-dtor -Wdelete-non-virtual-dtor -Wsuggest-override -Wstring-conversion -fdiagnostics-color -Wall -std=c++14 -Wno-unused-parameter -O3  -arch x86_64 -arch x86_64h -isysroot /Applications/Xcode.app/Contents/Developer/Platforms/MacOSX.platform/Developer/SDKs/MacOSX10.15.sdk    -stdlib=libc++ -mmacosx-version-min=10.10 -isysroot /Applications/Xcode.app/Contents/Developer/Platforms/MacOSX.platform/Developer/SDKs/MacOSX10.15.sdk -fPIC -fno-builtin -fno-exceptions -funwind-tables -fno-stack-protector -fno-sanitize=safe-stack -fvisibility=hidden -fno-lto -O3 -gline-tables-only -fno-modules -Wno-gnu -Wno-variadic-macros -Wno-c99-extensions -Wno-non-virtual-dtor -fno-omit-frame-pointer -UNDEBUG -std=c++14 -MD -MT projects/compiler-rt/lib/fuzzer/CMakeFiles/RTfuzzer.osx.dir/FuzzerFork.cpp.o -MF projects/compiler-rt/lib/fuzzer/CMakeFiles/RTfuzzer.osx.dir/FuzzerFork.cpp.o.d -o projects/compiler-rt/lib/fuzzer/CMakeFiles/RTfuzzer.osx.dir/FuzzerFork.cpp.o -c /Users/buildslave/jenkins/workspace/lldb-cmake/llvm-project/compiler-rt/lib/fuzzer/FuzzerFork.cpp
clang-12: warning: argument unused during compilation: '-fmodules-cache-path=/Users/buildslave/jenkins/workspace/lldb-cmake/lldb-build/module.cache' [-Wunused-command-line-argument]
clang-12: warning: argument unused during compilation: '-fcxx-modules' [-Wunused-command-line-argument]
[486/3587] /Users/buildslave/jenkins/workspace/lldb-cmake/host-compiler/bin/clang++  -D_DEBUG -D__STDC_CONSTANT_MACROS -D__STDC_FORMAT_MACROS -D__STDC_LIMIT_MACROS -Iprojects/compiler-rt/lib/fuzzer -I/Users/buildslave/jenkins/workspace/lldb-cmake/llvm-project/compiler-rt/lib/fuzzer -I/Applications/Xcode.app/Contents/Developer/Platforms/MacOSX.platform/Developer/SDKs/MacOSX10.15.sdk/usr/include/libxml2 -Iinclude -I/Users/buildslave/jenkins/workspace/lldb-cmake/llvm-project/llvm/include -I/Users/buildslave/jenkins/workspace/lldb-cmake/llvm-project/compiler-rt/lib/fuzzer/../../include -Wdocumentation -fPIC -fvisibility-inlines-hidden -Werror=date-time -Werror=unguarded-availability-new -fmodules -fmodules-cache-path=/Users/buildslave/jenkins/workspace/lldb-cmake/lldb-build/module.cache -fcxx-modules -Xclang -fmodules-local-submodule-visibility -Wall -Wextra -Wno-unused-parameter -Wwrite-strings -Wcast-qual -Wmissing-field-initializers -pedantic -Wno-long-long -Wimplicit-fallthrough -Wcovered-switch-default -Wno-noexcept-type -Wnon-virtual-dtor -Wdelete-non-virtual-dtor -Wsuggest-override -Wstring-conversion -fdiagnostics-color -Wall -std=c++14 -Wno-unused-parameter -O3  -arch x86_64 -isysroot /Applications/Xcode.app/Contents/Developer/Platforms/MacOSX.platform/Developer/SDKs/MacOSX10.15.sdk    -stdlib=libc++ -mios-simulator-version-min=9.0 -isysroot /Applications/Xcode.app/Contents/Developer/Platforms/iPhoneSimulator.platform/Developer/SDKs/iPhoneSimulator13.5.sdk -fPIC -fno-builtin -fno-exceptions -funwind-tables -fno-stack-protector -fno-sanitize=safe-stack -fvisibility=hidden -fno-lto -O3 -gline-tables-only -fno-modules -Wno-gnu -Wno-variadic-macros -Wno-c99-extensions -Wno-non-virtual-dtor -fno-omit-frame-pointer -UNDEBUG -std=c++14 -MD -MT projects/compiler-rt/lib/fuzzer/CMakeFiles/RTfuzzer.iossim.dir/FuzzerExtFunctionsDlsym.cpp.o -MF projects/compiler-rt/lib/fuzzer/CMakeFiles/RTfuzzer.iossim.dir/FuzzerExtFunctionsDlsym.cpp.o.d -o projects/compiler-rt/lib/fuzzer/CMakeFiles/RTfuzzer.iossim.dir/FuzzerExtFunctionsDlsym.cpp.o -c /Users/buildslave/jenkins/workspace/lldb-cmake/llvm-project/compiler-rt/lib/fuzzer/FuzzerExtFunctionsDlsym.cpp
clang-12: warning: argument unused during compilation: '-fmodules-cache-path=/Users/buildslave/jenkins/workspace/lldb-cmake/lldb-build/module.cache' [-Wunused-command-line-argument]
clang-12: warning: argument unused during compilation: '-fcxx-modules' [-Wunused-command-line-argument]
[487/3587] /Users/buildslave/jenkins/workspace/lldb-cmake/host-compiler/bin/clang++  -D_DEBUG -D__STDC_CONSTANT_MACROS -D__STDC_FORMAT_MACROS -D__STDC_LIMIT_MACROS -Iprojects/compiler-rt/lib/fuzzer -I/Users/buildslave/jenkins/workspace/lldb-cmake/llvm-project/compiler-rt/lib/fuzzer -I/Applications/Xcode.app/Contents/Developer/Platforms/MacOSX.platform/Developer/SDKs/MacOSX10.15.sdk/usr/include/libxml2 -Iinclude -I/Users/buildslave/jenkins/workspace/lldb-cmake/llvm-project/llvm/include -I/Users/buildslave/jenkins/workspace/lldb-cmake/llvm-project/compiler-rt/lib/fuzzer/../../include -Wdocumentation -fPIC -fvisibility-inlines-hidden -Werror=date-time -Werror=unguarded-availability-new -fmodules -fmodules-cache-path=/Users/buildslave/jenkins/workspace/lldb-cmake/lldb-build/module.cache -fcxx-modules -Xclang -fmodules-local-submodule-visibility -Wall -Wextra -Wno-unused-parameter -Wwrite-strings -Wcast-qual -Wmissing-field-initializers -pedantic -Wno-long-long -Wimplicit-fallthrough -Wcovered-switch-default -Wno-noexcept-type -Wnon-virtual-dtor -Wdelete-non-virtual-dtor -Wsuggest-override -Wstring-conversion -fdiagnostics-color -Wall -std=c++14 -Wno-unused-parameter -O3  -arch x86_64 -arch x86_64h -isysroot /Applications/Xcode.app/Contents/Developer/Platforms/MacOSX.platform/Developer/SDKs/MacOSX10.15.sdk    -stdlib=libc++ -mmacosx-version-min=10.10 -isysroot /Applications/Xcode.app/Contents/Developer/Platforms/MacOSX.platform/Developer/SDKs/MacOSX10.15.sdk -fPIC -fno-builtin -fno-exceptions -funwind-tables -fno-stack-protector -fno-sanitize=safe-stack -fvisibility=hidden -fno-lto -O3 -gline-tables-only -fno-modules -Wno-gnu -Wno-variadic-macros -Wno-c99-extensions -Wno-non-virtual-dtor -fno-omit-frame-pointer -UNDEBUG -std=c++14 -MD -MT projects/compiler-rt/lib/fuzzer/CMakeFiles/RTfuzzer.osx.dir/FuzzerUtilPosix.cpp.o -MF projects/compiler-rt/lib/fuzzer/CMakeFiles/RTfuzzer.osx.dir/FuzzerUtilPosix.cpp.o.d -o projects/compiler-rt/lib/fuzzer/CMakeFiles/RTfuzzer.osx.dir/FuzzerUtilPosix.cpp.o -c /Users/buildslave/jenkins/workspace/lldb-cmake/llvm-project/compiler-rt/lib/fuzzer/FuzzerUtilPosix.cpp
clang-12: warning: argument unused during compilation: '-fmodules-cache-path=/Users/buildslave/jenkins/workspace/lldb-cmake/lldb-build/module.cache' [-Wunused-command-line-argument]
clang-12: warning: argument unused during compilation: '-fcxx-modules' [-Wunused-command-line-argument]
[488/3587] /Users/buildslave/jenkins/workspace/lldb-cmake/host-compiler/bin/clang++  -D_DEBUG -D__STDC_CONSTANT_MACROS -D__STDC_FORMAT_MACROS -D__STDC_LIMIT_MACROS -Iprojects/compiler-rt/lib/fuzzer -I/Users/buildslave/jenkins/workspace/lldb-cmake/llvm-project/compiler-rt/lib/fuzzer -I/Applications/Xcode.app/Contents/Developer/Platforms/MacOSX.platform/Developer/SDKs/MacOSX10.15.sdk/usr/include/libxml2 -Iinclude -I/Users/buildslave/jenkins/workspace/lldb-cmake/llvm-project/llvm/include -I/Users/buildslave/jenkins/workspace/lldb-cmake/llvm-project/compiler-rt/lib/fuzzer/../../include -Wdocumentation -fPIC -fvisibility-inlines-hidden -Werror=date-time -Werror=unguarded-availability-new -fmodules -fmodules-cache-path=/Users/buildslave/jenkins/workspace/lldb-cmake/lldb-build/module.cache -fcxx-modules -Xclang -fmodules-local-submodule-visibility -Wall -Wextra -Wno-unused-parameter -Wwrite-strings -Wcast-qual -Wmissing-field-initializers -pedantic -Wno-long-long -Wimplicit-fallthrough -Wcovered-switch-default -Wno-noexcept-type -Wnon-virtual-dtor -Wdelete-non-virtual-dtor -Wsuggest-override -Wstring-conversion -fdiagnostics-color -Wall -std=c++14 -Wno-unused-parameter -O3  -arch x86_64 -arch x86_64h -isysroot /Applications/Xcode.app/Contents/Developer/Platforms/MacOSX.platform/Developer/SDKs/MacOSX10.15.sdk    -stdlib=libc++ -mmacosx-version-min=10.10 -isysroot /Applications/Xcode.app/Contents/Developer/Platforms/MacOSX.platform/Developer/SDKs/MacOSX10.15.sdk -fPIC -fno-builtin -fno-exceptions -funwind-tables -fno-stack-protector -fno-sanitize=safe-stack -fvisibility=hidden -fno-lto -O3 -gline-tables-only -fno-modules -Wno-gnu -Wno-variadic-macros -Wno-c99-extensions -Wno-non-virtual-dtor -fno-omit-frame-pointer -UNDEBUG -std=c++14 -MD -MT projects/compiler-rt/lib/fuzzer/CMakeFiles/RTfuzzer.osx.dir/FuzzerDriver.cpp.o -MF projects/compiler-rt/lib/fuzzer/CMakeFiles/RTfuzzer.osx.dir/FuzzerDriver.cpp.o.d -o projects/compiler-rt/lib/fuzzer/CMakeFiles/RTfuzzer.osx.dir/FuzzerDriver.cpp.o -c /Users/buildslave/jenkins/workspace/lldb-cmake/llvm-project/compiler-rt/lib/fuzzer/FuzzerDriver.cpp
clang-12: warning: argument unused during compilation: '-fmodules-cache-path=/Users/buildslave/jenkins/workspace/lldb-cmake/lldb-build/module.cache' [-Wunused-command-line-argument]
clang-12: warning: argument unused during compilation: '-fcxx-modules' [-Wunused-command-line-argument]
[489/3587] /Users/buildslave/jenkins/workspace/lldb-cmake/host-compiler/bin/clang++  -D_DEBUG -D__STDC_CONSTANT_MACROS -D__STDC_FORMAT_MACROS -D__STDC_LIMIT_MACROS -Iprojects/compiler-rt/lib/fuzzer -I/Users/buildslave/jenkins/workspace/lldb-cmake/llvm-project/compiler-rt/lib/fuzzer -I/Applications/Xcode.app/Contents/Developer/Platforms/MacOSX.platform/Developer/SDKs/MacOSX10.15.sdk/usr/include/libxml2 -Iinclude -I/Users/buildslave/jenkins/workspace/lldb-cmake/llvm-project/llvm/include -I/Users/buildslave/jenkins/workspace/lldb-cmake/llvm-project/compiler-rt/lib/fuzzer/../../include -Wdocumentation -fPIC -fvisibility-inlines-hidden -Werror=date-time -Werror=unguarded-availability-new -fmodules -fmodules-cache-path=/Users/buildslave/jenkins/workspace/lldb-cmake/lldb-build/module.cache -fcxx-modules -Xclang -fmodules-local-submodule-visibility -Wall -Wextra -Wno-unused-parameter -Wwrite-strings -Wcast-qual -Wmissing-field-initializers -pedantic -Wno-long-long -Wimplicit-fallthrough -Wcovered-switch-default -Wno-noexcept-type -Wnon-virtual-dtor -Wdelete-non-virtual-dtor -Wsuggest-override -Wstring-conversion -fdiagnostics-color -Wall -std=c++14 -Wno-unused-parameter -O3  -arch x86_64 -arch x86_64h -isysroot /Applications/Xcode.app/Contents/Developer/Platforms/MacOSX.platform/Developer/SDKs/MacOSX10.15.sdk    -stdlib=libc++ -mmacosx-version-min=10.10 -isysroot /Applications/Xcode.app/Contents/Developer/Platforms/MacOSX.platform/Developer/SDKs/MacOSX10.15.sdk -fPIC -fno-builtin -fno-exceptions -funwind-tables -fno-stack-protector -fno-sanitize=safe-stack -fvisibility=hidden -fno-lto -O3 -gline-tables-only -fno-modules -Wno-gnu -Wno-variadic-macros -Wno-c99-extensions -Wno-non-virtual-dtor -fno-omit-frame-pointer -UNDEBUG -std=c++14 -MD -MT projects/compiler-rt/lib/fuzzer/CMakeFiles/RTfuzzer.osx.dir/FuzzerTracePC.cpp.o -MF projects/compiler-rt/lib/fuzzer/CMakeFiles/RTfuzzer.osx.dir/FuzzerTracePC.cpp.o.d -o projects/compiler-rt/lib/fuzzer/CMakeFiles/RTfuzzer.osx.dir/FuzzerTracePC.cpp.o -c /Users/buildslave/jenkins/workspace/lldb-cmake/llvm-project/compiler-rt/lib/fuzzer/FuzzerTracePC.cpp
clang-12: warning: argument unused during compilation: '-fmodules-cache-path=/Users/buildslave/jenkins/workspace/lldb-cmake/lldb-build/module.cache' [-Wunused-command-line-argument]
clang-12: warning: argument unused during compilation: '-fcxx-modules' [-Wunused-command-line-argument]
[490/3587] /Users/buildslave/jenkins/workspace/lldb-cmake/host-compiler/bin/clang++  -D_DEBUG -D__STDC_CONSTANT_MACROS -D__STDC_FORMAT_MACROS -D__STDC_LIMIT_MACROS -Iprojects/compiler-rt/lib/fuzzer -I/Users/buildslave/jenkins/workspace/lldb-cmake/llvm-project/compiler-rt/lib/fuzzer -I/Applications/Xcode.app/Contents/Developer/Platforms/MacOSX.platform/Developer/SDKs/MacOSX10.15.sdk/usr/include/libxml2 -Iinclude -I/Users/buildslave/jenkins/workspace/lldb-cmake/llvm-project/llvm/include -I/Users/buildslave/jenkins/workspace/lldb-cmake/llvm-project/compiler-rt/lib/fuzzer/../../include -Wdocumentation -fPIC -fvisibility-inlines-hidden -Werror=date-time -Werror=unguarded-availability-new -fmodules -fmodules-cache-path=/Users/buildslave/jenkins/workspace/lldb-cmake/lldb-build/module.cache -fcxx-modules -Xclang -fmodules-local-submodule-visibility -Wall -Wextra -Wno-unused-parameter -Wwrite-strings -Wcast-qual -Wmissing-field-initializers -pedantic -Wno-long-long -Wimplicit-fallthrough -Wcovered-switch-default -Wno-noexcept-type -Wnon-virtual-dtor -Wdelete-non-virtual-dtor -Wsuggest-override -Wstring-conversion -fdiagnostics-color -Wall -std=c++14 -Wno-unused-parameter -O3  -arch x86_64 -isysroot /Applications/Xcode.app/Contents/Developer/Platforms/MacOSX.platform/Developer/SDKs/MacOSX10.15.sdk    -stdlib=libc++ -mios-simulator-version-min=9.0 -isysroot /Applications/Xcode.app/Contents/Developer/Platforms/iPhoneSimulator.platform/Developer/SDKs/iPhoneSimulator13.5.sdk -fPIC -fno-builtin -fno-exceptions -funwind-tables -fno-stack-protector -fno-sanitize=safe-stack -fvisibility=hidden -fno-lto -O3 -gline-tables-only -fno-modules -Wno-gnu -Wno-variadic-macros -Wno-c99-extensions -Wno-non-virtual-dtor -fno-omit-frame-pointer -UNDEBUG -std=c++14 -MD -MT projects/compiler-rt/lib/fuzzer/CMakeFiles/RTfuzzer.iossim.dir/FuzzerIOPosix.cpp.o -MF projects/compiler-rt/lib/fuzzer/CMakeFiles/RTfuzzer.iossim.dir/FuzzerIOPosix.cpp.o.d -o projects/compiler-rt/lib/fuzzer/CMakeFiles/RTfuzzer.iossim.dir/FuzzerIOPosix.cpp.o -c /Users/buildslave/jenkins/workspace/lldb-cmake/llvm-project/compiler-rt/lib/fuzzer/FuzzerIOPosix.cpp
clang-12: warning: argument unused during compilation: '-fmodules-cache-path=/Users/buildslave/jenkins/workspace/lldb-cmake/lldb-build/module.cache' [-Wunused-command-line-argument]
clang-12: warning: argument unused during compilation: '-fcxx-modules' [-Wunused-command-line-argument]
[491/3587] /Users/buildslave/jenkins/workspace/lldb-cmake/host-compiler/bin/clang++  -D_DEBUG -D__STDC_CONSTANT_MACROS -D__STDC_FORMAT_MACROS -D__STDC_LIMIT_MACROS -Iprojects/compiler-rt/lib/fuzzer -I/Users/buildslave/jenkins/workspace/lldb-cmake/llvm-project/compiler-rt/lib/fuzzer -I/Applications/Xcode.app/Contents/Developer/Platforms/MacOSX.platform/Developer/SDKs/MacOSX10.15.sdk/usr/include/libxml2 -Iinclude -I/Users/buildslave/jenkins/workspace/lldb-cmake/llvm-project/llvm/include -I/Users/buildslave/jenkins/workspace/lldb-cmake/llvm-project/compiler-rt/lib/fuzzer/../../include -Wdocumentation -fPIC -fvisibility-inlines-hidden -Werror=date-time -Werror=unguarded-availability-new -fmodules -fmodules-cache-path=/Users/buildslave/jenkins/workspace/lldb-cmake/lldb-build/module.cache -fcxx-modules -Xclang -fmodules-local-submodule-visibility -Wall -Wextra -Wno-unused-parameter -Wwrite-strings -Wcast-qual -Wmissing-field-initializers -pedantic -Wno-long-long -Wimplicit-fallthrough -Wcovered-switch-default -Wno-noexcept-type -Wnon-virtual-dtor -Wdelete-non-virtual-dtor -Wsuggest-override -Wstring-conversion -fdiagnostics-color -Wall -std=c++14 -Wno-unused-parameter -O3  -arch x86_64 -isysroot /Applications/Xcode.app/Contents/Developer/Platforms/MacOSX.platform/Developer/SDKs/MacOSX10.15.sdk    -stdlib=libc++ -mios-simulator-version-min=9.0 -isysroot /Applications/Xcode.app/Contents/Developer/Platforms/iPhoneSimulator.platform/Developer/SDKs/iPhoneSimulator13.5.sdk -fPIC -fno-builtin -fno-exceptions -funwind-tables -fno-stack-protector -fno-sanitize=safe-stack -fvisibility=hidden -fno-lto -O3 -gline-tables-only -fno-modules -Wno-gnu -Wno-variadic-macros -Wno-c99-extensions -Wno-non-virtual-dtor -fno-omit-frame-pointer -UNDEBUG -std=c++14 -MD -MT projects/compiler-rt/lib/fuzzer/CMakeFiles/RTfuzzer.iossim.dir/FuzzerIO.cpp.o -MF projects/compiler-rt/lib/fuzzer/CMakeFiles/RTfuzzer.iossim.dir/FuzzerIO.cpp.o.d -o projects/compiler-rt/lib/fuzzer/CMakeFiles/RTfuzzer.iossim.dir/FuzzerIO.cpp.o -c /Users/buildslave/jenkins/workspace/lldb-cmake/llvm-project/compiler-rt/lib/fuzzer/FuzzerIO.cpp
clang-12: warning: argument unused during compilation: '-fmodules-cache-path=/Users/buildslave/jenkins/workspace/lldb-cmake/lldb-build/module.cache' [-Wunused-command-line-argument]
clang-12: warning: argument unused during compilation: '-fcxx-modules' [-Wunused-command-line-argument]
[492/3587] /Users/buildslave/jenkins/workspace/lldb-cmake/host-compiler/bin/clang++  -D_DEBUG -D__STDC_CONSTANT_MACROS -D__STDC_FORMAT_MACROS -D__STDC_LIMIT_MACROS -Iprojects/compiler-rt/lib/fuzzer -I/Users/buildslave/jenkins/workspace/lldb-cmake/llvm-project/compiler-rt/lib/fuzzer -I/Applications/Xcode.app/Contents/Developer/Platforms/MacOSX.platform/Developer/SDKs/MacOSX10.15.sdk/usr/include/libxml2 -Iinclude -I/Users/buildslave/jenkins/workspace/lldb-cmake/llvm-project/llvm/include -I/Users/buildslave/jenkins/workspace/lldb-cmake/llvm-project/compiler-rt/lib/fuzzer/../../include -Wdocumentation -fPIC -fvisibility-inlines-hidden -Werror=date-time -Werror=unguarded-availability-new -fmodules -fmodules-cache-path=/Users/buildslave/jenkins/workspace/lldb-cmake/lldb-build/module.cache -fcxx-modules -Xclang -fmodules-local-submodule-visibility -Wall -Wextra -Wno-unused-parameter -Wwrite-strings -Wcast-qual -Wmissing-field-initializers -pedantic -Wno-long-long -Wimplicit-fallthrough -Wcovered-switch-default -Wno-noexcept-type -Wnon-virtual-dtor -Wdelete-non-virtual-dtor -Wsuggest-override -Wstring-conversion -fdiagnostics-color -Wall -std=c++14 -Wno-unused-parameter -O3  -arch x86_64 -arch x86_64h -isysroot /Applications/Xcode.app/Contents/Developer/Platforms/MacOSX.platform/Developer/SDKs/MacOSX10.15.sdk    -stdlib=libc++ -mmacosx-version-min=10.10 -isysroot /Applications/Xcode.app/Contents/Developer/Platforms/MacOSX.platform/Developer/SDKs/MacOSX10.15.sdk -fPIC -fno-builtin -fno-exceptions -funwind-tables -fno-stack-protector -fno-sanitize=safe-stack -fvisibility=hidden -fno-lto -O3 -gline-tables-only -fno-modules -Wno-gnu -Wno-variadic-macros -Wno-c99-extensions -Wno-non-virtual-dtor -fno-omit-frame-pointer -UNDEBUG -std=c++14 -MD -MT projects/compiler-rt/lib/fuzzer/CMakeFiles/RTfuzzer.osx.dir/FuzzerMerge.cpp.o -MF projects/compiler-rt/lib/fuzzer/CMakeFiles/RTfuzzer.osx.dir/FuzzerMerge.cpp.o.d -o projects/compiler-rt/lib/fuzzer/CMakeFiles/RTfuzzer.osx.dir/FuzzerMerge.cpp.o -c /Users/buildslave/jenkins/workspace/lldb-cmake/llvm-project/compiler-rt/lib/fuzzer/FuzzerMerge.cpp
clang-12: warning: argument unused during compilation: '-fmodules-cache-path=/Users/buildslave/jenkins/workspace/lldb-cmake/lldb-build/module.cache' [-Wunused-command-line-argument]
clang-12: warning: argument unused during compilation: '-fcxx-modules' [-Wunused-command-line-argument]
[493/3587] /Users/buildslave/jenkins/workspace/lldb-cmake/host-compiler/bin/clang++  -D_DEBUG -D__STDC_CONSTANT_MACROS -D__STDC_FORMAT_MACROS -D__STDC_LIMIT_MACROS -Iprojects/compiler-rt/lib/fuzzer -I/Users/buildslave/jenkins/workspace/lldb-cmake/llvm-project/compiler-rt/lib/fuzzer -I/Applications/Xcode.app/Contents/Developer/Platforms/MacOSX.platform/Developer/SDKs/MacOSX10.15.sdk/usr/include/libxml2 -Iinclude -I/Users/buildslave/jenkins/workspace/lldb-cmake/llvm-project/llvm/include -I/Users/buildslave/jenkins/workspace/lldb-cmake/llvm-project/compiler-rt/lib/fuzzer/../../include -Wdocumentation -fPIC -fvisibility-inlines-hidden -Werror=date-time -Werror=unguarded-availability-new -fmodules -fmodules-cache-path=/Users/buildslave/jenkins/workspace/lldb-cmake/lldb-build/module.cache -fcxx-modules -Xclang -fmodules-local-submodule-visibility -Wall -Wextra -Wno-unused-parameter -Wwrite-strings -Wcast-qual -Wmissing-field-initializers -pedantic -Wno-long-long -Wimplicit-fallthrough -Wcovered-switch-default -Wno-noexcept-type -Wnon-virtual-dtor -Wdelete-non-virtual-dtor -Wsuggest-override -Wstring-conversion -fdiagnostics-color -Wall -std=c++14 -Wno-unused-parameter -O3  -arch x86_64 -arch x86_64h -isysroot /Applications/Xcode.app/Contents/Developer/Platforms/MacOSX.platform/Developer/SDKs/MacOSX10.15.sdk    -stdlib=libc++ -mmacosx-version-min=10.10 -isysroot /Applications/Xcode.app/Contents/Developer/Platforms/MacOSX.platform/Developer/SDKs/MacOSX10.15.sdk -fPIC -fno-builtin -fno-exceptions -funwind-tables -fno-stack-protector -fno-sanitize=safe-stack -fvisibility=hidden -fno-lto -O3 -gline-tables-only -fno-modules -Wno-gnu -Wno-variadic-macros -Wno-c99-extensions -Wno-non-virtual-dtor -fno-omit-frame-pointer -UNDEBUG -std=c++14 -MD -MT projects/compiler-rt/lib/fuzzer/CMakeFiles/RTfuzzer.osx.dir/FuzzerLoop.cpp.o -MF projects/compiler-rt/lib/fuzzer/CMakeFiles/RTfuzzer.osx.dir/FuzzerLoop.cpp.o.d -o projects/compiler-rt/lib/fuzzer/CMakeFiles/RTfuzzer.osx.dir/FuzzerLoop.cpp.o -c /Users/buildslave/jenkins/workspace/lldb-cmake/llvm-project/compiler-rt/lib/fuzzer/FuzzerLoop.cpp
clang-12: warning: argument unused during compilation: '-fmodules-cache-path=/Users/buildslave/jenkins/workspace/lldb-cmake/lldb-build/module.cache' [-Wunused-command-line-argument]
clang-12: warning: argument unused during compilation: '-fcxx-modules' [-Wunused-command-line-argument]
[494/3587] /Users/buildslave/jenkins/workspace/lldb-cmake/host-compiler/bin/clang++  -D_DEBUG -D__STDC_CONSTANT_MACROS -D__STDC_FORMAT_MACROS -D__STDC_LIMIT_MACROS -Iprojects/compiler-rt/lib/fuzzer -I/Users/buildslave/jenkins/workspace/lldb-cmake/llvm-project/compiler-rt/lib/fuzzer -I/Applications/Xcode.app/Contents/Developer/Platforms/MacOSX.platform/Developer/SDKs/MacOSX10.15.sdk/usr/include/libxml2 -Iinclude -I/Users/buildslave/jenkins/workspace/lldb-cmake/llvm-project/llvm/include -I/Users/buildslave/jenkins/workspace/lldb-cmake/llvm-project/compiler-rt/lib/fuzzer/../../include -Wdocumentation -fPIC -fvisibility-inlines-hidden -Werror=date-time -Werror=unguarded-availability-new -fmodules -fmodules-cache-path=/Users/buildslave/jenkins/workspace/lldb-cmake/lldb-build/module.cache -fcxx-modules -Xclang -fmodules-local-submodule-visibility -Wall -Wextra -Wno-unused-parameter -Wwrite-strings -Wcast-qual -Wmissing-field-initializers -pedantic -Wno-long-long -Wimplicit-fallthrough -Wcovered-switch-default -Wno-noexcept-type -Wnon-virtual-dtor -Wdelete-non-virtual-dtor -Wsuggest-override -Wstring-conversion -fdiagnostics-color -Wall -std=c++14 -Wno-unused-parameter -O3  -arch x86_64 -isysroot /Applications/Xcode.app/Contents/Developer/Platforms/MacOSX.platform/Developer/SDKs/MacOSX10.15.sdk    -stdlib=libc++ -mios-simulator-version-min=9.0 -isysroot /Applications/Xcode.app/Contents/Developer/Platforms/iPhoneSimulator.platform/Developer/SDKs/iPhoneSimulator13.5.sdk -fPIC -fno-builtin -fno-exceptions -funwind-tables -fno-stack-protector -fno-sanitize=safe-stack -fvisibility=hidden -fno-lto -O3 -gline-tables-only -fno-modules -Wno-gnu -Wno-variadic-macros -Wno-c99-extensions -Wno-non-virtual-dtor -fno-omit-frame-pointer -UNDEBUG -std=c++14 -MD -MT projects/compiler-rt/lib/fuzzer/CMakeFiles/RTfuzzer.iossim.dir/FuzzerSHA1.cpp.o -MF projects/compiler-rt/lib/fuzzer/CMakeFiles/RTfuzzer.iossim.dir/FuzzerSHA1.cpp.o.d -o projects/compiler-rt/lib/fuzzer/CMakeFiles/RTfuzzer.iossim.dir/FuzzerSHA1.cpp.o -c /Users/buildslave/jenkins/workspace/lldb-cmake/llvm-project/compiler-rt/lib/fuzzer/FuzzerSHA1.cpp
clang-12: warning: argument unused during compilation: '-fmodules-cache-path=/Users/buildslave/jenkins/workspace/lldb-cmake/lldb-build/module.cache' [-Wunused-command-line-argument]
clang-12: warning: argument unused during compilation: '-fcxx-modules' [-Wunused-command-line-argument]
[495/3587] /Users/buildslave/jenkins/workspace/lldb-cmake/host-compiler/bin/clang++  -D_DEBUG -D__STDC_CONSTANT_MACROS -D__STDC_FORMAT_MACROS -D__STDC_LIMIT_MACROS -Iprojects/compiler-rt/lib/fuzzer -I/Users/buildslave/jenkins/workspace/lldb-cmake/llvm-project/compiler-rt/lib/fuzzer -I/Applications/Xcode.app/Contents/Developer/Platforms/MacOSX.platform/Developer/SDKs/MacOSX10.15.sdk/usr/include/libxml2 -Iinclude -I/Users/buildslave/jenkins/workspace/lldb-cmake/llvm-project/llvm/include -I/Users/buildslave/jenkins/workspace/lldb-cmake/llvm-project/compiler-rt/lib/fuzzer/../../include -Wdocumentation -fPIC -fvisibility-inlines-hidden -Werror=date-time -Werror=unguarded-availability-new -fmodules -fmodules-cache-path=/Users/buildslave/jenkins/workspace/lldb-cmake/lldb-build/module.cache -fcxx-modules -Xclang -fmodules-local-submodule-visibility -Wall -Wextra -Wno-unused-parameter -Wwrite-strings -Wcast-qual -Wmissing-field-initializers -pedantic -Wno-long-long -Wimplicit-fallthrough -Wcovered-switch-default -Wno-noexcept-type -Wnon-virtual-dtor -Wdelete-non-virtual-dtor -Wsuggest-override -Wstring-conversion -fdiagnostics-color -Wall -std=c++14 -Wno-unused-parameter -O3  -arch x86_64 -isysroot /Applications/Xcode.app/Contents/Developer/Platforms/MacOSX.platform/Developer/SDKs/MacOSX10.15.sdk    -stdlib=libc++ -mios-simulator-version-min=9.0 -isysroot /Applications/Xcode.app/Contents/Developer/Platforms/iPhoneSimulator.platform/Developer/SDKs/iPhoneSimulator13.5.sdk -fPIC -fno-builtin -fno-exceptions -funwind-tables -fno-stack-protector -fno-sanitize=safe-stack -fvisibility=hidden -fno-lto -O3 -gline-tables-only -fno-modules -Wno-gnu -Wno-variadic-macros -Wno-c99-extensions -Wno-non-virtual-dtor -fno-omit-frame-pointer -UNDEBUG -std=c++14 -MD -MT projects/compiler-rt/lib/fuzzer/CMakeFiles/RTfuzzer.iossim.dir/FuzzerMutate.cpp.o -MF projects/compiler-rt/lib/fuzzer/CMakeFiles/RTfuzzer.iossim.dir/FuzzerMutate.cpp.o.d -o projects/compiler-rt/lib/fuzzer/CMakeFiles/RTfuzzer.iossim.dir/FuzzerMutate.cpp.o -c /Users/buildslave/jenkins/workspace/lldb-cmake/llvm-project/compiler-rt/lib/fuzzer/FuzzerMutate.cpp
clang-12: warning: argument unused during compilation: '-fmodules-cache-path=/Users/buildslave/jenkins/workspace/lldb-cmake/lldb-build/module.cache' [-Wunused-command-line-argument]
clang-12: warning: argument unused during compilation: '-fcxx-modules' [-Wunused-command-line-argument]
[496/3587] /Users/buildslave/jenkins/workspace/lldb-cmake/host-compiler/bin/clang++  -D_DEBUG -D__STDC_CONSTANT_MACROS -D__STDC_FORMAT_MACROS -D__STDC_LIMIT_MACROS -Iprojects/compiler-rt/lib/fuzzer -I/Users/buildslave/jenkins/workspace/lldb-cmake/llvm-project/compiler-rt/lib/fuzzer -I/Applications/Xcode.app/Contents/Developer/Platforms/MacOSX.platform/Developer/SDKs/MacOSX10.15.sdk/usr/include/libxml2 -Iinclude -I/Users/buildslave/jenkins/workspace/lldb-cmake/llvm-project/llvm/include -I/Users/buildslave/jenkins/workspace/lldb-cmake/llvm-project/compiler-rt/lib/fuzzer/../../include -Wdocumentation -fPIC -fvisibility-inlines-hidden -Werror=date-time -Werror=unguarded-availability-new -fmodules -fmodules-cache-path=/Users/buildslave/jenkins/workspace/lldb-cmake/lldb-build/module.cache -fcxx-modules -Xclang -fmodules-local-submodule-visibility -Wall -Wextra -Wno-unused-parameter -Wwrite-strings -Wcast-qual -Wmissing-field-initializers -pedantic -Wno-long-long -Wimplicit-fallthrough -Wcovered-switch-default -Wno-noexcept-type -Wnon-virtual-dtor -Wdelete-non-virtual-dtor -Wsuggest-override -Wstring-conversion -fdiagnostics-color -Wall -std=c++14 -Wno-unused-parameter -O3  -arch x86_64 -isysroot /Applications/Xcode.app/Contents/Developer/Platforms/MacOSX.platform/Developer/SDKs/MacOSX10.15.sdk    -stdlib=libc++ -mios-simulator-version-min=9.0 -isysroot /Applications/Xcode.app/Contents/Developer/Platforms/iPhoneSimulator.platform/Developer/SDKs/iPhoneSimulator13.5.sdk -fPIC -fno-builtin -fno-exceptions -funwind-tables -fno-stack-protector -fno-sanitize=safe-stack -fvisibility=hidden -fno-lto -O3 -gline-tables-only -fno-modules -Wno-gnu -Wno-variadic-macros -Wno-c99-extensions -Wno-non-virtual-dtor -fno-omit-frame-pointer -UNDEBUG -std=c++14 -MD -MT projects/compiler-rt/lib/fuzzer/CMakeFiles/RTfuzzer.iossim.dir/FuzzerDataFlowTrace.cpp.o -MF projects/compiler-rt/lib/fuzzer/CMakeFiles/RTfuzzer.iossim.dir/FuzzerDataFlowTrace.cpp.o.d -o projects/compiler-rt/lib/fuzzer/CMakeFiles/RTfuzzer.iossim.dir/FuzzerDataFlowTrace.cpp.o -c /Users/buildslave/jenkins/workspace/lldb-cmake/llvm-project/compiler-rt/lib/fuzzer/FuzzerDataFlowTrace.cpp
clang-12: warning: argument unused during compilation: '-fmodules-cache-path=/Users/buildslave/jenkins/workspace/lldb-cmake/lldb-build/module.cache' [-Wunused-command-line-argument]
clang-12: warning: argument unused during compilation: '-fcxx-modules' [-Wunused-command-line-argument]
[497/3587] /Users/buildslave/jenkins/workspace/lldb-cmake/host-compiler/bin/clang++  -D_DEBUG -D__STDC_CONSTANT_MACROS -D__STDC_FORMAT_MACROS -D__STDC_LIMIT_MACROS -Iprojects/compiler-rt/lib/fuzzer -I/Users/buildslave/jenkins/workspace/lldb-cmake/llvm-project/compiler-rt/lib/fuzzer -I/Applications/Xcode.app/Contents/Developer/Platforms/MacOSX.platform/Developer/SDKs/MacOSX10.15.sdk/usr/include/libxml2 -Iinclude -I/Users/buildslave/jenkins/workspace/lldb-cmake/llvm-project/llvm/include -I/Users/buildslave/jenkins/workspace/lldb-cmake/llvm-project/compiler-rt/lib/fuzzer/../../include -Wdocumentation -fPIC -fvisibility-inlines-hidden -Werror=date-time -Werror=unguarded-availability-new -fmodules -fmodules-cache-path=/Users/buildslave/jenkins/workspace/lldb-cmake/lldb-build/module.cache -fcxx-modules -Xclang -fmodules-local-submodule-visibility -Wall -Wextra -Wno-unused-parameter -Wwrite-strings -Wcast-qual -Wmissing-field-initializers -pedantic -Wno-long-long -Wimplicit-fallthrough -Wcovered-switch-default -Wno-noexcept-type -Wnon-virtual-dtor -Wdelete-non-virtual-dtor -Wsuggest-override -Wstring-conversion -fdiagnostics-color -Wall -std=c++14 -Wno-unused-parameter -O3  -arch x86_64 -isysroot /Applications/Xcode.app/Contents/Developer/Platforms/MacOSX.platform/Developer/SDKs/MacOSX10.15.sdk    -stdlib=libc++ -mios-simulator-version-min=9.0 -isysroot /Applications/Xcode.app/Contents/Developer/Platforms/iPhoneSimulator.platform/Developer/SDKs/iPhoneSimulator13.5.sdk -fPIC -fno-builtin -fno-exceptions -funwind-tables -fno-stack-protector -fno-sanitize=safe-stack -fvisibility=hidden -fno-lto -O3 -gline-tables-only -fno-modules -Wno-gnu -Wno-variadic-macros -Wno-c99-extensions -Wno-non-virtual-dtor -fno-omit-frame-pointer -UNDEBUG -std=c++14 -MD -MT projects/compiler-rt/lib/fuzzer/CMakeFiles/RTfuzzer.iossim.dir/FuzzerUtilDarwin.cpp.o -MF projects/compiler-rt/lib/fuzzer/CMakeFiles/RTfuzzer.iossim.dir/FuzzerUtilDarwin.cpp.o.d -o projects/compiler-rt/lib/fuzzer/CMakeFiles/RTfuzzer.iossim.dir/FuzzerUtilDarwin.cpp.o -c /Users/buildslave/jenkins/workspace/lldb-cmake/llvm-project/compiler-rt/lib/fuzzer/FuzzerUtilDarwin.cpp
clang-12: warning: argument unused during compilation: '-fmodules-cache-path=/Users/buildslave/jenkins/workspace/lldb-cmake/lldb-build/module.cache' [-Wunused-command-line-argument]
clang-12: warning: argument unused during compilation: '-fcxx-modules' [-Wunused-command-line-argument]
[498/3587] /Users/buildslave/jenkins/workspace/lldb-cmake/host-compiler/bin/clang++  -D_DEBUG -D__STDC_CONSTANT_MACROS -D__STDC_FORMAT_MACROS -D__STDC_LIMIT_MACROS -Iprojects/compiler-rt/lib/fuzzer -I/Users/buildslave/jenkins/workspace/lldb-cmake/llvm-project/compiler-rt/lib/fuzzer -I/Applications/Xcode.app/Contents/Developer/Platforms/MacOSX.platform/Developer/SDKs/MacOSX10.15.sdk/usr/include/libxml2 -Iinclude -I/Users/buildslave/jenkins/workspace/lldb-cmake/llvm-project/llvm/include -I/Users/buildslave/jenkins/workspace/lldb-cmake/llvm-project/compiler-rt/lib/fuzzer/../../include -Wdocumentation -fPIC -fvisibility-inlines-hidden -Werror=date-time -Werror=unguarded-availability-new -fmodules -fmodules-cache-path=/Users/buildslave/jenkins/workspace/lldb-cmake/lldb-build/module.cache -fcxx-modules -Xclang -fmodules-local-submodule-visibility -Wall -Wextra -Wno-unused-parameter -Wwrite-strings -Wcast-qual -Wmissing-field-initializers -pedantic -Wno-long-long -Wimplicit-fallthrough -Wcovered-switch-default -Wno-noexcept-type -Wnon-virtual-dtor -Wdelete-non-virtual-dtor -Wsuggest-override -Wstring-conversion -fdiagnostics-color -Wall -std=c++14 -Wno-unused-parameter -O3  -arch x86_64 -isysroot /Applications/Xcode.app/Contents/Developer/Platforms/MacOSX.platform/Developer/SDKs/MacOSX10.15.sdk    -stdlib=libc++ -mios-simulator-version-min=9.0 -isysroot /Applications/Xcode.app/Contents/Developer/Platforms/iPhoneSimulator.platform/Developer/SDKs/iPhoneSimulator13.5.sdk -fPIC -fno-builtin -fno-exceptions -funwind-tables -fno-stack-protector -fno-sanitize=safe-stack -fvisibility=hidden -fno-lto -O3 -gline-tables-only -fno-modules -Wno-gnu -Wno-variadic-macros -Wno-c99-extensions -Wno-non-virtual-dtor -fno-omit-frame-pointer -UNDEBUG -std=c++14 -MD -MT projects/compiler-rt/lib/fuzzer/CMakeFiles/RTfuzzer.iossim.dir/FuzzerFork.cpp.o -MF projects/compiler-rt/lib/fuzzer/CMakeFiles/RTfuzzer.iossim.dir/FuzzerFork.cpp.o.d -o projects/compiler-rt/lib/fuzzer/CMakeFiles/RTfuzzer.iossim.dir/FuzzerFork.cpp.o -c /Users/buildslave/jenkins/workspace/lldb-cmake/llvm-project/compiler-rt/lib/fuzzer/FuzzerFork.cpp
clang-12: warning: argument unused during compilation: '-fmodules-cache-path=/Users/buildslave/jenkins/workspace/lldb-cmake/lldb-build/module.cache' [-Wunused-command-line-argument]
clang-12: warning: argument unused during compilation: '-fcxx-modules' [-Wunused-command-line-argument]
[499/3587] /Users/buildslave/jenkins/workspace/lldb-cmake/host-compiler/bin/clang++  -D_DEBUG -D__STDC_CONSTANT_MACROS -D__STDC_FORMAT_MACROS -D__STDC_LIMIT_MACROS -Iprojects/compiler-rt/lib/fuzzer -I/Users/buildslave/jenkins/workspace/lldb-cmake/llvm-project/compiler-rt/lib/fuzzer -I/Applications/Xcode.app/Contents/Developer/Platforms/MacOSX.platform/Developer/SDKs/MacOSX10.15.sdk/usr/include/libxml2 -Iinclude -I/Users/buildslave/jenkins/workspace/lldb-cmake/llvm-project/llvm/include -I/Users/buildslave/jenkins/workspace/lldb-cmake/llvm-project/compiler-rt/lib/fuzzer/../../include -Wdocumentation -fPIC -fvisibility-inlines-hidden -Werror=date-time -Werror=unguarded-availability-new -fmodules -fmodules-cache-path=/Users/buildslave/jenkins/workspace/lldb-cmake/lldb-build/module.cache -fcxx-modules -Xclang -fmodules-local-submodule-visibility -Wall -Wextra -Wno-unused-parameter -Wwrite-strings -Wcast-qual -Wmissing-field-initializers -pedantic -Wno-long-long -Wimplicit-fallthrough -Wcovered-switch-default -Wno-noexcept-type -Wnon-virtual-dtor -Wdelete-non-virtual-dtor -Wsuggest-override -Wstring-conversion -fdiagnostics-color -Wall -std=c++14 -Wno-unused-parameter -O3  -arch x86_64 -isysroot /Applications/Xcode.app/Contents/Developer/Platforms/MacOSX.platform/Developer/SDKs/MacOSX10.15.sdk    -stdlib=libc++ -mios-simulator-version-min=9.0 -isysroot /Applications/Xcode.app/Contents/Developer/Platforms/iPhoneSimulator.platform/Developer/SDKs/iPhoneSimulator13.5.sdk -fPIC -fno-builtin -fno-exceptions -funwind-tables -fno-stack-protector -fno-sanitize=safe-stack -fvisibility=hidden -fno-lto -O3 -gline-tables-only -fno-modules -Wno-gnu -Wno-variadic-macros -Wno-c99-extensions -Wno-non-virtual-dtor -fno-omit-frame-pointer -UNDEBUG -std=c++14 -MD -MT projects/compiler-rt/lib/fuzzer/CMakeFiles/RTfuzzer_main.iossim.dir/FuzzerMain.cpp.o -MF projects/compiler-rt/lib/fuzzer/CMakeFiles/RTfuzzer_main.iossim.dir/FuzzerMain.cpp.o.d -o projects/compiler-rt/lib/fuzzer/CMakeFiles/RTfuzzer_main.iossim.dir/FuzzerMain.cpp.o -c /Users/buildslave/jenkins/workspace/lldb-cmake/llvm-project/compiler-rt/lib/fuzzer/FuzzerMain.cpp
clang-12: warning: argument unused during compilation: '-fmodules-cache-path=/Users/buildslave/jenkins/workspace/lldb-cmake/lldb-build/module.cache' [-Wunused-command-line-argument]
clang-12: warning: argument unused during compilation: '-fcxx-modules' [-Wunused-command-line-argument]
[500/3587] /Users/buildslave/jenkins/workspace/lldb-cmake/host-compiler/bin/clang++  -D_DEBUG -D__STDC_CONSTANT_MACROS -D__STDC_FORMAT_MACROS -D__STDC_LIMIT_MACROS -Iprojects/compiler-rt/lib/fuzzer -I/Users/buildslave/jenkins/workspace/lldb-cmake/llvm-project/compiler-rt/lib/fuzzer -I/Applications/Xcode.app/Contents/Developer/Platforms/MacOSX.platform/Developer/SDKs/MacOSX10.15.sdk/usr/include/libxml2 -Iinclude -I/Users/buildslave/jenkins/workspace/lldb-cmake/llvm-project/llvm/include -I/Users/buildslave/jenkins/workspace/lldb-cmake/llvm-project/compiler-rt/lib/fuzzer/../../include -Wdocumentation -fPIC -fvisibility-inlines-hidden -Werror=date-time -Werror=unguarded-availability-new -fmodules -fmodules-cache-path=/Users/buildslave/jenkins/workspace/lldb-cmake/lldb-build/module.cache -fcxx-modules -Xclang -fmodules-local-submodule-visibility -Wall -Wextra -Wno-unused-parameter -Wwrite-strings -Wcast-qual -Wmissing-field-initializers -pedantic -Wno-long-long -Wimplicit-fallthrough -Wcovered-switch-default -Wno-noexcept-type -Wnon-virtual-dtor -Wdelete-non-virtual-dtor -Wsuggest-override -Wstring-conversion -fdiagnostics-color -Wall -std=c++14 -Wno-unused-parameter -O3  -arch x86_64 -isysroot /Applications/Xcode.app/Contents/Developer/Platforms/MacOSX.platform/Developer/SDKs/MacOSX10.15.sdk    -stdlib=libc++ -mios-simulator-version-min=9.0 -isysroot /Applications/Xcode.app/Contents/Developer/Platforms/iPhoneSimulator.platform/Developer/SDKs/iPhoneSimulator13.5.sdk -fPIC -fno-builtin -fno-exceptions -funwind-tables -fno-stack-protector -fno-sanitize=safe-stack -fvisibility=hidden -fno-lto -O3 -gline-tables-only -fno-modules -Wno-gnu -Wno-variadic-macros -Wno-c99-extensions -Wno-non-virtual-dtor -fno-omit-frame-pointer -UNDEBUG -std=c++14 -MD -MT projects/compiler-rt/lib/fuzzer/CMakeFiles/RTfuzzer.iossim.dir/FuzzerUtilPosix.cpp.o -MF projects/compiler-rt/lib/fuzzer/CMakeFiles/RTfuzzer.iossim.dir/FuzzerUtilPosix.cpp.o.d -o projects/compiler-rt/lib/fuzzer/CMakeFiles/RTfuzzer.iossim.dir/FuzzerUtilPosix.cpp.o -c /Users/buildslave/jenkins/workspace/lldb-cmake/llvm-project/compiler-rt/lib/fuzzer/FuzzerUtilPosix.cpp
clang-12: warning: argument unused during compilation: '-fmodules-cache-path=/Users/buildslave/jenkins/workspace/lldb-cmake/lldb-build/module.cache' [-Wunused-command-line-argument]
clang-12: warning: argument unused during compilation: '-fcxx-modules' [-Wunused-command-line-argument]
[501/3587] /Users/buildslave/jenkins/workspace/lldb-cmake/host-compiler/bin/clang++  -D_DEBUG -D__STDC_CONSTANT_MACROS -D__STDC_FORMAT_MACROS -D__STDC_LIMIT_MACROS -Iprojects/compiler-rt/lib/fuzzer -I/Users/buildslave/jenkins/workspace/lldb-cmake/llvm-project/compiler-rt/lib/fuzzer -I/Applications/Xcode.app/Contents/Developer/Platforms/MacOSX.platform/Developer/SDKs/MacOSX10.15.sdk/usr/include/libxml2 -Iinclude -I/Users/buildslave/jenkins/workspace/lldb-cmake/llvm-project/llvm/include -I/Users/buildslave/jenkins/workspace/lldb-cmake/llvm-project/compiler-rt/lib/fuzzer/../../include -Wdocumentation -fPIC -fvisibility-inlines-hidden -Werror=date-time -Werror=unguarded-availability-new -fmodules -fmodules-cache-path=/Users/buildslave/jenkins/workspace/lldb-cmake/lldb-build/module.cache -fcxx-modules -Xclang -fmodules-local-submodule-visibility -Wall -Wextra -Wno-unused-parameter -Wwrite-strings -Wcast-qual -Wmissing-field-initializers -pedantic -Wno-long-long -Wimplicit-fallthrough -Wcovered-switch-default -Wno-noexcept-type -Wnon-virtual-dtor -Wdelete-non-virtual-dtor -Wsuggest-override -Wstring-conversion -fdiagnostics-color -Wall -std=c++14 -Wno-unused-parameter -O3  -arch x86_64 -isysroot /Applications/Xcode.app/Contents/Developer/Platforms/MacOSX.platform/Developer/SDKs/MacOSX10.15.sdk    -stdlib=libc++ -mios-simulator-version-min=9.0 -isysroot /Applications/Xcode.app/Contents/Developer/Platforms/iPhoneSimulator.platform/Developer/SDKs/iPhoneSimulator13.5.sdk -fPIC -fno-builtin -fno-exceptions -funwind-tables -fno-stack-protector -fno-sanitize=safe-stack -fvisibility=hidden -fno-lto -O3 -gline-tables-only -fno-modules -Wno-gnu -Wno-variadic-macros -Wno-c99-extensions -Wno-non-virtual-dtor -fno-omit-frame-pointer -UNDEBUG -std=c++14 -MD -MT projects/compiler-rt/lib/fuzzer/CMakeFiles/RTfuzzer.iossim.dir/FuzzerUtil.cpp.o -MF projects/compiler-rt/lib/fuzzer/CMakeFiles/RTfuzzer.iossim.dir/FuzzerUtil.cpp.o.d -o projects/compiler-rt/lib/fuzzer/CMakeFiles/RTfuzzer.iossim.dir/FuzzerUtil.cpp.o -c /Users/buildslave/jenkins/workspace/lldb-cmake/llvm-project/compiler-rt/lib/fuzzer/FuzzerUtil.cpp
clang-12: warning: argument unused during compilation: '-fmodules-cache-path=/Users/buildslave/jenkins/workspace/lldb-cmake/lldb-build/module.cache' [-Wunused-command-line-argument]
clang-12: warning: argument unused during compilation: '-fcxx-modules' [-Wunused-command-line-argument]
[502/3587] /Users/buildslave/jenkins/workspace/lldb-cmake/host-compiler/bin/clang++  -D_DEBUG -D__STDC_CONSTANT_MACROS -D__STDC_FORMAT_MACROS -D__STDC_LIMIT_MACROS -Iprojects/compiler-rt/lib/fuzzer -I/Users/buildslave/jenkins/workspace/lldb-cmake/llvm-project/compiler-rt/lib/fuzzer -I/Applications/Xcode.app/Contents/Developer/Platforms/MacOSX.platform/Developer/SDKs/MacOSX10.15.sdk/usr/include/libxml2 -Iinclude -I/Users/buildslave/jenkins/workspace/lldb-cmake/llvm-project/llvm/include -I/Users/buildslave/jenkins/workspace/lldb-cmake/llvm-project/compiler-rt/lib/fuzzer/../../include -Wdocumentation -fPIC -fvisibility-inlines-hidden -Werror=date-time -Werror=unguarded-availability-new -fmodules -fmodules-cache-path=/Users/buildslave/jenkins/workspace/lldb-cmake/lldb-build/module.cache -fcxx-modules -Xclang -fmodules-local-submodule-visibility -Wall -Wextra -Wno-unused-parameter -Wwrite-strings -Wcast-qual -Wmissing-field-initializers -pedantic -Wno-long-long -Wimplicit-fallthrough -Wcovered-switch-default -Wno-noexcept-type -Wnon-virtual-dtor -Wdelete-non-virtual-dtor -Wsuggest-override -Wstring-conversion -fdiagnostics-color -Wall -std=c++14 -Wno-unused-parameter -O3  -arch arm64 -isysroot /Applications/Xcode.app/Contents/Developer/Platforms/MacOSX.platform/Developer/SDKs/MacOSX10.15.sdk    -stdlib=libc++ -miphoneos-version-min=9.0 -isysroot /Applications/Xcode.app/Contents/Developer/Platforms/iPhoneOS.platform/Developer/SDKs/iPhoneOS13.5.sdk -fPIC -fno-builtin -fno-exceptions -funwind-tables -fno-stack-protector -fno-sanitize=safe-stack -fvisibility=hidden -fno-lto -O3 -gline-tables-only -fno-modules -Wno-gnu -Wno-variadic-macros -Wno-c99-extensions -Wno-non-virtual-dtor -fno-omit-frame-pointer -UNDEBUG -std=c++14 -MD -MT projects/compiler-rt/lib/fuzzer/CMakeFiles/RTfuzzer.ios.dir/FuzzerExtraCounters.cpp.o -MF projects/compiler-rt/lib/fuzzer/CMakeFiles/RTfuzzer.ios.dir/FuzzerExtraCounters.cpp.o.d -o projects/compiler-rt/lib/fuzzer/CMakeFiles/RTfuzzer.ios.dir/FuzzerExtraCounters.cpp.o -c /Users/buildslave/jenkins/workspace/lldb-cmake/llvm-project/compiler-rt/lib/fuzzer/FuzzerExtraCounters.cpp
clang-12: warning: argument unused during compilation: '-fmodules-cache-path=/Users/buildslave/jenkins/workspace/lldb-cmake/lldb-build/module.cache' [-Wunused-command-line-argument]
clang-12: warning: argument unused during compilation: '-fcxx-modules' [-Wunused-command-line-argument]
[503/3587] /Users/buildslave/jenkins/workspace/lldb-cmake/host-compiler/bin/clang++  -D_DEBUG -D__STDC_CONSTANT_MACROS -D__STDC_FORMAT_MACROS -D__STDC_LIMIT_MACROS -Iprojects/compiler-rt/lib/fuzzer -I/Users/buildslave/jenkins/workspace/lldb-cmake/llvm-project/compiler-rt/lib/fuzzer -I/Applications/Xcode.app/Contents/Developer/Platforms/MacOSX.platform/Developer/SDKs/MacOSX10.15.sdk/usr/include/libxml2 -Iinclude -I/Users/buildslave/jenkins/workspace/lldb-cmake/llvm-project/llvm/include -I/Users/buildslave/jenkins/workspace/lldb-cmake/llvm-project/compiler-rt/lib/fuzzer/../../include -Wdocumentation -fPIC -fvisibility-inlines-hidden -Werror=date-time -Werror=unguarded-availability-new -fmodules -fmodules-cache-path=/Users/buildslave/jenkins/workspace/lldb-cmake/lldb-build/module.cache -fcxx-modules -Xclang -fmodules-local-submodule-visibility -Wall -Wextra -Wno-unused-parameter -Wwrite-strings -Wcast-qual -Wmissing-field-initializers -pedantic -Wno-long-long -Wimplicit-fallthrough -Wcovered-switch-default -Wno-noexcept-type -Wnon-virtual-dtor -Wdelete-non-virtual-dtor -Wsuggest-override -Wstring-conversion -fdiagnostics-color -Wall -std=c++14 -Wno-unused-parameter -O3  -arch x86_64 -isysroot /Applications/Xcode.app/Contents/Developer/Platforms/MacOSX.platform/Developer/SDKs/MacOSX10.15.sdk    -stdlib=libc++ -mios-simulator-version-min=9.0 -isysroot /Applications/Xcode.app/Contents/Developer/Platforms/iPhoneSimulator.platform/Developer/SDKs/iPhoneSimulator13.5.sdk -fPIC -fno-builtin -fno-exceptions -funwind-tables -fno-stack-protector -fno-sanitize=safe-stack -fvisibility=hidden -fno-lto -O3 -gline-tables-only -fno-modules -Wno-gnu -Wno-variadic-macros -Wno-c99-extensions -Wno-non-virtual-dtor -fno-omit-frame-pointer -UNDEBUG -std=c++14 -MD -MT projects/compiler-rt/lib/fuzzer/CMakeFiles/RTfuzzer.iossim.dir/FuzzerDriver.cpp.o -MF projects/compiler-rt/lib/fuzzer/CMakeFiles/RTfuzzer.iossim.dir/FuzzerDriver.cpp.o.d -o projects/compiler-rt/lib/fuzzer/CMakeFiles/RTfuzzer.iossim.dir/FuzzerDriver.cpp.o -c /Users/buildslave/jenkins/workspace/lldb-cmake/llvm-project/compiler-rt/lib/fuzzer/FuzzerDriver.cpp
clang-12: warning: argument unused during compilation: '-fmodules-cache-path=/Users/buildslave/jenkins/workspace/lldb-cmake/lldb-build/module.cache' [-Wunused-command-line-argument]
clang-12: warning: argument unused during compilation: '-fcxx-modules' [-Wunused-command-line-argument]
[504/3587] /Users/buildslave/jenkins/workspace/lldb-cmake/host-compiler/bin/clang++  -D_DEBUG -D__STDC_CONSTANT_MACROS -D__STDC_FORMAT_MACROS -D__STDC_LIMIT_MACROS -Iprojects/compiler-rt/lib/fuzzer -I/Users/buildslave/jenkins/workspace/lldb-cmake/llvm-project/compiler-rt/lib/fuzzer -I/Applications/Xcode.app/Contents/Developer/Platforms/MacOSX.platform/Developer/SDKs/MacOSX10.15.sdk/usr/include/libxml2 -Iinclude -I/Users/buildslave/jenkins/workspace/lldb-cmake/llvm-project/llvm/include -I/Users/buildslave/jenkins/workspace/lldb-cmake/llvm-project/compiler-rt/lib/fuzzer/../../include -Wdocumentation -fPIC -fvisibility-inlines-hidden -Werror=date-time -Werror=unguarded-availability-new -fmodules -fmodules-cache-path=/Users/buildslave/jenkins/workspace/lldb-cmake/lldb-build/module.cache -fcxx-modules -Xclang -fmodules-local-submodule-visibility -Wall -Wextra -Wno-unused-parameter -Wwrite-strings -Wcast-qual -Wmissing-field-initializers -pedantic -Wno-long-long -Wimplicit-fallthrough -Wcovered-switch-default -Wno-noexcept-type -Wnon-virtual-dtor -Wdelete-non-virtual-dtor -Wsuggest-override -Wstring-conversion -fdiagnostics-color -Wall -std=c++14 -Wno-unused-parameter -O3  -arch x86_64 -isysroot /Applications/Xcode.app/Contents/Developer/Platforms/MacOSX.platform/Developer/SDKs/MacOSX10.15.sdk    -stdlib=libc++ -mios-simulator-version-min=9.0 -isysroot /Applications/Xcode.app/Contents/Developer/Platforms/iPhoneSimulator.platform/Developer/SDKs/iPhoneSimulator13.5.sdk -fPIC -fno-builtin -fno-exceptions -funwind-tables -fno-stack-protector -fno-sanitize=safe-stack -fvisibility=hidden -fno-lto -O3 -gline-tables-only -fno-modules -Wno-gnu -Wno-variadic-macros -Wno-c99-extensions -Wno-non-virtual-dtor -fno-omit-frame-pointer -UNDEBUG -std=c++14 -MD -MT projects/compiler-rt/lib/fuzzer/CMakeFiles/RTfuzzer.iossim.dir/FuzzerTracePC.cpp.o -MF projects/compiler-rt/lib/fuzzer/CMakeFiles/RTfuzzer.iossim.dir/FuzzerTracePC.cpp.o.d -o projects/compiler-rt/lib/fuzzer/CMakeFiles/RTfuzzer.iossim.dir/FuzzerTracePC.cpp.o -c /Users/buildslave/jenkins/workspace/lldb-cmake/llvm-project/compiler-rt/lib/fuzzer/FuzzerTracePC.cpp
clang-12: warning: argument unused during compilation: '-fmodules-cache-path=/Users/buildslave/jenkins/workspace/lldb-cmake/lldb-build/module.cache' [-Wunused-command-line-argument]
clang-12: warning: argument unused during compilation: '-fcxx-modules' [-Wunused-command-line-argument]
[505/3587] /Users/buildslave/jenkins/workspace/lldb-cmake/host-compiler/bin/clang++  -D_DEBUG -D__STDC_CONSTANT_MACROS -D__STDC_FORMAT_MACROS -D__STDC_LIMIT_MACROS -Iprojects/compiler-rt/lib/fuzzer -I/Users/buildslave/jenkins/workspace/lldb-cmake/llvm-project/compiler-rt/lib/fuzzer -I/Applications/Xcode.app/Contents/Developer/Platforms/MacOSX.platform/Developer/SDKs/MacOSX10.15.sdk/usr/include/libxml2 -Iinclude -I/Users/buildslave/jenkins/workspace/lldb-cmake/llvm-project/llvm/include -I/Users/buildslave/jenkins/workspace/lldb-cmake/llvm-project/compiler-rt/lib/fuzzer/../../include -Wdocumentation -fPIC -fvisibility-inlines-hidden -Werror=date-time -Werror=unguarded-availability-new -fmodules -fmodules-cache-path=/Users/buildslave/jenkins/workspace/lldb-cmake/lldb-build/module.cache -fcxx-modules -Xclang -fmodules-local-submodule-visibility -Wall -Wextra -Wno-unused-parameter -Wwrite-strings -Wcast-qual -Wmissing-field-initializers -pedantic -Wno-long-long -Wimplicit-fallthrough -Wcovered-switch-default -Wno-noexcept-type -Wnon-virtual-dtor -Wdelete-non-virtual-dtor -Wsuggest-override -Wstring-conversion -fdiagnostics-color -Wall -std=c++14 -Wno-unused-parameter -O3  -arch arm64 -isysroot /Applications/Xcode.app/Contents/Developer/Platforms/MacOSX.platform/Developer/SDKs/MacOSX10.15.sdk    -stdlib=libc++ -miphoneos-version-min=9.0 -isysroot /Applications/Xcode.app/Contents/Developer/Platforms/iPhoneOS.platform/Developer/SDKs/iPhoneOS13.5.sdk -fPIC -fno-builtin -fno-exceptions -funwind-tables -fno-stack-protector -fno-sanitize=safe-stack -fvisibility=hidden -fno-lto -O3 -gline-tables-only -fno-modules -Wno-gnu -Wno-variadic-macros -Wno-c99-extensions -Wno-non-virtual-dtor -fno-omit-frame-pointer -UNDEBUG -std=c++14 -MD -MT projects/compiler-rt/lib/fuzzer/CMakeFiles/RTfuzzer.ios.dir/FuzzerExtFunctionsDlsym.cpp.o -MF projects/compiler-rt/lib/fuzzer/CMakeFiles/RTfuzzer.ios.dir/FuzzerExtFunctionsDlsym.cpp.o.d -o projects/compiler-rt/lib/fuzzer/CMakeFiles/RTfuzzer.ios.dir/FuzzerExtFunctionsDlsym.cpp.o -c /Users/buildslave/jenkins/workspace/lldb-cmake/llvm-project/compiler-rt/lib/fuzzer/FuzzerExtFunctionsDlsym.cpp
clang-12: warning: argument unused during compilation: '-fmodules-cache-path=/Users/buildslave/jenkins/workspace/lldb-cmake/lldb-build/module.cache' [-Wunused-command-line-argument]
clang-12: warning: argument unused during compilation: '-fcxx-modules' [-Wunused-command-line-argument]
[506/3587] /Users/buildslave/jenkins/workspace/lldb-cmake/host-compiler/bin/clang++  -D_DEBUG -D__STDC_CONSTANT_MACROS -D__STDC_FORMAT_MACROS -D__STDC_LIMIT_MACROS -Iprojects/compiler-rt/lib/fuzzer -I/Users/buildslave/jenkins/workspace/lldb-cmake/llvm-project/compiler-rt/lib/fuzzer -I/Applications/Xcode.app/Contents/Developer/Platforms/MacOSX.platform/Developer/SDKs/MacOSX10.15.sdk/usr/include/libxml2 -Iinclude -I/Users/buildslave/jenkins/workspace/lldb-cmake/llvm-project/llvm/include -I/Users/buildslave/jenkins/workspace/lldb-cmake/llvm-project/compiler-rt/lib/fuzzer/../../include -Wdocumentation -fPIC -fvisibility-inlines-hidden -Werror=date-time -Werror=unguarded-availability-new -fmodules -fmodules-cache-path=/Users/buildslave/jenkins/workspace/lldb-cmake/lldb-build/module.cache -fcxx-modules -Xclang -fmodules-local-submodule-visibility -Wall -Wextra -Wno-unused-parameter -Wwrite-strings -Wcast-qual -Wmissing-field-initializers -pedantic -Wno-long-long -Wimplicit-fallthrough -Wcovered-switch-default -Wno-noexcept-type -Wnon-virtual-dtor -Wdelete-non-virtual-dtor -Wsuggest-override -Wstring-conversion -fdiagnostics-color -Wall -std=c++14 -Wno-unused-parameter -O3  -arch arm64 -isysroot /Applications/Xcode.app/Contents/Developer/Platforms/MacOSX.platform/Developer/SDKs/MacOSX10.15.sdk    -stdlib=libc++ -miphoneos-version-min=9.0 -isysroot /Applications/Xcode.app/Contents/Developer/Platforms/iPhoneOS.platform/Developer/SDKs/iPhoneOS13.5.sdk -fPIC -fno-builtin -fno-exceptions -funwind-tables -fno-stack-protector -fno-sanitize=safe-stack -fvisibility=hidden -fno-lto -O3 -gline-tables-only -fno-modules -Wno-gnu -Wno-variadic-macros -Wno-c99-extensions -Wno-non-virtual-dtor -fno-omit-frame-pointer -UNDEBUG -std=c++14 -MD -MT projects/compiler-rt/lib/fuzzer/CMakeFiles/RTfuzzer.ios.dir/FuzzerCrossOver.cpp.o -MF projects/compiler-rt/lib/fuzzer/CMakeFiles/RTfuzzer.ios.dir/FuzzerCrossOver.cpp.o.d -o projects/compiler-rt/lib/fuzzer/CMakeFiles/RTfuzzer.ios.dir/FuzzerCrossOver.cpp.o -c /Users/buildslave/jenkins/workspace/lldb-cmake/llvm-project/compiler-rt/lib/fuzzer/FuzzerCrossOver.cpp
clang-12: warning: argument unused during compilation: '-fmodules-cache-path=/Users/buildslave/jenkins/workspace/lldb-cmake/lldb-build/module.cache' [-Wunused-command-line-argument]
clang-12: warning: argument unused during compilation: '-fcxx-modules' [-Wunused-command-line-argument]
[507/3587] /Users/buildslave/jenkins/workspace/lldb-cmake/host-compiler/bin/clang++  -D_DEBUG -D__STDC_CONSTANT_MACROS -D__STDC_FORMAT_MACROS -D__STDC_LIMIT_MACROS -Iprojects/compiler-rt/lib/fuzzer -I/Users/buildslave/jenkins/workspace/lldb-cmake/llvm-project/compiler-rt/lib/fuzzer -I/Applications/Xcode.app/Contents/Developer/Platforms/MacOSX.platform/Developer/SDKs/MacOSX10.15.sdk/usr/include/libxml2 -Iinclude -I/Users/buildslave/jenkins/workspace/lldb-cmake/llvm-project/llvm/include -I/Users/buildslave/jenkins/workspace/lldb-cmake/llvm-project/compiler-rt/lib/fuzzer/../../include -Wdocumentation -fPIC -fvisibility-inlines-hidden -Werror=date-time -Werror=unguarded-availability-new -fmodules -fmodules-cache-path=/Users/buildslave/jenkins/workspace/lldb-cmake/lldb-build/module.cache -fcxx-modules -Xclang -fmodules-local-submodule-visibility -Wall -Wextra -Wno-unused-parameter -Wwrite-strings -Wcast-qual -Wmissing-field-initializers -pedantic -Wno-long-long -Wimplicit-fallthrough -Wcovered-switch-default -Wno-noexcept-type -Wnon-virtual-dtor -Wdelete-non-virtual-dtor -Wsuggest-override -Wstring-conversion -fdiagnostics-color -Wall -std=c++14 -Wno-unused-parameter -O3  -arch x86_64 -isysroot /Applications/Xcode.app/Contents/Developer/Platforms/MacOSX.platform/Developer/SDKs/MacOSX10.15.sdk    -stdlib=libc++ -mios-simulator-version-min=9.0 -isysroot /Applications/Xcode.app/Contents/Developer/Platforms/iPhoneSimulator.platform/Developer/SDKs/iPhoneSimulator13.5.sdk -fPIC -fno-builtin -fno-exceptions -funwind-tables -fno-stack-protector -fno-sanitize=safe-stack -fvisibility=hidden -fno-lto -O3 -gline-tables-only -fno-modules -Wno-gnu -Wno-variadic-macros -Wno-c99-extensions -Wno-non-virtual-dtor -fno-omit-frame-pointer -UNDEBUG -std=c++14 -MD -MT projects/compiler-rt/lib/fuzzer/CMakeFiles/RTfuzzer.iossim.dir/FuzzerLoop.cpp.o -MF projects/compiler-rt/lib/fuzzer/CMakeFiles/RTfuzzer.iossim.dir/FuzzerLoop.cpp.o.d -o projects/compiler-rt/lib/fuzzer/CMakeFiles/RTfuzzer.iossim.dir/FuzzerLoop.cpp.o -c /Users/buildslave/jenkins/workspace/lldb-cmake/llvm-project/compiler-rt/lib/fuzzer/FuzzerLoop.cpp
clang-12: warning: argument unused during compilation: '-fmodules-cache-path=/Users/buildslave/jenkins/workspace/lldb-cmake/lldb-build/module.cache' [-Wunused-command-line-argument]
clang-12: warning: argument unused during compilation: '-fcxx-modules' [-Wunused-command-line-argument]
[508/3587] /Users/buildslave/jenkins/workspace/lldb-cmake/host-compiler/bin/clang++  -D_DEBUG -D__STDC_CONSTANT_MACROS -D__STDC_FORMAT_MACROS -D__STDC_LIMIT_MACROS -Iprojects/compiler-rt/lib/fuzzer -I/Users/buildslave/jenkins/workspace/lldb-cmake/llvm-project/compiler-rt/lib/fuzzer -I/Applications/Xcode.app/Contents/Developer/Platforms/MacOSX.platform/Developer/SDKs/MacOSX10.15.sdk/usr/include/libxml2 -Iinclude -I/Users/buildslave/jenkins/workspace/lldb-cmake/llvm-project/llvm/include -I/Users/buildslave/jenkins/workspace/lldb-cmake/llvm-project/compiler-rt/lib/fuzzer/../../include -Wdocumentation -fPIC -fvisibility-inlines-hidden -Werror=date-time -Werror=unguarded-availability-new -fmodules -fmodules-cache-path=/Users/buildslave/jenkins/workspace/lldb-cmake/lldb-build/module.cache -fcxx-modules -Xclang -fmodules-local-submodule-visibility -Wall -Wextra -Wno-unused-parameter -Wwrite-strings -Wcast-qual -Wmissing-field-initializers -pedantic -Wno-long-long -Wimplicit-fallthrough -Wcovered-switch-default -Wno-noexcept-type -Wnon-virtual-dtor -Wdelete-non-virtual-dtor -Wsuggest-override -Wstring-conversion -fdiagnostics-color -Wall -std=c++14 -Wno-unused-parameter -O3  -arch x86_64 -isysroot /Applications/Xcode.app/Contents/Developer/Platforms/MacOSX.platform/Developer/SDKs/MacOSX10.15.sdk    -stdlib=libc++ -mios-simulator-version-min=9.0 -isysroot /Applications/Xcode.app/Contents/Developer/Platforms/iPhoneSimulator.platform/Developer/SDKs/iPhoneSimulator13.5.sdk -fPIC -fno-builtin -fno-exceptions -funwind-tables -fno-stack-protector -fno-sanitize=safe-stack -fvisibility=hidden -fno-lto -O3 -gline-tables-only -fno-modules -Wno-gnu -Wno-variadic-macros -Wno-c99-extensions -Wno-non-virtual-dtor -fno-omit-frame-pointer -UNDEBUG -std=c++14 -MD -MT projects/compiler-rt/lib/fuzzer/CMakeFiles/RTfuzzer.iossim.dir/FuzzerMerge.cpp.o -MF projects/compiler-rt/lib/fuzzer/CMakeFiles/RTfuzzer.iossim.dir/FuzzerMerge.cpp.o.d -o projects/compiler-rt/lib/fuzzer/CMakeFiles/RTfuzzer.iossim.dir/FuzzerMerge.cpp.o -c /Users/buildslave/jenkins/workspace/lldb-cmake/llvm-project/compiler-rt/lib/fuzzer/FuzzerMerge.cpp
clang-12: warning: argument unused during compilation: '-fmodules-cache-path=/Users/buildslave/jenkins/workspace/lldb-cmake/lldb-build/module.cache' [-Wunused-command-line-argument]
clang-12: warning: argument unused during compilation: '-fcxx-modules' [-Wunused-command-line-argument]
[509/3587] : && /Users/buildslave/jenkins/workspace/lldb-cmake/host-compiler/bin/clang++ -Wdocumentation -fPIC -fvisibility-inlines-hidden -Werror=date-time -Werror=unguarded-availability-new -fmodules -fmodules-cache-path=/Users/buildslave/jenkins/workspace/lldb-cmake/lldb-build/module.cache -fcxx-modules -Xclang -fmodules-local-submodule-visibility -Wall -Wextra -Wno-unused-parameter -Wwrite-strings -Wcast-qual -Wmissing-field-initializers -pedantic -Wno-long-long -Wimplicit-fallthrough -Wcovered-switch-default -Wno-noexcept-type -Wnon-virtual-dtor -Wdelete-non-virtual-dtor -Wsuggest-override -Wstring-conversion -fdiagnostics-color -Wall -std=c++14 -Wno-unused-parameter -O3 -arch x86_64 -isysroot /Applications/Xcode.app/Contents/Developer/Platforms/MacOSX.platform/Developer/SDKs/MacOSX10.15.sdk -dynamiclib -Wl,-headerpad_max_install_names -stdlib=libc++ -lc++ -lc++abi -fapplication-extension -mios-simulator-version-min=9.0 -isysroot /Applications/Xcode.app/Contents/Developer/Platforms/iPhoneSimulator.platform/Developer/SDKs/iPhoneSimulator13.5.sdk -nodefaultlibs -o lib/clang/12.0.99/lib/darwin/libclang_rt.fuzzer_no_main_iossim_dynamic.dylib -install_name @rpath/libclang_rt.fuzzer_no_main_iossim_dynamic.dylib projects/compiler-rt/lib/fuzzer/CMakeFiles/RTfuzzer.iossim.dir/FuzzerCrossOver.cpp.o projects/compiler-rt/lib/fuzzer/CMakeFiles/RTfuzzer.iossim.dir/FuzzerDataFlowTrace.cpp.o projects/compiler-rt/lib/fuzzer/CMakeFiles/RTfuzzer.iossim.dir/FuzzerDriver.cpp.o projects/compiler-rt/lib/fuzzer/CMakeFiles/RTfuzzer.iossim.dir/FuzzerExtFunctionsDlsym.cpp.o projects/compiler-rt/lib/fuzzer/CMakeFiles/RTfuzzer.iossim.dir/FuzzerExtFunctionsWeak.cpp.o projects/compiler-rt/lib/fuzzer/CMakeFiles/RTfuzzer.iossim.dir/FuzzerExtFunctionsWindows.cpp.o projects/compiler-rt/lib/fuzzer/CMakeFiles/RTfuzzer.iossim.dir/FuzzerExtraCounters.cpp.o projects/compiler-rt/lib/fuzzer/CMakeFiles/RTfuzzer.iossim.dir/FuzzerFork.cpp.o projects/compiler-rt/lib/fuzzer/CMakeFiles/RTfuzzer.iossim.dir/FuzzerIO.cpp.o projects/compiler-rt/lib/fuzzer/CMakeFiles/RTfuzzer.iossim.dir/FuzzerIOPosix.cpp.o projects/compiler-rt/lib/fuzzer/CMakeFiles/RTfuzzer.iossim.dir/FuzzerIOWindows.cpp.o projects/compiler-rt/lib/fuzzer/CMakeFiles/RTfuzzer.iossim.dir/FuzzerLoop.cpp.o projects/compiler-rt/lib/fuzzer/CMakeFiles/RTfuzzer.iossim.dir/FuzzerMerge.cpp.o projects/compiler-rt/lib/fuzzer/CMakeFiles/RTfuzzer.iossim.dir/FuzzerMutate.cpp.o projects/compiler-rt/lib/fuzzer/CMakeFiles/RTfuzzer.iossim.dir/FuzzerSHA1.cpp.o projects/compiler-rt/lib/fuzzer/CMakeFiles/RTfuzzer.iossim.dir/FuzzerTracePC.cpp.o projects/compiler-rt/lib/fuzzer/CMakeFiles/RTfuzzer.iossim.dir/FuzzerUtil.cpp.o projects/compiler-rt/lib/fuzzer/CMakeFiles/RTfuzzer.iossim.dir/FuzzerUtilDarwin.cpp.o projects/compiler-rt/lib/fuzzer/CMakeFiles/RTfuzzer.iossim.dir/FuzzerUtilFuchsia.cpp.o projects/compiler-rt/lib/fuzzer/CMakeFiles/RTfuzzer.iossim.dir/FuzzerUtilLinux.cpp.o projects/compiler-rt/lib/fuzzer/CMakeFiles/RTfuzzer.iossim.dir/FuzzerUtilPosix.cpp.o projects/compiler-rt/lib/fuzzer/CMakeFiles/RTfuzzer.iossim.dir/FuzzerUtilWindows.cpp.o  -Wl,-rpath,@loader_path/../lib  -lc  -lstdc++  -lm  -lpthread && cd /Users/buildslave/jenkins/workspace/lldb-cmake/lldb-build/lib/clang/12.0.99/lib/darwin && codesign --sign - /Users/buildslave/jenkins/workspace/lldb-cmake/lldb-build/lib/clang/12.0.99/lib/darwin/libclang_rt.fuzzer_no_main_iossim_dynamic.dylib
FAILED: lib/clang/12.0.99/lib/darwin/libclang_rt.fuzzer_no_main_iossim_dynamic.dylib 
: && /Users/buildslave/jenkins/workspace/lldb-cmake/host-compiler/bin/clang++ -Wdocumentation -fPIC -fvisibility-inlines-hidden -Werror=date-time -Werror=unguarded-availability-new -fmodules -fmodules-cache-path=/Users/buildslave/jenkins/workspace/lldb-cmake/lldb-build/module.cache -fcxx-modules -Xclang -fmodules-local-submodule-visibility -Wall -Wextra -Wno-unused-parameter -Wwrite-strings -Wcast-qual -Wmissing-field-initializers -pedantic -Wno-long-long -Wimplicit-fallthrough -Wcovered-switch-default -Wno-noexcept-type -Wnon-virtual-dtor -Wdelete-non-virtual-dtor -Wsuggest-override -Wstring-conversion -fdiagnostics-color -Wall -std=c++14 -Wno-unused-parameter -O3 -arch x86_64 -isysroot /Applications/Xcode.app/Contents/Developer/Platforms/MacOSX.platform/Developer/SDKs/MacOSX10.15.sdk -dynamiclib -Wl,-headerpad_max_install_names -stdlib=libc++ -lc++ -lc++abi -fapplication-extension -mios-simulator-version-min=9.0 -isysroot /Applications/Xcode.app/Contents/Developer/Platforms/iPhoneSimulator.platform/Developer/SDKs/iPhoneSimulator13.5.sdk -nodefaultlibs -o lib/clang/12.0.99/lib/darwin/libclang_rt.fuzzer_no_main_iossim_dynamic.dylib -install_name @rpath/libclang_rt.fuzzer_no_main_iossim_dynamic.dylib projects/compiler-rt/lib/fuzzer/CMakeFiles/RTfuzzer.iossim.dir/FuzzerCrossOver.cpp.o projects/compiler-rt/lib/fuzzer/CMakeFiles/RTfuzzer.iossim.dir/FuzzerDataFlowTrace.cpp.o projects/compiler-rt/lib/fuzzer/CMakeFiles/RTfuzzer.iossim.dir/FuzzerDriver.cpp.o projects/compiler-rt/lib/fuzzer/CMakeFiles/RTfuzzer.iossim.dir/FuzzerExtFunctionsDlsym.cpp.o projects/compiler-rt/lib/fuzzer/CMakeFiles/RTfuzzer.iossim.dir/FuzzerExtFunctionsWeak.cpp.o projects/compiler-rt/lib/fuzzer/CMakeFiles/RTfuzzer.iossim.dir/FuzzerExtFunctionsWindows.cpp.o projects/compiler-rt/lib/fuzzer/CMakeFiles/RTfuzzer.iossim.dir/FuzzerExtraCounters.cpp.o projects/compiler-rt/lib/fuzzer/CMakeFiles/RTfuzzer.iossim.dir/FuzzerFork.cpp.o projects/compiler-rt/lib/fuzzer/CMakeFiles/RTfuzzer.iossim.dir/FuzzerIO.cpp.o projects/compiler-rt/lib/fuzzer/CMakeFiles/RTfuzzer.iossim.dir/FuzzerIOPosix.cpp.o projects/compiler-rt/lib/fuzzer/CMakeFiles/RTfuzzer.iossim.dir/FuzzerIOWindows.cpp.o projects/compiler-rt/lib/fuzzer/CMakeFiles/RTfuzzer.iossim.dir/FuzzerLoop.cpp.o projects/compiler-rt/lib/fuzzer/CMakeFiles/RTfuzzer.iossim.dir/FuzzerMerge.cpp.o projects/compiler-rt/lib/fuzzer/CMakeFiles/RTfuzzer.iossim.dir/FuzzerMutate.cpp.o projects/compiler-rt/lib/fuzzer/CMakeFiles/RTfuzzer.iossim.dir/FuzzerSHA1.cpp.o projects/compiler-rt/lib/fuzzer/CMakeFiles/RTfuzzer.iossim.dir/FuzzerTracePC.cpp.o projects/compiler-rt/lib/fuzzer/CMakeFiles/RTfuzzer.iossim.dir/FuzzerUtil.cpp.o projects/compiler-rt/lib/fuzzer/CMakeFiles/RTfuzzer.iossim.dir/FuzzerUtilDarwin.cpp.o projects/compiler-rt/lib/fuzzer/CMakeFiles/RTfuzzer.iossim.dir/FuzzerUtilFuchsia.cpp.o projects/compiler-rt/lib/fuzzer/CMakeFiles/RTfuzzer.iossim.dir/FuzzerUtilLinux.cpp.o projects/compiler-rt/lib/fuzzer/CMakeFiles/RTfuzzer.iossim.dir/FuzzerUtilPosix.cpp.o projects/compiler-rt/lib/fuzzer/CMakeFiles/RTfuzzer.iossim.dir/FuzzerUtilWindows.cpp.o  -Wl,-rpath,@loader_path/../lib  -lc  -lstdc++  -lm  -lpthread && cd /Users/buildslave/jenkins/workspace/lldb-cmake/lldb-build/lib/clang/12.0.99/lib/darwin && codesign --sign - /Users/buildslave/jenkins/workspace/lldb-cmake/lldb-build/lib/clang/12.0.99/lib/darwin/libclang_rt.fuzzer_no_main_iossim_dynamic.dylib
ld: library not found for -lstdc++
clang-12: error: linker command failed with exit code 1 (use -v to see invocation)
[510/3587] /Users/buildslave/jenkins/workspace/lldb-cmake/host-compiler/bin/clang++  -D_DEBUG -D__STDC_CONSTANT_MACROS -D__STDC_FORMAT_MACROS -D__STDC_LIMIT_MACROS -Iprojects/compiler-rt/lib/fuzzer -I/Users/buildslave/jenkins/workspace/lldb-cmake/llvm-project/compiler-rt/lib/fuzzer -I/Applications/Xcode.app/Contents/Developer/Platforms/MacOSX.platform/Developer/SDKs/MacOSX10.15.sdk/usr/include/libxml2 -Iinclude -I/Users/buildslave/jenkins/workspace/lldb-cmake/llvm-project/llvm/include -I/Users/buildslave/jenkins/workspace/lldb-cmake/llvm-project/compiler-rt/lib/fuzzer/../../include -Wdocumentation -fPIC -fvisibility-inlines-hidden -Werror=date-time -Werror=unguarded-availability-new -fmodules -fmodules-cache-path=/Users/buildslave/jenkins/workspace/lldb-cmake/lldb-build/module.cache -fcxx-modules -Xclang -fmodules-local-submodule-visibility -Wall -Wextra -Wno-unused-parameter -Wwrite-strings -Wcast-qual -Wmissing-field-initializers -pedantic -Wno-long-long -Wimplicit-fallthrough -Wcovered-switch-default -Wno-noexcept-type -Wnon-virtual-dtor -Wdelete-non-virtual-dtor -Wsuggest-override -Wstring-conversion -fdiagnostics-color -Wall -std=c++14 -Wno-unused-parameter -O3  -arch arm64 -isysroot /Applications/Xcode.app/Contents/Developer/Platforms/MacOSX.platform/Developer/SDKs/MacOSX10.15.sdk    -stdlib=libc++ -miphoneos-version-min=9.0 -isysroot /Applications/Xcode.app/Contents/Developer/Platforms/iPhoneOS.platform/Developer/SDKs/iPhoneOS13.5.sdk -fPIC -fno-builtin -fno-exceptions -funwind-tables -fno-stack-protector -fno-sanitize=safe-stack -fvisibility=hidden -fno-lto -O3 -gline-tables-only -fno-modules -Wno-gnu -Wno-variadic-macros -Wno-c99-extensions -Wno-non-virtual-dtor -fno-omit-frame-pointer -UNDEBUG -std=c++14 -MD -MT projects/compiler-rt/lib/fuzzer/CMakeFiles/RTfuzzer.ios.dir/FuzzerIOPosix.cpp.o -MF projects/compiler-rt/lib/fuzzer/CMakeFiles/RTfuzzer.ios.dir/FuzzerIOPosix.cpp.o.d -o projects/compiler-rt/lib/fuzzer/CMakeFiles/RTfuzzer.ios.dir/FuzzerIOPosix.cpp.o -c /Users/buildslave/jenkins/workspace/lldb-cmake/llvm-project/compiler-rt/lib/fuzzer/FuzzerIOPosix.cpp
clang-12: warning: argument unused during compilation: '-fmodules-cache-path=/Users/buildslave/jenkins/workspace/lldb-cmake/lldb-build/module.cache' [-Wunused-command-line-argument]
clang-12: warning: argument unused during compilation: '-fcxx-modules' [-Wunused-command-line-argument]
[511/3587] /Users/buildslave/jenkins/workspace/lldb-cmake/host-compiler/bin/clang++  -D_DEBUG -D__STDC_CONSTANT_MACROS -D__STDC_FORMAT_MACROS -D__STDC_LIMIT_MACROS -Iprojects/compiler-rt/lib/fuzzer -I/Users/buildslave/jenkins/workspace/lldb-cmake/llvm-project/compiler-rt/lib/fuzzer -I/Applications/Xcode.app/Contents/Developer/Platforms/MacOSX.platform/Developer/SDKs/MacOSX10.15.sdk/usr/include/libxml2 -Iinclude -I/Users/buildslave/jenkins/workspace/lldb-cmake/llvm-project/llvm/include -I/Users/buildslave/jenkins/workspace/lldb-cmake/llvm-project/compiler-rt/lib/fuzzer/../../include -Wdocumentation -fPIC -fvisibility-inlines-hidden -Werror=date-time -Werror=unguarded-availability-new -fmodules -fmodules-cache-path=/Users/buildslave/jenkins/workspace/lldb-cmake/lldb-build/module.cache -fcxx-modules -Xclang -fmodules-local-submodule-visibility -Wall -Wextra -Wno-unused-parameter -Wwrite-strings -Wcast-qual -Wmissing-field-initializers -pedantic -Wno-long-long -Wimplicit-fallthrough -Wcovered-switch-default -Wno-noexcept-type -Wnon-virtual-dtor -Wdelete-non-virtual-dtor -Wsuggest-override -Wstring-conversion -fdiagnostics-color -Wall -std=c++14 -Wno-unused-parameter -O3  -arch arm64 -isysroot /Applications/Xcode.app/Contents/Developer/Platforms/MacOSX.platform/Developer/SDKs/MacOSX10.15.sdk    -stdlib=libc++ -miphoneos-version-min=9.0 -isysroot /Applications/Xcode.app/Contents/Developer/Platforms/iPhoneOS.platform/Developer/SDKs/iPhoneOS13.5.sdk -fPIC -fno-builtin -fno-exceptions -funwind-tables -fno-stack-protector -fno-sanitize=safe-stack -fvisibility=hidden -fno-lto -O3 -gline-tables-only -fno-modules -Wno-gnu -Wno-variadic-macros -Wno-c99-extensions -Wno-non-virtual-dtor -fno-omit-frame-pointer -UNDEBUG -std=c++14 -MD -MT projects/compiler-rt/lib/fuzzer/CMakeFiles/RTfuzzer.ios.dir/FuzzerIO.cpp.o -MF projects/compiler-rt/lib/fuzzer/CMakeFiles/RTfuzzer.ios.dir/FuzzerIO.cpp.o.d -o projects/compiler-rt/lib/fuzzer/CMakeFiles/RTfuzzer.ios.dir/FuzzerIO.cpp.o -c /Users/buildslave/jenkins/workspace/lldb-cmake/llvm-project/compiler-rt/lib/fuzzer/FuzzerIO.cpp
clang-12: warning: argument unused during compilation: '-fmodules-cache-path=/Users/buildslave/jenkins/workspace/lldb-cmake/lldb-build/module.cache' [-Wunused-command-line-argument]
clang-12: warning: argument unused during compilation: '-fcxx-modules' [-Wunused-command-line-argument]
[512/3587] /Users/buildslave/jenkins/workspace/lldb-cmake/host-compiler/bin/clang++  -D_DEBUG -D__STDC_CONSTANT_MACROS -D__STDC_FORMAT_MACROS -D__STDC_LIMIT_MACROS -Iprojects/compiler-rt/lib/fuzzer -I/Users/buildslave/jenkins/workspace/lldb-cmake/llvm-project/compiler-rt/lib/fuzzer -I/Applications/Xcode.app/Contents/Developer/Platforms/MacOSX.platform/Developer/SDKs/MacOSX10.15.sdk/usr/include/libxml2 -Iinclude -I/Users/buildslave/jenkins/workspace/lldb-cmake/llvm-project/llvm/include -I/Users/buildslave/jenkins/workspace/lldb-cmake/llvm-project/compiler-rt/lib/fuzzer/../../include -Wdocumentation -fPIC -fvisibility-inlines-hidden -Werror=date-time -Werror=unguarded-availability-new -fmodules -fmodules-cache-path=/Users/buildslave/jenkins/workspace/lldb-cmake/lldb-build/module.cache -fcxx-modules -Xclang -fmodules-local-submodule-visibility -Wall -Wextra -Wno-unused-parameter -Wwrite-strings -Wcast-qual -Wmissing-field-initializers -pedantic -Wno-long-long -Wimplicit-fallthrough -Wcovered-switch-default -Wno-noexcept-type -Wnon-virtual-dtor -Wdelete-non-virtual-dtor -Wsuggest-override -Wstring-conversion -fdiagnostics-color -Wall -std=c++14 -Wno-unused-parameter -O3  -arch arm64 -isysroot /Applications/Xcode.app/Contents/Developer/Platforms/MacOSX.platform/Developer/SDKs/MacOSX10.15.sdk    -stdlib=libc++ -miphoneos-version-min=9.0 -isysroot /Applications/Xcode.app/Contents/Developer/Platforms/iPhoneOS.platform/Developer/SDKs/iPhoneOS13.5.sdk -fPIC -fno-builtin -fno-exceptions -funwind-tables -fno-stack-protector -fno-sanitize=safe-stack -fvisibility=hidden -fno-lto -O3 -gline-tables-only -fno-modules -Wno-gnu -Wno-variadic-macros -Wno-c99-extensions -Wno-non-virtual-dtor -fno-omit-frame-pointer -UNDEBUG -std=c++14 -MD -MT projects/compiler-rt/lib/fuzzer/CMakeFiles/RTfuzzer.ios.dir/FuzzerSHA1.cpp.o -MF projects/compiler-rt/lib/fuzzer/CMakeFiles/RTfuzzer.ios.dir/FuzzerSHA1.cpp.o.d -o projects/compiler-rt/lib/fuzzer/CMakeFiles/RTfuzzer.ios.dir/FuzzerSHA1.cpp.o -c /Users/buildslave/jenkins/workspace/lldb-cmake/llvm-project/compiler-rt/lib/fuzzer/FuzzerSHA1.cpp
clang-12: warning: argument unused during compilation: '-fmodules-cache-path=/Users/buildslave/jenkins/workspace/lldb-cmake/lldb-build/module.cache' [-Wunused-command-line-argument]
clang-12: warning: argument unused during compilation: '-fcxx-modules' [-Wunused-command-line-argument]
[513/3587] /Users/buildslave/jenkins/workspace/lldb-cmake/host-compiler/bin/clang++  -D_DEBUG -D__STDC_CONSTANT_MACROS -D__STDC_FORMAT_MACROS -D__STDC_LIMIT_MACROS -Iprojects/compiler-rt/lib/fuzzer -I/Users/buildslave/jenkins/workspace/lldb-cmake/llvm-project/compiler-rt/lib/fuzzer -I/Applications/Xcode.app/Contents/Developer/Platforms/MacOSX.platform/Developer/SDKs/MacOSX10.15.sdk/usr/include/libxml2 -Iinclude -I/Users/buildslave/jenkins/workspace/lldb-cmake/llvm-project/llvm/include -I/Users/buildslave/jenkins/workspace/lldb-cmake/llvm-project/compiler-rt/lib/fuzzer/../../include -Wdocumentation -fPIC -fvisibility-inlines-hidden -Werror=date-time -Werror=unguarded-availability-new -fmodules -fmodules-cache-path=/Users/buildslave/jenkins/workspace/lldb-cmake/lldb-build/module.cache -fcxx-modules -Xclang -fmodules-local-submodule-visibility -Wall -Wextra -Wno-unused-parameter -Wwrite-strings -Wcast-qual -Wmissing-field-initializers -pedantic -Wno-long-long -Wimplicit-fallthrough -Wcovered-switch-default -Wno-noexcept-type -Wnon-virtual-dtor -Wdelete-non-virtual-dtor -Wsuggest-override -Wstring-conversion -fdiagnostics-color -Wall -std=c++14 -Wno-unused-parameter -O3  -arch arm64 -isysroot /Applications/Xcode.app/Contents/Developer/Platforms/MacOSX.platform/Developer/SDKs/MacOSX10.15.sdk    -stdlib=libc++ -miphoneos-version-min=9.0 -isysroot /Applications/Xcode.app/Contents/Developer/Platforms/iPhoneOS.platform/Developer/SDKs/iPhoneOS13.5.sdk -fPIC -fno-builtin -fno-exceptions -funwind-tables -fno-stack-protector -fno-sanitize=safe-stack -fvisibility=hidden -fno-lto -O3 -gline-tables-only -fno-modules -Wno-gnu -Wno-variadic-macros -Wno-c99-extensions -Wno-non-virtual-dtor -fno-omit-frame-pointer -UNDEBUG -std=c++14 -MD -MT projects/compiler-rt/lib/fuzzer/CMakeFiles/RTfuzzer.ios.dir/FuzzerMutate.cpp.o -MF projects/compiler-rt/lib/fuzzer/CMakeFiles/RTfuzzer.ios.dir/FuzzerMutate.cpp.o.d -o projects/compiler-rt/lib/fuzzer/CMakeFiles/RTfuzzer.ios.dir/FuzzerMutate.cpp.o -c /Users/buildslave/jenkins/workspace/lldb-cmake/llvm-project/compiler-rt/lib/fuzzer/FuzzerMutate.cpp
clang-12: warning: argument unused during compilation: '-fmodules-cache-path=/Users/buildslave/jenkins/workspace/lldb-cmake/lldb-build/module.cache' [-Wunused-command-line-argument]
clang-12: warning: argument unused during compilation: '-fcxx-modules' [-Wunused-command-line-argument]
[514/3587] /Users/buildslave/jenkins/workspace/lldb-cmake/host-compiler/bin/clang++  -D_DEBUG -D__STDC_CONSTANT_MACROS -D__STDC_FORMAT_MACROS -D__STDC_LIMIT_MACROS -Iprojects/compiler-rt/lib/fuzzer -I/Users/buildslave/jenkins/workspace/lldb-cmake/llvm-project/compiler-rt/lib/fuzzer -I/Applications/Xcode.app/Contents/Developer/Platforms/MacOSX.platform/Developer/SDKs/MacOSX10.15.sdk/usr/include/libxml2 -Iinclude -I/Users/buildslave/jenkins/workspace/lldb-cmake/llvm-project/llvm/include -I/Users/buildslave/jenkins/workspace/lldb-cmake/llvm-project/compiler-rt/lib/fuzzer/../../include -Wdocumentation -fPIC -fvisibility-inlines-hidden -Werror=date-time -Werror=unguarded-availability-new -fmodules -fmodules-cache-path=/Users/buildslave/jenkins/workspace/lldb-cmake/lldb-build/module.cache -fcxx-modules -Xclang -fmodules-local-submodule-visibility -Wall -Wextra -Wno-unused-parameter -Wwrite-strings -Wcast-qual -Wmissing-field-initializers -pedantic -Wno-long-long -Wimplicit-fallthrough -Wcovered-switch-default -Wno-noexcept-type -Wnon-virtual-dtor -Wdelete-non-virtual-dtor -Wsuggest-override -Wstring-conversion -fdiagnostics-color -Wall -std=c++14 -Wno-unused-parameter -O3  -arch arm64 -isysroot /Applications/Xcode.app/Contents/Developer/Platforms/MacOSX.platform/Developer/SDKs/MacOSX10.15.sdk    -stdlib=libc++ -miphoneos-version-min=9.0 -isysroot /Applications/Xcode.app/Contents/Developer/Platforms/iPhoneOS.platform/Developer/SDKs/iPhoneOS13.5.sdk -fPIC -fno-builtin -fno-exceptions -funwind-tables -fno-stack-protector -fno-sanitize=safe-stack -fvisibility=hidden -fno-lto -O3 -gline-tables-only -fno-modules -Wno-gnu -Wno-variadic-macros -Wno-c99-extensions -Wno-non-virtual-dtor -fno-omit-frame-pointer -UNDEBUG -std=c++14 -MD -MT projects/compiler-rt/lib/fuzzer/CMakeFiles/RTfuzzer.ios.dir/FuzzerDataFlowTrace.cpp.o -MF projects/compiler-rt/lib/fuzzer/CMakeFiles/RTfuzzer.ios.dir/FuzzerDataFlowTrace.cpp.o.d -o projects/compiler-rt/lib/fuzzer/CMakeFiles/RTfuzzer.ios.dir/FuzzerDataFlowTrace.cpp.o -c /Users/buildslave/jenkins/workspace/lldb-cmake/llvm-project/compiler-rt/lib/fuzzer/FuzzerDataFlowTrace.cpp
clang-12: warning: argument unused during compilation: '-fmodules-cache-path=/Users/buildslave/jenkins/workspace/lldb-cmake/lldb-build/module.cache' [-Wunused-command-line-argument]
clang-12: warning: argument unused during compilation: '-fcxx-modules' [-Wunused-command-line-argument]
[515/3587] /Users/buildslave/jenkins/workspace/lldb-cmake/host-compiler/bin/clang++  -D_DEBUG -D__STDC_CONSTANT_MACROS -D__STDC_FORMAT_MACROS -D__STDC_LIMIT_MACROS -Iprojects/compiler-rt/lib/fuzzer -I/Users/buildslave/jenkins/workspace/lldb-cmake/llvm-project/compiler-rt/lib/fuzzer -I/Applications/Xcode.app/Contents/Developer/Platforms/MacOSX.platform/Developer/SDKs/MacOSX10.15.sdk/usr/include/libxml2 -Iinclude -I/Users/buildslave/jenkins/workspace/lldb-cmake/llvm-project/llvm/include -I/Users/buildslave/jenkins/workspace/lldb-cmake/llvm-project/compiler-rt/lib/fuzzer/../../include -Wdocumentation -fPIC -fvisibility-inlines-hidden -Werror=date-time -Werror=unguarded-availability-new -fmodules -fmodules-cache-path=/Users/buildslave/jenkins/workspace/lldb-cmake/lldb-build/module.cache -fcxx-modules -Xclang -fmodules-local-submodule-visibility -Wall -Wextra -Wno-unused-parameter -Wwrite-strings -Wcast-qual -Wmissing-field-initializers -pedantic -Wno-long-long -Wimplicit-fallthrough -Wcovered-switch-default -Wno-noexcept-type -Wnon-virtual-dtor -Wdelete-non-virtual-dtor -Wsuggest-override -Wstring-conversion -fdiagnostics-color -Wall -std=c++14 -Wno-unused-parameter -O3  -arch arm64 -isysroot /Applications/Xcode.app/Contents/Developer/Platforms/MacOSX.platform/Developer/SDKs/MacOSX10.15.sdk    -stdlib=libc++ -miphoneos-version-min=9.0 -isysroot /Applications/Xcode.app/Contents/Developer/Platforms/iPhoneOS.platform/Developer/SDKs/iPhoneOS13.5.sdk -fPIC -fno-builtin -fno-exceptions -funwind-tables -fno-stack-protector -fno-sanitize=safe-stack -fvisibility=hidden -fno-lto -O3 -gline-tables-only -fno-modules -Wno-gnu -Wno-variadic-macros -Wno-c99-extensions -Wno-non-virtual-dtor -fno-omit-frame-pointer -UNDEBUG -std=c++14 -MD -MT projects/compiler-rt/lib/fuzzer/CMakeFiles/RTfuzzer.ios.dir/FuzzerFork.cpp.o -MF projects/compiler-rt/lib/fuzzer/CMakeFiles/RTfuzzer.ios.dir/FuzzerFork.cpp.o.d -o projects/compiler-rt/lib/fuzzer/CMakeFiles/RTfuzzer.ios.dir/FuzzerFork.cpp.o -c /Users/buildslave/jenkins/workspace/lldb-cmake/llvm-project/compiler-rt/lib/fuzzer/FuzzerFork.cpp
clang-12: warning: argument unused during compilation: '-fmodules-cache-path=/Users/buildslave/jenkins/workspace/lldb-cmake/lldb-build/module.cache' [-Wunused-command-line-argument]
clang-12: warning: argument unused during compilation: '-fcxx-modules' [-Wunused-command-line-argument]
[516/3587] /Users/buildslave/jenkins/workspace/lldb-cmake/host-compiler/bin/clang++  -D_DEBUG -D__STDC_CONSTANT_MACROS -D__STDC_FORMAT_MACROS -D__STDC_LIMIT_MACROS -Iprojects/compiler-rt/lib/fuzzer -I/Users/buildslave/jenkins/workspace/lldb-cmake/llvm-project/compiler-rt/lib/fuzzer -I/Applications/Xcode.app/Contents/Developer/Platforms/MacOSX.platform/Developer/SDKs/MacOSX10.15.sdk/usr/include/libxml2 -Iinclude -I/Users/buildslave/jenkins/workspace/lldb-cmake/llvm-project/llvm/include -I/Users/buildslave/jenkins/workspace/lldb-cmake/llvm-project/compiler-rt/lib/fuzzer/../../include -Wdocumentation -fPIC -fvisibility-inlines-hidden -Werror=date-time -Werror=unguarded-availability-new -fmodules -fmodules-cache-path=/Users/buildslave/jenkins/workspace/lldb-cmake/lldb-build/module.cache -fcxx-modules -Xclang -fmodules-local-submodule-visibility -Wall -Wextra -Wno-unused-parameter -Wwrite-strings -Wcast-qual -Wmissing-field-initializers -pedantic -Wno-long-long -Wimplicit-fallthrough -Wcovered-switch-default -Wno-noexcept-type -Wnon-virtual-dtor -Wdelete-non-virtual-dtor -Wsuggest-override -Wstring-conversion -fdiagnostics-color -Wall -std=c++14 -Wno-unused-parameter -O3  -arch arm64 -isysroot /Applications/Xcode.app/Contents/Developer/Platforms/MacOSX.platform/Developer/SDKs/MacOSX10.15.sdk    -stdlib=libc++ -miphoneos-version-min=9.0 -isysroot /Applications/Xcode.app/Contents/Developer/Platforms/iPhoneOS.platform/Developer/SDKs/iPhoneOS13.5.sdk -fPIC -fno-builtin -fno-exceptions -funwind-tables -fno-stack-protector -fno-sanitize=safe-stack -fvisibility=hidden -fno-lto -O3 -gline-tables-only -fno-modules -Wno-gnu -Wno-variadic-macros -Wno-c99-extensions -Wno-non-virtual-dtor -fno-omit-frame-pointer -UNDEBUG -std=c++14 -MD -MT projects/compiler-rt/lib/fuzzer/CMakeFiles/RTfuzzer.ios.dir/FuzzerDriver.cpp.o -MF projects/compiler-rt/lib/fuzzer/CMakeFiles/RTfuzzer.ios.dir/FuzzerDriver.cpp.o.d -o projects/compiler-rt/lib/fuzzer/CMakeFiles/RTfuzzer.ios.dir/FuzzerDriver.cpp.o -c /Users/buildslave/jenkins/workspace/lldb-cmake/llvm-project/compiler-rt/lib/fuzzer/FuzzerDriver.cpp
clang-12: warning: argument unused during compilation: '-fmodules-cache-path=/Users/buildslave/jenkins/workspace/lldb-cmake/lldb-build/module.cache' [-Wunused-command-line-argument]
clang-12: warning: argument unused during compilation: '-fcxx-modules' [-Wunused-command-line-argument]
[517/3587] /Users/buildslave/jenkins/workspace/lldb-cmake/host-compiler/bin/clang++  -D_DEBUG -D__STDC_CONSTANT_MACROS -D__STDC_FORMAT_MACROS -D__STDC_LIMIT_MACROS -Iprojects/compiler-rt/lib/fuzzer -I/Users/buildslave/jenkins/workspace/lldb-cmake/llvm-project/compiler-rt/lib/fuzzer -I/Applications/Xcode.app/Contents/Developer/Platforms/MacOSX.platform/Developer/SDKs/MacOSX10.15.sdk/usr/include/libxml2 -Iinclude -I/Users/buildslave/jenkins/workspace/lldb-cmake/llvm-project/llvm/include -I/Users/buildslave/jenkins/workspace/lldb-cmake/llvm-project/compiler-rt/lib/fuzzer/../../include -Wdocumentation -fPIC -fvisibility-inlines-hidden -Werror=date-time -Werror=unguarded-availability-new -fmodules -fmodules-cache-path=/Users/buildslave/jenkins/workspace/lldb-cmake/lldb-build/module.cache -fcxx-modules -Xclang -fmodules-local-submodule-visibility -Wall -Wextra -Wno-unused-parameter -Wwrite-strings -Wcast-qual -Wmissing-field-initializers -pedantic -Wno-long-long -Wimplicit-fallthrough -Wcovered-switch-default -Wno-noexcept-type -Wnon-virtual-dtor -Wdelete-non-virtual-dtor -Wsuggest-override -Wstring-conversion -fdiagnostics-color -Wall -std=c++14 -Wno-unused-parameter -O3  -arch arm64 -isysroot /Applications/Xcode.app/Contents/Developer/Platforms/MacOSX.platform/Developer/SDKs/MacOSX10.15.sdk    -stdlib=libc++ -miphoneos-version-min=9.0 -isysroot /Applications/Xcode.app/Contents/Developer/Platforms/iPhoneOS.platform/Developer/SDKs/iPhoneOS13.5.sdk -fPIC -fno-builtin -fno-exceptions -funwind-tables -fno-stack-protector -fno-sanitize=safe-stack -fvisibility=hidden -fno-lto -O3 -gline-tables-only -fno-modules -Wno-gnu -Wno-variadic-macros -Wno-c99-extensions -Wno-non-virtual-dtor -fno-omit-frame-pointer -UNDEBUG -std=c++14 -MD -MT projects/compiler-rt/lib/fuzzer/CMakeFiles/RTfuzzer.ios.dir/FuzzerLoop.cpp.o -MF projects/compiler-rt/lib/fuzzer/CMakeFiles/RTfuzzer.ios.dir/FuzzerLoop.cpp.o.d -o projects/compiler-rt/lib/fuzzer/CMakeFiles/RTfuzzer.ios.dir/FuzzerLoop.cpp.o -c /Users/buildslave/jenkins/workspace/lldb-cmake/llvm-project/compiler-rt/lib/fuzzer/FuzzerLoop.cpp
clang-12: warning: argument unused during compilation: '-fmodules-cache-path=/Users/buildslave/jenkins/workspace/lldb-cmake/lldb-build/module.cache' [-Wunused-command-line-argument]
clang-12: warning: argument unused during compilation: '-fcxx-modules' [-Wunused-command-line-argument]
[518/3587] /Users/buildslave/jenkins/workspace/lldb-cmake/host-compiler/bin/clang++  -D_DEBUG -D__STDC_CONSTANT_MACROS -D__STDC_FORMAT_MACROS -D__STDC_LIMIT_MACROS -Iprojects/compiler-rt/lib/fuzzer -I/Users/buildslave/jenkins/workspace/lldb-cmake/llvm-project/compiler-rt/lib/fuzzer -I/Applications/Xcode.app/Contents/Developer/Platforms/MacOSX.platform/Developer/SDKs/MacOSX10.15.sdk/usr/include/libxml2 -Iinclude -I/Users/buildslave/jenkins/workspace/lldb-cmake/llvm-project/llvm/include -I/Users/buildslave/jenkins/workspace/lldb-cmake/llvm-project/compiler-rt/lib/fuzzer/../../include -Wdocumentation -fPIC -fvisibility-inlines-hidden -Werror=date-time -Werror=unguarded-availability-new -fmodules -fmodules-cache-path=/Users/buildslave/jenkins/workspace/lldb-cmake/lldb-build/module.cache -fcxx-modules -Xclang -fmodules-local-submodule-visibility -Wall -Wextra -Wno-unused-parameter -Wwrite-strings -Wcast-qual -Wmissing-field-initializers -pedantic -Wno-long-long -Wimplicit-fallthrough -Wcovered-switch-default -Wno-noexcept-type -Wnon-virtual-dtor -Wdelete-non-virtual-dtor -Wsuggest-override -Wstring-conversion -fdiagnostics-color -Wall -std=c++14 -Wno-unused-parameter -O3  -arch arm64 -isysroot /Applications/Xcode.app/Contents/Developer/Platforms/MacOSX.platform/Developer/SDKs/MacOSX10.15.sdk    -stdlib=libc++ -miphoneos-version-min=9.0 -isysroot /Applications/Xcode.app/Contents/Developer/Platforms/iPhoneOS.platform/Developer/SDKs/iPhoneOS13.5.sdk -fPIC -fno-builtin -fno-exceptions -funwind-tables -fno-stack-protector -fno-sanitize=safe-stack -fvisibility=hidden -fno-lto -O3 -gline-tables-only -fno-modules -Wno-gnu -Wno-variadic-macros -Wno-c99-extensions -Wno-non-virtual-dtor -fno-omit-frame-pointer -UNDEBUG -std=c++14 -MD -MT projects/compiler-rt/lib/fuzzer/CMakeFiles/RTfuzzer.ios.dir/FuzzerMerge.cpp.o -MF projects/compiler-rt/lib/fuzzer/CMakeFiles/RTfuzzer.ios.dir/FuzzerMerge.cpp.o.d -o projects/compiler-rt/lib/fuzzer/CMakeFiles/RTfuzzer.ios.dir/FuzzerMerge.cpp.o -c /Users/buildslave/jenkins/workspace/lldb-cmake/llvm-project/compiler-rt/lib/fuzzer/FuzzerMerge.cpp
clang-12: warning: argument unused during compilation: '-fmodules-cache-path=/Users/buildslave/jenkins/workspace/lldb-cmake/lldb-build/module.cache' [-Wunused-command-line-argument]
clang-12: warning: argument unused during compilation: '-fcxx-modules' [-Wunused-command-line-argument]
ninja: build stopped: subcommand failed.
Command failed: Command '['/usr/local/bin/ninja', '-v']' returned non-zero exit status 1
Command: ['/usr/local/bin/ninja', '-v']
[Pipeline] }
[Pipeline] // timeout
[Pipeline] }
[Pipeline] // stage
[Pipeline] stage
[Pipeline] { (Test)
Stage "Test" skipped due to earlier failure(s)
[Pipeline] }
[Pipeline] // stage
[Pipeline] stage
[Pipeline] { (Declarative: Post Actions)
[Pipeline] scanForIssues
[Clang (LLVM based)] Sleeping for 5 seconds due to JENKINS-32191...
[Clang (LLVM based)] Parsing console log (workspace: '/Users/buildslave/jenkins/workspace/lldb-cmake')
[Clang (LLVM based)] Successfully parsed console log
[Clang (LLVM based)] -> found 0 issues (skipped 0 duplicates)
[Clang (LLVM based)] Skipping post processing
[Clang (LLVM based)] No filter has been set, publishing all 0 issues
[Pipeline] junit
Recording test results
Test reports were found but none of them are new. Did leafNodes run? 
For example, /Users/buildslave/jenkins/workspace/lldb-cmake/test/results.xml is 50 sec old

Hide Details

Error when executing always post condition: Also: hudson.remoting.Channel$CallSiteStackTrace: Remote call to green-dragon-10 at hudson.remoting.Channel.attachCallSiteStackTrace(Channel.java:1788) at hudson.remoting.UserRequest$ExceptionResponse.retrieve(UserRequest.java:356) at hudson.remoting.Channel.call(Channel.java:998) at hudson.FilePath.act(FilePath.java:1069) at hudson.FilePath.act(FilePath.java:1058) at hudson.tasks.junit.JUnitParser.parseResult(JUnitParser.java:114) at hudson.tasks.junit.JUnitResultArchiver.parse(JUnitResultArchiver.java:137) at hudson.tasks.junit.JUnitResultArchiver.parseAndAttach(JUnitResultArchiver.java:167) at hudson.tasks.junit.pipeline.JUnitResultsStepExecution.run(JUnitResultsStepExecution.java:52) at hudson.tasks.junit.pipeline.JUnitResultsStepExecution.run(JUnitResultsStepExecution.java:25) at org.jenkinsci.plugins.workflow.steps.SynchronousNonBlockingStepExecution.lambda$start$0(SynchronousNonBlockingStepExecution.java:47) at java.util.concurrent.Executors$RunnableAdapter.call(Executors.java:511) at java.util.concurrent.FutureTask.run(FutureTask.java:266) at java.util.concurrent.ThreadPoolExecutor.runWorker(ThreadPoolExecutor.java:1149) at java.util.concurrent.ThreadPoolExecutor$Worker.run(ThreadPoolExecutor.java:624) at java.lang.Thread.run(Thread.java:748) hudson.AbortException: Test reports were found but none of them are new. Did leafNodes run? For example, /Users/buildslave/jenkins/workspace/lldb-cmake/test/results.xml is 50 sec old

Hide Details

at hudson.tasks.junit.TestResult.parse(TestResult.java:222) at hudson.tasks.junit.TestResult.parse(TestResult.java:178) at hudson.tasks.junit.TestResult.<init>(TestResult.java:143) at hudson.tasks.junit.JUnitParser$ParseResultCallable.invoke(JUnitParser.java:146) at hudson.tasks.junit.JUnitParser$ParseResultCallable.invoke(JUnitParser.java:118) at hudson.FilePath$FileCallableWrapper.call(FilePath.java:3073) at hudson.remoting.UserRequest.perform(UserRequest.java:211) at hudson.remoting.UserRequest.perform(UserRequest.java:54) at hudson.remoting.Request$2.run(Request.java:369) at hudson.remoting.InterceptingExecutorService$1.call(InterceptingExecutorService.java:72) at java.util.concurrent.FutureTask.run(Unknown Source) at java.util.concurrent.ThreadPoolExecutor.runWorker(Unknown Source) at java.util.concurrent.ThreadPoolExecutor$Worker.run(Unknown Source) at java.lang.Thread.run(Unknown Source)

Hide Details

[Pipeline] emailext Not sending mail to unregistered user pifon@google.com because your SCM claimed this was associated with a user ID ‘pifon' which your security realm does not recognize; you may need changes in your SCM plugin Not sending mail to unregistered user spatel@rotateright.com because your SCM claimed this was associated with a user ID ‘spatel' which your security realm does not recognize; you may need changes in your SCM plugin Not sending mail to unregistered user noreply@github.com because your SCM claimed this was associated with a user ID ‘noreply' which your security realm does not recognize; you may need changes in your SCM plugin Not sending mail to unregistered user hans@hanshq.net because your SCM claimed this was associated with a user ID ‘hans' which your security realm does not recognize; you may need changes in your SCM plugin Not sending mail to unregistered user i@maskray.me because your SCM claimed this was associated with a user ID ‘i' which your security realm does not recognize; you may need changes in your SCM plugin Not sending mail to unregistered user gyurgyikcp@gmail.com because your SCM claimed this was associated with a user ID ‘gyurgyikcp' which your security realm does not recognize; you may need changes in your SCM plugin Not sending mail to unregistered user kadircet@google.com because your SCM claimed this was associated with a user ID ‘kadircet' which your security realm does not recognize; you may need changes in your SCM plugin Not sending mail to unregistered user mascasa@google.com because your SCM claimed this was associated with a user ID ‘mascasa' which your security realm does not recognize; you may need changes in your SCM plugin Not sending mail to unregistered user pifon@google.com because your SCM claimed this was associated with a user ID ‘pifon' which your security realm does not recognize; you may need changes in your SCM plugin Not sending mail to unregistered user spatel@rotateright.com because your SCM claimed this was associated with a user ID ‘spatel' which your security realm does not recognize; you may need changes in your SCM plugin Not sending mail to unregistered user noreply@github.com because your SCM claimed this was associated with a user ID ‘noreply' which your security realm does not recognize; you may need changes in your SCM plugin Not sending mail to unregistered user hans@hanshq.net because your SCM claimed this was associated with a user ID ‘hans' which your security realm does not recognize; you may need changes in your SCM plugin Not sending mail to unregistered user i@maskray.me because your SCM claimed this was associated with a user ID ‘i' which your security realm does not recognize; you may need changes in your SCM plugin Not sending mail to unregistered user gyurgyikcp@gmail.com because your SCM claimed this was associated with a user ID ‘gyurgyikcp' which your security realm does not recognize; you may need changes in your SCM plugin Not sending mail to unregistered user kadircet@google.com because your SCM claimed this was associated with a user ID ‘kadircet' which your security realm does not recognize; you may need changes in your SCM plugin Not sending mail to unregistered user mascasa@google.com because your SCM claimed this was associated with a user ID ‘mascasa' which your security realm does not recognize; you may need changes in your SCM plugin

Hide Details

Begin Pre-Send Script... Sending email to: mschifer@apple.com lhames@gmail.com compnerd@compnerd.org Erik Pilkington <epilkington@apple.com> Azhar Mohammed <azhar@apple.com>
[Pipeline] } [Pipeline] // stage [Pipeline] } [Pipeline] // withEnv [Pipeline] } [Pipeline] // node [Pipeline] End of Pipeline ERROR: script returned exit code 1 Finished: FAILURE