FailedConsole Output

Started by timer
Obtained zorg/jenkins/jobs/jobs/lldb-cmake from git https://github.com/llvm/llvm-zorg.git
Running in Durability level: MAX_SURVIVABILITY
[Pipeline] Start of Pipeline
[Pipeline] node
Running on green-dragon-10 in /Users/buildslave/jenkins/workspace/lldb-cmake
[Pipeline] {
[Pipeline] stage
[Pipeline] { (Declarative: Checkout SCM)
[Pipeline] checkout
No credentials specified
Fetching changes from the remote Git repository
Checking out Revision 74e099cb9569f67ddb4341839eea408abc67e04e (refs/remotes/origin/master)
Commit message: "Added automatic cluster config and  deployment"
 > git rev-parse --is-inside-work-tree # timeout=10
 > git config remote.origin.url https://github.com/llvm/llvm-zorg.git # timeout=10
Fetching upstream changes from https://github.com/llvm/llvm-zorg.git
 > git --version # timeout=10
 > git fetch --tags --force --progress -- https://github.com/llvm/llvm-zorg.git +refs/heads/*:refs/remotes/origin/* # timeout=10
 > git rev-parse refs/remotes/origin/master^{commit} # timeout=10
 > git rev-parse refs/remotes/origin/origin/master^{commit} # timeout=10
 > git config core.sparsecheckout # timeout=10
 > git checkout -f 74e099cb9569f67ddb4341839eea408abc67e04e # timeout=10
 > git rev-list --no-walk 74e099cb9569f67ddb4341839eea408abc67e04e # timeout=10
[Pipeline] }
[Pipeline] // stage
[Pipeline] withEnv
[Pipeline] {
[Pipeline] stage
[Pipeline] { (Checkout)
[Pipeline] timeout
Timeout set to expire in 30 min
[Pipeline] {
[Pipeline] dir
Running in /Users/buildslave/jenkins/workspace/lldb-cmake/llvm-project
[Pipeline] {
[Pipeline] checkout
No credentials specified
Fetching changes from the remote Git repository
 > git rev-parse --is-inside-work-tree # timeout=10
 > git config remote.origin.url http://labmaster3.local/git/llvm-project.git # timeout=10
Fetching upstream changes from http://labmaster3.local/git/llvm-project.git
 > git --version # timeout=10
 > git fetch --tags --force --progress -- http://labmaster3.local/git/llvm-project.git +refs/heads/*:refs/remotes/origin/* # timeout=10
Checking out Revision 719954eacb704236cb726fa3db5503f650a89b81 (refs/remotes/origin/master)
 > git rev-parse refs/remotes/origin/master^{commit} # timeout=10
 > git rev-parse refs/remotes/origin/origin/master^{commit} # timeout=10
 > git config core.sparsecheckout # timeout=10
 > git checkout -f 719954eacb704236cb726fa3db5503f650a89b81 # timeout=10
Commit message: "[InstSimplify] add tests for icmp with 'mul nuw' operand; NFC"
 > git rev-list --no-walk bc7456fd8a11e3b477060af85b00c42ca728ad7f # timeout=10
[Pipeline] }
[Pipeline] // dir
[Pipeline] dir
Running in /Users/buildslave/jenkins/workspace/lldb-cmake/llvm-zorg
[Pipeline] {
[Pipeline] checkout
No credentials specified
Fetching changes from the remote Git repository
Checking out Revision 74e099cb9569f67ddb4341839eea408abc67e04e (refs/remotes/origin/master)
Commit message: "Added automatic cluster config and  deployment"
 > git rev-parse --is-inside-work-tree # timeout=10
 > git config remote.origin.url http://labmaster3.local/git/llvm-zorg.git # timeout=10
Fetching upstream changes from http://labmaster3.local/git/llvm-zorg.git
 > git --version # timeout=10
 > git fetch --tags --force --progress -- http://labmaster3.local/git/llvm-zorg.git +refs/heads/*:refs/remotes/origin/* # timeout=10
 > git rev-parse refs/remotes/origin/master^{commit} # timeout=10
 > git rev-parse refs/remotes/origin/origin/master^{commit} # timeout=10
 > git config core.sparsecheckout # timeout=10
 > git checkout -f 74e099cb9569f67ddb4341839eea408abc67e04e # timeout=10
 > git rev-list --no-walk 74e099cb9569f67ddb4341839eea408abc67e04e # timeout=10
[Pipeline] }
[Pipeline] // dir
[Pipeline] }
[Pipeline] // timeout
[Pipeline] }
[Pipeline] // stage
[Pipeline] stage
[Pipeline] { (Fetch Host Compiler)
[Pipeline] timeout
Timeout set to expire in 10 min
[Pipeline] {
[Pipeline] sh
+ python llvm-zorg/zorg/jenkins/monorepo_build.py fetch
Fetching Compiler

Hide Details

@@@ Fetching Compiler @@@ GETting http://labmaster2.local/artifacts//clang-stage1-RA/latest to /Users/buildslave/jenkins/workspace/lldb-cmake/host-compiler.tar.gz ... done. Decompressing... cd /Users/buildslave/jenkins/workspace/lldb-cmake/host-compiler/ 'tar' 'zxf' '../host-compiler.tar.gz' Completed at: 2020-08-05T09:56:25 @@@@@@
[Pipeline] } [Pipeline] // timeout [Pipeline] } [Pipeline] // stage [Pipeline] stage [Pipeline] { (Build) [Pipeline] timeout Timeout set to expire in 2 hr 0 min [Pipeline] { [Pipeline] sh + set -u + rm -rf build.properties + cd llvm-project + git tag -a -m 'First Commit' first_commit 97724f18c79c7cc81ced24239eb5e883bf1398ef fatal: tag 'first_commit' already exists + true ++ git describe --match first_commit + git_desc=first_commit-362522-g719954eacb7 ++ echo first_commit-362522-g719954eacb7 ++ cut -f 2 -d - + export GIT_DISTANCE=362522 + GIT_DISTANCE=362522 ++ echo first_commit-362522-g719954eacb7 ++ cut -f 3 -d - + sha=g719954eacb7 + export GIT_SHA=719954eacb7 + GIT_SHA=719954eacb7 + cd - /Users/buildslave/jenkins/workspace/lldb-cmake + python llvm-zorg/zorg/jenkins/monorepo_build.py lldb-cmake build --assertions '--projects=clang;libcxx;libcxxabi;compiler-rt;lld;lldb;debuginfo-tests' --compiler-flag=-Wdocumentation --cmake-type=Release You are using pip version 18.1, however version 20.2 is available. You should consider upgrading via the 'pip install --upgrade pip' command. You are using pip version 18.1, however version 20.2 is available. You should consider upgrading via the 'pip install --upgrade pip' command. Dependency met os_version v10.15.5 Dependency met brew cmake v3.17.2 Dependency met brew ninja v1.8.2 Dependency met pip psutil v5.4.5 Dependency met pip six v1.11.0 Dependency met xcode v11.5
Clean

Hide Details

@@@ Clean @@@ Removing module cache: /Users/buildslave/jenkins/workspace/lldb-cmake/lldb-build/module.cache Completed at: 2020-08-05T09:57:49 @@@@@@
Cmake

Hide Details

@@@ Cmake @@@ cd /Users/buildslave/jenkins/workspace/lldb-cmake/lldb-build '/usr/local/bin/cmake' '-G' 'Ninja' '/Users/buildslave/jenkins/workspace/lldb-cmake/llvm-project/llvm' '-DCMAKE_BUILD_TYPE=Release' '-DCMAKE_EXPORT_COMPILE_COMMANDS=ON' '-DCMAKE_INSTALL_PREFIX=/Users/buildslave/jenkins/workspace/lldb-cmake/lldb-install' '-DCMAKE_MAKE_PROGRAM=/usr/local/bin/ninja' '-DLLDB_TEST_USER_ARGS=--arch;x86_64;--build-dir;/Users/buildslave/jenkins/workspace/lldb-cmake/lldb-build/lldb-test-build.noindex;-s=/Users/buildslave/jenkins/workspace/lldb-cmake/test/logs;-t;--env;TERM=vt100' '-DLLDB_ENABLE_PYTHON=On' '-DLLVM_ENABLE_ASSERTIONS:BOOL=TRUE' '-DLLVM_ENABLE_MODULES=On' '-DLLVM_ENABLE_PROJECTS=clang;libcxx;libcxxabi;compiler-rt;lld;lldb;debuginfo-tests' '-DLLVM_LIT_ARGS=-v --time-tests --shuffle --xunit-xml-output=/Users/buildslave/jenkins/workspace/lldb-cmake/test/results.xml -v' '-DLLVM_VERSION_PATCH=99' '-DCMAKE_C_FLAGS=-Wdocumentation' '-DCMAKE_CXX_FLAGS=-Wdocumentation' '-DCMAKE_C_COMPILER=/Users/buildslave/jenkins/workspace/lldb-cmake/host-compiler/bin/clang' '-DCMAKE_CXX_COMPILER=/Users/buildslave/jenkins/workspace/lldb-cmake/host-compiler/bin/clang++' -- clang project is enabled -- clang-tools-extra project is disabled -- compiler-rt project is enabled -- debuginfo-tests project is enabled -- libc project is disabled -- libclc project is disabled -- libcxx project is enabled -- libcxxabi project is enabled -- libunwind project is disabled -- lld project is enabled -- lldb project is enabled -- mlir project is disabled -- openmp project is disabled -- parallel-libs project is disabled -- polly project is disabled -- pstl project is disabled -- flang project is disabled -- Found libtool - /Applications/Xcode.app/Contents/Developer/Toolchains/XcodeDefault.xctoolchain/usr/bin/libtool -- Found LibXml2: /usr/lib/libxml2.dylib (found version "2.9.4") -- Native target architecture is X86 -- Threads enabled. -- Doxygen disabled. -- Go bindings disabled. -- Ninja version: 1.8.2 -- Found ld64 - /Applications/Xcode.app/Contents/Developer/Toolchains/XcodeDefault.xctoolchain/usr/bin/ld -- Could NOT find OCaml (missing: OCAMLFIND OCAML_VERSION OCAML_STDLIB_PATH) -- Could NOT find OCaml (missing: OCAMLFIND OCAML_VERSION OCAML_STDLIB_PATH) -- OCaml bindings disabled. -- LLVM host triple: x86_64-apple-darwin19.5.0 -- LLVM default target triple: x86_64-apple-darwin19.5.0 -- Building with -fPIC -- Found Python3: /usr/local/Frameworks/Python.framework/Versions/3.7/bin/python3.7 (found version "3.7.1") found components: Interpreter -- Constructing LLVMBuild project information -- Targeting AArch64 -- Targeting AMDGPU -- Targeting ARM -- Targeting AVR -- Targeting BPF -- Targeting Hexagon -- Targeting Lanai -- Targeting Mips -- Targeting MSP430 -- Targeting NVPTX -- Targeting PowerPC -- Targeting RISCV -- Targeting Sparc -- Targeting SystemZ -- Targeting WebAssembly -- Targeting X86 -- Targeting XCore -- Libc++abi will be using libc++ includes from /Users/buildslave/jenkins/workspace/lldb-cmake/llvm-project/libcxxabi/../libcxx/include -- Could not find CrashReporterClient, not linking against it -- Could not find ParallelSTL, libc++abi will not attempt to use it but the build may fail if the libc++ in use needs it to be available. -- Looking for cxxabi.h in /Users/buildslave/jenkins/workspace/lldb-cmake/llvm-project/libcxx/../libcxxabi/include -- Looking for cxxabi.h in /Users/buildslave/jenkins/workspace/lldb-cmake/llvm-project/libcxx/../libcxxabi/include - found -- Looking for __cxxabi_config.h in /Users/buildslave/jenkins/workspace/lldb-cmake/llvm-project/libcxx/../libcxxabi/include -- Looking for __cxxabi_config.h in /Users/buildslave/jenkins/workspace/lldb-cmake/llvm-project/libcxx/../libcxxabi/include - found -- Found OSX_SYSROOT: /Applications/Xcode.app/Contents/Developer/Platforms/MacOSX.platform/Developer/SDKs/MacOSX10.15.sdk -- Got ld supported ARCHES: armv6 armv7 armv7s arm64 arm64e arm64_32 i386 x86_64 x86_64h armv6m armv7k armv7m armv7em -- Toolchain supported arches: armv6;armv7;armv7s;arm64;arm64e;arm64_32;i386;x86_64;x86_64h;armv6m;armv7k;armv7m;armv7em -- Using cached valid architectures for osx. -- OSX supported arches: x86_64;x86_64h -- Using cached valid architectures for iossim. -- ios Simulator supported arches: i386;x86_64 -- Using cached valid architectures for ios. -- ios supported arches: armv6;armv7;armv7s;arm64;armv7k -- Compiler-RT supported architectures: x86_64;x86_64h;i386;armv6;armv7;armv7s;arm64;armv7k -- No arm64 support in /Applications/Xcode.app/Contents/Developer/Platforms/MacOSX.platform/Developer/SDKs/MacOSX10.15.sdk/SDKSettings.plist -- No arm64e support in /Applications/Xcode.app/Contents/Developer/Platforms/MacOSX.platform/Developer/SDKs/MacOSX10.15.sdk/SDKSettings.plist -- Using cached valid architectures for osx. -- OSX supported builtin arches: i386;x86_64;x86_64h -- Using cached valid architectures for iossim. -- ios Simulator supported builtin arches: i386;x86_64 -- Using cached valid architectures for ios. -- ios supported builtin arches: arm64;armv7;armv7k;armv7s -- Builtin supported architectures: i386;x86_64;x86_64h;armv7;armv7k;armv7s;arm64 -- For osx_i386 builtins preferring i386/fp_mode.c to fp_mode.c -- For osx_i386 builtins preferring i386/ashldi3.S to ashldi3.c -- For osx_i386 builtins preferring i386/ashrdi3.S to ashrdi3.c -- For osx_i386 builtins preferring i386/divdi3.S to divdi3.c -- For osx_i386 builtins preferring i386/floatdidf.S to floatdidf.c -- For osx_i386 builtins preferring i386/floatdisf.S to floatdisf.c -- For osx_i386 builtins preferring i386/floatundidf.S to floatundidf.c -- For osx_i386 builtins preferring i386/floatundisf.S to floatundisf.c -- For osx_i386 builtins preferring i386/lshrdi3.S to lshrdi3.c -- For osx_i386 builtins preferring i386/moddi3.S to moddi3.c -- For osx_i386 builtins preferring i386/muldi3.S to muldi3.c -- For osx_i386 builtins preferring i386/udivdi3.S to udivdi3.c -- For osx_i386 builtins preferring i386/umoddi3.S to umoddi3.c -- For osx_i386 builtins preferring i386/floatdixf.S to floatdixf.c -- For osx_i386 builtins preferring i386/floatundixf.S to floatundixf.c -- For osx_x86_64 builtins preferring i386/fp_mode.c to fp_mode.c -- For osx_x86_64 builtins preferring x86_64/floatdidf.c to floatdidf.c -- For osx_x86_64 builtins preferring x86_64/floatdisf.c to floatdisf.c -- For osx_x86_64 builtins preferring x86_64/floatundidf.S to floatundidf.c -- For osx_x86_64 builtins preferring x86_64/floatundisf.S to floatundisf.c -- For osx_x86_64 builtins preferring x86_64/floatdixf.c to floatdixf.c -- For osx_x86_64 builtins preferring x86_64/floatundixf.S to floatundixf.c -- For osx_x86_64h builtins preferring i386/fp_mode.c to fp_mode.c -- For osx_x86_64h builtins preferring x86_64/floatdidf.c to floatdidf.c -- For osx_x86_64h builtins preferring x86_64/floatdisf.c to floatdisf.c -- For osx_x86_64h builtins preferring x86_64/floatundidf.S to floatundidf.c -- For osx_x86_64h builtins preferring x86_64/floatundisf.S to floatundisf.c -- For osx_x86_64h builtins preferring x86_64/floatdixf.c to floatdixf.c -- For osx_x86_64h builtins preferring x86_64/floatundixf.S to floatundixf.c -- For cc_kext_osx_i386 builtins preferring i386/fp_mode.c to fp_mode.c -- For cc_kext_osx_i386 builtins preferring i386/ashldi3.S to ashldi3.c -- For cc_kext_osx_i386 builtins preferring i386/ashrdi3.S to ashrdi3.c -- For cc_kext_osx_i386 builtins preferring i386/divdi3.S to divdi3.c -- For cc_kext_osx_i386 builtins preferring i386/floatdidf.S to floatdidf.c -- For cc_kext_osx_i386 builtins preferring i386/floatdisf.S to floatdisf.c -- For cc_kext_osx_i386 builtins preferring i386/floatundidf.S to floatundidf.c -- For cc_kext_osx_i386 builtins preferring i386/floatundisf.S to floatundisf.c -- For cc_kext_osx_i386 builtins preferring i386/lshrdi3.S to lshrdi3.c -- For cc_kext_osx_i386 builtins preferring i386/moddi3.S to moddi3.c -- For cc_kext_osx_i386 builtins preferring i386/muldi3.S to muldi3.c -- For cc_kext_osx_i386 builtins preferring i386/udivdi3.S to udivdi3.c -- For cc_kext_osx_i386 builtins preferring i386/umoddi3.S to umoddi3.c -- For cc_kext_osx_i386 builtins preferring i386/floatdixf.S to floatdixf.c -- For cc_kext_osx_i386 builtins preferring i386/floatundixf.S to floatundixf.c -- For cc_kext_osx_x86_64 builtins preferring i386/fp_mode.c to fp_mode.c -- For cc_kext_osx_x86_64 builtins preferring x86_64/floatdidf.c to floatdidf.c -- For cc_kext_osx_x86_64 builtins preferring x86_64/floatdisf.c to floatdisf.c -- For cc_kext_osx_x86_64 builtins preferring x86_64/floatundidf.S to floatundidf.c -- For cc_kext_osx_x86_64 builtins preferring x86_64/floatundisf.S to floatundisf.c -- For cc_kext_osx_x86_64 builtins preferring x86_64/floatdixf.c to floatdixf.c -- For cc_kext_osx_x86_64 builtins preferring x86_64/floatundixf.S to floatundixf.c -- For cc_kext_osx_x86_64h builtins preferring i386/fp_mode.c to fp_mode.c -- For cc_kext_osx_x86_64h builtins preferring x86_64/floatdidf.c to floatdidf.c -- For cc_kext_osx_x86_64h builtins preferring x86_64/floatdisf.c to floatdisf.c -- For cc_kext_osx_x86_64h builtins preferring x86_64/floatundidf.S to floatundidf.c -- For cc_kext_osx_x86_64h builtins preferring x86_64/floatundisf.S to floatundisf.c -- For cc_kext_osx_x86_64h builtins preferring x86_64/floatdixf.c to floatdixf.c -- For cc_kext_osx_x86_64h builtins preferring x86_64/floatundixf.S to floatundixf.c -- For iossim_i386 builtins preferring i386/fp_mode.c to fp_mode.c -- For iossim_i386 builtins preferring i386/ashldi3.S to ashldi3.c -- For iossim_i386 builtins preferring i386/ashrdi3.S to ashrdi3.c -- For iossim_i386 builtins preferring i386/divdi3.S to divdi3.c -- For iossim_i386 builtins preferring i386/floatdidf.S to floatdidf.c -- For iossim_i386 builtins preferring i386/floatdisf.S to floatdisf.c -- For iossim_i386 builtins preferring i386/floatundidf.S to floatundidf.c -- For iossim_i386 builtins preferring i386/floatundisf.S to floatundisf.c -- For iossim_i386 builtins preferring i386/lshrdi3.S to lshrdi3.c -- For iossim_i386 builtins preferring i386/moddi3.S to moddi3.c -- For iossim_i386 builtins preferring i386/muldi3.S to muldi3.c -- For iossim_i386 builtins preferring i386/udivdi3.S to udivdi3.c -- For iossim_i386 builtins preferring i386/umoddi3.S to umoddi3.c -- For iossim_i386 builtins preferring i386/floatdixf.S to floatdixf.c -- For iossim_i386 builtins preferring i386/floatundixf.S to floatundixf.c -- For iossim_x86_64 builtins preferring i386/fp_mode.c to fp_mode.c -- For iossim_x86_64 builtins preferring x86_64/floatdidf.c to floatdidf.c -- For iossim_x86_64 builtins preferring x86_64/floatdisf.c to floatdisf.c -- For iossim_x86_64 builtins preferring x86_64/floatundidf.S to floatundidf.c -- For iossim_x86_64 builtins preferring x86_64/floatundisf.S to floatundisf.c -- For iossim_x86_64 builtins preferring x86_64/floatdixf.c to floatdixf.c -- For iossim_x86_64 builtins preferring x86_64/floatundixf.S to floatundixf.c -- For ios_arm64 builtins preferring aarch64/fp_mode.c to fp_mode.c -- For ios_armv7 builtins preferring arm/fp_mode.c to fp_mode.c -- For ios_armv7 builtins preferring arm/comparesf2.S to comparesf2.c -- For ios_armv7k builtins preferring arm/fp_mode.c to fp_mode.c -- For ios_armv7k builtins preferring arm/bswapdi2.S to bswapdi2.c -- For ios_armv7k builtins preferring arm/bswapsi2.S to bswapsi2.c -- For ios_armv7k builtins preferring arm/clzdi2.S to clzdi2.c -- For ios_armv7k builtins preferring arm/clzsi2.S to clzsi2.c -- For ios_armv7k builtins preferring arm/comparesf2.S to comparesf2.c -- For ios_armv7k builtins preferring arm/divmodsi4.S to divmodsi4.c -- For ios_armv7k builtins preferring arm/divsi3.S to divsi3.c -- For ios_armv7k builtins preferring arm/modsi3.S to modsi3.c -- For ios_armv7k builtins preferring arm/udivmodsi4.S to udivmodsi4.c -- For ios_armv7k builtins preferring arm/udivsi3.S to udivsi3.c -- For ios_armv7k builtins preferring arm/umodsi3.S to umodsi3.c -- For ios_armv7s builtins preferring arm/fp_mode.c to fp_mode.c -- For ios_armv7s builtins preferring arm/comparesf2.S to comparesf2.c -- For cc_kext_ios_arm64 builtins preferring aarch64/fp_mode.c to fp_mode.c -- For cc_kext_ios_armv7 builtins preferring arm/fp_mode.c to fp_mode.c -- For cc_kext_ios_armv7 builtins preferring arm/bswapdi2.S to bswapdi2.c -- For cc_kext_ios_armv7 builtins preferring arm/bswapsi2.S to bswapsi2.c -- For cc_kext_ios_armv7 builtins preferring arm/clzdi2.S to clzdi2.c -- For cc_kext_ios_armv7 builtins preferring arm/clzsi2.S to clzsi2.c -- For cc_kext_ios_armv7 builtins preferring arm/comparesf2.S to comparesf2.c -- For cc_kext_ios_armv7 builtins preferring arm/divmodsi4.S to divmodsi4.c -- For cc_kext_ios_armv7 builtins preferring arm/divsi3.S to divsi3.c -- For cc_kext_ios_armv7 builtins preferring arm/modsi3.S to modsi3.c -- For cc_kext_ios_armv7 builtins preferring arm/udivmodsi4.S to udivmodsi4.c -- For cc_kext_ios_armv7 builtins preferring arm/udivsi3.S to udivsi3.c -- For cc_kext_ios_armv7 builtins preferring arm/umodsi3.S to umodsi3.c -- For cc_kext_ios_armv7k builtins preferring arm/fp_mode.c to fp_mode.c -- For cc_kext_ios_armv7k builtins preferring arm/bswapdi2.S to bswapdi2.c -- For cc_kext_ios_armv7k builtins preferring arm/bswapsi2.S to bswapsi2.c -- For cc_kext_ios_armv7k builtins preferring arm/clzdi2.S to clzdi2.c -- For cc_kext_ios_armv7k builtins preferring arm/clzsi2.S to clzsi2.c -- For cc_kext_ios_armv7k builtins preferring arm/comparesf2.S to comparesf2.c -- For cc_kext_ios_armv7k builtins preferring arm/divmodsi4.S to divmodsi4.c -- For cc_kext_ios_armv7k builtins preferring arm/divsi3.S to divsi3.c -- For cc_kext_ios_armv7k builtins preferring arm/modsi3.S to modsi3.c -- For cc_kext_ios_armv7k builtins preferring arm/udivmodsi4.S to udivmodsi4.c -- For cc_kext_ios_armv7k builtins preferring arm/udivsi3.S to udivsi3.c -- For cc_kext_ios_armv7k builtins preferring arm/umodsi3.S to umodsi3.c -- For cc_kext_ios_armv7s builtins preferring arm/fp_mode.c to fp_mode.c -- For cc_kext_ios_armv7s builtins preferring arm/bswapdi2.S to bswapdi2.c -- For cc_kext_ios_armv7s builtins preferring arm/bswapsi2.S to bswapsi2.c -- For cc_kext_ios_armv7s builtins preferring arm/clzdi2.S to clzdi2.c -- For cc_kext_ios_armv7s builtins preferring arm/clzsi2.S to clzsi2.c -- For cc_kext_ios_armv7s builtins preferring arm/comparesf2.S to comparesf2.c -- For cc_kext_ios_armv7s builtins preferring arm/divmodsi4.S to divmodsi4.c -- For cc_kext_ios_armv7s builtins preferring arm/divsi3.S to divsi3.c -- For cc_kext_ios_armv7s builtins preferring arm/modsi3.S to modsi3.c -- For cc_kext_ios_armv7s builtins preferring arm/udivmodsi4.S to udivmodsi4.c -- For cc_kext_ios_armv7s builtins preferring arm/udivsi3.S to udivsi3.c -- For cc_kext_ios_armv7s builtins preferring arm/umodsi3.S to umodsi3.c -- For macho_embedded_armv6m builtins preferring arm/divsi3.S to divsi3.c -- For macho_embedded_armv6m builtins preferring arm/udivsi3.S to udivsi3.c -- For macho_embedded_armv6m builtins preferring arm/comparesf2.S to comparesf2.c -- For macho_embedded_armv6m builtins preferring arm/addsf3.S to addsf3.c -- For macho_embedded_armv7m builtins preferring arm/clzdi2.S to clzdi2.c -- For macho_embedded_armv7m builtins preferring arm/clzsi2.S to clzsi2.c -- For macho_embedded_armv7m builtins preferring arm/comparesf2.S to comparesf2.c -- For macho_embedded_armv7m builtins preferring arm/divmodsi4.S to divmodsi4.c -- For macho_embedded_armv7m builtins preferring arm/divsi3.S to divsi3.c -- For macho_embedded_armv7m builtins preferring arm/modsi3.S to modsi3.c -- For macho_embedded_armv7m builtins preferring arm/udivmodsi4.S to udivmodsi4.c -- For macho_embedded_armv7m builtins preferring arm/udivsi3.S to udivsi3.c -- For macho_embedded_armv7m builtins preferring arm/umodsi3.S to umodsi3.c -- For macho_embedded_armv7em builtins preferring arm/clzdi2.S to clzdi2.c -- For macho_embedded_armv7em builtins preferring arm/clzsi2.S to clzsi2.c -- For macho_embedded_armv7em builtins preferring arm/comparesf2.S to comparesf2.c -- For macho_embedded_armv7em builtins preferring arm/divmodsi4.S to divmodsi4.c -- For macho_embedded_armv7em builtins preferring arm/divsi3.S to divsi3.c -- For macho_embedded_armv7em builtins preferring arm/modsi3.S to modsi3.c -- For macho_embedded_armv7em builtins preferring arm/udivmodsi4.S to udivmodsi4.c -- For macho_embedded_armv7em builtins preferring arm/udivsi3.S to udivsi3.c -- For macho_embedded_armv7em builtins preferring arm/umodsi3.S to umodsi3.c -- For macho_embedded_armv7 builtins preferring arm/clzdi2.S to clzdi2.c -- For macho_embedded_armv7 builtins preferring arm/clzsi2.S to clzsi2.c -- For macho_embedded_armv7 builtins preferring arm/comparesf2.S to comparesf2.c -- For macho_embedded_armv7 builtins preferring arm/divmodsi4.S to divmodsi4.c -- For macho_embedded_armv7 builtins preferring arm/divsi3.S to divsi3.c -- For macho_embedded_armv7 builtins preferring arm/modsi3.S to modsi3.c -- For macho_embedded_armv7 builtins preferring arm/udivmodsi4.S to udivmodsi4.c -- For macho_embedded_armv7 builtins preferring arm/udivsi3.S to udivsi3.c -- For macho_embedded_armv7 builtins preferring arm/umodsi3.S to umodsi3.c -- For macho_embedded_i386 builtins preferring i386/ashldi3.S to ashldi3.c -- For macho_embedded_i386 builtins preferring i386/ashrdi3.S to ashrdi3.c -- For macho_embedded_i386 builtins preferring i386/divdi3.S to divdi3.c -- For macho_embedded_i386 builtins preferring i386/floatdidf.S to floatdidf.c -- For macho_embedded_i386 builtins preferring i386/floatdisf.S to floatdisf.c -- For macho_embedded_i386 builtins preferring i386/floatundidf.S to floatundidf.c -- For macho_embedded_i386 builtins preferring i386/floatundisf.S to floatundisf.c -- For macho_embedded_i386 builtins preferring i386/lshrdi3.S to lshrdi3.c -- For macho_embedded_i386 builtins preferring i386/moddi3.S to moddi3.c -- For macho_embedded_i386 builtins preferring i386/muldi3.S to muldi3.c -- For macho_embedded_i386 builtins preferring i386/udivdi3.S to udivdi3.c -- For macho_embedded_i386 builtins preferring i386/umoddi3.S to umoddi3.c -- For macho_embedded_x86_64 builtins preferring x86_64/floatdidf.c to floatdidf.c -- For macho_embedded_x86_64 builtins preferring x86_64/floatdisf.c to floatdisf.c -- For macho_embedded_x86_64 builtins preferring x86_64/floatundidf.S to floatundidf.c -- For macho_embedded_x86_64 builtins preferring x86_64/floatundisf.S to floatundisf.c -- No arm64 support in /Applications/Xcode.app/Contents/Developer/Platforms/MacOSX.platform/Developer/SDKs/MacOSX10.15.sdk/SDKSettings.plist -- No arm64e support in /Applications/Xcode.app/Contents/Developer/Platforms/MacOSX.platform/Developer/SDKs/MacOSX10.15.sdk/SDKSettings.plist -- Using cached valid architectures for osx. -- OSX supported builtin arches: i386;x86_64;x86_64h -- Using cached valid architectures for iossim. -- ios Simulator supported builtin arches: i386;x86_64 -- Using cached valid architectures for ios. -- ios supported builtin arches: arm64;armv7;armv7k;armv7s -- Builtin supported architectures: i386;x86_64;x86_64h;armv7;armv7k;armv7s;arm64 -- check-interception does nothing. -- Generated Sanitizer SUPPORTED_TOOLS list on "Darwin" is "asan;lsan;tsan;ubsan" -- sanitizer_common tests on "Darwin" will run against "asan;lsan;tsan;ubsan" -- Clang version: 12.0.99 -- LLD version: 12.0.99 -- Enable editline support in LLDB: TRUE -- Enable curses support in LLDB: TRUE -- Enable LZMA compression support in LLDB: TRUE -- Could NOT find Lua (missing: LUA_LIBRARIES LUA_INCLUDE_DIR) (Required is at least version "5.3") -- Could NOT find LuaAndSwig (missing: LUA_LIBRARIES LUA_INCLUDE_DIR) -- Enable Lua scripting support in LLDB: FALSE -- Found Python3: /usr/local/Frameworks/Python.framework/Versions/3.7/bin/python3.7 (found version "3.7.1") found components: Interpreter Development -- Enable Python scripting support in LLDB: TRUE -- Found LibXml2: /usr/lib/libxml2.dylib (found suitable version "2.9.4", minimum required is "2.8") -- Enable Libxml 2 support in LLDB: TRUE -- LLDB version: 12.0.99git -- Symbols (liblldb): exporting all symbols from the lldb namespace CMake Warning at /Users/buildslave/jenkins/workspace/lldb-cmake/llvm-project/lldb/tools/debugserver/source/CMakeLists.txt:44 (message): Development code sign identity not found: 'lldb_codesign' This will cause failures in the test suite.Pass '-DLLDB_USE_SYSTEM_DEBUGSERVER=ON' to use the system one instead.See 'Code Signing on macOS' in the documentation. Call Stack (most recent call first): /Users/buildslave/jenkins/workspace/lldb-cmake/llvm-project/lldb/tools/debugserver/source/CMakeLists.txt:92 (get_debugserver_codesign_identity)

Hide Details

Hide Details

-- LLDB debugserver energy support is disabled -- Could NOT find Doxygen (missing: DOXYGEN_EXECUTABLE) -- Could NOT find epydoc -- LLDB Tests use just-built debugserver: /Users/buildslave/jenkins/workspace/lldb-cmake/lldb-build/./bin/debugserver -- Registering Bye as a pass plugin (static build: OFF) -- LLVM FileCheck Found: /usr/local/bin/FileCheck -- Version: 0.0.0 -- Performing Test HAVE_THREAD_SAFETY_ATTRIBUTES -- failed to compile -- Performing Test HAVE_GNU_POSIX_REGEX -- failed to compile -- Performing Test HAVE_POSIX_REGEX -- success -- Performing Test HAVE_STEADY_CLOCK -- success -- Configuring done -- Generating done -- Build files have been written to: /Users/buildslave/jenkins/workspace/lldb-cmake/lldb-build Completed at: 2020-08-05T09:58:47 @@@@@@
Build

Hide Details

@@@ Build @@@ cd /Users/buildslave/jenkins/workspace/lldb-cmake/lldb-build '/usr/local/bin/ninja' '-v' [1/3070] /Users/buildslave/jenkins/workspace/lldb-cmake/host-compiler/bin/clang++ -DGTEST_HAS_RTTI=0 -D_DEBUG -D__STDC_CONSTANT_MACROS -D__STDC_FORMAT_MACROS -D__STDC_LIMIT_MACROS -Ilib/Support -I/Users/buildslave/jenkins/workspace/lldb-cmake/llvm-project/llvm/lib/Support -I/Applications/Xcode.app/Contents/Developer/Platforms/MacOSX.platform/Developer/SDKs/MacOSX10.15.sdk/usr/include/libxml2 -Iinclude -I/Users/buildslave/jenkins/workspace/lldb-cmake/llvm-project/llvm/include -Wdocumentation -fPIC -fvisibility-inlines-hidden -Werror=date-time -Werror=unguarded-availability-new -fmodules -fmodules-cache-path=/Users/buildslave/jenkins/workspace/lldb-cmake/lldb-build/module.cache -fcxx-modules -Xclang -fmodules-local-submodule-visibility -Wall -Wextra -Wno-unused-parameter -Wwrite-strings -Wcast-qual -Wmissing-field-initializers -pedantic -Wno-long-long -Wimplicit-fallthrough -Wcovered-switch-default -Wno-noexcept-type -Wnon-virtual-dtor -Wdelete-non-virtual-dtor -Wsuggest-override -Wstring-conversion -fdiagnostics-color -O3 -isysroot /Applications/Xcode.app/Contents/Developer/Platforms/MacOSX.platform/Developer/SDKs/MacOSX10.15.sdk -UNDEBUG -std=c++14 -fno-exceptions -fno-rtti -MD -MT lib/Support/CMakeFiles/LLVMSupport.dir/Valgrind.cpp.o -MF lib/Support/CMakeFiles/LLVMSupport.dir/Valgrind.cpp.o.d -o lib/Support/CMakeFiles/LLVMSupport.dir/Valgrind.cpp.o -c /Users/buildslave/jenkins/workspace/lldb-cmake/llvm-project/llvm/lib/Support/Valgrind.cpp [2/3070] /Users/buildslave/jenkins/workspace/lldb-cmake/host-compiler/bin/clang++ -DGTEST_HAS_RTTI=0 -D_DEBUG -D__STDC_CONSTANT_MACROS -D__STDC_FORMAT_MACROS -D__STDC_LIMIT_MACROS -Ilib/Support -I/Users/buildslave/jenkins/workspace/lldb-cmake/llvm-project/llvm/lib/Support -I/Applications/Xcode.app/Contents/Developer/Platforms/MacOSX.platform/Developer/SDKs/MacOSX10.15.sdk/usr/include/libxml2 -Iinclude -I/Users/buildslave/jenkins/workspace/lldb-cmake/llvm-project/llvm/include -Wdocumentation -fPIC -fvisibility-inlines-hidden -Werror=date-time -Werror=unguarded-availability-new -fmodules -fmodules-cache-path=/Users/buildslave/jenkins/workspace/lldb-cmake/lldb-build/module.cache -fcxx-modules -Xclang -fmodules-local-submodule-visibility -Wall -Wextra -Wno-unused-parameter -Wwrite-strings -Wcast-qual -Wmissing-field-initializers -pedantic -Wno-long-long -Wimplicit-fallthrough -Wcovered-switch-default -Wno-noexcept-type -Wnon-virtual-dtor -Wdelete-non-virtual-dtor -Wsuggest-override -Wstring-conversion -fdiagnostics-color -O3 -isysroot /Applications/Xcode.app/Contents/Developer/Platforms/MacOSX.platform/Developer/SDKs/MacOSX10.15.sdk -UNDEBUG -std=c++14 -fno-exceptions -fno-rtti -MD -MT lib/Support/CMakeFiles/LLVMSupport.dir/ThreadLocal.cpp.o -MF lib/Support/CMakeFiles/LLVMSupport.dir/ThreadLocal.cpp.o.d -o lib/Support/CMakeFiles/LLVMSupport.dir/ThreadLocal.cpp.o -c /Users/buildslave/jenkins/workspace/lldb-cmake/llvm-project/llvm/lib/Support/ThreadLocal.cpp [3/3070] /Users/buildslave/jenkins/workspace/lldb-cmake/host-compiler/bin/clang++ -DGTEST_HAS_RTTI=0 -D_DEBUG -D__STDC_CONSTANT_MACROS -D__STDC_FORMAT_MACROS -D__STDC_LIMIT_MACROS -Ilib/Support -I/Users/buildslave/jenkins/workspace/lldb-cmake/llvm-project/llvm/lib/Support -I/Applications/Xcode.app/Contents/Developer/Platforms/MacOSX.platform/Developer/SDKs/MacOSX10.15.sdk/usr/include/libxml2 -Iinclude -I/Users/buildslave/jenkins/workspace/lldb-cmake/llvm-project/llvm/include -Wdocumentation -fPIC -fvisibility-inlines-hidden -Werror=date-time -Werror=unguarded-availability-new -fmodules -fmodules-cache-path=/Users/buildslave/jenkins/workspace/lldb-cmake/lldb-build/module.cache -fcxx-modules -Xclang -fmodules-local-submodule-visibility -Wall -Wextra -Wno-unused-parameter -Wwrite-strings -Wcast-qual -Wmissing-field-initializers -pedantic -Wno-long-long -Wimplicit-fallthrough -Wcovered-switch-default -Wno-noexcept-type -Wnon-virtual-dtor -Wdelete-non-virtual-dtor -Wsuggest-override -Wstring-conversion -fdiagnostics-color -O3 -isysroot /Applications/Xcode.app/Contents/Developer/Platforms/MacOSX.platform/Developer/SDKs/MacOSX10.15.sdk -UNDEBUG -std=c++14 -fno-exceptions -fno-rtti -MD -MT lib/Support/CMakeFiles/LLVMSupport.dir/Watchdog.cpp.o -MF lib/Support/CMakeFiles/LLVMSupport.dir/Watchdog.cpp.o.d -o lib/Support/CMakeFiles/LLVMSupport.dir/Watchdog.cpp.o -c /Users/buildslave/jenkins/workspace/lldb-cmake/llvm-project/llvm/lib/Support/Watchdog.cpp [4/3070] /Users/buildslave/jenkins/workspace/lldb-cmake/host-compiler/bin/clang++ -DGTEST_HAS_RTTI=0 -D_DEBUG -D__STDC_CONSTANT_MACROS -D__STDC_FORMAT_MACROS -D__STDC_LIMIT_MACROS -Ilib/Support -I/Users/buildslave/jenkins/workspace/lldb-cmake/llvm-project/llvm/lib/Support -I/Applications/Xcode.app/Contents/Developer/Platforms/MacOSX.platform/Developer/SDKs/MacOSX10.15.sdk/usr/include/libxml2 -Iinclude -I/Users/buildslave/jenkins/workspace/lldb-cmake/llvm-project/llvm/include -Wdocumentation -fPIC -fvisibility-inlines-hidden -Werror=date-time -Werror=unguarded-availability-new -fmodules -fmodules-cache-path=/Users/buildslave/jenkins/workspace/lldb-cmake/lldb-build/module.cache -fcxx-modules -Xclang -fmodules-local-submodule-visibility -Wall -Wextra -Wno-unused-parameter -Wwrite-strings -Wcast-qual -Wmissing-field-initializers -pedantic -Wno-long-long -Wimplicit-fallthrough -Wcovered-switch-default -Wno-noexcept-type -Wnon-virtual-dtor -Wdelete-non-virtual-dtor -Wsuggest-override -Wstring-conversion -fdiagnostics-color -O3 -isysroot /Applications/Xcode.app/Contents/Developer/Platforms/MacOSX.platform/Developer/SDKs/MacOSX10.15.sdk -UNDEBUG -std=c++14 -fno-exceptions -fno-rtti -MD -MT lib/Support/CMakeFiles/LLVMSupport.dir/Threading.cpp.o -MF lib/Support/CMakeFiles/LLVMSupport.dir/Threading.cpp.o.d -o lib/Support/CMakeFiles/LLVMSupport.dir/Threading.cpp.o -c /Users/buildslave/jenkins/workspace/lldb-cmake/llvm-project/llvm/lib/Support/Threading.cpp [5/3070] /Users/buildslave/jenkins/workspace/lldb-cmake/host-compiler/bin/clang++ -DGTEST_HAS_RTTI=0 -D_DEBUG -D__STDC_CONSTANT_MACROS -D__STDC_FORMAT_MACROS -D__STDC_LIMIT_MACROS -Ilib/Support -I/Users/buildslave/jenkins/workspace/lldb-cmake/llvm-project/llvm/lib/Support -I/Applications/Xcode.app/Contents/Developer/Platforms/MacOSX.platform/Developer/SDKs/MacOSX10.15.sdk/usr/include/libxml2 -Iinclude -I/Users/buildslave/jenkins/workspace/lldb-cmake/llvm-project/llvm/include -Wdocumentation -fPIC -fvisibility-inlines-hidden -Werror=date-time -Werror=unguarded-availability-new -fmodules -fmodules-cache-path=/Users/buildslave/jenkins/workspace/lldb-cmake/lldb-build/module.cache -fcxx-modules -Xclang -fmodules-local-submodule-visibility -Wall -Wextra -Wno-unused-parameter -Wwrite-strings -Wcast-qual -Wmissing-field-initializers -pedantic -Wno-long-long -Wimplicit-fallthrough -Wcovered-switch-default -Wno-noexcept-type -Wnon-virtual-dtor -Wdelete-non-virtual-dtor -Wsuggest-override -Wstring-conversion -fdiagnostics-color -O3 -isysroot /Applications/Xcode.app/Contents/Developer/Platforms/MacOSX.platform/Developer/SDKs/MacOSX10.15.sdk -UNDEBUG -std=c++14 -fno-exceptions -fno-rtti -MD -MT lib/Support/CMakeFiles/LLVMSupport.dir/TargetRegistry.cpp.o -MF lib/Support/CMakeFiles/LLVMSupport.dir/TargetRegistry.cpp.o.d -o lib/Support/CMakeFiles/LLVMSupport.dir/TargetRegistry.cpp.o -c /Users/buildslave/jenkins/workspace/lldb-cmake/llvm-project/llvm/lib/Support/TargetRegistry.cpp [6/3070] /Users/buildslave/jenkins/workspace/lldb-cmake/host-compiler/bin/clang++ -DGTEST_HAS_RTTI=0 -D_DEBUG -D__STDC_CONSTANT_MACROS -D__STDC_FORMAT_MACROS -D__STDC_LIMIT_MACROS -Ilib/TableGen -I/Users/buildslave/jenkins/workspace/lldb-cmake/llvm-project/llvm/lib/TableGen -I/Applications/Xcode.app/Contents/Developer/Platforms/MacOSX.platform/Developer/SDKs/MacOSX10.15.sdk/usr/include/libxml2 -Iinclude -I/Users/buildslave/jenkins/workspace/lldb-cmake/llvm-project/llvm/include -Wdocumentation -fPIC -fvisibility-inlines-hidden -Werror=date-time -Werror=unguarded-availability-new -fmodules -fmodules-cache-path=/Users/buildslave/jenkins/workspace/lldb-cmake/lldb-build/module.cache -fcxx-modules -Xclang -fmodules-local-submodule-visibility -Wall -Wextra -Wno-unused-parameter -Wwrite-strings -Wcast-qual -Wmissing-field-initializers -pedantic -Wno-long-long -Wimplicit-fallthrough -Wcovered-switch-default -Wno-noexcept-type -Wnon-virtual-dtor -Wdelete-non-virtual-dtor -Wsuggest-override -Wstring-conversion -fdiagnostics-color -O3 -isysroot /Applications/Xcode.app/Contents/Developer/Platforms/MacOSX.platform/Developer/SDKs/MacOSX10.15.sdk -fno-exceptions -fno-rtti -UNDEBUG -std=c++14 -MD -MT lib/TableGen/CMakeFiles/LLVMTableGen.dir/TableGenBackend.cpp.o -MF lib/TableGen/CMakeFiles/LLVMTableGen.dir/TableGenBackend.cpp.o.d -o lib/TableGen/CMakeFiles/LLVMTableGen.dir/TableGenBackend.cpp.o -c /Users/buildslave/jenkins/workspace/lldb-cmake/llvm-project/llvm/lib/TableGen/TableGenBackend.cpp [7/3070] /Users/buildslave/jenkins/workspace/lldb-cmake/host-compiler/bin/clang++ -DGTEST_HAS_RTTI=0 -D_DEBUG -D__STDC_CONSTANT_MACROS -D__STDC_FORMAT_MACROS -D__STDC_LIMIT_MACROS -Ilib/TableGen -I/Users/buildslave/jenkins/workspace/lldb-cmake/llvm-project/llvm/lib/TableGen -I/Applications/Xcode.app/Contents/Developer/Platforms/MacOSX.platform/Developer/SDKs/MacOSX10.15.sdk/usr/include/libxml2 -Iinclude -I/Users/buildslave/jenkins/workspace/lldb-cmake/llvm-project/llvm/include -Wdocumentation -fPIC -fvisibility-inlines-hidden -Werror=date-time -Werror=unguarded-availability-new -fmodules -fmodules-cache-path=/Users/buildslave/jenkins/workspace/lldb-cmake/lldb-build/module.cache -fcxx-modules -Xclang -fmodules-local-submodule-visibility -Wall -Wextra -Wno-unused-parameter -Wwrite-strings -Wcast-qual -Wmissing-field-initializers -pedantic -Wno-long-long -Wimplicit-fallthrough -Wcovered-switch-default -Wno-noexcept-type -Wnon-virtual-dtor -Wdelete-non-virtual-dtor -Wsuggest-override -Wstring-conversion -fdiagnostics-color -O3 -isysroot /Applications/Xcode.app/Contents/Developer/Platforms/MacOSX.platform/Developer/SDKs/MacOSX10.15.sdk -fno-exceptions -fno-rtti -UNDEBUG -std=c++14 -MD -MT lib/TableGen/CMakeFiles/LLVMTableGen.dir/Error.cpp.o -MF lib/TableGen/CMakeFiles/LLVMTableGen.dir/Error.cpp.o.d -o lib/TableGen/CMakeFiles/LLVMTableGen.dir/Error.cpp.o -c /Users/buildslave/jenkins/workspace/lldb-cmake/llvm-project/llvm/lib/TableGen/Error.cpp [8/3070] : && "/Applications/Xcode.app/Contents/Developer/Toolchains/XcodeDefault.xctoolchain/usr/bin/libtool" -static -no_warning_for_no_symbols -o lib/libLLVMSupport.a lib/Support/CMakeFiles/LLVMSupport.dir/AArch64TargetParser.cpp.o lib/Support/CMakeFiles/LLVMSupport.dir/ABIBreak.cpp.o lib/Support/CMakeFiles/LLVMSupport.dir/ARMTargetParser.cpp.o lib/Support/CMakeFiles/LLVMSupport.dir/AMDGPUMetadata.cpp.o lib/Support/CMakeFiles/LLVMSupport.dir/APFloat.cpp.o lib/Support/CMakeFiles/LLVMSupport.dir/APInt.cpp.o lib/Support/CMakeFiles/LLVMSupport.dir/APSInt.cpp.o lib/Support/CMakeFiles/LLVMSupport.dir/ARMBuildAttrs.cpp.o lib/Support/CMakeFiles/LLVMSupport.dir/ARMAttributeParser.cpp.o lib/Support/CMakeFiles/LLVMSupport.dir/ARMWinEH.cpp.o lib/Support/CMakeFiles/LLVMSupport.dir/Allocator.cpp.o lib/Support/CMakeFiles/LLVMSupport.dir/BinaryStreamError.cpp.o lib/Support/CMakeFiles/LLVMSupport.dir/BinaryStreamReader.cpp.o lib/Support/CMakeFiles/LLVMSupport.dir/BinaryStreamRef.cpp.o lib/Support/CMakeFiles/LLVMSupport.dir/BinaryStreamWriter.cpp.o lib/Support/CMakeFiles/LLVMSupport.dir/BlockFrequency.cpp.o lib/Support/CMakeFiles/LLVMSupport.dir/BranchProbability.cpp.o lib/Support/CMakeFiles/LLVMSupport.dir/BuryPointer.cpp.o lib/Support/CMakeFiles/LLVMSupport.dir/CachePruning.cpp.o lib/Support/CMakeFiles/LLVMSupport.dir/circular_raw_ostream.cpp.o lib/Support/CMakeFiles/LLVMSupport.dir/Chrono.cpp.o lib/Support/CMakeFiles/LLVMSupport.dir/COM.cpp.o lib/Support/CMakeFiles/LLVMSupport.dir/CodeGenCoverage.cpp.o lib/Support/CMakeFiles/LLVMSupport.dir/CommandLine.cpp.o lib/Support/CMakeFiles/LLVMSupport.dir/Compression.cpp.o lib/Support/CMakeFiles/LLVMSupport.dir/CRC.cpp.o lib/Support/CMakeFiles/LLVMSupport.dir/ConvertUTF.cpp.o lib/Support/CMakeFiles/LLVMSupport.dir/ConvertUTFWrapper.cpp.o lib/Support/CMakeFiles/LLVMSupport.dir/CrashRecoveryContext.cpp.o lib/Support/CMakeFiles/LLVMSupport.dir/DataExtractor.cpp.o lib/Support/CMakeFiles/LLVMSupport.dir/Debug.cpp.o lib/Support/CMakeFiles/LLVMSupport.dir/DebugCounter.cpp.o lib/Support/CMakeFiles/LLVMSupport.dir/DeltaAlgorithm.cpp.o lib/Support/CMakeFiles/LLVMSupport.dir/DAGDeltaAlgorithm.cpp.o lib/Support/CMakeFiles/LLVMSupport.dir/DJB.cpp.o lib/Support/CMakeFiles/LLVMSupport.dir/ELFAttributeParser.cpp.o lib/Support/CMakeFiles/LLVMSupport.dir/ELFAttributes.cpp.o lib/Support/CMakeFiles/LLVMSupport.dir/Error.cpp.o lib/Support/CMakeFiles/LLVMSupport.dir/ErrorHandling.cpp.o lib/Support/CMakeFiles/LLVMSupport.dir/ExtensibleRTTI.cpp.o lib/Support/CMakeFiles/LLVMSupport.dir/FileCheck.cpp.o lib/Support/CMakeFiles/LLVMSupport.dir/FileCollector.cpp.o lib/Support/CMakeFiles/LLVMSupport.dir/FileUtilities.cpp.o lib/Support/CMakeFiles/LLVMSupport.dir/FileOutputBuffer.cpp.o lib/Support/CMakeFiles/LLVMSupport.dir/FoldingSet.cpp.o lib/Support/CMakeFiles/LLVMSupport.dir/FormattedStream.cpp.o lib/Support/CMakeFiles/LLVMSupport.dir/FormatVariadic.cpp.o lib/Support/CMakeFiles/LLVMSupport.dir/GlobPattern.cpp.o lib/Support/CMakeFiles/LLVMSupport.dir/GraphWriter.cpp.o lib/Support/CMakeFiles/LLVMSupport.dir/Hashing.cpp.o lib/Support/CMakeFiles/LLVMSupport.dir/InitLLVM.cpp.o lib/Support/CMakeFiles/LLVMSupport.dir/IntEqClasses.cpp.o lib/Support/CMakeFiles/LLVMSupport.dir/IntervalMap.cpp.o lib/Support/CMakeFiles/LLVMSupport.dir/ItaniumManglingCanonicalizer.cpp.o lib/Support/CMakeFiles/LLVMSupport.dir/JSON.cpp.o lib/Support/CMakeFiles/LLVMSupport.dir/KnownBits.cpp.o lib/Support/CMakeFiles/LLVMSupport.dir/LEB128.cpp.o lib/Support/CMakeFiles/LLVMSupport.dir/LineIterator.cpp.o lib/Support/CMakeFiles/LLVMSupport.dir/Locale.cpp.o lib/Support/CMakeFiles/LLVMSupport.dir/LockFileManager.cpp.o lib/Support/CMakeFiles/LLVMSupport.dir/LowLevelType.cpp.o lib/Support/CMakeFiles/LLVMSupport.dir/ManagedStatic.cpp.o lib/Support/CMakeFiles/LLVMSupport.dir/MathExtras.cpp.o lib/Support/CMakeFiles/LLVMSupport.dir/MemAlloc.cpp.o lib/Support/CMakeFiles/LLVMSupport.dir/MemoryBuffer.cpp.o lib/Support/CMakeFiles/LLVMSupport.dir/MD5.cpp.o lib/Support/CMakeFiles/LLVMSupport.dir/NativeFormatting.cpp.o lib/Support/CMakeFiles/LLVMSupport.dir/OptimizedStructLayout.cpp.o lib/Support/CMakeFiles/LLVMSupport.dir/Optional.cpp.o lib/Support/CMakeFiles/LLVMSupport.dir/Parallel.cpp.o lib/Support/CMakeFiles/LLVMSupport.dir/PluginLoader.cpp.o lib/Support/CMakeFiles/LLVMSupport.dir/PrettyStackTrace.cpp.o lib/Support/CMakeFiles/LLVMSupport.dir/RandomNumberGenerator.cpp.o lib/Support/CMakeFiles/LLVMSupport.dir/Regex.cpp.o lib/Support/CMakeFiles/LLVMSupport.dir/RISCVAttributes.cpp.o lib/Support/CMakeFiles/LLVMSupport.dir/RISCVAttributeParser.cpp.o lib/Support/CMakeFiles/LLVMSupport.dir/ScaledNumber.cpp.o lib/Support/CMakeFiles/LLVMSupport.dir/ScopedPrinter.cpp.o lib/Support/CMakeFiles/LLVMSupport.dir/SHA1.cpp.o lib/Support/CMakeFiles/LLVMSupport.dir/Signposts.cpp.o lib/Support/CMakeFiles/LLVMSupport.dir/SmallPtrSet.cpp.o lib/Support/CMakeFiles/LLVMSupport.dir/SmallVector.cpp.o lib/Support/CMakeFiles/LLVMSupport.dir/SourceMgr.cpp.o lib/Support/CMakeFiles/LLVMSupport.dir/SpecialCaseList.cpp.o lib/Support/CMakeFiles/LLVMSupport.dir/Statistic.cpp.o lib/Support/CMakeFiles/LLVMSupport.dir/StringExtras.cpp.o lib/Support/CMakeFiles/LLVMSupport.dir/StringMap.cpp.o lib/Support/CMakeFiles/LLVMSupport.dir/StringSaver.cpp.o lib/Support/CMakeFiles/LLVMSupport.dir/StringRef.cpp.o lib/Support/CMakeFiles/LLVMSupport.dir/SuffixTree.cpp.o lib/Support/CMakeFiles/LLVMSupport.dir/SymbolRemappingReader.cpp.o lib/Support/CMakeFiles/LLVMSupport.dir/SystemUtils.cpp.o lib/Support/CMakeFiles/LLVMSupport.dir/TarWriter.cpp.o lib/Support/CMakeFiles/LLVMSupport.dir/TargetParser.cpp.o lib/Support/CMakeFiles/LLVMSupport.dir/ThreadPool.cpp.o lib/Support/CMakeFiles/LLVMSupport.dir/TimeProfiler.cpp.o lib/Support/CMakeFiles/LLVMSupport.dir/Timer.cpp.o lib/Support/CMakeFiles/LLVMSupport.dir/ToolOutputFile.cpp.o lib/Support/CMakeFiles/LLVMSupport.dir/TrigramIndex.cpp.o lib/Support/CMakeFiles/LLVMSupport.dir/Triple.cpp.o lib/Support/CMakeFiles/LLVMSupport.dir/Twine.cpp.o lib/Support/CMakeFiles/LLVMSupport.dir/Unicode.cpp.o lib/Support/CMakeFiles/LLVMSupport.dir/UnicodeCaseFold.cpp.o lib/Support/CMakeFiles/LLVMSupport.dir/VersionTuple.cpp.o lib/Support/CMakeFiles/LLVMSupport.dir/VirtualFileSystem.cpp.o lib/Support/CMakeFiles/LLVMSupport.dir/WithColor.cpp.o lib/Support/CMakeFiles/LLVMSupport.dir/X86TargetParser.cpp.o lib/Support/CMakeFiles/LLVMSupport.dir/YAMLParser.cpp.o lib/Support/CMakeFiles/LLVMSupport.dir/YAMLTraits.cpp.o lib/Support/CMakeFiles/LLVMSupport.dir/raw_os_ostream.cpp.o lib/Support/CMakeFiles/LLVMSupport.dir/raw_ostream.cpp.o lib/Support/CMakeFiles/LLVMSupport.dir/regcomp.c.o lib/Support/CMakeFiles/LLVMSupport.dir/regerror.c.o lib/Support/CMakeFiles/LLVMSupport.dir/regexec.c.o lib/Support/CMakeFiles/LLVMSupport.dir/regfree.c.o lib/Support/CMakeFiles/LLVMSupport.dir/regstrlcpy.c.o lib/Support/CMakeFiles/LLVMSupport.dir/xxhash.cpp.o lib/Support/CMakeFiles/LLVMSupport.dir/Z3Solver.cpp.o lib/Support/CMakeFiles/LLVMSupport.dir/Atomic.cpp.o lib/Support/CMakeFiles/LLVMSupport.dir/DynamicLibrary.cpp.o lib/Support/CMakeFiles/LLVMSupport.dir/Errno.cpp.o lib/Support/CMakeFiles/LLVMSupport.dir/Host.cpp.o lib/Support/CMakeFiles/LLVMSupport.dir/Memory.cpp.o lib/Support/CMakeFiles/LLVMSupport.dir/Path.cpp.o lib/Support/CMakeFiles/LLVMSupport.dir/Process.cpp.o lib/Support/CMakeFiles/LLVMSupport.dir/Program.cpp.o lib/Support/CMakeFiles/LLVMSupport.dir/RWMutex.cpp.o lib/Support/CMakeFiles/LLVMSupport.dir/Signals.cpp.o lib/Support/CMakeFiles/LLVMSupport.dir/TargetRegistry.cpp.o lib/Support/CMakeFiles/LLVMSupport.dir/ThreadLocal.cpp.o lib/Support/CMakeFiles/LLVMSupport.dir/Threading.cpp.o lib/Support/CMakeFiles/LLVMSupport.dir/Valgrind.cpp.o lib/Support/CMakeFiles/LLVMSupport.dir/Watchdog.cpp.o && : [9/3070] /Users/buildslave/jenkins/workspace/lldb-cmake/host-compiler/bin/clang++ -DGTEST_HAS_RTTI=0 -D_DEBUG -D__STDC_CONSTANT_MACROS -D__STDC_FORMAT_MACROS -D__STDC_LIMIT_MACROS -Ilib/TableGen -I/Users/buildslave/jenkins/workspace/lldb-cmake/llvm-project/llvm/lib/TableGen -I/Applications/Xcode.app/Contents/Developer/Platforms/MacOSX.platform/Developer/SDKs/MacOSX10.15.sdk/usr/include/libxml2 -Iinclude -I/Users/buildslave/jenkins/workspace/lldb-cmake/llvm-project/llvm/include -Wdocumentation -fPIC -fvisibility-inlines-hidden -Werror=date-time -Werror=unguarded-availability-new -fmodules -fmodules-cache-path=/Users/buildslave/jenkins/workspace/lldb-cmake/lldb-build/module.cache -fcxx-modules -Xclang -fmodules-local-submodule-visibility -Wall -Wextra -Wno-unused-parameter -Wwrite-strings -Wcast-qual -Wmissing-field-initializers -pedantic -Wno-long-long -Wimplicit-fallthrough -Wcovered-switch-default -Wno-noexcept-type -Wnon-virtual-dtor -Wdelete-non-virtual-dtor -Wsuggest-override -Wstring-conversion -fdiagnostics-color -O3 -isysroot /Applications/Xcode.app/Contents/Developer/Platforms/MacOSX.platform/Developer/SDKs/MacOSX10.15.sdk -fno-exceptions -fno-rtti -UNDEBUG -std=c++14 -MD -MT lib/TableGen/CMakeFiles/LLVMTableGen.dir/StringMatcher.cpp.o -MF lib/TableGen/CMakeFiles/LLVMTableGen.dir/StringMatcher.cpp.o.d -o lib/TableGen/CMakeFiles/LLVMTableGen.dir/StringMatcher.cpp.o -c /Users/buildslave/jenkins/workspace/lldb-cmake/llvm-project/llvm/lib/TableGen/StringMatcher.cpp [10/3070] /Users/buildslave/jenkins/workspace/lldb-cmake/host-compiler/bin/clang++ -DGTEST_HAS_RTTI=0 -D_DEBUG -D__STDC_CONSTANT_MACROS -D__STDC_FORMAT_MACROS -D__STDC_LIMIT_MACROS -Ilib/TableGen -I/Users/buildslave/jenkins/workspace/lldb-cmake/llvm-project/llvm/lib/TableGen -I/Applications/Xcode.app/Contents/Developer/Platforms/MacOSX.platform/Developer/SDKs/MacOSX10.15.sdk/usr/include/libxml2 -Iinclude -I/Users/buildslave/jenkins/workspace/lldb-cmake/llvm-project/llvm/include -Wdocumentation -fPIC -fvisibility-inlines-hidden -Werror=date-time -Werror=unguarded-availability-new -fmodules -fmodules-cache-path=/Users/buildslave/jenkins/workspace/lldb-cmake/lldb-build/module.cache -fcxx-modules -Xclang -fmodules-local-submodule-visibility -Wall -Wextra -Wno-unused-parameter -Wwrite-strings -Wcast-qual -Wmissing-field-initializers -pedantic -Wno-long-long -Wimplicit-fallthrough -Wcovered-switch-default -Wno-noexcept-type -Wnon-virtual-dtor -Wdelete-non-virtual-dtor -Wsuggest-override -Wstring-conversion -fdiagnostics-color -O3 -isysroot /Applications/Xcode.app/Contents/Developer/Platforms/MacOSX.platform/Developer/SDKs/MacOSX10.15.sdk -fno-exceptions -fno-rtti -UNDEBUG -std=c++14 -MD -MT lib/TableGen/CMakeFiles/LLVMTableGen.dir/TGLexer.cpp.o -MF lib/TableGen/CMakeFiles/LLVMTableGen.dir/TGLexer.cpp.o.d -o lib/TableGen/CMakeFiles/LLVMTableGen.dir/TGLexer.cpp.o -c /Users/buildslave/jenkins/workspace/lldb-cmake/llvm-project/llvm/lib/TableGen/TGLexer.cpp [11/3070] /Users/buildslave/jenkins/workspace/lldb-cmake/host-compiler/bin/clang++ -DGTEST_HAS_RTTI=0 -D_DEBUG -D__STDC_CONSTANT_MACROS -D__STDC_FORMAT_MACROS -D__STDC_LIMIT_MACROS -Ilib/TableGen -I/Users/buildslave/jenkins/workspace/lldb-cmake/llvm-project/llvm/lib/TableGen -I/Applications/Xcode.app/Contents/Developer/Platforms/MacOSX.platform/Developer/SDKs/MacOSX10.15.sdk/usr/include/libxml2 -Iinclude -I/Users/buildslave/jenkins/workspace/lldb-cmake/llvm-project/llvm/include -Wdocumentation -fPIC -fvisibility-inlines-hidden -Werror=date-time -Werror=unguarded-availability-new -fmodules -fmodules-cache-path=/Users/buildslave/jenkins/workspace/lldb-cmake/lldb-build/module.cache -fcxx-modules -Xclang -fmodules-local-submodule-visibility -Wall -Wextra -Wno-unused-parameter -Wwrite-strings -Wcast-qual -Wmissing-field-initializers -pedantic -Wno-long-long -Wimplicit-fallthrough -Wcovered-switch-default -Wno-noexcept-type -Wnon-virtual-dtor -Wdelete-non-virtual-dtor -Wsuggest-override -Wstring-conversion -fdiagnostics-color -O3 -isysroot /Applications/Xcode.app/Contents/Developer/Platforms/MacOSX.platform/Developer/SDKs/MacOSX10.15.sdk -fno-exceptions -fno-rtti -UNDEBUG -std=c++14 -MD -MT lib/TableGen/CMakeFiles/LLVMTableGen.dir/JSONBackend.cpp.o -MF lib/TableGen/CMakeFiles/LLVMTableGen.dir/JSONBackend.cpp.o.d -o lib/TableGen/CMakeFiles/LLVMTableGen.dir/JSONBackend.cpp.o -c /Users/buildslave/jenkins/workspace/lldb-cmake/llvm-project/llvm/lib/TableGen/JSONBackend.cpp [12/3070] /Users/buildslave/jenkins/workspace/lldb-cmake/host-compiler/bin/clang++ -DGTEST_HAS_RTTI=0 -D_DEBUG -D__STDC_CONSTANT_MACROS -D__STDC_FORMAT_MACROS -D__STDC_LIMIT_MACROS -Iutils/TableGen -I/Users/buildslave/jenkins/workspace/lldb-cmake/llvm-project/llvm/utils/TableGen -I/Applications/Xcode.app/Contents/Developer/Platforms/MacOSX.platform/Developer/SDKs/MacOSX10.15.sdk/usr/include/libxml2 -Iinclude -I/Users/buildslave/jenkins/workspace/lldb-cmake/llvm-project/llvm/include -Wdocumentation -fPIC -fvisibility-inlines-hidden -Werror=date-time -Werror=unguarded-availability-new -fmodules -fmodules-cache-path=/Users/buildslave/jenkins/workspace/lldb-cmake/lldb-build/module.cache -fcxx-modules -Xclang -fmodules-local-submodule-visibility -Wall -Wextra -Wno-unused-parameter -Wwrite-strings -Wcast-qual -Wmissing-field-initializers -pedantic -Wno-long-long -Wimplicit-fallthrough -Wcovered-switch-default -Wno-noexcept-type -Wnon-virtual-dtor -Wdelete-non-virtual-dtor -Wsuggest-override -Wstring-conversion -fdiagnostics-color -O3 -isysroot /Applications/Xcode.app/Contents/Developer/Platforms/MacOSX.platform/Developer/SDKs/MacOSX10.15.sdk -fno-exceptions -fno-rtti -UNDEBUG -std=c++14 -MD -MT utils/TableGen/CMakeFiles/llvm-tblgen.dir/Attributes.cpp.o -MF utils/TableGen/CMakeFiles/llvm-tblgen.dir/Attributes.cpp.o.d -o utils/TableGen/CMakeFiles/llvm-tblgen.dir/Attributes.cpp.o -c /Users/buildslave/jenkins/workspace/lldb-cmake/llvm-project/llvm/utils/TableGen/Attributes.cpp [13/3070] /Users/buildslave/jenkins/workspace/lldb-cmake/host-compiler/bin/clang++ -DGTEST_HAS_RTTI=0 -D_DEBUG -D__STDC_CONSTANT_MACROS -D__STDC_FORMAT_MACROS -D__STDC_LIMIT_MACROS -Ilib/TableGen -I/Users/buildslave/jenkins/workspace/lldb-cmake/llvm-project/llvm/lib/TableGen -I/Applications/Xcode.app/Contents/Developer/Platforms/MacOSX.platform/Developer/SDKs/MacOSX10.15.sdk/usr/include/libxml2 -Iinclude -I/Users/buildslave/jenkins/workspace/lldb-cmake/llvm-project/llvm/include -Wdocumentation -fPIC -fvisibility-inlines-hidden -Werror=date-time -Werror=unguarded-availability-new -fmodules -fmodules-cache-path=/Users/buildslave/jenkins/workspace/lldb-cmake/lldb-build/module.cache -fcxx-modules -Xclang -fmodules-local-submodule-visibility -Wall -Wextra -Wno-unused-parameter -Wwrite-strings -Wcast-qual -Wmissing-field-initializers -pedantic -Wno-long-long -Wimplicit-fallthrough -Wcovered-switch-default -Wno-noexcept-type -Wnon-virtual-dtor -Wdelete-non-virtual-dtor -Wsuggest-override -Wstring-conversion -fdiagnostics-color -O3 -isysroot /Applications/Xcode.app/Contents/Developer/Platforms/MacOSX.platform/Developer/SDKs/MacOSX10.15.sdk -fno-exceptions -fno-rtti -UNDEBUG -std=c++14 -MD -MT lib/TableGen/CMakeFiles/LLVMTableGen.dir/SetTheory.cpp.o -MF lib/TableGen/CMakeFiles/LLVMTableGen.dir/SetTheory.cpp.o.d -o lib/TableGen/CMakeFiles/LLVMTableGen.dir/SetTheory.cpp.o -c /Users/buildslave/jenkins/workspace/lldb-cmake/llvm-project/llvm/lib/TableGen/SetTheory.cpp [14/3070] /Users/buildslave/jenkins/workspace/lldb-cmake/host-compiler/bin/clang++ -DGTEST_HAS_RTTI=0 -D_DEBUG -D__STDC_CONSTANT_MACROS -D__STDC_FORMAT_MACROS -D__STDC_LIMIT_MACROS -Ilib/TableGen -I/Users/buildslave/jenkins/workspace/lldb-cmake/llvm-project/llvm/lib/TableGen -I/Applications/Xcode.app/Contents/Developer/Platforms/MacOSX.platform/Developer/SDKs/MacOSX10.15.sdk/usr/include/libxml2 -Iinclude -I/Users/buildslave/jenkins/workspace/lldb-cmake/llvm-project/llvm/include -Wdocumentation -fPIC -fvisibility-inlines-hidden -Werror=date-time -Werror=unguarded-availability-new -fmodules -fmodules-cache-path=/Users/buildslave/jenkins/workspace/lldb-cmake/lldb-build/module.cache -fcxx-modules -Xclang -fmodules-local-submodule-visibility -Wall -Wextra -Wno-unused-parameter -Wwrite-strings -Wcast-qual -Wmissing-field-initializers -pedantic -Wno-long-long -Wimplicit-fallthrough -Wcovered-switch-default -Wno-noexcept-type -Wnon-virtual-dtor -Wdelete-non-virtual-dtor -Wsuggest-override -Wstring-conversion -fdiagnostics-color -O3 -isysroot /Applications/Xcode.app/Contents/Developer/Platforms/MacOSX.platform/Developer/SDKs/MacOSX10.15.sdk -fno-exceptions -fno-rtti -UNDEBUG -std=c++14 -MD -MT lib/TableGen/CMakeFiles/LLVMTableGen.dir/Main.cpp.o -MF lib/TableGen/CMakeFiles/LLVMTableGen.dir/Main.cpp.o.d -o lib/TableGen/CMakeFiles/LLVMTableGen.dir/Main.cpp.o -c /Users/buildslave/jenkins/workspace/lldb-cmake/llvm-project/llvm/lib/TableGen/Main.cpp [15/3070] /Users/buildslave/jenkins/workspace/lldb-cmake/host-compiler/bin/clang++ -DGTEST_HAS_RTTI=0 -D_DEBUG -D__STDC_CONSTANT_MACROS -D__STDC_FORMAT_MACROS -D__STDC_LIMIT_MACROS -Iutils/TableGen -I/Users/buildslave/jenkins/workspace/lldb-cmake/llvm-project/llvm/utils/TableGen -I/Applications/Xcode.app/Contents/Developer/Platforms/MacOSX.platform/Developer/SDKs/MacOSX10.15.sdk/usr/include/libxml2 -Iinclude -I/Users/buildslave/jenkins/workspace/lldb-cmake/llvm-project/llvm/include -Wdocumentation -fPIC -fvisibility-inlines-hidden -Werror=date-time -Werror=unguarded-availability-new -fmodules -fmodules-cache-path=/Users/buildslave/jenkins/workspace/lldb-cmake/lldb-build/module.cache -fcxx-modules -Xclang -fmodules-local-submodule-visibility -Wall -Wextra -Wno-unused-parameter -Wwrite-strings -Wcast-qual -Wmissing-field-initializers -pedantic -Wno-long-long -Wimplicit-fallthrough -Wcovered-switch-default -Wno-noexcept-type -Wnon-virtual-dtor -Wdelete-non-virtual-dtor -Wsuggest-override -Wstring-conversion -fdiagnostics-color -O3 -isysroot /Applications/Xcode.app/Contents/Developer/Platforms/MacOSX.platform/Developer/SDKs/MacOSX10.15.sdk -fno-exceptions -fno-rtti -UNDEBUG -std=c++14 -MD -MT utils/TableGen/CMakeFiles/llvm-tblgen.dir/AsmWriterInst.cpp.o -MF utils/TableGen/CMakeFiles/llvm-tblgen.dir/AsmWriterInst.cpp.o.d -o utils/TableGen/CMakeFiles/llvm-tblgen.dir/AsmWriterInst.cpp.o -c /Users/buildslave/jenkins/workspace/lldb-cmake/llvm-project/llvm/utils/TableGen/AsmWriterInst.cpp [16/3070] /Users/buildslave/jenkins/workspace/lldb-cmake/host-compiler/bin/clang++ -DGTEST_HAS_RTTI=0 -D_DEBUG -D__STDC_CONSTANT_MACROS -D__STDC_FORMAT_MACROS -D__STDC_LIMIT_MACROS -Iutils/TableGen -I/Users/buildslave/jenkins/workspace/lldb-cmake/llvm-project/llvm/utils/TableGen -I/Applications/Xcode.app/Contents/Developer/Platforms/MacOSX.platform/Developer/SDKs/MacOSX10.15.sdk/usr/include/libxml2 -Iinclude -I/Users/buildslave/jenkins/workspace/lldb-cmake/llvm-project/llvm/include -Wdocumentation -fPIC -fvisibility-inlines-hidden -Werror=date-time -Werror=unguarded-availability-new -fmodules -fmodules-cache-path=/Users/buildslave/jenkins/workspace/lldb-cmake/lldb-build/module.cache -fcxx-modules -Xclang -fmodules-local-submodule-visibility -Wall -Wextra -Wno-unused-parameter -Wwrite-strings -Wcast-qual -Wmissing-field-initializers -pedantic -Wno-long-long -Wimplicit-fallthrough -Wcovered-switch-default -Wno-noexcept-type -Wnon-virtual-dtor -Wdelete-non-virtual-dtor -Wsuggest-override -Wstring-conversion -fdiagnostics-color -O3 -isysroot /Applications/Xcode.app/Contents/Developer/Platforms/MacOSX.platform/Developer/SDKs/MacOSX10.15.sdk -fno-exceptions -fno-rtti -UNDEBUG -std=c++14 -MD -MT utils/TableGen/CMakeFiles/llvm-tblgen.dir/CallingConvEmitter.cpp.o -MF utils/TableGen/CMakeFiles/llvm-tblgen.dir/CallingConvEmitter.cpp.o.d -o utils/TableGen/CMakeFiles/llvm-tblgen.dir/CallingConvEmitter.cpp.o -c /Users/buildslave/jenkins/workspace/lldb-cmake/llvm-project/llvm/utils/TableGen/CallingConvEmitter.cpp [17/3070] /Users/buildslave/jenkins/workspace/lldb-cmake/host-compiler/bin/clang++ -DGTEST_HAS_RTTI=0 -D_DEBUG -D__STDC_CONSTANT_MACROS -D__STDC_FORMAT_MACROS -D__STDC_LIMIT_MACROS -Iutils/TableGen -I/Users/buildslave/jenkins/workspace/lldb-cmake/llvm-project/llvm/utils/TableGen -I/Applications/Xcode.app/Contents/Developer/Platforms/MacOSX.platform/Developer/SDKs/MacOSX10.15.sdk/usr/include/libxml2 -Iinclude -I/Users/buildslave/jenkins/workspace/lldb-cmake/llvm-project/llvm/include -Wdocumentation -fPIC -fvisibility-inlines-hidden -Werror=date-time -Werror=unguarded-availability-new -fmodules -fmodules-cache-path=/Users/buildslave/jenkins/workspace/lldb-cmake/lldb-build/module.cache -fcxx-modules -Xclang -fmodules-local-submodule-visibility -Wall -Wextra -Wno-unused-parameter -Wwrite-strings -Wcast-qual -Wmissing-field-initializers -pedantic -Wno-long-long -Wimplicit-fallthrough -Wcovered-switch-default -Wno-noexcept-type -Wnon-virtual-dtor -Wdelete-non-virtual-dtor -Wsuggest-override -Wstring-conversion -fdiagnostics-color -O3 -isysroot /Applications/Xcode.app/Contents/Developer/Platforms/MacOSX.platform/Developer/SDKs/MacOSX10.15.sdk -fno-exceptions -fno-rtti -UNDEBUG -std=c++14 -MD -MT utils/TableGen/CMakeFiles/llvm-tblgen.dir/CodeGenHwModes.cpp.o -MF utils/TableGen/CMakeFiles/llvm-tblgen.dir/CodeGenHwModes.cpp.o.d -o utils/TableGen/CMakeFiles/llvm-tblgen.dir/CodeGenHwModes.cpp.o -c /Users/buildslave/jenkins/workspace/lldb-cmake/llvm-project/llvm/utils/TableGen/CodeGenHwModes.cpp [18/3070] /Users/buildslave/jenkins/workspace/lldb-cmake/host-compiler/bin/clang++ -DGTEST_HAS_RTTI=0 -D_DEBUG -D__STDC_CONSTANT_MACROS -D__STDC_FORMAT_MACROS -D__STDC_LIMIT_MACROS -Ilib/TableGen -I/Users/buildslave/jenkins/workspace/lldb-cmake/llvm-project/llvm/lib/TableGen -I/Applications/Xcode.app/Contents/Developer/Platforms/MacOSX.platform/Developer/SDKs/MacOSX10.15.sdk/usr/include/libxml2 -Iinclude -I/Users/buildslave/jenkins/workspace/lldb-cmake/llvm-project/llvm/include -Wdocumentation -fPIC -fvisibility-inlines-hidden -Werror=date-time -Werror=unguarded-availability-new -fmodules -fmodules-cache-path=/Users/buildslave/jenkins/workspace/lldb-cmake/lldb-build/module.cache -fcxx-modules -Xclang -fmodules-local-submodule-visibility -Wall -Wextra -Wno-unused-parameter -Wwrite-strings -Wcast-qual -Wmissing-field-initializers -pedantic -Wno-long-long -Wimplicit-fallthrough -Wcovered-switch-default -Wno-noexcept-type -Wnon-virtual-dtor -Wdelete-non-virtual-dtor -Wsuggest-override -Wstring-conversion -fdiagnostics-color -O3 -isysroot /Applications/Xcode.app/Contents/Developer/Platforms/MacOSX.platform/Developer/SDKs/MacOSX10.15.sdk -fno-exceptions -fno-rtti -UNDEBUG -std=c++14 -MD -MT lib/TableGen/CMakeFiles/LLVMTableGen.dir/TGParser.cpp.o -MF lib/TableGen/CMakeFiles/LLVMTableGen.dir/TGParser.cpp.o.d -o lib/TableGen/CMakeFiles/LLVMTableGen.dir/TGParser.cpp.o -c /Users/buildslave/jenkins/workspace/lldb-cmake/llvm-project/llvm/lib/TableGen/TGParser.cpp [19/3070] /Users/buildslave/jenkins/workspace/lldb-cmake/host-compiler/bin/clang++ -DGTEST_HAS_RTTI=0 -D_DEBUG -D__STDC_CONSTANT_MACROS -D__STDC_FORMAT_MACROS -D__STDC_LIMIT_MACROS -Iutils/TableGen -I/Users/buildslave/jenkins/workspace/lldb-cmake/llvm-project/llvm/utils/TableGen -I/Applications/Xcode.app/Contents/Developer/Platforms/MacOSX.platform/Developer/SDKs/MacOSX10.15.sdk/usr/include/libxml2 -Iinclude -I/Users/buildslave/jenkins/workspace/lldb-cmake/llvm-project/llvm/include -Wdocumentation -fPIC -fvisibility-inlines-hidden -Werror=date-time -Werror=unguarded-availability-new -fmodules -fmodules-cache-path=/Users/buildslave/jenkins/workspace/lldb-cmake/lldb-build/module.cache -fcxx-modules -Xclang -fmodules-local-submodule-visibility -Wall -Wextra -Wno-unused-parameter -Wwrite-strings -Wcast-qual -Wmissing-field-initializers -pedantic -Wno-long-long -Wimplicit-fallthrough -Wcovered-switch-default -Wno-noexcept-type -Wnon-virtual-dtor -Wdelete-non-virtual-dtor -Wsuggest-override -Wstring-conversion -fdiagnostics-color -O3 -isysroot /Applications/Xcode.app/Contents/Developer/Platforms/MacOSX.platform/Developer/SDKs/MacOSX10.15.sdk -fno-exceptions -fno-rtti -UNDEBUG -std=c++14 -MD -MT utils/TableGen/CMakeFiles/llvm-tblgen.dir/CodeEmitterGen.cpp.o -MF utils/TableGen/CMakeFiles/llvm-tblgen.dir/CodeEmitterGen.cpp.o.d -o utils/TableGen/CMakeFiles/llvm-tblgen.dir/CodeEmitterGen.cpp.o -c /Users/buildslave/jenkins/workspace/lldb-cmake/llvm-project/llvm/utils/TableGen/CodeEmitterGen.cpp [20/3070] /Users/buildslave/jenkins/workspace/lldb-cmake/host-compiler/bin/clang++ -DGTEST_HAS_RTTI=0 -D_DEBUG -D__STDC_CONSTANT_MACROS -D__STDC_FORMAT_MACROS -D__STDC_LIMIT_MACROS -Iutils/TableGen -I/Users/buildslave/jenkins/workspace/lldb-cmake/llvm-project/llvm/utils/TableGen -I/Applications/Xcode.app/Contents/Developer/Platforms/MacOSX.platform/Developer/SDKs/MacOSX10.15.sdk/usr/include/libxml2 -Iinclude -I/Users/buildslave/jenkins/workspace/lldb-cmake/llvm-project/llvm/include -Wdocumentation -fPIC -fvisibility-inlines-hidden -Werror=date-time -Werror=unguarded-availability-new -fmodules -fmodules-cache-path=/Users/buildslave/jenkins/workspace/lldb-cmake/lldb-build/module.cache -fcxx-modules -Xclang -fmodules-local-submodule-visibility -Wall -Wextra -Wno-unused-parameter -Wwrite-strings -Wcast-qual -Wmissing-field-initializers -pedantic -Wno-long-long -Wimplicit-fallthrough -Wcovered-switch-default -Wno-noexcept-type -Wnon-virtual-dtor -Wdelete-non-virtual-dtor -Wsuggest-override -Wstring-conversion -fdiagnostics-color -O3 -isysroot /Applications/Xcode.app/Contents/Developer/Platforms/MacOSX.platform/Developer/SDKs/MacOSX10.15.sdk -fno-exceptions -fno-rtti -UNDEBUG -std=c++14 -MD -MT utils/TableGen/CMakeFiles/llvm-tblgen.dir/CodeGenInstruction.cpp.o -MF utils/TableGen/CMakeFiles/llvm-tblgen.dir/CodeGenInstruction.cpp.o.d -o utils/TableGen/CMakeFiles/llvm-tblgen.dir/CodeGenInstruction.cpp.o -c /Users/buildslave/jenkins/workspace/lldb-cmake/llvm-project/llvm/utils/TableGen/CodeGenInstruction.cpp [21/3070] /Users/buildslave/jenkins/workspace/lldb-cmake/host-compiler/bin/clang++ -DGTEST_HAS_RTTI=0 -D_DEBUG -D__STDC_CONSTANT_MACROS -D__STDC_FORMAT_MACROS -D__STDC_LIMIT_MACROS -Iutils/TableGen -I/Users/buildslave/jenkins/workspace/lldb-cmake/llvm-project/llvm/utils/TableGen -I/Applications/Xcode.app/Contents/Developer/Platforms/MacOSX.platform/Developer/SDKs/MacOSX10.15.sdk/usr/include/libxml2 -Iinclude -I/Users/buildslave/jenkins/workspace/lldb-cmake/llvm-project/llvm/include -Wdocumentation -fPIC -fvisibility-inlines-hidden -Werror=date-time -Werror=unguarded-availability-new -fmodules -fmodules-cache-path=/Users/buildslave/jenkins/workspace/lldb-cmake/lldb-build/module.cache -fcxx-modules -Xclang -fmodules-local-submodule-visibility -Wall -Wextra -Wno-unused-parameter -Wwrite-strings -Wcast-qual -Wmissing-field-initializers -pedantic -Wno-long-long -Wimplicit-fallthrough -Wcovered-switch-default -Wno-noexcept-type -Wnon-virtual-dtor -Wdelete-non-virtual-dtor -Wsuggest-override -Wstring-conversion -fdiagnostics-color -O3 -isysroot /Applications/Xcode.app/Contents/Developer/Platforms/MacOSX.platform/Developer/SDKs/MacOSX10.15.sdk -fno-exceptions -fno-rtti -UNDEBUG -std=c++14 -MD -MT utils/TableGen/CMakeFiles/llvm-tblgen.dir/CodeGenMapTable.cpp.o -MF utils/TableGen/CMakeFiles/llvm-tblgen.dir/CodeGenMapTable.cpp.o.d -o utils/TableGen/CMakeFiles/llvm-tblgen.dir/CodeGenMapTable.cpp.o -c /Users/buildslave/jenkins/workspace/lldb-cmake/llvm-project/llvm/utils/TableGen/CodeGenMapTable.cpp [22/3070] /Users/buildslave/jenkins/workspace/lldb-cmake/host-compiler/bin/clang++ -DGTEST_HAS_RTTI=0 -D_DEBUG -D__STDC_CONSTANT_MACROS -D__STDC_FORMAT_MACROS -D__STDC_LIMIT_MACROS -Ilib/TableGen -I/Users/buildslave/jenkins/workspace/lldb-cmake/llvm-project/llvm/lib/TableGen -I/Applications/Xcode.app/Contents/Developer/Platforms/MacOSX.platform/Developer/SDKs/MacOSX10.15.sdk/usr/include/libxml2 -Iinclude -I/Users/buildslave/jenkins/workspace/lldb-cmake/llvm-project/llvm/include -Wdocumentation -fPIC -fvisibility-inlines-hidden -Werror=date-time -Werror=unguarded-availability-new -fmodules -fmodules-cache-path=/Users/buildslave/jenkins/workspace/lldb-cmake/lldb-build/module.cache -fcxx-modules -Xclang -fmodules-local-submodule-visibility -Wall -Wextra -Wno-unused-parameter -Wwrite-strings -Wcast-qual -Wmissing-field-initializers -pedantic -Wno-long-long -Wimplicit-fallthrough -Wcovered-switch-default -Wno-noexcept-type -Wnon-virtual-dtor -Wdelete-non-virtual-dtor -Wsuggest-override -Wstring-conversion -fdiagnostics-color -O3 -isysroot /Applications/Xcode.app/Contents/Developer/Platforms/MacOSX.platform/Developer/SDKs/MacOSX10.15.sdk -fno-exceptions -fno-rtti -UNDEBUG -std=c++14 -MD -MT lib/TableGen/CMakeFiles/LLVMTableGen.dir/Record.cpp.o -MF lib/TableGen/CMakeFiles/LLVMTableGen.dir/Record.cpp.o.d -o lib/TableGen/CMakeFiles/LLVMTableGen.dir/Record.cpp.o -c /Users/buildslave/jenkins/workspace/lldb-cmake/llvm-project/llvm/lib/TableGen/Record.cpp [23/3070] : && "/Applications/Xcode.app/Contents/Developer/Toolchains/XcodeDefault.xctoolchain/usr/bin/libtool" -static -no_warning_for_no_symbols -o lib/libLLVMTableGen.a lib/TableGen/CMakeFiles/LLVMTableGen.dir/Error.cpp.o lib/TableGen/CMakeFiles/LLVMTableGen.dir/JSONBackend.cpp.o lib/TableGen/CMakeFiles/LLVMTableGen.dir/Main.cpp.o lib/TableGen/CMakeFiles/LLVMTableGen.dir/Record.cpp.o lib/TableGen/CMakeFiles/LLVMTableGen.dir/SetTheory.cpp.o lib/TableGen/CMakeFiles/LLVMTableGen.dir/StringMatcher.cpp.o lib/TableGen/CMakeFiles/LLVMTableGen.dir/TableGenBackend.cpp.o lib/TableGen/CMakeFiles/LLVMTableGen.dir/TGLexer.cpp.o lib/TableGen/CMakeFiles/LLVMTableGen.dir/TGParser.cpp.o && : [24/3070] /Users/buildslave/jenkins/workspace/lldb-cmake/host-compiler/bin/clang++ -DGTEST_HAS_RTTI=0 -D_DEBUG -D__STDC_CONSTANT_MACROS -D__STDC_FORMAT_MACROS -D__STDC_LIMIT_MACROS -Iutils/TableGen -I/Users/buildslave/jenkins/workspace/lldb-cmake/llvm-project/llvm/utils/TableGen -I/Applications/Xcode.app/Contents/Developer/Platforms/MacOSX.platform/Developer/SDKs/MacOSX10.15.sdk/usr/include/libxml2 -Iinclude -I/Users/buildslave/jenkins/workspace/lldb-cmake/llvm-project/llvm/include -Wdocumentation -fPIC -fvisibility-inlines-hidden -Werror=date-time -Werror=unguarded-availability-new -fmodules -fmodules-cache-path=/Users/buildslave/jenkins/workspace/lldb-cmake/lldb-build/module.cache -fcxx-modules -Xclang -fmodules-local-submodule-visibility -Wall -Wextra -Wno-unused-parameter -Wwrite-strings -Wcast-qual -Wmissing-field-initializers -pedantic -Wno-long-long -Wimplicit-fallthrough -Wcovered-switch-default -Wno-noexcept-type -Wnon-virtual-dtor -Wdelete-non-virtual-dtor -Wsuggest-override -Wstring-conversion -fdiagnostics-color -O3 -isysroot /Applications/Xcode.app/Contents/Developer/Platforms/MacOSX.platform/Developer/SDKs/MacOSX10.15.sdk -fno-exceptions -fno-rtti -UNDEBUG -std=c++14 -MD -MT utils/TableGen/CMakeFiles/llvm-tblgen.dir/DAGISelEmitter.cpp.o -MF utils/TableGen/CMakeFiles/llvm-tblgen.dir/DAGISelEmitter.cpp.o.d -o utils/TableGen/CMakeFiles/llvm-tblgen.dir/DAGISelEmitter.cpp.o -c /Users/buildslave/jenkins/workspace/lldb-cmake/llvm-project/llvm/utils/TableGen/DAGISelEmitter.cpp [25/3070] /Users/buildslave/jenkins/workspace/lldb-cmake/host-compiler/bin/clang++ -DGTEST_HAS_RTTI=0 -D_DEBUG -D__STDC_CONSTANT_MACROS -D__STDC_FORMAT_MACROS -D__STDC_LIMIT_MACROS -Iutils/TableGen -I/Users/buildslave/jenkins/workspace/lldb-cmake/llvm-project/llvm/utils/TableGen -I/Applications/Xcode.app/Contents/Developer/Platforms/MacOSX.platform/Developer/SDKs/MacOSX10.15.sdk/usr/include/libxml2 -Iinclude -I/Users/buildslave/jenkins/workspace/lldb-cmake/llvm-project/llvm/include -Wdocumentation -fPIC -fvisibility-inlines-hidden -Werror=date-time -Werror=unguarded-availability-new -fmodules -fmodules-cache-path=/Users/buildslave/jenkins/workspace/lldb-cmake/lldb-build/module.cache -fcxx-modules -Xclang -fmodules-local-submodule-visibility -Wall -Wextra -Wno-unused-parameter -Wwrite-strings -Wcast-qual -Wmissing-field-initializers -pedantic -Wno-long-long -Wimplicit-fallthrough -Wcovered-switch-default -Wno-noexcept-type -Wnon-virtual-dtor -Wdelete-non-virtual-dtor -Wsuggest-override -Wstring-conversion -fdiagnostics-color -O3 -isysroot /Applications/Xcode.app/Contents/Developer/Platforms/MacOSX.platform/Developer/SDKs/MacOSX10.15.sdk -fno-exceptions -fno-rtti -UNDEBUG -std=c++14 -MD -MT utils/TableGen/CMakeFiles/llvm-tblgen.dir/DAGISelMatcherOpt.cpp.o -MF utils/TableGen/CMakeFiles/llvm-tblgen.dir/DAGISelMatcherOpt.cpp.o.d -o utils/TableGen/CMakeFiles/llvm-tblgen.dir/DAGISelMatcherOpt.cpp.o -c /Users/buildslave/jenkins/workspace/lldb-cmake/llvm-project/llvm/utils/TableGen/DAGISelMatcherOpt.cpp [26/3070] /Users/buildslave/jenkins/workspace/lldb-cmake/host-compiler/bin/clang++ -DGTEST_HAS_RTTI=0 -D_DEBUG -D__STDC_CONSTANT_MACROS -D__STDC_FORMAT_MACROS -D__STDC_LIMIT_MACROS -Iutils/TableGen -I/Users/buildslave/jenkins/workspace/lldb-cmake/llvm-project/llvm/utils/TableGen -I/Applications/Xcode.app/Contents/Developer/Platforms/MacOSX.platform/Developer/SDKs/MacOSX10.15.sdk/usr/include/libxml2 -Iinclude -I/Users/buildslave/jenkins/workspace/lldb-cmake/llvm-project/llvm/include -Wdocumentation -fPIC -fvisibility-inlines-hidden -Werror=date-time -Werror=unguarded-availability-new -fmodules -fmodules-cache-path=/Users/buildslave/jenkins/workspace/lldb-cmake/lldb-build/module.cache -fcxx-modules -Xclang -fmodules-local-submodule-visibility -Wall -Wextra -Wno-unused-parameter -Wwrite-strings -Wcast-qual -Wmissing-field-initializers -pedantic -Wno-long-long -Wimplicit-fallthrough -Wcovered-switch-default -Wno-noexcept-type -Wnon-virtual-dtor -Wdelete-non-virtual-dtor -Wsuggest-override -Wstring-conversion -fdiagnostics-color -O3 -isysroot /Applications/Xcode.app/Contents/Developer/Platforms/MacOSX.platform/Developer/SDKs/MacOSX10.15.sdk -fno-exceptions -fno-rtti -UNDEBUG -std=c++14 -MD -MT utils/TableGen/CMakeFiles/llvm-tblgen.dir/AsmWriterEmitter.cpp.o -MF utils/TableGen/CMakeFiles/llvm-tblgen.dir/AsmWriterEmitter.cpp.o.d -o utils/TableGen/CMakeFiles/llvm-tblgen.dir/AsmWriterEmitter.cpp.o -c /Users/buildslave/jenkins/workspace/lldb-cmake/llvm-project/llvm/utils/TableGen/AsmWriterEmitter.cpp [27/3070] /Users/buildslave/jenkins/workspace/lldb-cmake/host-compiler/bin/clang++ -DGTEST_HAS_RTTI=0 -D_DEBUG -D__STDC_CONSTANT_MACROS -D__STDC_FORMAT_MACROS -D__STDC_LIMIT_MACROS -Iutils/TableGen -I/Users/buildslave/jenkins/workspace/lldb-cmake/llvm-project/llvm/utils/TableGen -I/Applications/Xcode.app/Contents/Developer/Platforms/MacOSX.platform/Developer/SDKs/MacOSX10.15.sdk/usr/include/libxml2 -Iinclude -I/Users/buildslave/jenkins/workspace/lldb-cmake/llvm-project/llvm/include -Wdocumentation -fPIC -fvisibility-inlines-hidden -Werror=date-time -Werror=unguarded-availability-new -fmodules -fmodules-cache-path=/Users/buildslave/jenkins/workspace/lldb-cmake/lldb-build/module.cache -fcxx-modules -Xclang -fmodules-local-submodule-visibility -Wall -Wextra -Wno-unused-parameter -Wwrite-strings -Wcast-qual -Wmissing-field-initializers -pedantic -Wno-long-long -Wimplicit-fallthrough -Wcovered-switch-default -Wno-noexcept-type -Wnon-virtual-dtor -Wdelete-non-virtual-dtor -Wsuggest-override -Wstring-conversion -fdiagnostics-color -O3 -isysroot /Applications/Xcode.app/Contents/Developer/Platforms/MacOSX.platform/Developer/SDKs/MacOSX10.15.sdk -fno-exceptions -fno-rtti -UNDEBUG -std=c++14 -MD -MT utils/TableGen/CMakeFiles/llvm-tblgen.dir/DAGISelMatcherGen.cpp.o -MF utils/TableGen/CMakeFiles/llvm-tblgen.dir/DAGISelMatcherGen.cpp.o.d -o utils/TableGen/CMakeFiles/llvm-tblgen.dir/DAGISelMatcherGen.cpp.o -c /Users/buildslave/jenkins/workspace/lldb-cmake/llvm-project/llvm/utils/TableGen/DAGISelMatcherGen.cpp [28/3070] /Users/buildslave/jenkins/workspace/lldb-cmake/host-compiler/bin/clang++ -DGTEST_HAS_RTTI=0 -D_DEBUG -D__STDC_CONSTANT_MACROS -D__STDC_FORMAT_MACROS -D__STDC_LIMIT_MACROS -Iutils/TableGen -I/Users/buildslave/jenkins/workspace/lldb-cmake/llvm-project/llvm/utils/TableGen -I/Applications/Xcode.app/Contents/Developer/Platforms/MacOSX.platform/Developer/SDKs/MacOSX10.15.sdk/usr/include/libxml2 -Iinclude -I/Users/buildslave/jenkins/workspace/lldb-cmake/llvm-project/llvm/include -Wdocumentation -fPIC -fvisibility-inlines-hidden -Werror=date-time -Werror=unguarded-availability-new -fmodules -fmodules-cache-path=/Users/buildslave/jenkins/workspace/lldb-cmake/lldb-build/module.cache -fcxx-modules -Xclang -fmodules-local-submodule-visibility -Wall -Wextra -Wno-unused-parameter -Wwrite-strings -Wcast-qual -Wmissing-field-initializers -pedantic -Wno-long-long -Wimplicit-fallthrough -Wcovered-switch-default -Wno-noexcept-type -Wnon-virtual-dtor -Wdelete-non-virtual-dtor -Wsuggest-override -Wstring-conversion -fdiagnostics-color -O3 -isysroot /Applications/Xcode.app/Contents/Developer/Platforms/MacOSX.platform/Developer/SDKs/MacOSX10.15.sdk -fno-exceptions -fno-rtti -UNDEBUG -std=c++14 -MD -MT utils/TableGen/CMakeFiles/llvm-tblgen.dir/DirectiveEmitter.cpp.o -MF utils/TableGen/CMakeFiles/llvm-tblgen.dir/DirectiveEmitter.cpp.o.d -o utils/TableGen/CMakeFiles/llvm-tblgen.dir/DirectiveEmitter.cpp.o -c /Users/buildslave/jenkins/workspace/lldb-cmake/llvm-project/llvm/utils/TableGen/DirectiveEmitter.cpp [29/3070] /Users/buildslave/jenkins/workspace/lldb-cmake/host-compiler/bin/clang++ -DGTEST_HAS_RTTI=0 -D_DEBUG -D__STDC_CONSTANT_MACROS -D__STDC_FORMAT_MACROS -D__STDC_LIMIT_MACROS -Iutils/TableGen -I/Users/buildslave/jenkins/workspace/lldb-cmake/llvm-project/llvm/utils/TableGen -I/Applications/Xcode.app/Contents/Developer/Platforms/MacOSX.platform/Developer/SDKs/MacOSX10.15.sdk/usr/include/libxml2 -Iinclude -I/Users/buildslave/jenkins/workspace/lldb-cmake/llvm-project/llvm/include -Wdocumentation -fPIC -fvisibility-inlines-hidden -Werror=date-time -Werror=unguarded-availability-new -fmodules -fmodules-cache-path=/Users/buildslave/jenkins/workspace/lldb-cmake/lldb-build/module.cache -fcxx-modules -Xclang -fmodules-local-submodule-visibility -Wall -Wextra -Wno-unused-parameter -Wwrite-strings -Wcast-qual -Wmissing-field-initializers -pedantic -Wno-long-long -Wimplicit-fallthrough -Wcovered-switch-default -Wno-noexcept-type -Wnon-virtual-dtor -Wdelete-non-virtual-dtor -Wsuggest-override -Wstring-conversion -fdiagnostics-color -O3 -isysroot /Applications/Xcode.app/Contents/Developer/Platforms/MacOSX.platform/Developer/SDKs/MacOSX10.15.sdk -fno-exceptions -fno-rtti -UNDEBUG -std=c++14 -MD -MT utils/TableGen/CMakeFiles/llvm-tblgen.dir/DAGISelMatcherEmitter.cpp.o -MF utils/TableGen/CMakeFiles/llvm-tblgen.dir/DAGISelMatcherEmitter.cpp.o.d -o utils/TableGen/CMakeFiles/llvm-tblgen.dir/DAGISelMatcherEmitter.cpp.o -c /Users/buildslave/jenkins/workspace/lldb-cmake/llvm-project/llvm/utils/TableGen/DAGISelMatcherEmitter.cpp [30/3070] /Users/buildslave/jenkins/workspace/lldb-cmake/host-compiler/bin/clang++ -DGTEST_HAS_RTTI=0 -D_DEBUG -D__STDC_CONSTANT_MACROS -D__STDC_FORMAT_MACROS -D__STDC_LIMIT_MACROS -Iutils/TableGen -I/Users/buildslave/jenkins/workspace/lldb-cmake/llvm-project/llvm/utils/TableGen -I/Applications/Xcode.app/Contents/Developer/Platforms/MacOSX.platform/Developer/SDKs/MacOSX10.15.sdk/usr/include/libxml2 -Iinclude -I/Users/buildslave/jenkins/workspace/lldb-cmake/llvm-project/llvm/include -Wdocumentation -fPIC -fvisibility-inlines-hidden -Werror=date-time -Werror=unguarded-availability-new -fmodules -fmodules-cache-path=/Users/buildslave/jenkins/workspace/lldb-cmake/lldb-build/module.cache -fcxx-modules -Xclang -fmodules-local-submodule-visibility -Wall -Wextra -Wno-unused-parameter -Wwrite-strings -Wcast-qual -Wmissing-field-initializers -pedantic -Wno-long-long -Wimplicit-fallthrough -Wcovered-switch-default -Wno-noexcept-type -Wnon-virtual-dtor -Wdelete-non-virtual-dtor -Wsuggest-override -Wstring-conversion -fdiagnostics-color -O3 -isysroot /Applications/Xcode.app/Contents/Developer/Platforms/MacOSX.platform/Developer/SDKs/MacOSX10.15.sdk -fno-exceptions -fno-rtti -UNDEBUG -std=c++14 -MD -MT utils/TableGen/CMakeFiles/llvm-tblgen.dir/DAGISelMatcher.cpp.o -MF utils/TableGen/CMakeFiles/llvm-tblgen.dir/DAGISelMatcher.cpp.o.d -o utils/TableGen/CMakeFiles/llvm-tblgen.dir/DAGISelMatcher.cpp.o -c /Users/buildslave/jenkins/workspace/lldb-cmake/llvm-project/llvm/utils/TableGen/DAGISelMatcher.cpp [31/3070] /Users/buildslave/jenkins/workspace/lldb-cmake/host-compiler/bin/clang++ -DGTEST_HAS_RTTI=0 -D_DEBUG -D__STDC_CONSTANT_MACROS -D__STDC_FORMAT_MACROS -D__STDC_LIMIT_MACROS -Iutils/TableGen -I/Users/buildslave/jenkins/workspace/lldb-cmake/llvm-project/llvm/utils/TableGen -I/Applications/Xcode.app/Contents/Developer/Platforms/MacOSX.platform/Developer/SDKs/MacOSX10.15.sdk/usr/include/libxml2 -Iinclude -I/Users/buildslave/jenkins/workspace/lldb-cmake/llvm-project/llvm/include -Wdocumentation -fPIC -fvisibility-inlines-hidden -Werror=date-time -Werror=unguarded-availability-new -fmodules -fmodules-cache-path=/Users/buildslave/jenkins/workspace/lldb-cmake/lldb-build/module.cache -fcxx-modules -Xclang -fmodules-local-submodule-visibility -Wall -Wextra -Wno-unused-parameter -Wwrite-strings -Wcast-qual -Wmissing-field-initializers -pedantic -Wno-long-long -Wimplicit-fallthrough -Wcovered-switch-default -Wno-noexcept-type -Wnon-virtual-dtor -Wdelete-non-virtual-dtor -Wsuggest-override -Wstring-conversion -fdiagnostics-color -O3 -isysroot /Applications/Xcode.app/Contents/Developer/Platforms/MacOSX.platform/Developer/SDKs/MacOSX10.15.sdk -fno-exceptions -fno-rtti -UNDEBUG -std=c++14 -MD -MT utils/TableGen/CMakeFiles/llvm-tblgen.dir/DisassemblerEmitter.cpp.o -MF utils/TableGen/CMakeFiles/llvm-tblgen.dir/DisassemblerEmitter.cpp.o.d -o utils/TableGen/CMakeFiles/llvm-tblgen.dir/DisassemblerEmitter.cpp.o -c /Users/buildslave/jenkins/workspace/lldb-cmake/llvm-project/llvm/utils/TableGen/DisassemblerEmitter.cpp [32/3070] /Users/buildslave/jenkins/workspace/lldb-cmake/host-compiler/bin/clang++ -DGTEST_HAS_RTTI=0 -D_DEBUG -D__STDC_CONSTANT_MACROS -D__STDC_FORMAT_MACROS -D__STDC_LIMIT_MACROS -Iutils/TableGen -I/Users/buildslave/jenkins/workspace/lldb-cmake/llvm-project/llvm/utils/TableGen -I/Applications/Xcode.app/Contents/Developer/Platforms/MacOSX.platform/Developer/SDKs/MacOSX10.15.sdk/usr/include/libxml2 -Iinclude -I/Users/buildslave/jenkins/workspace/lldb-cmake/llvm-project/llvm/include -Wdocumentation -fPIC -fvisibility-inlines-hidden -Werror=date-time -Werror=unguarded-availability-new -fmodules -fmodules-cache-path=/Users/buildslave/jenkins/workspace/lldb-cmake/lldb-build/module.cache -fcxx-modules -Xclang -fmodules-local-submodule-visibility -Wall -Wextra -Wno-unused-parameter -Wwrite-strings -Wcast-qual -Wmissing-field-initializers -pedantic -Wno-long-long -Wimplicit-fallthrough -Wcovered-switch-default -Wno-noexcept-type -Wnon-virtual-dtor -Wdelete-non-virtual-dtor -Wsuggest-override -Wstring-conversion -fdiagnostics-color -O3 -isysroot /Applications/Xcode.app/Contents/Developer/Platforms/MacOSX.platform/Developer/SDKs/MacOSX10.15.sdk -fno-exceptions -fno-rtti -UNDEBUG -std=c++14 -MD -MT utils/TableGen/CMakeFiles/llvm-tblgen.dir/ExegesisEmitter.cpp.o -MF utils/TableGen/CMakeFiles/llvm-tblgen.dir/ExegesisEmitter.cpp.o.d -o utils/TableGen/CMakeFiles/llvm-tblgen.dir/ExegesisEmitter.cpp.o -c /Users/buildslave/jenkins/workspace/lldb-cmake/llvm-project/llvm/utils/TableGen/ExegesisEmitter.cpp [33/3070] /Users/buildslave/jenkins/workspace/lldb-cmake/host-compiler/bin/clang++ -DGTEST_HAS_RTTI=0 -D_DEBUG -D__STDC_CONSTANT_MACROS -D__STDC_FORMAT_MACROS -D__STDC_LIMIT_MACROS -Iutils/TableGen -I/Users/buildslave/jenkins/workspace/lldb-cmake/llvm-project/llvm/utils/TableGen -I/Applications/Xcode.app/Contents/Developer/Platforms/MacOSX.platform/Developer/SDKs/MacOSX10.15.sdk/usr/include/libxml2 -Iinclude -I/Users/buildslave/jenkins/workspace/lldb-cmake/llvm-project/llvm/include -Wdocumentation -fPIC -fvisibility-inlines-hidden -Werror=date-time -Werror=unguarded-availability-new -fmodules -fmodules-cache-path=/Users/buildslave/jenkins/workspace/lldb-cmake/lldb-build/module.cache -fcxx-modules -Xclang -fmodules-local-submodule-visibility -Wall -Wextra -Wno-unused-parameter -Wwrite-strings -Wcast-qual -Wmissing-field-initializers -pedantic -Wno-long-long -Wimplicit-fallthrough -Wcovered-switch-default -Wno-noexcept-type -Wnon-virtual-dtor -Wdelete-non-virtual-dtor -Wsuggest-override -Wstring-conversion -fdiagnostics-color -O3 -isysroot /Applications/Xcode.app/Contents/Developer/Platforms/MacOSX.platform/Developer/SDKs/MacOSX10.15.sdk -fno-exceptions -fno-rtti -UNDEBUG -std=c++14 -MD -MT utils/TableGen/CMakeFiles/llvm-tblgen.dir/CodeGenTarget.cpp.o -MF utils/TableGen/CMakeFiles/llvm-tblgen.dir/CodeGenTarget.cpp.o.d -o utils/TableGen/CMakeFiles/llvm-tblgen.dir/CodeGenTarget.cpp.o -c /Users/buildslave/jenkins/workspace/lldb-cmake/llvm-project/llvm/utils/TableGen/CodeGenTarget.cpp [34/3070] /Users/buildslave/jenkins/workspace/lldb-cmake/host-compiler/bin/clang++ -DGTEST_HAS_RTTI=0 -D_DEBUG -D__STDC_CONSTANT_MACROS -D__STDC_FORMAT_MACROS -D__STDC_LIMIT_MACROS -Iutils/TableGen -I/Users/buildslave/jenkins/workspace/lldb-cmake/llvm-project/llvm/utils/TableGen -I/Applications/Xcode.app/Contents/Developer/Platforms/MacOSX.platform/Developer/SDKs/MacOSX10.15.sdk/usr/include/libxml2 -Iinclude -I/Users/buildslave/jenkins/workspace/lldb-cmake/llvm-project/llvm/include -Wdocumentation -fPIC -fvisibility-inlines-hidden -Werror=date-time -Werror=unguarded-availability-new -fmodules -fmodules-cache-path=/Users/buildslave/jenkins/workspace/lldb-cmake/lldb-build/module.cache -fcxx-modules -Xclang -fmodules-local-submodule-visibility -Wall -Wextra -Wno-unused-parameter -Wwrite-strings -Wcast-qual -Wmissing-field-initializers -pedantic -Wno-long-long -Wimplicit-fallthrough -Wcovered-switch-default -Wno-noexcept-type -Wnon-virtual-dtor -Wdelete-non-virtual-dtor -Wsuggest-override -Wstring-conversion -fdiagnostics-color -O3 -isysroot /Applications/Xcode.app/Contents/Developer/Platforms/MacOSX.platform/Developer/SDKs/MacOSX10.15.sdk -fno-exceptions -fno-rtti -UNDEBUG -std=c++14 -MD -MT utils/TableGen/CMakeFiles/llvm-tblgen.dir/CodeGenSchedule.cpp.o -MF utils/TableGen/CMakeFiles/llvm-tblgen.dir/CodeGenSchedule.cpp.o.d -o utils/TableGen/CMakeFiles/llvm-tblgen.dir/CodeGenSchedule.cpp.o -c /Users/buildslave/jenkins/workspace/lldb-cmake/llvm-project/llvm/utils/TableGen/CodeGenSchedule.cpp [35/3070] /Users/buildslave/jenkins/workspace/lldb-cmake/host-compiler/bin/clang++ -DGTEST_HAS_RTTI=0 -D_DEBUG -D__STDC_CONSTANT_MACROS -D__STDC_FORMAT_MACROS -D__STDC_LIMIT_MACROS -Iutils/TableGen -I/Users/buildslave/jenkins/workspace/lldb-cmake/llvm-project/llvm/utils/TableGen -I/Applications/Xcode.app/Contents/Developer/Platforms/MacOSX.platform/Developer/SDKs/MacOSX10.15.sdk/usr/include/libxml2 -Iinclude -I/Users/buildslave/jenkins/workspace/lldb-cmake/llvm-project/llvm/include -Wdocumentation -fPIC -fvisibility-inlines-hidden -Werror=date-time -Werror=unguarded-availability-new -fmodules -fmodules-cache-path=/Users/buildslave/jenkins/workspace/lldb-cmake/lldb-build/module.cache -fcxx-modules -Xclang -fmodules-local-submodule-visibility -Wall -Wextra -Wno-unused-parameter -Wwrite-strings -Wcast-qual -Wmissing-field-initializers -pedantic -Wno-long-long -Wimplicit-fallthrough -Wcovered-switch-default -Wno-noexcept-type -Wnon-virtual-dtor -Wdelete-non-virtual-dtor -Wsuggest-override -Wstring-conversion -fdiagnostics-color -O3 -isysroot /Applications/Xcode.app/Contents/Developer/Platforms/MacOSX.platform/Developer/SDKs/MacOSX10.15.sdk -fno-exceptions -fno-rtti -UNDEBUG -std=c++14 -MD -MT utils/TableGen/CMakeFiles/llvm-tblgen.dir/DFAPacketizerEmitter.cpp.o -MF utils/TableGen/CMakeFiles/llvm-tblgen.dir/DFAPacketizerEmitter.cpp.o.d -o utils/TableGen/CMakeFiles/llvm-tblgen.dir/DFAPacketizerEmitter.cpp.o -c /Users/buildslave/jenkins/workspace/lldb-cmake/llvm-project/llvm/utils/TableGen/DFAPacketizerEmitter.cpp [36/3070] /Users/buildslave/jenkins/workspace/lldb-cmake/host-compiler/bin/clang++ -DGTEST_HAS_RTTI=0 -D_DEBUG -D__STDC_CONSTANT_MACROS -D__STDC_FORMAT_MACROS -D__STDC_LIMIT_MACROS -Iutils/TableGen -I/Users/buildslave/jenkins/workspace/lldb-cmake/llvm-project/llvm/utils/TableGen -I/Applications/Xcode.app/Contents/Developer/Platforms/MacOSX.platform/Developer/SDKs/MacOSX10.15.sdk/usr/include/libxml2 -Iinclude -I/Users/buildslave/jenkins/workspace/lldb-cmake/llvm-project/llvm/include -Wdocumentation -fPIC -fvisibility-inlines-hidden -Werror=date-time -Werror=unguarded-availability-new -fmodules -fmodules-cache-path=/Users/buildslave/jenkins/workspace/lldb-cmake/lldb-build/module.cache -fcxx-modules -Xclang -fmodules-local-submodule-visibility -Wall -Wextra -Wno-unused-parameter -Wwrite-strings -Wcast-qual -Wmissing-field-initializers -pedantic -Wno-long-long -Wimplicit-fallthrough -Wcovered-switch-default -Wno-noexcept-type -Wnon-virtual-dtor -Wdelete-non-virtual-dtor -Wsuggest-override -Wstring-conversion -fdiagnostics-color -O3 -isysroot /Applications/Xcode.app/Contents/Developer/Platforms/MacOSX.platform/Developer/SDKs/MacOSX10.15.sdk -fno-exceptions -fno-rtti -UNDEBUG -std=c++14 -MD -MT utils/TableGen/CMakeFiles/llvm-tblgen.dir/DFAEmitter.cpp.o -MF utils/TableGen/CMakeFiles/llvm-tblgen.dir/DFAEmitter.cpp.o.d -o utils/TableGen/CMakeFiles/llvm-tblgen.dir/DFAEmitter.cpp.o -c /Users/buildslave/jenkins/workspace/lldb-cmake/llvm-project/llvm/utils/TableGen/DFAEmitter.cpp [37/3070] /Users/buildslave/jenkins/workspace/lldb-cmake/host-compiler/bin/clang++ -DGTEST_HAS_RTTI=0 -D_DEBUG -D__STDC_CONSTANT_MACROS -D__STDC_FORMAT_MACROS -D__STDC_LIMIT_MACROS -Iutils/TableGen -I/Users/buildslave/jenkins/workspace/lldb-cmake/llvm-project/llvm/utils/TableGen -I/Applications/Xcode.app/Contents/Developer/Platforms/MacOSX.platform/Developer/SDKs/MacOSX10.15.sdk/usr/include/libxml2 -Iinclude -I/Users/buildslave/jenkins/workspace/lldb-cmake/llvm-project/llvm/include -Wdocumentation -fPIC -fvisibility-inlines-hidden -Werror=date-time -Werror=unguarded-availability-new -fmodules -fmodules-cache-path=/Users/buildslave/jenkins/workspace/lldb-cmake/lldb-build/module.cache -fcxx-modules -Xclang -fmodules-local-submodule-visibility -Wall -Wextra -Wno-unused-parameter -Wwrite-strings -Wcast-qual -Wmissing-field-initializers -pedantic -Wno-long-long -Wimplicit-fallthrough -Wcovered-switch-default -Wno-noexcept-type -Wnon-virtual-dtor -Wdelete-non-virtual-dtor -Wsuggest-override -Wstring-conversion -fdiagnostics-color -O3 -isysroot /Applications/Xcode.app/Contents/Developer/Platforms/MacOSX.platform/Developer/SDKs/MacOSX10.15.sdk -fno-exceptions -fno-rtti -UNDEBUG -std=c++14 -MD -MT utils/TableGen/CMakeFiles/llvm-tblgen.dir/AsmMatcherEmitter.cpp.o -MF utils/TableGen/CMakeFiles/llvm-tblgen.dir/AsmMatcherEmitter.cpp.o.d -o utils/TableGen/CMakeFiles/llvm-tblgen.dir/AsmMatcherEmitter.cpp.o -c /Users/buildslave/jenkins/workspace/lldb-cmake/llvm-project/llvm/utils/TableGen/AsmMatcherEmitter.cpp [38/3070] /Users/buildslave/jenkins/workspace/lldb-cmake/host-compiler/bin/clang++ -DGTEST_HAS_RTTI=0 -D_DEBUG -D__STDC_CONSTANT_MACROS -D__STDC_FORMAT_MACROS -D__STDC_LIMIT_MACROS -Iutils/TableGen -I/Users/buildslave/jenkins/workspace/lldb-cmake/llvm-project/llvm/utils/TableGen -I/Applications/Xcode.app/Contents/Developer/Platforms/MacOSX.platform/Developer/SDKs/MacOSX10.15.sdk/usr/include/libxml2 -Iinclude -I/Users/buildslave/jenkins/workspace/lldb-cmake/llvm-project/llvm/include -Wdocumentation -fPIC -fvisibility-inlines-hidden -Werror=date-time -Werror=unguarded-availability-new -fmodules -fmodules-cache-path=/Users/buildslave/jenkins/workspace/lldb-cmake/lldb-build/module.cache -fcxx-modules -Xclang -fmodules-local-submodule-visibility -Wall -Wextra -Wno-unused-parameter -Wwrite-strings -Wcast-qual -Wmissing-field-initializers -pedantic -Wno-long-long -Wimplicit-fallthrough -Wcovered-switch-default -Wno-noexcept-type -Wnon-virtual-dtor -Wdelete-non-virtual-dtor -Wsuggest-override -Wstring-conversion -fdiagnostics-color -O3 -isysroot /Applications/Xcode.app/Contents/Developer/Platforms/MacOSX.platform/Developer/SDKs/MacOSX10.15.sdk -fno-exceptions -fno-rtti -UNDEBUG -std=c++14 -MD -MT utils/TableGen/CMakeFiles/llvm-tblgen.dir/CodeGenRegisters.cpp.o -MF utils/TableGen/CMakeFiles/llvm-tblgen.dir/CodeGenRegisters.cpp.o.d -o utils/TableGen/CMakeFiles/llvm-tblgen.dir/CodeGenRegisters.cpp.o -c /Users/buildslave/jenkins/workspace/lldb-cmake/llvm-project/llvm/utils/TableGen/CodeGenRegisters.cpp [39/3070] /Users/buildslave/jenkins/workspace/lldb-cmake/host-compiler/bin/clang++ -DGTEST_HAS_RTTI=0 -D_DEBUG -D__STDC_CONSTANT_MACROS -D__STDC_FORMAT_MACROS -D__STDC_LIMIT_MACROS -Iutils/TableGen -I/Users/buildslave/jenkins/workspace/lldb-cmake/llvm-project/llvm/utils/TableGen -I/Applications/Xcode.app/Contents/Developer/Platforms/MacOSX.platform/Developer/SDKs/MacOSX10.15.sdk/usr/include/libxml2 -Iinclude -I/Users/buildslave/jenkins/workspace/lldb-cmake/llvm-project/llvm/include -Wdocumentation -fPIC -fvisibility-inlines-hidden -Werror=date-time -Werror=unguarded-availability-new -fmodules -fmodules-cache-path=/Users/buildslave/jenkins/workspace/lldb-cmake/lldb-build/module.cache -fcxx-modules -Xclang -fmodules-local-submodule-visibility -Wall -Wextra -Wno-unused-parameter -Wwrite-strings -Wcast-qual -Wmissing-field-initializers -pedantic -Wno-long-long -Wimplicit-fallthrough -Wcovered-switch-default -Wno-noexcept-type -Wnon-virtual-dtor -Wdelete-non-virtual-dtor -Wsuggest-override -Wstring-conversion -fdiagnostics-color -O3 -isysroot /Applications/Xcode.app/Contents/Developer/Platforms/MacOSX.platform/Developer/SDKs/MacOSX10.15.sdk -fno-exceptions -fno-rtti -UNDEBUG -std=c++14 -MD -MT utils/TableGen/CMakeFiles/llvm-tblgen.dir/InfoByHwMode.cpp.o -MF utils/TableGen/CMakeFiles/llvm-tblgen.dir/InfoByHwMode.cpp.o.d -o utils/TableGen/CMakeFiles/llvm-tblgen.dir/InfoByHwMode.cpp.o -c /Users/buildslave/jenkins/workspace/lldb-cmake/llvm-project/llvm/utils/TableGen/InfoByHwMode.cpp [40/3070] /Users/buildslave/jenkins/workspace/lldb-cmake/host-compiler/bin/clang++ -DGTEST_HAS_RTTI=0 -D_DEBUG -D__STDC_CONSTANT_MACROS -D__STDC_FORMAT_MACROS -D__STDC_LIMIT_MACROS -Iutils/TableGen -I/Users/buildslave/jenkins/workspace/lldb-cmake/llvm-project/llvm/utils/TableGen -I/Applications/Xcode.app/Contents/Developer/Platforms/MacOSX.platform/Developer/SDKs/MacOSX10.15.sdk/usr/include/libxml2 -Iinclude -I/Users/buildslave/jenkins/workspace/lldb-cmake/llvm-project/llvm/include -Wdocumentation -fPIC -fvisibility-inlines-hidden -Werror=date-time -Werror=unguarded-availability-new -fmodules -fmodules-cache-path=/Users/buildslave/jenkins/workspace/lldb-cmake/lldb-build/module.cache -fcxx-modules -Xclang -fmodules-local-submodule-visibility -Wall -Wextra -Wno-unused-parameter -Wwrite-strings -Wcast-qual -Wmissing-field-initializers -pedantic -Wno-long-long -Wimplicit-fallthrough -Wcovered-switch-default -Wno-noexcept-type -Wnon-virtual-dtor -Wdelete-non-virtual-dtor -Wsuggest-override -Wstring-conversion -fdiagnostics-color -O3 -isysroot /Applications/Xcode.app/Contents/Developer/Platforms/MacOSX.platform/Developer/SDKs/MacOSX10.15.sdk -fno-exceptions -fno-rtti -UNDEBUG -std=c++14 -MD -MT utils/TableGen/CMakeFiles/llvm-tblgen.dir/OptEmitter.cpp.o -MF utils/TableGen/CMakeFiles/llvm-tblgen.dir/OptEmitter.cpp.o.d -o utils/TableGen/CMakeFiles/llvm-tblgen.dir/OptEmitter.cpp.o -c /Users/buildslave/jenkins/workspace/lldb-cmake/llvm-project/llvm/utils/TableGen/OptEmitter.cpp [41/3070] /Users/buildslave/jenkins/workspace/lldb-cmake/host-compiler/bin/clang++ -DGTEST_HAS_RTTI=0 -D_DEBUG -D__STDC_CONSTANT_MACROS -D__STDC_FORMAT_MACROS -D__STDC_LIMIT_MACROS -Iutils/TableGen -I/Users/buildslave/jenkins/workspace/lldb-cmake/llvm-project/llvm/utils/TableGen -I/Applications/Xcode.app/Contents/Developer/Platforms/MacOSX.platform/Developer/SDKs/MacOSX10.15.sdk/usr/include/libxml2 -Iinclude -I/Users/buildslave/jenkins/workspace/lldb-cmake/llvm-project/llvm/include -Wdocumentation -fPIC -fvisibility-inlines-hidden -Werror=date-time -Werror=unguarded-availability-new -fmodules -fmodules-cache-path=/Users/buildslave/jenkins/workspace/lldb-cmake/lldb-build/module.cache -fcxx-modules -Xclang -fmodules-local-submodule-visibility -Wall -Wextra -Wno-unused-parameter -Wwrite-strings -Wcast-qual -Wmissing-field-initializers -pedantic -Wno-long-long -Wimplicit-fallthrough -Wcovered-switch-default -Wno-noexcept-type -Wnon-virtual-dtor -Wdelete-non-virtual-dtor -Wsuggest-override -Wstring-conversion -fdiagnostics-color -O3 -isysroot /Applications/Xcode.app/Contents/Developer/Platforms/MacOSX.platform/Developer/SDKs/MacOSX10.15.sdk -fno-exceptions -fno-rtti -UNDEBUG -std=c++14 -MD -MT utils/TableGen/CMakeFiles/llvm-tblgen.dir/OptRSTEmitter.cpp.o -MF utils/TableGen/CMakeFiles/llvm-tblgen.dir/OptRSTEmitter.cpp.o.d -o utils/TableGen/CMakeFiles/llvm-tblgen.dir/OptRSTEmitter.cpp.o -c /Users/buildslave/jenkins/workspace/lldb-cmake/llvm-project/llvm/utils/TableGen/OptRSTEmitter.cpp [42/3070] /Users/buildslave/jenkins/workspace/lldb-cmake/host-compiler/bin/clang++ -DGTEST_HAS_RTTI=0 -D_DEBUG -D__STDC_CONSTANT_MACROS -D__STDC_FORMAT_MACROS -D__STDC_LIMIT_MACROS -Iutils/TableGen -I/Users/buildslave/jenkins/workspace/lldb-cmake/llvm-project/llvm/utils/TableGen -I/Applications/Xcode.app/Contents/Developer/Platforms/MacOSX.platform/Developer/SDKs/MacOSX10.15.sdk/usr/include/libxml2 -Iinclude -I/Users/buildslave/jenkins/workspace/lldb-cmake/llvm-project/llvm/include -Wdocumentation -fPIC -fvisibility-inlines-hidden -Werror=date-time -Werror=unguarded-availability-new -fmodules -fmodules-cache-path=/Users/buildslave/jenkins/workspace/lldb-cmake/lldb-build/module.cache -fcxx-modules -Xclang -fmodules-local-submodule-visibility -Wall -Wextra -Wno-unused-parameter -Wwrite-strings -Wcast-qual -Wmissing-field-initializers -pedantic -Wno-long-long -Wimplicit-fallthrough -Wcovered-switch-default -Wno-noexcept-type -Wnon-virtual-dtor -Wdelete-non-virtual-dtor -Wsuggest-override -Wstring-conversion -fdiagnostics-color -O3 -isysroot /Applications/Xcode.app/Contents/Developer/Platforms/MacOSX.platform/Developer/SDKs/MacOSX10.15.sdk -fno-exceptions -fno-rtti -UNDEBUG -std=c++14 -MD -MT utils/TableGen/CMakeFiles/llvm-tblgen.dir/InstrDocsEmitter.cpp.o -MF utils/TableGen/CMakeFiles/llvm-tblgen.dir/InstrDocsEmitter.cpp.o.d -o utils/TableGen/CMakeFiles/llvm-tblgen.dir/InstrDocsEmitter.cpp.o -c /Users/buildslave/jenkins/workspace/lldb-cmake/llvm-project/llvm/utils/TableGen/InstrDocsEmitter.cpp [43/3070] /Users/buildslave/jenkins/workspace/lldb-cmake/host-compiler/bin/clang++ -DGTEST_HAS_RTTI=0 -D_DEBUG -D__STDC_CONSTANT_MACROS -D__STDC_FORMAT_MACROS -D__STDC_LIMIT_MACROS -Iutils/TableGen -I/Users/buildslave/jenkins/workspace/lldb-cmake/llvm-project/llvm/utils/TableGen -I/Applications/Xcode.app/Contents/Developer/Platforms/MacOSX.platform/Developer/SDKs/MacOSX10.15.sdk/usr/include/libxml2 -Iinclude -I/Users/buildslave/jenkins/workspace/lldb-cmake/llvm-project/llvm/include -Wdocumentation -fPIC -fvisibility-inlines-hidden -Werror=date-time -Werror=unguarded-availability-new -fmodules -fmodules-cache-path=/Users/buildslave/jenkins/workspace/lldb-cmake/lldb-build/module.cache -fcxx-modules -Xclang -fmodules-local-submodule-visibility -Wall -Wextra -Wno-unused-parameter -Wwrite-strings -Wcast-qual -Wmissing-field-initializers -pedantic -Wno-long-long -Wimplicit-fallthrough -Wcovered-switch-default -Wno-noexcept-type -Wnon-virtual-dtor -Wdelete-non-virtual-dtor -Wsuggest-override -Wstring-conversion -fdiagnostics-color -O3 -isysroot /Applications/Xcode.app/Contents/Developer/Platforms/MacOSX.platform/Developer/SDKs/MacOSX10.15.sdk -fno-exceptions -fno-rtti -UNDEBUG -std=c++14 -MD -MT utils/TableGen/CMakeFiles/llvm-tblgen.dir/FastISelEmitter.cpp.o -MF utils/TableGen/CMakeFiles/llvm-tblgen.dir/FastISelEmitter.cpp.o.d -o utils/TableGen/CMakeFiles/llvm-tblgen.dir/FastISelEmitter.cpp.o -c /Users/buildslave/jenkins/workspace/lldb-cmake/llvm-project/llvm/utils/TableGen/FastISelEmitter.cpp [44/3070] /Users/buildslave/jenkins/workspace/lldb-cmake/host-compiler/bin/clang++ -DGTEST_HAS_RTTI=0 -D_DEBUG -D__STDC_CONSTANT_MACROS -D__STDC_FORMAT_MACROS -D__STDC_LIMIT_MACROS -Iutils/TableGen -I/Users/buildslave/jenkins/workspace/lldb-cmake/llvm-project/llvm/utils/TableGen -I/Applications/Xcode.app/Contents/Developer/Platforms/MacOSX.platform/Developer/SDKs/MacOSX10.15.sdk/usr/include/libxml2 -Iinclude -I/Users/buildslave/jenkins/workspace/lldb-cmake/llvm-project/llvm/include -Wdocumentation -fPIC -fvisibility-inlines-hidden -Werror=date-time -Werror=unguarded-availability-new -fmodules -fmodules-cache-path=/Users/buildslave/jenkins/workspace/lldb-cmake/lldb-build/module.cache -fcxx-modules -Xclang -fmodules-local-submodule-visibility -Wall -Wextra -Wno-unused-parameter -Wwrite-strings -Wcast-qual -Wmissing-field-initializers -pedantic -Wno-long-long -Wimplicit-fallthrough -Wcovered-switch-default -Wno-noexcept-type -Wnon-virtual-dtor -Wdelete-non-virtual-dtor -Wsuggest-override -Wstring-conversion -fdiagnostics-color -O3 -isysroot /Applications/Xcode.app/Contents/Developer/Platforms/MacOSX.platform/Developer/SDKs/MacOSX10.15.sdk -fno-exceptions -fno-rtti -UNDEBUG -std=c++14 -MD -MT utils/TableGen/CMakeFiles/llvm-tblgen.dir/CodeGenDAGPatterns.cpp.o -MF utils/TableGen/CMakeFiles/llvm-tblgen.dir/CodeGenDAGPatterns.cpp.o.d -o utils/TableGen/CMakeFiles/llvm-tblgen.dir/CodeGenDAGPatterns.cpp.o -c /Users/buildslave/jenkins/workspace/lldb-cmake/llvm-project/llvm/utils/TableGen/CodeGenDAGPatterns.cpp [45/3070] /Users/buildslave/jenkins/workspace/lldb-cmake/host-compiler/bin/clang++ -DGTEST_HAS_RTTI=0 -D_DEBUG -D__STDC_CONSTANT_MACROS -D__STDC_FORMAT_MACROS -D__STDC_LIMIT_MACROS -Iutils/TableGen -I/Users/buildslave/jenkins/workspace/lldb-cmake/llvm-project/llvm/utils/TableGen -I/Applications/Xcode.app/Contents/Developer/Platforms/MacOSX.platform/Developer/SDKs/MacOSX10.15.sdk/usr/include/libxml2 -Iinclude -I/Users/buildslave/jenkins/workspace/lldb-cmake/llvm-project/llvm/include -Wdocumentation -fPIC -fvisibility-inlines-hidden -Werror=date-time -Werror=unguarded-availability-new -fmodules -fmodules-cache-path=/Users/buildslave/jenkins/workspace/lldb-cmake/lldb-build/module.cache -fcxx-modules -Xclang -fmodules-local-submodule-visibility -Wall -Wextra -Wno-unused-parameter -Wwrite-strings -Wcast-qual -Wmissing-field-initializers -pedantic -Wno-long-long -Wimplicit-fallthrough -Wcovered-switch-default -Wno-noexcept-type -Wnon-virtual-dtor -Wdelete-non-virtual-dtor -Wsuggest-override -Wstring-conversion -fdiagnostics-color -O3 -isysroot /Applications/Xcode.app/Contents/Developer/Platforms/MacOSX.platform/Developer/SDKs/MacOSX10.15.sdk -fno-exceptions -fno-rtti -UNDEBUG -std=c++14 -MD -MT utils/TableGen/CMakeFiles/llvm-tblgen.dir/PredicateExpander.cpp.o -MF utils/TableGen/CMakeFiles/llvm-tblgen.dir/PredicateExpander.cpp.o.d -o utils/TableGen/CMakeFiles/llvm-tblgen.dir/PredicateExpander.cpp.o -c /Users/buildslave/jenkins/workspace/lldb-cmake/llvm-project/llvm/utils/TableGen/PredicateExpander.cpp [46/3070] /Users/buildslave/jenkins/workspace/lldb-cmake/host-compiler/bin/clang++ -DGTEST_HAS_RTTI=0 -D_DEBUG -D__STDC_CONSTANT_MACROS -D__STDC_FORMAT_MACROS -D__STDC_LIMIT_MACROS -Iutils/TableGen -I/Users/buildslave/jenkins/workspace/lldb-cmake/llvm-project/llvm/utils/TableGen -I/Applications/Xcode.app/Contents/Developer/Platforms/MacOSX.platform/Developer/SDKs/MacOSX10.15.sdk/usr/include/libxml2 -Iinclude -I/Users/buildslave/jenkins/workspace/lldb-cmake/llvm-project/llvm/include -Wdocumentation -fPIC -fvisibility-inlines-hidden -Werror=date-time -Werror=unguarded-availability-new -fmodules -fmodules-cache-path=/Users/buildslave/jenkins/workspace/lldb-cmake/lldb-build/module.cache -fcxx-modules -Xclang -fmodules-local-submodule-visibility -Wall -Wextra -Wno-unused-parameter -Wwrite-strings -Wcast-qual -Wmissing-field-initializers -pedantic -Wno-long-long -Wimplicit-fallthrough -Wcovered-switch-default -Wno-noexcept-type -Wnon-virtual-dtor -Wdelete-non-virtual-dtor -Wsuggest-override -Wstring-conversion -fdiagnostics-color -O3 -isysroot /Applications/Xcode.app/Contents/Developer/Platforms/MacOSX.platform/Developer/SDKs/MacOSX10.15.sdk -fno-exceptions -fno-rtti -UNDEBUG -std=c++14 -MD -MT utils/TableGen/CMakeFiles/llvm-tblgen.dir/OptParserEmitter.cpp.o -MF utils/TableGen/CMakeFiles/llvm-tblgen.dir/OptParserEmitter.cpp.o.d -o utils/TableGen/CMakeFiles/llvm-tblgen.dir/OptParserEmitter.cpp.o -c /Users/buildslave/jenkins/workspace/lldb-cmake/llvm-project/llvm/utils/TableGen/OptParserEmitter.cpp [47/3070] /Users/buildslave/jenkins/workspace/lldb-cmake/host-compiler/bin/clang++ -DGTEST_HAS_RTTI=0 -D_DEBUG -D__STDC_CONSTANT_MACROS -D__STDC_FORMAT_MACROS -D__STDC_LIMIT_MACROS -Iutils/TableGen -I/Users/buildslave/jenkins/workspace/lldb-cmake/llvm-project/llvm/utils/TableGen -I/Applications/Xcode.app/Contents/Developer/Platforms/MacOSX.platform/Developer/SDKs/MacOSX10.15.sdk/usr/include/libxml2 -Iinclude -I/Users/buildslave/jenkins/workspace/lldb-cmake/llvm-project/llvm/include -Wdocumentation -fPIC -fvisibility-inlines-hidden -Werror=date-time -Werror=unguarded-availability-new -fmodules -fmodules-cache-path=/Users/buildslave/jenkins/workspace/lldb-cmake/lldb-build/module.cache -fcxx-modules -Xclang -fmodules-local-submodule-visibility -Wall -Wextra -Wno-unused-parameter -Wwrite-strings -Wcast-qual -Wmissing-field-initializers -pedantic -Wno-long-long -Wimplicit-fallthrough -Wcovered-switch-default -Wno-noexcept-type -Wnon-virtual-dtor -Wdelete-non-virtual-dtor -Wsuggest-override -Wstring-conversion -fdiagnostics-color -O3 -isysroot /Applications/Xcode.app/Contents/Developer/Platforms/MacOSX.platform/Developer/SDKs/MacOSX10.15.sdk -fno-exceptions -fno-rtti -UNDEBUG -std=c++14 -MD -MT utils/TableGen/CMakeFiles/llvm-tblgen.dir/SDNodeProperties.cpp.o -MF utils/TableGen/CMakeFiles/llvm-tblgen.dir/SDNodeProperties.cpp.o.d -o utils/TableGen/CMakeFiles/llvm-tblgen.dir/SDNodeProperties.cpp.o -c /Users/buildslave/jenkins/workspace/lldb-cmake/llvm-project/llvm/utils/TableGen/SDNodeProperties.cpp [48/3070] /Users/buildslave/jenkins/workspace/lldb-cmake/host-compiler/bin/clang++ -DGTEST_HAS_RTTI=0 -D_DEBUG -D__STDC_CONSTANT_MACROS -D__STDC_FORMAT_MACROS -D__STDC_LIMIT_MACROS -Iutils/TableGen -I/Users/buildslave/jenkins/workspace/lldb-cmake/llvm-project/llvm/utils/TableGen -I/Applications/Xcode.app/Contents/Developer/Platforms/MacOSX.platform/Developer/SDKs/MacOSX10.15.sdk/usr/include/libxml2 -Iinclude -I/Users/buildslave/jenkins/workspace/lldb-cmake/llvm-project/llvm/include -Wdocumentation -fPIC -fvisibility-inlines-hidden -Werror=date-time -Werror=unguarded-availability-new -fmodules -fmodules-cache-path=/Users/buildslave/jenkins/workspace/lldb-cmake/lldb-build/module.cache -fcxx-modules -Xclang -fmodules-local-submodule-visibility -Wall -Wextra -Wno-unused-parameter -Wwrite-strings -Wcast-qual -Wmissing-field-initializers -pedantic -Wno-long-long -Wimplicit-fallthrough -Wcovered-switch-default -Wno-noexcept-type -Wnon-virtual-dtor -Wdelete-non-virtual-dtor -Wsuggest-override -Wstring-conversion -fdiagnostics-color -O3 -isysroot /Applications/Xcode.app/Contents/Developer/Platforms/MacOSX.platform/Developer/SDKs/MacOSX10.15.sdk -fno-exceptions -fno-rtti -UNDEBUG -std=c++14 -MD -MT utils/TableGen/CMakeFiles/llvm-tblgen.dir/GICombinerEmitter.cpp.o -MF utils/TableGen/CMakeFiles/llvm-tblgen.dir/GICombinerEmitter.cpp.o.d -o utils/TableGen/CMakeFiles/llvm-tblgen.dir/GICombinerEmitter.cpp.o -c /Users/buildslave/jenkins/workspace/lldb-cmake/llvm-project/llvm/utils/TableGen/GICombinerEmitter.cpp [49/3070] /Users/buildslave/jenkins/workspace/lldb-cmake/host-compiler/bin/clang++ -DGTEST_HAS_RTTI=0 -D_DEBUG -D__STDC_CONSTANT_MACROS -D__STDC_FORMAT_MACROS -D__STDC_LIMIT_MACROS -Iutils/TableGen -I/Users/buildslave/jenkins/workspace/lldb-cmake/llvm-project/llvm/utils/TableGen -I/Applications/Xcode.app/Contents/Developer/Platforms/MacOSX.platform/Developer/SDKs/MacOSX10.15.sdk/usr/include/libxml2 -Iinclude -I/Users/buildslave/jenkins/workspace/lldb-cmake/llvm-project/llvm/include -Wdocumentation -fPIC -fvisibility-inlines-hidden -Werror=date-time -Werror=unguarded-availability-new -fmodules -fmodules-cache-path=/Users/buildslave/jenkins/workspace/lldb-cmake/lldb-build/module.cache -fcxx-modules -Xclang -fmodules-local-submodule-visibility -Wall -Wextra -Wno-unused-parameter -Wwrite-strings -Wcast-qual -Wmissing-field-initializers -pedantic -Wno-long-long -Wimplicit-fallthrough -Wcovered-switch-default -Wno-noexcept-type -Wnon-virtual-dtor -Wdelete-non-virtual-dtor -Wsuggest-override -Wstring-conversion -fdiagnostics-color -O3 -isysroot /Applications/Xcode.app/Contents/Developer/Platforms/MacOSX.platform/Developer/SDKs/MacOSX10.15.sdk -fno-exceptions -fno-rtti -UNDEBUG -std=c++14 -MD -MT utils/TableGen/CMakeFiles/llvm-tblgen.dir/IntrinsicEmitter.cpp.o -MF utils/TableGen/CMakeFiles/llvm-tblgen.dir/IntrinsicEmitter.cpp.o.d -o utils/TableGen/CMakeFiles/llvm-tblgen.dir/IntrinsicEmitter.cpp.o -c /Users/buildslave/jenkins/workspace/lldb-cmake/llvm-project/llvm/utils/TableGen/IntrinsicEmitter.cpp [50/3070] /Users/buildslave/jenkins/workspace/lldb-cmake/host-compiler/bin/clang++ -DGTEST_HAS_RTTI=0 -D_DEBUG -D__STDC_CONSTANT_MACROS -D__STDC_FORMAT_MACROS -D__STDC_LIMIT_MACROS -Iutils/TableGen -I/Users/buildslave/jenkins/workspace/lldb-cmake/llvm-project/llvm/utils/TableGen -I/Applications/Xcode.app/Contents/Developer/Platforms/MacOSX.platform/Developer/SDKs/MacOSX10.15.sdk/usr/include/libxml2 -Iinclude -I/Users/buildslave/jenkins/workspace/lldb-cmake/llvm-project/llvm/include -Wdocumentation -fPIC -fvisibility-inlines-hidden -Werror=date-time -Werror=unguarded-availability-new -fmodules -fmodules-cache-path=/Users/buildslave/jenkins/workspace/lldb-cmake/lldb-build/module.cache -fcxx-modules -Xclang -fmodules-local-submodule-visibility -Wall -Wextra -Wno-unused-parameter -Wwrite-strings -Wcast-qual -Wmissing-field-initializers -pedantic -Wno-long-long -Wimplicit-fallthrough -Wcovered-switch-default -Wno-noexcept-type -Wnon-virtual-dtor -Wdelete-non-virtual-dtor -Wsuggest-override -Wstring-conversion -fdiagnostics-color -O3 -isysroot /Applications/Xcode.app/Contents/Developer/Platforms/MacOSX.platform/Developer/SDKs/MacOSX10.15.sdk -fno-exceptions -fno-rtti -UNDEBUG -std=c++14 -MD -MT utils/TableGen/CMakeFiles/llvm-tblgen.dir/PseudoLoweringEmitter.cpp.o -MF utils/TableGen/CMakeFiles/llvm-tblgen.dir/PseudoLoweringEmitter.cpp.o.d -o utils/TableGen/CMakeFiles/llvm-tblgen.dir/PseudoLoweringEmitter.cpp.o -c /Users/buildslave/jenkins/workspace/lldb-cmake/llvm-project/llvm/utils/TableGen/PseudoLoweringEmitter.cpp [51/3070] /Users/buildslave/jenkins/workspace/lldb-cmake/host-compiler/bin/clang++ -DGTEST_HAS_RTTI=0 -D_DEBUG -D__STDC_CONSTANT_MACROS -D__STDC_FORMAT_MACROS -D__STDC_LIMIT_MACROS -Iutils/TableGen -I/Users/buildslave/jenkins/workspace/lldb-cmake/llvm-project/llvm/utils/TableGen -I/Applications/Xcode.app/Contents/Developer/Platforms/MacOSX.platform/Developer/SDKs/MacOSX10.15.sdk/usr/include/libxml2 -Iinclude -I/Users/buildslave/jenkins/workspace/lldb-cmake/llvm-project/llvm/include -Wdocumentation -fPIC -fvisibility-inlines-hidden -Werror=date-time -Werror=unguarded-availability-new -fmodules -fmodules-cache-path=/Users/buildslave/jenkins/workspace/lldb-cmake/lldb-build/module.cache -fcxx-modules -Xclang -fmodules-local-submodule-visibility -Wall -Wextra -Wno-unused-parameter -Wwrite-strings -Wcast-qual -Wmissing-field-initializers -pedantic -Wno-long-long -Wimplicit-fallthrough -Wcovered-switch-default -Wno-noexcept-type -Wnon-virtual-dtor -Wdelete-non-virtual-dtor -Wsuggest-override -Wstring-conversion -fdiagnostics-color -O3 -isysroot /Applications/Xcode.app/Contents/Developer/Platforms/MacOSX.platform/Developer/SDKs/MacOSX10.15.sdk -fno-exceptions -fno-rtti -UNDEBUG -std=c++14 -MD -MT utils/TableGen/CMakeFiles/llvm-tblgen.dir/InstrInfoEmitter.cpp.o -MF utils/TableGen/CMakeFiles/llvm-tblgen.dir/InstrInfoEmitter.cpp.o.d -o utils/TableGen/CMakeFiles/llvm-tblgen.dir/InstrInfoEmitter.cpp.o -c /Users/buildslave/jenkins/workspace/lldb-cmake/llvm-project/llvm/utils/TableGen/InstrInfoEmitter.cpp [52/3070] /Users/buildslave/jenkins/workspace/lldb-cmake/host-compiler/bin/clang++ -DGTEST_HAS_RTTI=0 -D_DEBUG -D__STDC_CONSTANT_MACROS -D__STDC_FORMAT_MACROS -D__STDC_LIMIT_MACROS -Iutils/TableGen -I/Users/buildslave/jenkins/workspace/lldb-cmake/llvm-project/llvm/utils/TableGen -I/Applications/Xcode.app/Contents/Developer/Platforms/MacOSX.platform/Developer/SDKs/MacOSX10.15.sdk/usr/include/libxml2 -Iinclude -I/Users/buildslave/jenkins/workspace/lldb-cmake/llvm-project/llvm/include -Wdocumentation -fPIC -fvisibility-inlines-hidden -Werror=date-time -Werror=unguarded-availability-new -fmodules -fmodules-cache-path=/Users/buildslave/jenkins/workspace/lldb-cmake/lldb-build/module.cache -fcxx-modules -Xclang -fmodules-local-submodule-visibility -Wall -Wextra -Wno-unused-parameter -Wwrite-strings -Wcast-qual -Wmissing-field-initializers -pedantic -Wno-long-long -Wimplicit-fallthrough -Wcovered-switch-default -Wno-noexcept-type -Wnon-virtual-dtor -Wdelete-non-virtual-dtor -Wsuggest-override -Wstring-conversion -fdiagnostics-color -O3 -isysroot /Applications/Xcode.app/Contents/Developer/Platforms/MacOSX.platform/Developer/SDKs/MacOSX10.15.sdk -fno-exceptions -fno-rtti -UNDEBUG -std=c++14 -MD -MT utils/TableGen/CMakeFiles/llvm-tblgen.dir/Types.cpp.o -MF utils/TableGen/CMakeFiles/llvm-tblgen.dir/Types.cpp.o.d -o utils/TableGen/CMakeFiles/llvm-tblgen.dir/Types.cpp.o -c /Users/buildslave/jenkins/workspace/lldb-cmake/llvm-project/llvm/utils/TableGen/Types.cpp [53/3070] /Users/buildslave/jenkins/workspace/lldb-cmake/host-compiler/bin/clang++ -DGTEST_HAS_RTTI=0 -D_DEBUG -D__STDC_CONSTANT_MACROS -D__STDC_FORMAT_MACROS -D__STDC_LIMIT_MACROS -Iutils/TableGen -I/Users/buildslave/jenkins/workspace/lldb-cmake/llvm-project/llvm/utils/TableGen -I/Applications/Xcode.app/Contents/Developer/Platforms/MacOSX.platform/Developer/SDKs/MacOSX10.15.sdk/usr/include/libxml2 -Iinclude -I/Users/buildslave/jenkins/workspace/lldb-cmake/llvm-project/llvm/include -Wdocumentation -fPIC -fvisibility-inlines-hidden -Werror=date-time -Werror=unguarded-availability-new -fmodules -fmodules-cache-path=/Users/buildslave/jenkins/workspace/lldb-cmake/lldb-build/module.cache -fcxx-modules -Xclang -fmodules-local-submodule-visibility -Wall -Wextra -Wno-unused-parameter -Wwrite-strings -Wcast-qual -Wmissing-field-initializers -pedantic -Wno-long-long -Wimplicit-fallthrough -Wcovered-switch-default -Wno-noexcept-type -Wnon-virtual-dtor -Wdelete-non-virtual-dtor -Wsuggest-override -Wstring-conversion -fdiagnostics-color -O3 -isysroot /Applications/Xcode.app/Contents/Developer/Platforms/MacOSX.platform/Developer/SDKs/MacOSX10.15.sdk -fno-exceptions -fno-rtti -UNDEBUG -std=c++14 -MD -MT utils/TableGen/CMakeFiles/llvm-tblgen.dir/SubtargetFeatureInfo.cpp.o -MF utils/TableGen/CMakeFiles/llvm-tblgen.dir/SubtargetFeatureInfo.cpp.o.d -o utils/TableGen/CMakeFiles/llvm-tblgen.dir/SubtargetFeatureInfo.cpp.o -c /Users/buildslave/jenkins/workspace/lldb-cmake/llvm-project/llvm/utils/TableGen/SubtargetFeatureInfo.cpp [54/3070] /Users/buildslave/jenkins/workspace/lldb-cmake/host-compiler/bin/clang++ -DGTEST_HAS_RTTI=0 -D_DEBUG -D__STDC_CONSTANT_MACROS -D__STDC_FORMAT_MACROS -D__STDC_LIMIT_MACROS -Iutils/TableGen -I/Users/buildslave/jenkins/workspace/lldb-cmake/llvm-project/llvm/utils/TableGen -I/Applications/Xcode.app/Contents/Developer/Platforms/MacOSX.platform/Developer/SDKs/MacOSX10.15.sdk/usr/include/libxml2 -Iinclude -I/Users/buildslave/jenkins/workspace/lldb-cmake/llvm-project/llvm/include -Wdocumentation -fPIC -fvisibility-inlines-hidden -Werror=date-time -Werror=unguarded-availability-new -fmodules -fmodules-cache-path=/Users/buildslave/jenkins/workspace/lldb-cmake/lldb-build/module.cache -fcxx-modules -Xclang -fmodules-local-submodule-visibility -Wall -Wextra -Wno-unused-parameter -Wwrite-strings -Wcast-qual -Wmissing-field-initializers -pedantic -Wno-long-long -Wimplicit-fallthrough -Wcovered-switch-default -Wno-noexcept-type -Wnon-virtual-dtor -Wdelete-non-virtual-dtor -Wsuggest-override -Wstring-conversion -fdiagnostics-color -O3 -isysroot /Applications/Xcode.app/Contents/Developer/Platforms/MacOSX.platform/Developer/SDKs/MacOSX10.15.sdk -fno-exceptions -fno-rtti -UNDEBUG -std=c++14 -MD -MT utils/TableGen/CMakeFiles/llvm-tblgen.dir/RegisterBankEmitter.cpp.o -MF utils/TableGen/CMakeFiles/llvm-tblgen.dir/RegisterBankEmitter.cpp.o.d -o utils/TableGen/CMakeFiles/llvm-tblgen.dir/RegisterBankEmitter.cpp.o -c /Users/buildslave/jenkins/workspace/lldb-cmake/llvm-project/llvm/utils/TableGen/RegisterBankEmitter.cpp [55/3070] /Users/buildslave/jenkins/workspace/lldb-cmake/host-compiler/bin/clang++ -DGTEST_HAS_RTTI=0 -D_DEBUG -D__STDC_CONSTANT_MACROS -D__STDC_FORMAT_MACROS -D__STDC_LIMIT_MACROS -Iutils/TableGen -I/Users/buildslave/jenkins/workspace/lldb-cmake/llvm-project/llvm/utils/TableGen -I/Applications/Xcode.app/Contents/Developer/Platforms/MacOSX.platform/Developer/SDKs/MacOSX10.15.sdk/usr/include/libxml2 -Iinclude -I/Users/buildslave/jenkins/workspace/lldb-cmake/llvm-project/llvm/include -Wdocumentation -fPIC -fvisibility-inlines-hidden -Werror=date-time -Werror=unguarded-availability-new -fmodules -fmodules-cache-path=/Users/buildslave/jenkins/workspace/lldb-cmake/lldb-build/module.cache -fcxx-modules -Xclang -fmodules-local-submodule-visibility -Wall -Wextra -Wno-unused-parameter -Wwrite-strings -Wcast-qual -Wmissing-field-initializers -pedantic -Wno-long-long -Wimplicit-fallthrough -Wcovered-switch-default -Wno-noexcept-type -Wnon-virtual-dtor -Wdelete-non-virtual-dtor -Wsuggest-override -Wstring-conversion -fdiagnostics-color -O3 -isysroot /Applications/Xcode.app/Contents/Developer/Platforms/MacOSX.platform/Developer/SDKs/MacOSX10.15.sdk -fno-exceptions -fno-rtti -UNDEBUG -std=c++14 -MD -MT utils/TableGen/CMakeFiles/llvm-tblgen.dir/FixedLenDecoderEmitter.cpp.o -MF utils/TableGen/CMakeFiles/llvm-tblgen.dir/FixedLenDecoderEmitter.cpp.o.d -o utils/TableGen/CMakeFiles/llvm-tblgen.dir/FixedLenDecoderEmitter.cpp.o -c /Users/buildslave/jenkins/workspace/lldb-cmake/llvm-project/llvm/utils/TableGen/FixedLenDecoderEmitter.cpp [56/3070] /Users/buildslave/jenkins/workspace/lldb-cmake/host-compiler/bin/clang++ -DGTEST_HAS_RTTI=0 -D_DEBUG -D__STDC_CONSTANT_MACROS -D__STDC_FORMAT_MACROS -D__STDC_LIMIT_MACROS -Iutils/TableGen -I/Users/buildslave/jenkins/workspace/lldb-cmake/llvm-project/llvm/utils/TableGen -I/Applications/Xcode.app/Contents/Developer/Platforms/MacOSX.platform/Developer/SDKs/MacOSX10.15.sdk/usr/include/libxml2 -Iinclude -I/Users/buildslave/jenkins/workspace/lldb-cmake/llvm-project/llvm/include -Wdocumentation -fPIC -fvisibility-inlines-hidden -Werror=date-time -Werror=unguarded-availability-new -fmodules -fmodules-cache-path=/Users/buildslave/jenkins/workspace/lldb-cmake/lldb-build/module.cache -fcxx-modules -Xclang -fmodules-local-submodule-visibility -Wall -Wextra -Wno-unused-parameter -Wwrite-strings -Wcast-qual -Wmissing-field-initializers -pedantic -Wno-long-long -Wimplicit-fallthrough -Wcovered-switch-default -Wno-noexcept-type -Wnon-virtual-dtor -Wdelete-non-virtual-dtor -Wsuggest-override -Wstring-conversion -fdiagnostics-color -O3 -isysroot /Applications/Xcode.app/Contents/Developer/Platforms/MacOSX.platform/Developer/SDKs/MacOSX10.15.sdk -fno-exceptions -fno-rtti -UNDEBUG -std=c++14 -MD -MT utils/TableGen/CMakeFiles/llvm-tblgen.dir/X86ModRMFilters.cpp.o -MF utils/TableGen/CMakeFiles/llvm-tblgen.dir/X86ModRMFilters.cpp.o.d -o utils/TableGen/CMakeFiles/llvm-tblgen.dir/X86ModRMFilters.cpp.o -c /Users/buildslave/jenkins/workspace/lldb-cmake/llvm-project/llvm/utils/TableGen/X86ModRMFilters.cpp [57/3070] /Users/buildslave/jenkins/workspace/lldb-cmake/host-compiler/bin/clang++ -DGTEST_HAS_RTTI=0 -D_DEBUG -D__STDC_CONSTANT_MACROS -D__STDC_FORMAT_MACROS -D__STDC_LIMIT_MACROS -Iutils/TableGen -I/Users/buildslave/jenkins/workspace/lldb-cmake/llvm-project/llvm/utils/TableGen -I/Applications/Xcode.app/Contents/Developer/Platforms/MacOSX.platform/Developer/SDKs/MacOSX10.15.sdk/usr/include/libxml2 -Iinclude -I/Users/buildslave/jenkins/workspace/lldb-cmake/llvm-project/llvm/include -Wdocumentation -fPIC -fvisibility-inlines-hidden -Werror=date-time -Werror=unguarded-availability-new -fmodules -fmodules-cache-path=/Users/buildslave/jenkins/workspace/lldb-cmake/lldb-build/module.cache -fcxx-modules -Xclang -fmodules-local-submodule-visibility -Wall -Wextra -Wno-unused-parameter -Wwrite-strings -Wcast-qual -Wmissing-field-initializers -pedantic -Wno-long-long -Wimplicit-fallthrough -Wcovered-switch-default -Wno-noexcept-type -Wnon-virtual-dtor -Wdelete-non-virtual-dtor -Wsuggest-override -Wstring-conversion -fdiagnostics-color -O3 -isysroot /Applications/Xcode.app/Contents/Developer/Platforms/MacOSX.platform/Developer/SDKs/MacOSX10.15.sdk -fno-exceptions -fno-rtti -UNDEBUG -std=c++14 -MD -MT utils/TableGen/CMakeFiles/llvm-tblgen.dir/TableGen.cpp.o -MF utils/TableGen/CMakeFiles/llvm-tblgen.dir/TableGen.cpp.o.d -o utils/TableGen/CMakeFiles/llvm-tblgen.dir/TableGen.cpp.o -c /Users/buildslave/jenkins/workspace/lldb-cmake/llvm-project/llvm/utils/TableGen/TableGen.cpp [58/3070] /Users/buildslave/jenkins/workspace/lldb-cmake/host-compiler/bin/clang++ -DGTEST_HAS_RTTI=0 -D_DEBUG -D__STDC_CONSTANT_MACROS -D__STDC_FORMAT_MACROS -D__STDC_LIMIT_MACROS -Iutils/TableGen -I/Users/buildslave/jenkins/workspace/lldb-cmake/llvm-project/llvm/utils/TableGen -I/Applications/Xcode.app/Contents/Developer/Platforms/MacOSX.platform/Developer/SDKs/MacOSX10.15.sdk/usr/include/libxml2 -Iinclude -I/Users/buildslave/jenkins/workspace/lldb-cmake/llvm-project/llvm/include -Wdocumentation -fPIC -fvisibility-inlines-hidden -Werror=date-time -Werror=unguarded-availability-new -fmodules -fmodules-cache-path=/Users/buildslave/jenkins/workspace/lldb-cmake/lldb-build/module.cache -fcxx-modules -Xclang -fmodules-local-submodule-visibility -Wall -Wextra -Wno-unused-parameter -Wwrite-strings -Wcast-qual -Wmissing-field-initializers -pedantic -Wno-long-long -Wimplicit-fallthrough -Wcovered-switch-default -Wno-noexcept-type -Wnon-virtual-dtor -Wdelete-non-virtual-dtor -Wsuggest-override -Wstring-conversion -fdiagnostics-color -O3 -isysroot /Applications/Xcode.app/Contents/Developer/Platforms/MacOSX.platform/Developer/SDKs/MacOSX10.15.sdk -fno-exceptions -fno-rtti -UNDEBUG -std=c++14 -MD -MT utils/TableGen/CMakeFiles/llvm-tblgen.dir/X86EVEX2VEXTablesEmitter.cpp.o -MF utils/TableGen/CMakeFiles/llvm-tblgen.dir/X86EVEX2VEXTablesEmitter.cpp.o.d -o utils/TableGen/CMakeFiles/llvm-tblgen.dir/X86EVEX2VEXTablesEmitter.cpp.o -c /Users/buildslave/jenkins/workspace/lldb-cmake/llvm-project/llvm/utils/TableGen/X86EVEX2VEXTablesEmitter.cpp [59/3070] /Users/buildslave/jenkins/workspace/lldb-cmake/host-compiler/bin/clang++ -DGTEST_HAS_RTTI=0 -D_DEBUG -D__STDC_CONSTANT_MACROS -D__STDC_FORMAT_MACROS -D__STDC_LIMIT_MACROS -Iutils/TableGen -I/Users/buildslave/jenkins/workspace/lldb-cmake/llvm-project/llvm/utils/TableGen -I/Applications/Xcode.app/Contents/Developer/Platforms/MacOSX.platform/Developer/SDKs/MacOSX10.15.sdk/usr/include/libxml2 -Iinclude -I/Users/buildslave/jenkins/workspace/lldb-cmake/llvm-project/llvm/include -Wdocumentation -fPIC -fvisibility-inlines-hidden -Werror=date-time -Werror=unguarded-availability-new -fmodules -fmodules-cache-path=/Users/buildslave/jenkins/workspace/lldb-cmake/lldb-build/module.cache -fcxx-modules -Xclang -fmodules-local-submodule-visibility -Wall -Wextra -Wno-unused-parameter -Wwrite-strings -Wcast-qual -Wmissing-field-initializers -pedantic -Wno-long-long -Wimplicit-fallthrough -Wcovered-switch-default -Wno-noexcept-type -Wnon-virtual-dtor -Wdelete-non-virtual-dtor -Wsuggest-override -Wstring-conversion -fdiagnostics-color -O3 -isysroot /Applications/Xcode.app/Contents/Developer/Platforms/MacOSX.platform/Developer/SDKs/MacOSX10.15.sdk -fno-exceptions -fno-rtti -UNDEBUG -std=c++14 -MD -MT utils/TableGen/CMakeFiles/llvm-tblgen.dir/RISCVCompressInstEmitter.cpp.o -MF utils/TableGen/CMakeFiles/llvm-tblgen.dir/RISCVCompressInstEmitter.cpp.o.d -o utils/TableGen/CMakeFiles/llvm-tblgen.dir/RISCVCompressInstEmitter.cpp.o -c /Users/buildslave/jenkins/workspace/lldb-cmake/llvm-project/llvm/utils/TableGen/RISCVCompressInstEmitter.cpp [60/3070] /Users/buildslave/jenkins/workspace/lldb-cmake/host-compiler/bin/clang++ -DGTEST_HAS_RTTI=0 -D_DEBUG -D__STDC_CONSTANT_MACROS -D__STDC_FORMAT_MACROS -D__STDC_LIMIT_MACROS -Iutils/TableGen -I/Users/buildslave/jenkins/workspace/lldb-cmake/llvm-project/llvm/utils/TableGen -I/Applications/Xcode.app/Contents/Developer/Platforms/MacOSX.platform/Developer/SDKs/MacOSX10.15.sdk/usr/include/libxml2 -Iinclude -I/Users/buildslave/jenkins/workspace/lldb-cmake/llvm-project/llvm/include -Wdocumentation -fPIC -fvisibility-inlines-hidden -Werror=date-time -Werror=unguarded-availability-new -fmodules -fmodules-cache-path=/Users/buildslave/jenkins/workspace/lldb-cmake/lldb-build/module.cache -fcxx-modules -Xclang -fmodules-local-submodule-visibility -Wall -Wextra -Wno-unused-parameter -Wwrite-strings -Wcast-qual -Wmissing-field-initializers -pedantic -Wno-long-long -Wimplicit-fallthrough -Wcovered-switch-default -Wno-noexcept-type -Wnon-virtual-dtor -Wdelete-non-virtual-dtor -Wsuggest-override -Wstring-conversion -fdiagnostics-color -O3 -isysroot /Applications/Xcode.app/Contents/Developer/Platforms/MacOSX.platform/Developer/SDKs/MacOSX10.15.sdk -fno-exceptions -fno-rtti -UNDEBUG -std=c++14 -MD -MT utils/TableGen/CMakeFiles/llvm-tblgen.dir/WebAssemblyDisassemblerEmitter.cpp.o -MF utils/TableGen/CMakeFiles/llvm-tblgen.dir/WebAssemblyDisassemblerEmitter.cpp.o.d -o utils/TableGen/CMakeFiles/llvm-tblgen.dir/WebAssemblyDisassemblerEmitter.cpp.o -c /Users/buildslave/jenkins/workspace/lldb-cmake/llvm-project/llvm/utils/TableGen/WebAssemblyDisassemblerEmitter.cpp [61/3070] /Users/buildslave/jenkins/workspace/lldb-cmake/host-compiler/bin/clang++ -DGTEST_HAS_RTTI=0 -D_DEBUG -D__STDC_CONSTANT_MACROS -D__STDC_FORMAT_MACROS -D__STDC_LIMIT_MACROS -Iutils/TableGen -I/Users/buildslave/jenkins/workspace/lldb-cmake/llvm-project/llvm/utils/TableGen -I/Applications/Xcode.app/Contents/Developer/Platforms/MacOSX.platform/Developer/SDKs/MacOSX10.15.sdk/usr/include/libxml2 -Iinclude -I/Users/buildslave/jenkins/workspace/lldb-cmake/llvm-project/llvm/include -Wdocumentation -fPIC -fvisibility-inlines-hidden -Werror=date-time -Werror=unguarded-availability-new -fmodules -fmodules-cache-path=/Users/buildslave/jenkins/workspace/lldb-cmake/lldb-build/module.cache -fcxx-modules -Xclang -fmodules-local-submodule-visibility -Wall -Wextra -Wno-unused-parameter -Wwrite-strings -Wcast-qual -Wmissing-field-initializers -pedantic -Wno-long-long -Wimplicit-fallthrough -Wcovered-switch-default -Wno-noexcept-type -Wnon-virtual-dtor -Wdelete-non-virtual-dtor -Wsuggest-override -Wstring-conversion -fdiagnostics-color -O3 -isysroot /Applications/Xcode.app/Contents/Developer/Platforms/MacOSX.platform/Developer/SDKs/MacOSX10.15.sdk -fno-exceptions -fno-rtti -UNDEBUG -std=c++14 -MD -MT utils/TableGen/CMakeFiles/llvm-tblgen.dir/X86DisassemblerTables.cpp.o -MF utils/TableGen/CMakeFiles/llvm-tblgen.dir/X86DisassemblerTables.cpp.o.d -o utils/TableGen/CMakeFiles/llvm-tblgen.dir/X86DisassemblerTables.cpp.o -c /Users/buildslave/jenkins/workspace/lldb-cmake/llvm-project/llvm/utils/TableGen/X86DisassemblerTables.cpp [62/3070] /Users/buildslave/jenkins/workspace/lldb-cmake/host-compiler/bin/clang++ -DGTEST_HAS_RTTI=0 -D_DEBUG -D__STDC_CONSTANT_MACROS -D__STDC_FORMAT_MACROS -D__STDC_LIMIT_MACROS -Iutils/TableGen -I/Users/buildslave/jenkins/workspace/lldb-cmake/llvm-project/llvm/utils/TableGen -I/Applications/Xcode.app/Contents/Developer/Platforms/MacOSX.platform/Developer/SDKs/MacOSX10.15.sdk/usr/include/libxml2 -Iinclude -I/Users/buildslave/jenkins/workspace/lldb-cmake/llvm-project/llvm/include -Wdocumentation -fPIC -fvisibility-inlines-hidden -Werror=date-time -Werror=unguarded-availability-new -fmodules -fmodules-cache-path=/Users/buildslave/jenkins/workspace/lldb-cmake/lldb-build/module.cache -fcxx-modules -Xclang -fmodules-local-submodule-visibility -Wall -Wextra -Wno-unused-parameter -Wwrite-strings -Wcast-qual -Wmissing-field-initializers -pedantic -Wno-long-long -Wimplicit-fallthrough -Wcovered-switch-default -Wno-noexcept-type -Wnon-virtual-dtor -Wdelete-non-virtual-dtor -Wsuggest-override -Wstring-conversion -fdiagnostics-color -O3 -isysroot /Applications/Xcode.app/Contents/Developer/Platforms/MacOSX.platform/Developer/SDKs/MacOSX10.15.sdk -fno-exceptions -fno-rtti -UNDEBUG -std=c++14 -MD -MT utils/TableGen/CMakeFiles/llvm-tblgen.dir/X86FoldTablesEmitter.cpp.o -MF utils/TableGen/CMakeFiles/llvm-tblgen.dir/X86FoldTablesEmitter.cpp.o.d -o utils/TableGen/CMakeFiles/llvm-tblgen.dir/X86FoldTablesEmitter.cpp.o -c /Users/buildslave/jenkins/workspace/lldb-cmake/llvm-project/llvm/utils/TableGen/X86FoldTablesEmitter.cpp [63/3070] /Users/buildslave/jenkins/workspace/lldb-cmake/host-compiler/bin/clang++ -DGTEST_HAS_RTTI=0 -D_DEBUG -D__STDC_CONSTANT_MACROS -D__STDC_FORMAT_MACROS -D__STDC_LIMIT_MACROS -Iutils/TableGen/GlobalISel -I/Users/buildslave/jenkins/workspace/lldb-cmake/llvm-project/llvm/utils/TableGen/GlobalISel -I/Applications/Xcode.app/Contents/Developer/Platforms/MacOSX.platform/Developer/SDKs/MacOSX10.15.sdk/usr/include/libxml2 -Iinclude -I/Users/buildslave/jenkins/workspace/lldb-cmake/llvm-project/llvm/include -Wdocumentation -fPIC -fvisibility-inlines-hidden -Werror=date-time -Werror=unguarded-availability-new -fmodules -fmodules-cache-path=/Users/buildslave/jenkins/workspace/lldb-cmake/lldb-build/module.cache -fcxx-modules -Xclang -fmodules-local-submodule-visibility -Wall -Wextra -Wno-unused-parameter -Wwrite-strings -Wcast-qual -Wmissing-field-initializers -pedantic -Wno-long-long -Wimplicit-fallthrough -Wcovered-switch-default -Wno-noexcept-type -Wnon-virtual-dtor -Wdelete-non-virtual-dtor -Wsuggest-override -Wstring-conversion -fdiagnostics-color -O3 -isysroot /Applications/Xcode.app/Contents/Developer/Platforms/MacOSX.platform/Developer/SDKs/MacOSX10.15.sdk -fno-exceptions -fno-rtti -UNDEBUG -std=c++14 -MD -MT utils/TableGen/GlobalISel/CMakeFiles/LLVMTableGenGlobalISel.dir/CodeExpander.cpp.o -MF utils/TableGen/GlobalISel/CMakeFiles/LLVMTableGenGlobalISel.dir/CodeExpander.cpp.o.d -o utils/TableGen/GlobalISel/CMakeFiles/LLVMTableGenGlobalISel.dir/CodeExpander.cpp.o -c /Users/buildslave/jenkins/workspace/lldb-cmake/llvm-project/llvm/utils/TableGen/GlobalISel/CodeExpander.cpp [64/3070] /Users/buildslave/jenkins/workspace/lldb-cmake/host-compiler/bin/clang++ -DGTEST_HAS_RTTI=0 -D_DEBUG -D__STDC_CONSTANT_MACROS -D__STDC_FORMAT_MACROS -D__STDC_LIMIT_MACROS -Iutils/TableGen/GlobalISel -I/Users/buildslave/jenkins/workspace/lldb-cmake/llvm-project/llvm/utils/TableGen/GlobalISel -I/Applications/Xcode.app/Contents/Developer/Platforms/MacOSX.platform/Developer/SDKs/MacOSX10.15.sdk/usr/include/libxml2 -Iinclude -I/Users/buildslave/jenkins/workspace/lldb-cmake/llvm-project/llvm/include -Wdocumentation -fPIC -fvisibility-inlines-hidden -Werror=date-time -Werror=unguarded-availability-new -fmodules -fmodules-cache-path=/Users/buildslave/jenkins/workspace/lldb-cmake/lldb-build/module.cache -fcxx-modules -Xclang -fmodules-local-submodule-visibility -Wall -Wextra -Wno-unused-parameter -Wwrite-strings -Wcast-qual -Wmissing-field-initializers -pedantic -Wno-long-long -Wimplicit-fallthrough -Wcovered-switch-default -Wno-noexcept-type -Wnon-virtual-dtor -Wdelete-non-virtual-dtor -Wsuggest-override -Wstring-conversion -fdiagnostics-color -O3 -isysroot /Applications/Xcode.app/Contents/Developer/Platforms/MacOSX.platform/Developer/SDKs/MacOSX10.15.sdk -fno-exceptions -fno-rtti -UNDEBUG -std=c++14 -MD -MT utils/TableGen/GlobalISel/CMakeFiles/LLVMTableGenGlobalISel.dir/GIMatchDagEdge.cpp.o -MF utils/TableGen/GlobalISel/CMakeFiles/LLVMTableGenGlobalISel.dir/GIMatchDagEdge.cpp.o.d -o utils/TableGen/GlobalISel/CMakeFiles/LLVMTableGenGlobalISel.dir/GIMatchDagEdge.cpp.o -c /Users/buildslave/jenkins/workspace/lldb-cmake/llvm-project/llvm/utils/TableGen/GlobalISel/GIMatchDagEdge.cpp [65/3070] /Users/buildslave/jenkins/workspace/lldb-cmake/host-compiler/bin/clang++ -DGTEST_HAS_RTTI=0 -D_DEBUG -D__STDC_CONSTANT_MACROS -D__STDC_FORMAT_MACROS -D__STDC_LIMIT_MACROS -Iutils/TableGen -I/Users/buildslave/jenkins/workspace/lldb-cmake/llvm-project/llvm/utils/TableGen -I/Applications/Xcode.app/Contents/Developer/Platforms/MacOSX.platform/Developer/SDKs/MacOSX10.15.sdk/usr/include/libxml2 -Iinclude -I/Users/buildslave/jenkins/workspace/lldb-cmake/llvm-project/llvm/include -Wdocumentation -fPIC -fvisibility-inlines-hidden -Werror=date-time -Werror=unguarded-availability-new -fmodules -fmodules-cache-path=/Users/buildslave/jenkins/workspace/lldb-cmake/lldb-build/module.cache -fcxx-modules -Xclang -fmodules-local-submodule-visibility -Wall -Wextra -Wno-unused-parameter -Wwrite-strings -Wcast-qual -Wmissing-field-initializers -pedantic -Wno-long-long -Wimplicit-fallthrough -Wcovered-switch-default -Wno-noexcept-type -Wnon-virtual-dtor -Wdelete-non-virtual-dtor -Wsuggest-override -Wstring-conversion -fdiagnostics-color -O3 -isysroot /Applications/Xcode.app/Contents/Developer/Platforms/MacOSX.platform/Developer/SDKs/MacOSX10.15.sdk -fno-exceptions -fno-rtti -UNDEBUG -std=c++14 -MD -MT utils/TableGen/CMakeFiles/llvm-tblgen.dir/CTagsEmitter.cpp.o -MF utils/TableGen/CMakeFiles/llvm-tblgen.dir/CTagsEmitter.cpp.o.d -o utils/TableGen/CMakeFiles/llvm-tblgen.dir/CTagsEmitter.cpp.o -c /Users/buildslave/jenkins/workspace/lldb-cmake/llvm-project/llvm/utils/TableGen/CTagsEmitter.cpp [66/3070] /Users/buildslave/jenkins/workspace/lldb-cmake/host-compiler/bin/clang++ -DGTEST_HAS_RTTI=0 -D_DEBUG -D__STDC_CONSTANT_MACROS -D__STDC_FORMAT_MACROS -D__STDC_LIMIT_MACROS -Iutils/TableGen -I/Users/buildslave/jenkins/workspace/lldb-cmake/llvm-project/llvm/utils/TableGen -I/Applications/Xcode.app/Contents/Developer/Platforms/MacOSX.platform/Developer/SDKs/MacOSX10.15.sdk/usr/include/libxml2 -Iinclude -I/Users/buildslave/jenkins/workspace/lldb-cmake/llvm-project/llvm/include -Wdocumentation -fPIC -fvisibility-inlines-hidden -Werror=date-time -Werror=unguarded-availability-new -fmodules -fmodules-cache-path=/Users/buildslave/jenkins/workspace/lldb-cmake/lldb-build/module.cache -fcxx-modules -Xclang -fmodules-local-submodule-visibility -Wall -Wextra -Wno-unused-parameter -Wwrite-strings -Wcast-qual -Wmissing-field-initializers -pedantic -Wno-long-long -Wimplicit-fallthrough -Wcovered-switch-default -Wno-noexcept-type -Wnon-virtual-dtor -Wdelete-non-virtual-dtor -Wsuggest-override -Wstring-conversion -fdiagnostics-color -O3 -isysroot /Applications/Xcode.app/Contents/Developer/Platforms/MacOSX.platform/Developer/SDKs/MacOSX10.15.sdk -fno-exceptions -fno-rtti -UNDEBUG -std=c++14 -MD -MT utils/TableGen/CMakeFiles/llvm-tblgen.dir/SearchableTableEmitter.cpp.o -MF utils/TableGen/CMakeFiles/llvm-tblgen.dir/SearchableTableEmitter.cpp.o.d -o utils/TableGen/CMakeFiles/llvm-tblgen.dir/SearchableTableEmitter.cpp.o -c /Users/buildslave/jenkins/workspace/lldb-cmake/llvm-project/llvm/utils/TableGen/SearchableTableEmitter.cpp [67/3070] /Users/buildslave/jenkins/workspace/lldb-cmake/host-compiler/bin/clang++ -DGTEST_HAS_RTTI=0 -D_DEBUG -D__STDC_CONSTANT_MACROS -D__STDC_FORMAT_MACROS -D__STDC_LIMIT_MACROS -Iutils/TableGen -I/Users/buildslave/jenkins/workspace/lldb-cmake/llvm-project/llvm/utils/TableGen -I/Applications/Xcode.app/Contents/Developer/Platforms/MacOSX.platform/Developer/SDKs/MacOSX10.15.sdk/usr/include/libxml2 -Iinclude -I/Users/buildslave/jenkins/workspace/lldb-cmake/llvm-project/llvm/include -Wdocumentation -fPIC -fvisibility-inlines-hidden -Werror=date-time -Werror=unguarded-availability-new -fmodules -fmodules-cache-path=/Users/buildslave/jenkins/workspace/lldb-cmake/lldb-build/module.cache -fcxx-modules -Xclang -fmodules-local-submodule-visibility -Wall -Wextra -Wno-unused-parameter -Wwrite-strings -Wcast-qual -Wmissing-field-initializers -pedantic -Wno-long-long -Wimplicit-fallthrough -Wcovered-switch-default -Wno-noexcept-type -Wnon-virtual-dtor -Wdelete-non-virtual-dtor -Wsuggest-override -Wstring-conversion -fdiagnostics-color -O3 -isysroot /Applications/Xcode.app/Contents/Developer/Platforms/MacOSX.platform/Developer/SDKs/MacOSX10.15.sdk -fno-exceptions -fno-rtti -UNDEBUG -std=c++14 -MD -MT utils/TableGen/CMakeFiles/llvm-tblgen.dir/X86RecognizableInstr.cpp.o -MF utils/TableGen/CMakeFiles/llvm-tblgen.dir/X86RecognizableInstr.cpp.o.d -o utils/TableGen/CMakeFiles/llvm-tblgen.dir/X86RecognizableInstr.cpp.o -c /Users/buildslave/jenkins/workspace/lldb-cmake/llvm-project/llvm/utils/TableGen/X86RecognizableInstr.cpp [68/3070] cd /Users/buildslave/jenkins/workspace/lldb-cmake/lldb-build/include/llvm/Support && /usr/local/Cellar/cmake/3.17.2/bin/cmake -DNAMES=LLVM -DLLVM_SOURCE_DIR=/Users/buildslave/jenkins/workspace/lldb-cmake/llvm-project/llvm -DHEADER_FILE=/Users/buildslave/jenkins/workspace/lldb-cmake/lldb-build/include/llvm/Support/VCSRevision.h -P /Users/buildslave/jenkins/workspace/lldb-cmake/llvm-project/llvm/cmake/modules/GenerateVersionFromVCS.cmake [69/3070] : && "/Applications/Xcode.app/Contents/Developer/Toolchains/XcodeDefault.xctoolchain/usr/bin/libtool" -static -no_warning_for_no_symbols -o lib/libLLVMBinaryFormat.a lib/BinaryFormat/CMakeFiles/LLVMBinaryFormat.dir/AMDGPUMetadataVerifier.cpp.o lib/BinaryFormat/CMakeFiles/LLVMBinaryFormat.dir/Dwarf.cpp.o lib/BinaryFormat/CMakeFiles/LLVMBinaryFormat.dir/MachO.cpp.o lib/BinaryFormat/CMakeFiles/LLVMBinaryFormat.dir/Magic.cpp.o lib/BinaryFormat/CMakeFiles/LLVMBinaryFormat.dir/Minidump.cpp.o lib/BinaryFormat/CMakeFiles/LLVMBinaryFormat.dir/MsgPackDocument.cpp.o lib/BinaryFormat/CMakeFiles/LLVMBinaryFormat.dir/MsgPackDocumentYAML.cpp.o lib/BinaryFormat/CMakeFiles/LLVMBinaryFormat.dir/MsgPackReader.cpp.o lib/BinaryFormat/CMakeFiles/LLVMBinaryFormat.dir/MsgPackWriter.cpp.o lib/BinaryFormat/CMakeFiles/LLVMBinaryFormat.dir/Wasm.cpp.o lib/BinaryFormat/CMakeFiles/LLVMBinaryFormat.dir/XCOFF.cpp.o && : [70/3070] : && "/Applications/Xcode.app/Contents/Developer/Toolchains/XcodeDefault.xctoolchain/usr/bin/libtool" -static -no_warning_for_no_symbols -o lib/libLLVMBitstreamReader.a lib/Bitstream/Reader/CMakeFiles/LLVMBitstreamReader.dir/BitstreamReader.cpp.o && : [71/3070] /Users/buildslave/jenkins/workspace/lldb-cmake/host-compiler/bin/clang++ -DGTEST_HAS_RTTI=0 -D_DEBUG -D__STDC_CONSTANT_MACROS -D__STDC_FORMAT_MACROS -D__STDC_LIMIT_MACROS -Iutils/TableGen/GlobalISel -I/Users/buildslave/jenkins/workspace/lldb-cmake/llvm-project/llvm/utils/TableGen/GlobalISel -I/Applications/Xcode.app/Contents/Developer/Platforms/MacOSX.platform/Developer/SDKs/MacOSX10.15.sdk/usr/include/libxml2 -Iinclude -I/Users/buildslave/jenkins/workspace/lldb-cmake/llvm-project/llvm/include -Wdocumentation -fPIC -fvisibility-inlines-hidden -Werror=date-time -Werror=unguarded-availability-new -fmodules -fmodules-cache-path=/Users/buildslave/jenkins/workspace/lldb-cmake/lldb-build/module.cache -fcxx-modules -Xclang -fmodules-local-submodule-visibility -Wall -Wextra -Wno-unused-parameter -Wwrite-strings -Wcast-qual -Wmissing-field-initializers -pedantic -Wno-long-long -Wimplicit-fallthrough -Wcovered-switch-default -Wno-noexcept-type -Wnon-virtual-dtor -Wdelete-non-virtual-dtor -Wsuggest-override -Wstring-conversion -fdiagnostics-color -O3 -isysroot /Applications/Xcode.app/Contents/Developer/Platforms/MacOSX.platform/Developer/SDKs/MacOSX10.15.sdk -fno-exceptions -fno-rtti -UNDEBUG -std=c++14 -MD -MT utils/TableGen/GlobalISel/CMakeFiles/LLVMTableGenGlobalISel.dir/GIMatchDagPredicateDependencyEdge.cpp.o -MF utils/TableGen/GlobalISel/CMakeFiles/LLVMTableGenGlobalISel.dir/GIMatchDagPredicateDependencyEdge.cpp.o.d -o utils/TableGen/GlobalISel/CMakeFiles/LLVMTableGenGlobalISel.dir/GIMatchDagPredicateDependencyEdge.cpp.o -c /Users/buildslave/jenkins/workspace/lldb-cmake/llvm-project/llvm/utils/TableGen/GlobalISel/GIMatchDagPredicateDependencyEdge.cpp [72/3070] : && "/Applications/Xcode.app/Contents/Developer/Toolchains/XcodeDefault.xctoolchain/usr/bin/libtool" -static -no_warning_for_no_symbols -o lib/libLLVMOption.a lib/Option/CMakeFiles/LLVMOption.dir/Arg.cpp.o lib/Option/CMakeFiles/LLVMOption.dir/ArgList.cpp.o lib/Option/CMakeFiles/LLVMOption.dir/Option.cpp.o lib/Option/CMakeFiles/LLVMOption.dir/OptTable.cpp.o && : [73/3070] : && "/Applications/Xcode.app/Contents/Developer/Toolchains/XcodeDefault.xctoolchain/usr/bin/libtool" -static -no_warning_for_no_symbols -o lib/libLLVMDebugInfoMSF.a lib/DebugInfo/MSF/CMakeFiles/LLVMDebugInfoMSF.dir/MappedBlockStream.cpp.o lib/DebugInfo/MSF/CMakeFiles/LLVMDebugInfoMSF.dir/MSFBuilder.cpp.o lib/DebugInfo/MSF/CMakeFiles/LLVMDebugInfoMSF.dir/MSFCommon.cpp.o lib/DebugInfo/MSF/CMakeFiles/LLVMDebugInfoMSF.dir/MSFError.cpp.o && : [74/3070] : && "/Applications/Xcode.app/Contents/Developer/Toolchains/XcodeDefault.xctoolchain/usr/bin/libtool" -static -no_warning_for_no_symbols -o lib/libLLVMRemarks.a lib/Remarks/CMakeFiles/LLVMRemarks.dir/BitstreamRemarkParser.cpp.o lib/Remarks/CMakeFiles/LLVMRemarks.dir/BitstreamRemarkSerializer.cpp.o lib/Remarks/CMakeFiles/LLVMRemarks.dir/Remark.cpp.o lib/Remarks/CMakeFiles/LLVMRemarks.dir/RemarkFormat.cpp.o lib/Remarks/CMakeFiles/LLVMRemarks.dir/RemarkLinker.cpp.o lib/Remarks/CMakeFiles/LLVMRemarks.dir/RemarkParser.cpp.o lib/Remarks/CMakeFiles/LLVMRemarks.dir/RemarkSerializer.cpp.o lib/Remarks/CMakeFiles/LLVMRemarks.dir/RemarkStreamer.cpp.o lib/Remarks/CMakeFiles/LLVMRemarks.dir/RemarkStringTable.cpp.o lib/Remarks/CMakeFiles/LLVMRemarks.dir/YAMLRemarkParser.cpp.o lib/Remarks/CMakeFiles/LLVMRemarks.dir/YAMLRemarkSerializer.cpp.o && : [75/3070] /Users/buildslave/jenkins/workspace/lldb-cmake/host-compiler/bin/clang++ -DGTEST_HAS_RTTI=0 -D_DEBUG -D__STDC_CONSTANT_MACROS -D__STDC_FORMAT_MACROS -D__STDC_LIMIT_MACROS -Iutils/TableGen/GlobalISel -I/Users/buildslave/jenkins/workspace/lldb-cmake/llvm-project/llvm/utils/TableGen/GlobalISel -I/Applications/Xcode.app/Contents/Developer/Platforms/MacOSX.platform/Developer/SDKs/MacOSX10.15.sdk/usr/include/libxml2 -Iinclude -I/Users/buildslave/jenkins/workspace/lldb-cmake/llvm-project/llvm/include -Wdocumentation -fPIC -fvisibility-inlines-hidden -Werror=date-time -Werror=unguarded-availability-new -fmodules -fmodules-cache-path=/Users/buildslave/jenkins/workspace/lldb-cmake/lldb-build/module.cache -fcxx-modules -Xclang -fmodules-local-submodule-visibility -Wall -Wextra -Wno-unused-parameter -Wwrite-strings -Wcast-qual -Wmissing-field-initializers -pedantic -Wno-long-long -Wimplicit-fallthrough -Wcovered-switch-default -Wno-noexcept-type -Wnon-virtual-dtor -Wdelete-non-virtual-dtor -Wsuggest-override -Wstring-conversion -fdiagnostics-color -O3 -isysroot /Applications/Xcode.app/Contents/Developer/Platforms/MacOSX.platform/Developer/SDKs/MacOSX10.15.sdk -fno-exceptions -fno-rtti -UNDEBUG -std=c++14 -MD -MT utils/TableGen/GlobalISel/CMakeFiles/LLVMTableGenGlobalISel.dir/GIMatchDagPredicate.cpp.o -MF utils/TableGen/GlobalISel/CMakeFiles/LLVMTableGenGlobalISel.dir/GIMatchDagPredicate.cpp.o.d -o utils/TableGen/GlobalISel/CMakeFiles/LLVMTableGenGlobalISel.dir/GIMatchDagPredicate.cpp.o -c /Users/buildslave/jenkins/workspace/lldb-cmake/llvm-project/llvm/utils/TableGen/GlobalISel/GIMatchDagPredicate.cpp [76/3070] /Users/buildslave/jenkins/workspace/lldb-cmake/host-compiler/bin/clang++ -DGTEST_HAS_RTTI=0 -D_DEBUG -D__STDC_CONSTANT_MACROS -D__STDC_FORMAT_MACROS -D__STDC_LIMIT_MACROS -Iutils/TableGen/GlobalISel -I/Users/buildslave/jenkins/workspace/lldb-cmake/llvm-project/llvm/utils/TableGen/GlobalISel -I/Applications/Xcode.app/Contents/Developer/Platforms/MacOSX.platform/Developer/SDKs/MacOSX10.15.sdk/usr/include/libxml2 -Iinclude -I/Users/buildslave/jenkins/workspace/lldb-cmake/llvm-project/llvm/include -Wdocumentation -fPIC -fvisibility-inlines-hidden -Werror=date-time -Werror=unguarded-availability-new -fmodules -fmodules-cache-path=/Users/buildslave/jenkins/workspace/lldb-cmake/lldb-build/module.cache -fcxx-modules -Xclang -fmodules-local-submodule-visibility -Wall -Wextra -Wno-unused-parameter -Wwrite-strings -Wcast-qual -Wmissing-field-initializers -pedantic -Wno-long-long -Wimplicit-fallthrough -Wcovered-switch-default -Wno-noexcept-type -Wnon-virtual-dtor -Wdelete-non-virtual-dtor -Wsuggest-override -Wstring-conversion -fdiagnostics-color -O3 -isysroot /Applications/Xcode.app/Contents/Developer/Platforms/MacOSX.platform/Developer/SDKs/MacOSX10.15.sdk -fno-exceptions -fno-rtti -UNDEBUG -std=c++14 -MD -MT utils/TableGen/GlobalISel/CMakeFiles/LLVMTableGenGlobalISel.dir/GIMatchDagOperands.cpp.o -MF utils/TableGen/GlobalISel/CMakeFiles/LLVMTableGenGlobalISel.dir/GIMatchDagOperands.cpp.o.d -o utils/TableGen/GlobalISel/CMakeFiles/LLVMTableGenGlobalISel.dir/GIMatchDagOperands.cpp.o -c /Users/buildslave/jenkins/workspace/lldb-cmake/llvm-project/llvm/utils/TableGen/GlobalISel/GIMatchDagOperands.cpp [77/3070] : && "/Applications/Xcode.app/Contents/Developer/Toolchains/XcodeDefault.xctoolchain/usr/bin/libtool" -static -no_warning_for_no_symbols -o lib/libLLVMOrcError.a lib/ExecutionEngine/OrcError/CMakeFiles/LLVMOrcError.dir/OrcError.cpp.o lib/ExecutionEngine/OrcError/CMakeFiles/LLVMOrcError.dir/RPCError.cpp.o && : [78/3070] : && "/Applications/Xcode.app/Contents/Developer/Toolchains/XcodeDefault.xctoolchain/usr/bin/libtool" -static -no_warning_for_no_symbols -o lib/libLLVMWindowsManifest.a lib/WindowsManifest/CMakeFiles/LLVMWindowsManifest.dir/WindowsManifestMerger.cpp.o && : [79/3070] : && "/Applications/Xcode.app/Contents/Developer/Toolchains/XcodeDefault.xctoolchain/usr/bin/libtool" -static -no_warning_for_no_symbols -o lib/libLLVMLineEditor.a lib/LineEditor/CMakeFiles/LLVMLineEditor.dir/LineEditor.cpp.o && : [80/3070] /Users/buildslave/jenkins/workspace/lldb-cmake/host-compiler/bin/clang++ -DGTEST_HAS_RTTI=0 -D_DEBUG -D__STDC_CONSTANT_MACROS -D__STDC_FORMAT_MACROS -D__STDC_LIMIT_MACROS -Iutils/TableGen/GlobalISel -I/Users/buildslave/jenkins/workspace/lldb-cmake/llvm-project/llvm/utils/TableGen/GlobalISel -I/Applications/Xcode.app/Contents/Developer/Platforms/MacOSX.platform/Developer/SDKs/MacOSX10.15.sdk/usr/include/libxml2 -Iinclude -I/Users/buildslave/jenkins/workspace/lldb-cmake/llvm-project/llvm/include -Wdocumentation -fPIC -fvisibility-inlines-hidden -Werror=date-time -Werror=unguarded-availability-new -fmodules -fmodules-cache-path=/Users/buildslave/jenkins/workspace/lldb-cmake/lldb-build/module.cache -fcxx-modules -Xclang -fmodules-local-submodule-visibility -Wall -Wextra -Wno-unused-parameter -Wwrite-strings -Wcast-qual -Wmissing-field-initializers -pedantic -Wno-long-long -Wimplicit-fallthrough -Wcovered-switch-default -Wno-noexcept-type -Wnon-virtual-dtor -Wdelete-non-virtual-dtor -Wsuggest-override -Wstring-conversion -fdiagnostics-color -O3 -isysroot /Applications/Xcode.app/Contents/Developer/Platforms/MacOSX.platform/Developer/SDKs/MacOSX10.15.sdk -fno-exceptions -fno-rtti -UNDEBUG -std=c++14 -MD -MT utils/TableGen/GlobalISel/CMakeFiles/LLVMTableGenGlobalISel.dir/GIMatchDagInstr.cpp.o -MF utils/TableGen/GlobalISel/CMakeFiles/LLVMTableGenGlobalISel.dir/GIMatchDagInstr.cpp.o.d -o utils/TableGen/GlobalISel/CMakeFiles/LLVMTableGenGlobalISel.dir/GIMatchDagInstr.cpp.o -c /Users/buildslave/jenkins/workspace/lldb-cmake/llvm-project/llvm/utils/TableGen/GlobalISel/GIMatchDagInstr.cpp [81/3070] /Users/buildslave/jenkins/workspace/lldb-cmake/host-compiler/bin/clang++ -DGTEST_HAS_RTTI=0 -D_DEBUG -D__STDC_CONSTANT_MACROS -D__STDC_FORMAT_MACROS -D__STDC_LIMIT_MACROS -Iutils/TableGen/GlobalISel -I/Users/buildslave/jenkins/workspace/lldb-cmake/llvm-project/llvm/utils/TableGen/GlobalISel -I/Applications/Xcode.app/Contents/Developer/Platforms/MacOSX.platform/Developer/SDKs/MacOSX10.15.sdk/usr/include/libxml2 -Iinclude -I/Users/buildslave/jenkins/workspace/lldb-cmake/llvm-project/llvm/include -Wdocumentation -fPIC -fvisibility-inlines-hidden -Werror=date-time -Werror=unguarded-availability-new -fmodules -fmodules-cache-path=/Users/buildslave/jenkins/workspace/lldb-cmake/lldb-build/module.cache -fcxx-modules -Xclang -fmodules-local-submodule-visibility -Wall -Wextra -Wno-unused-parameter -Wwrite-strings -Wcast-qual -Wmissing-field-initializers -pedantic -Wno-long-long -Wimplicit-fallthrough -Wcovered-switch-default -Wno-noexcept-type -Wnon-virtual-dtor -Wdelete-non-virtual-dtor -Wsuggest-override -Wstring-conversion -fdiagnostics-color -O3 -isysroot /Applications/Xcode.app/Contents/Developer/Platforms/MacOSX.platform/Developer/SDKs/MacOSX10.15.sdk -fno-exceptions -fno-rtti -UNDEBUG -std=c++14 -MD -MT utils/TableGen/GlobalISel/CMakeFiles/LLVMTableGenGlobalISel.dir/GIMatchDag.cpp.o -MF utils/TableGen/GlobalISel/CMakeFiles/LLVMTableGenGlobalISel.dir/GIMatchDag.cpp.o.d -o utils/TableGen/GlobalISel/CMakeFiles/LLVMTableGenGlobalISel.dir/GIMatchDag.cpp.o -c /Users/buildslave/jenkins/workspace/lldb-cmake/llvm-project/llvm/utils/TableGen/GlobalISel/GIMatchDag.cpp [82/3070] : && /Users/buildslave/jenkins/workspace/lldb-cmake/host-compiler/bin/clang++ -Wdocumentation -fPIC -fvisibility-inlines-hidden -Werror=date-time -Werror=unguarded-availability-new -fmodules -fmodules-cache-path=/Users/buildslave/jenkins/workspace/lldb-cmake/lldb-build/module.cache -fcxx-modules -Xclang -fmodules-local-submodule-visibility -Wall -Wextra -Wno-unused-parameter -Wwrite-strings -Wcast-qual -Wmissing-field-initializers -pedantic -Wno-long-long -Wimplicit-fallthrough -Wcovered-switch-default -Wno-noexcept-type -Wnon-virtual-dtor -Wdelete-non-virtual-dtor -Wsuggest-override -Wstring-conversion -fdiagnostics-color -Wall -std=c++14 -Wno-unused-parameter -O3 -arch x86_64 -isysroot /Applications/Xcode.app/Contents/Developer/Platforms/MacOSX.platform/Developer/SDKs/MacOSX10.15.sdk -dynamiclib -Wl,-headerpad_max_install_names -stdlib=libc++ -lc++ -lc++abi -fapplication-extension -mios-simulator-version-min=9.0 -isysroot /Applications/Xcode.app/Contents/Developer/Platforms/iPhoneSimulator.platform/Developer/SDKs/iPhoneSimulator13.5.sdk -nodefaultlibs -o lib/clang/12.0.99/lib/darwin/libclang_rt.fuzzer_no_main_iossim_dynamic.dylib -install_name @rpath/libclang_rt.fuzzer_no_main_iossim_dynamic.dylib projects/compiler-rt/lib/fuzzer/CMakeFiles/RTfuzzer.iossim.dir/FuzzerCrossOver.cpp.o projects/compiler-rt/lib/fuzzer/CMakeFiles/RTfuzzer.iossim.dir/FuzzerDataFlowTrace.cpp.o projects/compiler-rt/lib/fuzzer/CMakeFiles/RTfuzzer.iossim.dir/FuzzerDriver.cpp.o projects/compiler-rt/lib/fuzzer/CMakeFiles/RTfuzzer.iossim.dir/FuzzerExtFunctionsDlsym.cpp.o projects/compiler-rt/lib/fuzzer/CMakeFiles/RTfuzzer.iossim.dir/FuzzerExtFunctionsWeak.cpp.o projects/compiler-rt/lib/fuzzer/CMakeFiles/RTfuzzer.iossim.dir/FuzzerExtFunctionsWindows.cpp.o projects/compiler-rt/lib/fuzzer/CMakeFiles/RTfuzzer.iossim.dir/FuzzerExtraCounters.cpp.o projects/compiler-rt/lib/fuzzer/CMakeFiles/RTfuzzer.iossim.dir/FuzzerFork.cpp.o projects/compiler-rt/lib/fuzzer/CMakeFiles/RTfuzzer.iossim.dir/FuzzerIO.cpp.o projects/compiler-rt/lib/fuzzer/CMakeFiles/RTfuzzer.iossim.dir/FuzzerIOPosix.cpp.o projects/compiler-rt/lib/fuzzer/CMakeFiles/RTfuzzer.iossim.dir/FuzzerIOWindows.cpp.o projects/compiler-rt/lib/fuzzer/CMakeFiles/RTfuzzer.iossim.dir/FuzzerLoop.cpp.o projects/compiler-rt/lib/fuzzer/CMakeFiles/RTfuzzer.iossim.dir/FuzzerMerge.cpp.o projects/compiler-rt/lib/fuzzer/CMakeFiles/RTfuzzer.iossim.dir/FuzzerMutate.cpp.o projects/compiler-rt/lib/fuzzer/CMakeFiles/RTfuzzer.iossim.dir/FuzzerSHA1.cpp.o projects/compiler-rt/lib/fuzzer/CMakeFiles/RTfuzzer.iossim.dir/FuzzerTracePC.cpp.o projects/compiler-rt/lib/fuzzer/CMakeFiles/RTfuzzer.iossim.dir/FuzzerUtil.cpp.o projects/compiler-rt/lib/fuzzer/CMakeFiles/RTfuzzer.iossim.dir/FuzzerUtilDarwin.cpp.o projects/compiler-rt/lib/fuzzer/CMakeFiles/RTfuzzer.iossim.dir/FuzzerUtilFuchsia.cpp.o projects/compiler-rt/lib/fuzzer/CMakeFiles/RTfuzzer.iossim.dir/FuzzerUtilLinux.cpp.o projects/compiler-rt/lib/fuzzer/CMakeFiles/RTfuzzer.iossim.dir/FuzzerUtilPosix.cpp.o projects/compiler-rt/lib/fuzzer/CMakeFiles/RTfuzzer.iossim.dir/FuzzerUtilWindows.cpp.o -Wl,-rpath,@loader_path/../lib -lc -lstdc++ -lm -lpthread && cd /Users/buildslave/jenkins/workspace/lldb-cmake/lldb-build/lib/clang/12.0.99/lib/darwin && codesign --sign - /Users/buildslave/jenkins/workspace/lldb-cmake/lldb-build/lib/clang/12.0.99/lib/darwin/libclang_rt.fuzzer_no_main_iossim_dynamic.dylib FAILED: lib/clang/12.0.99/lib/darwin/libclang_rt.fuzzer_no_main_iossim_dynamic.dylib : && /Users/buildslave/jenkins/workspace/lldb-cmake/host-compiler/bin/clang++ -Wdocumentation -fPIC -fvisibility-inlines-hidden -Werror=date-time -Werror=unguarded-availability-new -fmodules -fmodules-cache-path=/Users/buildslave/jenkins/workspace/lldb-cmake/lldb-build/module.cache -fcxx-modules -Xclang -fmodules-local-submodule-visibility -Wall -Wextra -Wno-unused-parameter -Wwrite-strings -Wcast-qual -Wmissing-field-initializers -pedantic -Wno-long-long -Wimplicit-fallthrough -Wcovered-switch-default -Wno-noexcept-type -Wnon-virtual-dtor -Wdelete-non-virtual-dtor -Wsuggest-override -Wstring-conversion -fdiagnostics-color -Wall -std=c++14 -Wno-unused-parameter -O3 -arch x86_64 -isysroot /Applications/Xcode.app/Contents/Developer/Platforms/MacOSX.platform/Developer/SDKs/MacOSX10.15.sdk -dynamiclib -Wl,-headerpad_max_install_names -stdlib=libc++ -lc++ -lc++abi -fapplication-extension -mios-simulator-version-min=9.0 -isysroot /Applications/Xcode.app/Contents/Developer/Platforms/iPhoneSimulator.platform/Developer/SDKs/iPhoneSimulator13.5.sdk -nodefaultlibs -o lib/clang/12.0.99/lib/darwin/libclang_rt.fuzzer_no_main_iossim_dynamic.dylib -install_name @rpath/libclang_rt.fuzzer_no_main_iossim_dynamic.dylib projects/compiler-rt/lib/fuzzer/CMakeFiles/RTfuzzer.iossim.dir/FuzzerCrossOver.cpp.o projects/compiler-rt/lib/fuzzer/CMakeFiles/RTfuzzer.iossim.dir/FuzzerDataFlowTrace.cpp.o projects/compiler-rt/lib/fuzzer/CMakeFiles/RTfuzzer.iossim.dir/FuzzerDriver.cpp.o projects/compiler-rt/lib/fuzzer/CMakeFiles/RTfuzzer.iossim.dir/FuzzerExtFunctionsDlsym.cpp.o projects/compiler-rt/lib/fuzzer/CMakeFiles/RTfuzzer.iossim.dir/FuzzerExtFunctionsWeak.cpp.o projects/compiler-rt/lib/fuzzer/CMakeFiles/RTfuzzer.iossim.dir/FuzzerExtFunctionsWindows.cpp.o projects/compiler-rt/lib/fuzzer/CMakeFiles/RTfuzzer.iossim.dir/FuzzerExtraCounters.cpp.o projects/compiler-rt/lib/fuzzer/CMakeFiles/RTfuzzer.iossim.dir/FuzzerFork.cpp.o projects/compiler-rt/lib/fuzzer/CMakeFiles/RTfuzzer.iossim.dir/FuzzerIO.cpp.o projects/compiler-rt/lib/fuzzer/CMakeFiles/RTfuzzer.iossim.dir/FuzzerIOPosix.cpp.o projects/compiler-rt/lib/fuzzer/CMakeFiles/RTfuzzer.iossim.dir/FuzzerIOWindows.cpp.o projects/compiler-rt/lib/fuzzer/CMakeFiles/RTfuzzer.iossim.dir/FuzzerLoop.cpp.o projects/compiler-rt/lib/fuzzer/CMakeFiles/RTfuzzer.iossim.dir/FuzzerMerge.cpp.o projects/compiler-rt/lib/fuzzer/CMakeFiles/RTfuzzer.iossim.dir/FuzzerMutate.cpp.o projects/compiler-rt/lib/fuzzer/CMakeFiles/RTfuzzer.iossim.dir/FuzzerSHA1.cpp.o projects/compiler-rt/lib/fuzzer/CMakeFiles/RTfuzzer.iossim.dir/FuzzerTracePC.cpp.o projects/compiler-rt/lib/fuzzer/CMakeFiles/RTfuzzer.iossim.dir/FuzzerUtil.cpp.o projects/compiler-rt/lib/fuzzer/CMakeFiles/RTfuzzer.iossim.dir/FuzzerUtilDarwin.cpp.o projects/compiler-rt/lib/fuzzer/CMakeFiles/RTfuzzer.iossim.dir/FuzzerUtilFuchsia.cpp.o projects/compiler-rt/lib/fuzzer/CMakeFiles/RTfuzzer.iossim.dir/FuzzerUtilLinux.cpp.o projects/compiler-rt/lib/fuzzer/CMakeFiles/RTfuzzer.iossim.dir/FuzzerUtilPosix.cpp.o projects/compiler-rt/lib/fuzzer/CMakeFiles/RTfuzzer.iossim.dir/FuzzerUtilWindows.cpp.o -Wl,-rpath,@loader_path/../lib -lc -lstdc++ -lm -lpthread && cd /Users/buildslave/jenkins/workspace/lldb-cmake/lldb-build/lib/clang/12.0.99/lib/darwin && codesign --sign - /Users/buildslave/jenkins/workspace/lldb-cmake/lldb-build/lib/clang/12.0.99/lib/darwin/libclang_rt.fuzzer_no_main_iossim_dynamic.dylib ld: library not found for -lstdc++ clang-12: error: linker command failed with exit code 1 (use -v to see invocation) [83/3070] : && "/Applications/Xcode.app/Contents/Developer/Toolchains/XcodeDefault.xctoolchain/usr/bin/libtool" -static -no_warning_for_no_symbols -o lib/libLLVMTextAPI.a lib/TextAPI/CMakeFiles/LLVMTextAPI.dir/ELF/ELFStub.cpp.o lib/TextAPI/CMakeFiles/LLVMTextAPI.dir/ELF/TBEHandler.cpp.o lib/TextAPI/CMakeFiles/LLVMTextAPI.dir/MachO/Architecture.cpp.o lib/TextAPI/CMakeFiles/LLVMTextAPI.dir/MachO/ArchitectureSet.cpp.o lib/TextAPI/CMakeFiles/LLVMTextAPI.dir/MachO/InterfaceFile.cpp.o lib/TextAPI/CMakeFiles/LLVMTextAPI.dir/MachO/PackedVersion.cpp.o lib/TextAPI/CMakeFiles/LLVMTextAPI.dir/MachO/Platform.cpp.o lib/TextAPI/CMakeFiles/LLVMTextAPI.dir/MachO/Symbol.cpp.o lib/TextAPI/CMakeFiles/LLVMTextAPI.dir/MachO/Target.cpp.o lib/TextAPI/CMakeFiles/LLVMTextAPI.dir/MachO/TextStub.cpp.o lib/TextAPI/CMakeFiles/LLVMTextAPI.dir/MachO/TextStubCommon.cpp.o && : [84/3070] : && /Users/buildslave/jenkins/workspace/lldb-cmake/host-compiler/bin/clang++ -Wdocumentation -fPIC -fvisibility-inlines-hidden -Werror=date-time -Werror=unguarded-availability-new -fmodules -fmodules-cache-path=/Users/buildslave/jenkins/workspace/lldb-cmake/lldb-build/module.cache -fcxx-modules -Xclang -fmodules-local-submodule-visibility -Wall -Wextra -Wno-unused-parameter -Wwrite-strings -Wcast-qual -Wmissing-field-initializers -pedantic -Wno-long-long -Wimplicit-fallthrough -Wcovered-switch-default -Wno-noexcept-type -Wnon-virtual-dtor -Wdelete-non-virtual-dtor -Wsuggest-override -Wstring-conversion -fdiagnostics-color -O3 -isysroot /Applications/Xcode.app/Contents/Developer/Platforms/MacOSX.platform/Developer/SDKs/MacOSX10.15.sdk -Wl,-search_paths_first -Wl,-headerpad_max_install_names -Wl,-dead_strip utils/not/CMakeFiles/not.dir/not.cpp.o -o bin/not -Wl,-rpath,@loader_path/../lib lib/libLLVMSupport.a -lz -lcurses -lm lib/libLLVMDemangle.a && : [85/3070] : && /Users/buildslave/jenkins/workspace/lldb-cmake/host-compiler/bin/clang++ -Wdocumentation -fPIC -fvisibility-inlines-hidden -Werror=date-time -Werror=unguarded-availability-new -fmodules -fmodules-cache-path=/Users/buildslave/jenkins/workspace/lldb-cmake/lldb-build/module.cache -fcxx-modules -Xclang -fmodules-local-submodule-visibility -Wall -Wextra -Wno-unused-parameter -Wwrite-strings -Wcast-qual -Wmissing-field-initializers -pedantic -Wno-long-long -Wimplicit-fallthrough -Wcovered-switch-default -Wno-noexcept-type -Wnon-virtual-dtor -Wdelete-non-virtual-dtor -Wsuggest-override -Wstring-conversion -fdiagnostics-color -O3 -isysroot /Applications/Xcode.app/Contents/Developer/Platforms/MacOSX.platform/Developer/SDKs/MacOSX10.15.sdk -Wl,-search_paths_first -Wl,-headerpad_max_install_names -Wl,-dead_strip utils/yaml-bench/CMakeFiles/yaml-bench.dir/YAMLBench.cpp.o -o bin/yaml-bench -Wl,-rpath,@loader_path/../lib lib/libLLVMSupport.a -lz -lcurses -lm lib/libLLVMDemangle.a && : [86/3070] : && /Users/buildslave/jenkins/workspace/lldb-cmake/host-compiler/bin/clang++ -Wdocumentation -fPIC -fvisibility-inlines-hidden -Werror=date-time -Werror=unguarded-availability-new -fmodules -fmodules-cache-path=/Users/buildslave/jenkins/workspace/lldb-cmake/lldb-build/module.cache -fcxx-modules -Xclang -fmodules-local-submodule-visibility -Wall -Wextra -Wno-unused-parameter -Wwrite-strings -Wcast-qual -Wmissing-field-initializers -pedantic -Wno-long-long -Wimplicit-fallthrough -Wcovered-switch-default -Wno-noexcept-type -Wnon-virtual-dtor -Wdelete-non-virtual-dtor -Wsuggest-override -Wstring-conversion -fdiagnostics-color -O3 -isysroot /Applications/Xcode.app/Contents/Developer/Platforms/MacOSX.platform/Developer/SDKs/MacOSX10.15.sdk -Wl,-search_paths_first -Wl,-headerpad_max_install_names -Wl,-dead_strip utils/FileCheck/CMakeFiles/FileCheck.dir/FileCheck.cpp.o -o bin/FileCheck -Wl,-rpath,@loader_path/../lib lib/libLLVMSupport.a -lz -lcurses -lm lib/libLLVMDemangle.a && : [87/3070] : && "/Applications/Xcode.app/Contents/Developer/Toolchains/XcodeDefault.xctoolchain/usr/bin/libtool" -static -no_warning_for_no_symbols -o lib/libLLVMDebugInfoCodeView.a lib/DebugInfo/CodeView/CMakeFiles/LLVMDebugInfoCodeView.dir/AppendingTypeTableBuilder.cpp.o lib/DebugInfo/CodeView/CMakeFiles/LLVMDebugInfoCodeView.dir/CodeViewError.cpp.o lib/DebugInfo/CodeView/CMakeFiles/LLVMDebugInfoCodeView.dir/CodeViewRecordIO.cpp.o lib/DebugInfo/CodeView/CMakeFiles/LLVMDebugInfoCodeView.dir/ContinuationRecordBuilder.cpp.o lib/DebugInfo/CodeView/CMakeFiles/LLVMDebugInfoCodeView.dir/CVSymbolVisitor.cpp.o lib/DebugInfo/CodeView/CMakeFiles/LLVMDebugInfoCodeView.dir/CVTypeVisitor.cpp.o lib/DebugInfo/CodeView/CMakeFiles/LLVMDebugInfoCodeView.dir/DebugChecksumsSubsection.cpp.o lib/DebugInfo/CodeView/CMakeFiles/LLVMDebugInfoCodeView.dir/DebugCrossExSubsection.cpp.o lib/DebugInfo/CodeView/CMakeFiles/LLVMDebugInfoCodeView.dir/DebugCrossImpSubsection.cpp.o lib/DebugInfo/CodeView/CMakeFiles/LLVMDebugInfoCodeView.dir/DebugFrameDataSubsection.cpp.o lib/DebugInfo/CodeView/CMakeFiles/LLVMDebugInfoCodeView.dir/DebugInlineeLinesSubsection.cpp.o lib/DebugInfo/CodeView/CMakeFiles/LLVMDebugInfoCodeView.dir/DebugLinesSubsection.cpp.o lib/DebugInfo/CodeView/CMakeFiles/LLVMDebugInfoCodeView.dir/DebugStringTableSubsection.cpp.o lib/DebugInfo/CodeView/CMakeFiles/LLVMDebugInfoCodeView.dir/DebugSubsection.cpp.o lib/DebugInfo/CodeView/CMakeFiles/LLVMDebugInfoCodeView.dir/DebugSubsectionRecord.cpp.o lib/DebugInfo/CodeView/CMakeFiles/LLVMDebugInfoCodeView.dir/DebugSubsectionVisitor.cpp.o lib/DebugInfo/CodeView/CMakeFiles/LLVMDebugInfoCodeView.dir/DebugSymbolRVASubsection.cpp.o lib/DebugInfo/CodeView/CMakeFiles/LLVMDebugInfoCodeView.dir/DebugSymbolsSubsection.cpp.o lib/DebugInfo/CodeView/CMakeFiles/LLVMDebugInfoCodeView.dir/EnumTables.cpp.o lib/DebugInfo/CodeView/CMakeFiles/LLVMDebugInfoCodeView.dir/Formatters.cpp.o lib/DebugInfo/CodeView/CMakeFiles/LLVMDebugInfoCodeView.dir/GlobalTypeTableBuilder.cpp.o lib/DebugInfo/CodeView/CMakeFiles/LLVMDebugInfoCodeView.dir/LazyRandomTypeCollection.cpp.o lib/DebugInfo/CodeView/CMakeFiles/LLVMDebugInfoCodeView.dir/Line.cpp.o lib/DebugInfo/CodeView/CMakeFiles/LLVMDebugInfoCodeView.dir/MergingTypeTableBuilder.cpp.o lib/DebugInfo/CodeView/CMakeFiles/LLVMDebugInfoCodeView.dir/RecordName.cpp.o lib/DebugInfo/CodeView/CMakeFiles/LLVMDebugInfoCodeView.dir/RecordSerialization.cpp.o lib/DebugInfo/CodeView/CMakeFiles/LLVMDebugInfoCodeView.dir/SimpleTypeSerializer.cpp.o lib/DebugInfo/CodeView/CMakeFiles/LLVMDebugInfoCodeView.dir/StringsAndChecksums.cpp.o lib/DebugInfo/CodeView/CMakeFiles/LLVMDebugInfoCodeView.dir/SymbolDumper.cpp.o lib/DebugInfo/CodeView/CMakeFiles/LLVMDebugInfoCodeView.dir/SymbolRecordHelpers.cpp.o lib/DebugInfo/CodeView/CMakeFiles/LLVMDebugInfoCodeView.dir/SymbolRecordMapping.cpp.o lib/DebugInfo/CodeView/CMakeFiles/LLVMDebugInfoCodeView.dir/SymbolSerializer.cpp.o lib/DebugInfo/CodeView/CMakeFiles/LLVMDebugInfoCodeView.dir/TypeDumpVisitor.cpp.o lib/DebugInfo/CodeView/CMakeFiles/LLVMDebugInfoCodeView.dir/TypeIndex.cpp.o lib/DebugInfo/CodeView/CMakeFiles/LLVMDebugInfoCodeView.dir/TypeIndexDiscovery.cpp.o lib/DebugInfo/CodeView/CMakeFiles/LLVMDebugInfoCodeView.dir/TypeHashing.cpp.o lib/DebugInfo/CodeView/CMakeFiles/LLVMDebugInfoCodeView.dir/TypeRecordHelpers.cpp.o lib/DebugInfo/CodeView/CMakeFiles/LLVMDebugInfoCodeView.dir/TypeRecordMapping.cpp.o lib/DebugInfo/CodeView/CMakeFiles/LLVMDebugInfoCodeView.dir/TypeStreamMerger.cpp.o lib/DebugInfo/CodeView/CMakeFiles/LLVMDebugInfoCodeView.dir/TypeTableCollection.cpp.o && : [88/3070] /Users/buildslave/jenkins/workspace/lldb-cmake/host-compiler/bin/clang++ -DGTEST_HAS_RTTI=0 -D_DEBUG -D__STDC_CONSTANT_MACROS -D__STDC_FORMAT_MACROS -D__STDC_LIMIT_MACROS -Iutils/TableGen -I/Users/buildslave/jenkins/workspace/lldb-cmake/llvm-project/llvm/utils/TableGen -I/Applications/Xcode.app/Contents/Developer/Platforms/MacOSX.platform/Developer/SDKs/MacOSX10.15.sdk/usr/include/libxml2 -Iinclude -I/Users/buildslave/jenkins/workspace/lldb-cmake/llvm-project/llvm/include -Wdocumentation -fPIC -fvisibility-inlines-hidden -Werror=date-time -Werror=unguarded-availability-new -fmodules -fmodules-cache-path=/Users/buildslave/jenkins/workspace/lldb-cmake/lldb-build/module.cache -fcxx-modules -Xclang -fmodules-local-submodule-visibility -Wall -Wextra -Wno-unused-parameter -Wwrite-strings -Wcast-qual -Wmissing-field-initializers -pedantic -Wno-long-long -Wimplicit-fallthrough -Wcovered-switch-default -Wno-noexcept-type -Wnon-virtual-dtor -Wdelete-non-virtual-dtor -Wsuggest-override -Wstring-conversion -fdiagnostics-color -O3 -isysroot /Applications/Xcode.app/Contents/Developer/Platforms/MacOSX.platform/Developer/SDKs/MacOSX10.15.sdk -fno-exceptions -fno-rtti -UNDEBUG -std=c++14 -MD -MT utils/TableGen/CMakeFiles/llvm-tblgen.dir/SubtargetEmitter.cpp.o -MF utils/TableGen/CMakeFiles/llvm-tblgen.dir/SubtargetEmitter.cpp.o.d -o utils/TableGen/CMakeFiles/llvm-tblgen.dir/SubtargetEmitter.cpp.o -c /Users/buildslave/jenkins/workspace/lldb-cmake/llvm-project/llvm/utils/TableGen/SubtargetEmitter.cpp [89/3070] /Users/buildslave/jenkins/workspace/lldb-cmake/host-compiler/bin/clang++ -DGTEST_HAS_RTTI=0 -D_DEBUG -D__STDC_CONSTANT_MACROS -D__STDC_FORMAT_MACROS -D__STDC_LIMIT_MACROS -Iutils/TableGen -I/Users/buildslave/jenkins/workspace/lldb-cmake/llvm-project/llvm/utils/TableGen -I/Applications/Xcode.app/Contents/Developer/Platforms/MacOSX.platform/Developer/SDKs/MacOSX10.15.sdk/usr/include/libxml2 -Iinclude -I/Users/buildslave/jenkins/workspace/lldb-cmake/llvm-project/llvm/include -Wdocumentation -fPIC -fvisibility-inlines-hidden -Werror=date-time -Werror=unguarded-availability-new -fmodules -fmodules-cache-path=/Users/buildslave/jenkins/workspace/lldb-cmake/lldb-build/module.cache -fcxx-modules -Xclang -fmodules-local-submodule-visibility -Wall -Wextra -Wno-unused-parameter -Wwrite-strings -Wcast-qual -Wmissing-field-initializers -pedantic -Wno-long-long -Wimplicit-fallthrough -Wcovered-switch-default -Wno-noexcept-type -Wnon-virtual-dtor -Wdelete-non-virtual-dtor -Wsuggest-override -Wstring-conversion -fdiagnostics-color -O3 -isysroot /Applications/Xcode.app/Contents/Developer/Platforms/MacOSX.platform/Developer/SDKs/MacOSX10.15.sdk -fno-exceptions -fno-rtti -UNDEBUG -std=c++14 -MD -MT utils/TableGen/CMakeFiles/llvm-tblgen.dir/RegisterInfoEmitter.cpp.o -MF utils/TableGen/CMakeFiles/llvm-tblgen.dir/RegisterInfoEmitter.cpp.o.d -o utils/TableGen/CMakeFiles/llvm-tblgen.dir/RegisterInfoEmitter.cpp.o -c /Users/buildslave/jenkins/workspace/lldb-cmake/llvm-project/llvm/utils/TableGen/RegisterInfoEmitter.cpp [90/3070] /Users/buildslave/jenkins/workspace/lldb-cmake/host-compiler/bin/clang++ -DGTEST_HAS_RTTI=0 -D_DEBUG -D__STDC_CONSTANT_MACROS -D__STDC_FORMAT_MACROS -D__STDC_LIMIT_MACROS -Iutils/TableGen/GlobalISel -I/Users/buildslave/jenkins/workspace/lldb-cmake/llvm-project/llvm/utils/TableGen/GlobalISel -I/Applications/Xcode.app/Contents/Developer/Platforms/MacOSX.platform/Developer/SDKs/MacOSX10.15.sdk/usr/include/libxml2 -Iinclude -I/Users/buildslave/jenkins/workspace/lldb-cmake/llvm-project/llvm/include -Wdocumentation -fPIC -fvisibility-inlines-hidden -Werror=date-time -Werror=unguarded-availability-new -fmodules -fmodules-cache-path=/Users/buildslave/jenkins/workspace/lldb-cmake/lldb-build/module.cache -fcxx-modules -Xclang -fmodules-local-submodule-visibility -Wall -Wextra -Wno-unused-parameter -Wwrite-strings -Wcast-qual -Wmissing-field-initializers -pedantic -Wno-long-long -Wimplicit-fallthrough -Wcovered-switch-default -Wno-noexcept-type -Wnon-virtual-dtor -Wdelete-non-virtual-dtor -Wsuggest-override -Wstring-conversion -fdiagnostics-color -O3 -isysroot /Applications/Xcode.app/Contents/Developer/Platforms/MacOSX.platform/Developer/SDKs/MacOSX10.15.sdk -fno-exceptions -fno-rtti -UNDEBUG -std=c++14 -MD -MT utils/TableGen/GlobalISel/CMakeFiles/LLVMTableGenGlobalISel.dir/GIMatchTree.cpp.o -MF utils/TableGen/GlobalISel/CMakeFiles/LLVMTableGenGlobalISel.dir/GIMatchTree.cpp.o.d -o utils/TableGen/GlobalISel/CMakeFiles/LLVMTableGenGlobalISel.dir/GIMatchTree.cpp.o -c /Users/buildslave/jenkins/workspace/lldb-cmake/llvm-project/llvm/utils/TableGen/GlobalISel/GIMatchTree.cpp [91/3070] /Users/buildslave/jenkins/workspace/lldb-cmake/host-compiler/bin/clang++ -DGTEST_HAS_RTTI=0 -D_DEBUG -D__STDC_CONSTANT_MACROS -D__STDC_FORMAT_MACROS -D__STDC_LIMIT_MACROS -Iutils/TableGen -I/Users/buildslave/jenkins/workspace/lldb-cmake/llvm-project/llvm/utils/TableGen -I/Applications/Xcode.app/Contents/Developer/Platforms/MacOSX.platform/Developer/SDKs/MacOSX10.15.sdk/usr/include/libxml2 -Iinclude -I/Users/buildslave/jenkins/workspace/lldb-cmake/llvm-project/llvm/include -Wdocumentation -fPIC -fvisibility-inlines-hidden -Werror=date-time -Werror=unguarded-availability-new -fmodules -fmodules-cache-path=/Users/buildslave/jenkins/workspace/lldb-cmake/lldb-build/module.cache -fcxx-modules -Xclang -fmodules-local-submodule-visibility -Wall -Wextra -Wno-unused-parameter -Wwrite-strings -Wcast-qual -Wmissing-field-initializers -pedantic -Wno-long-long -Wimplicit-fallthrough -Wcovered-switch-default -Wno-noexcept-type -Wnon-virtual-dtor -Wdelete-non-virtual-dtor -Wsuggest-override -Wstring-conversion -fdiagnostics-color -O3 -isysroot /Applications/Xcode.app/Contents/Developer/Platforms/MacOSX.platform/Developer/SDKs/MacOSX10.15.sdk -fno-exceptions -fno-rtti -UNDEBUG -std=c++14 -MD -MT utils/TableGen/CMakeFiles/llvm-tblgen.dir/GlobalISelEmitter.cpp.o -MF utils/TableGen/CMakeFiles/llvm-tblgen.dir/GlobalISelEmitter.cpp.o.d -o utils/TableGen/CMakeFiles/llvm-tblgen.dir/GlobalISelEmitter.cpp.o -c /Users/buildslave/jenkins/workspace/lldb-cmake/llvm-project/llvm/utils/TableGen/GlobalISelEmitter.cpp ninja: build stopped: subcommand failed. Command failed: Command '['/usr/local/bin/ninja', '-v']' returned non-zero exit status 1 Command: ['/usr/local/bin/ninja', '-v'] [Pipeline] } [Pipeline] // timeout [Pipeline] } [Pipeline] // stage [Pipeline] stage [Pipeline] { (Test) Stage "Test" skipped due to earlier failure(s) [Pipeline] } [Pipeline] // stage [Pipeline] stage [Pipeline] { (Declarative: Post Actions) [Pipeline] scanForIssues [Clang (LLVM based)] Sleeping for 5 seconds due to JENKINS-32191... [Clang (LLVM based)] Parsing console log (workspace: '/Users/buildslave/jenkins/workspace/lldb-cmake') [Clang (LLVM based)] Successfully parsed console log [Clang (LLVM based)] -> found 0 issues (skipped 0 duplicates) [Clang (LLVM based)] Skipping post processing [Clang (LLVM based)] No filter has been set, publishing all 0 issues [Pipeline] junit Recording test results Test reports were found but none of them are new. Did leafNodes run? For example, /Users/buildslave/jenkins/workspace/lldb-cmake/test/results.xml is 12 min old

Hide Details

Error when executing always post condition: Also: hudson.remoting.Channel$CallSiteStackTrace: Remote call to green-dragon-10 at hudson.remoting.Channel.attachCallSiteStackTrace(Channel.java:1788) at hudson.remoting.UserRequest$ExceptionResponse.retrieve(UserRequest.java:356) at hudson.remoting.Channel.call(Channel.java:998) at hudson.FilePath.act(FilePath.java:1069) at hudson.FilePath.act(FilePath.java:1058) at hudson.tasks.junit.JUnitParser.parseResult(JUnitParser.java:114) at hudson.tasks.junit.JUnitResultArchiver.parse(JUnitResultArchiver.java:137) at hudson.tasks.junit.JUnitResultArchiver.parseAndAttach(JUnitResultArchiver.java:167) at hudson.tasks.junit.pipeline.JUnitResultsStepExecution.run(JUnitResultsStepExecution.java:52) at hudson.tasks.junit.pipeline.JUnitResultsStepExecution.run(JUnitResultsStepExecution.java:25) at org.jenkinsci.plugins.workflow.steps.SynchronousNonBlockingStepExecution.lambda$start$0(SynchronousNonBlockingStepExecution.java:47) at java.util.concurrent.Executors$RunnableAdapter.call(Executors.java:511) at java.util.concurrent.FutureTask.run(FutureTask.java:266) at java.util.concurrent.ThreadPoolExecutor.runWorker(ThreadPoolExecutor.java:1149) at java.util.concurrent.ThreadPoolExecutor$Worker.run(ThreadPoolExecutor.java:624) at java.lang.Thread.run(Thread.java:748) hudson.AbortException: Test reports were found but none of them are new. Did leafNodes run? For example, /Users/buildslave/jenkins/workspace/lldb-cmake/test/results.xml is 12 min old

Hide Details

at hudson.tasks.junit.TestResult.parse(TestResult.java:222) at hudson.tasks.junit.TestResult.parse(TestResult.java:178) at hudson.tasks.junit.TestResult.<init>(TestResult.java:143) at hudson.tasks.junit.JUnitParser$ParseResultCallable.invoke(JUnitParser.java:146) at hudson.tasks.junit.JUnitParser$ParseResultCallable.invoke(JUnitParser.java:118) at hudson.FilePath$FileCallableWrapper.call(FilePath.java:3073) at hudson.remoting.UserRequest.perform(UserRequest.java:211) at hudson.remoting.UserRequest.perform(UserRequest.java:54) at hudson.remoting.Request$2.run(Request.java:369) at hudson.remoting.InterceptingExecutorService$1.call(InterceptingExecutorService.java:72) at java.util.concurrent.FutureTask.run(Unknown Source) at java.util.concurrent.ThreadPoolExecutor.runWorker(Unknown Source) at java.util.concurrent.ThreadPoolExecutor$Worker.run(Unknown Source) at java.lang.Thread.run(Unknown Source)

Hide Details

[Pipeline] } [Pipeline] // stage [Pipeline] } [Pipeline] // withEnv [Pipeline] } [Pipeline] // node [Pipeline] End of Pipeline ERROR: script returned exit code 1 Finished: FAILURE