FailedConsole Output

Started by timer
Obtained zorg/jenkins/jobs/jobs/lldb-cmake from git https://github.com/llvm/llvm-zorg.git
Running in Durability level: MAX_SURVIVABILITY
[Pipeline] Start of Pipeline
[Pipeline] node
Running on green-dragon-10 in /Users/buildslave/jenkins/workspace/lldb-cmake
[Pipeline] {
[Pipeline] stage
[Pipeline] { (Declarative: Checkout SCM)
[Pipeline] checkout
No credentials specified
Fetching changes from the remote Git repository
Checking out Revision 74e099cb9569f67ddb4341839eea408abc67e04e (refs/remotes/origin/master)
Commit message: "Added automatic cluster config and  deployment"
 > git rev-parse --is-inside-work-tree # timeout=10
 > git config remote.origin.url https://github.com/llvm/llvm-zorg.git # timeout=10
Fetching upstream changes from https://github.com/llvm/llvm-zorg.git
 > git --version # timeout=10
 > git fetch --tags --force --progress -- https://github.com/llvm/llvm-zorg.git +refs/heads/*:refs/remotes/origin/* # timeout=10
 > git rev-parse refs/remotes/origin/master^{commit} # timeout=10
 > git rev-parse refs/remotes/origin/origin/master^{commit} # timeout=10
 > git config core.sparsecheckout # timeout=10
 > git checkout -f 74e099cb9569f67ddb4341839eea408abc67e04e # timeout=10
 > git rev-list --no-walk 74e099cb9569f67ddb4341839eea408abc67e04e # timeout=10
[Pipeline] }
[Pipeline] // stage
[Pipeline] withEnv
[Pipeline] {
[Pipeline] stage
[Pipeline] { (Checkout)
[Pipeline] timeout
Timeout set to expire in 30 min
[Pipeline] {
[Pipeline] dir
Running in /Users/buildslave/jenkins/workspace/lldb-cmake/llvm-project
[Pipeline] {
[Pipeline] checkout
No credentials specified
Fetching changes from the remote Git repository
 > git rev-parse --is-inside-work-tree # timeout=10
 > git config remote.origin.url http://labmaster3.local/git/llvm-project.git # timeout=10
Fetching upstream changes from http://labmaster3.local/git/llvm-project.git
 > git --version # timeout=10
 > git fetch --tags --force --progress -- http://labmaster3.local/git/llvm-project.git +refs/heads/*:refs/remotes/origin/* # timeout=10
Checking out Revision 3a3c9519e272e664172a0a90e8abf84b6d400106 (refs/remotes/origin/master)
 > git rev-parse refs/remotes/origin/master^{commit} # timeout=10
 > git rev-parse refs/remotes/origin/origin/master^{commit} # timeout=10
 > git config core.sparsecheckout # timeout=10
 > git checkout -f 3a3c9519e272e664172a0a90e8abf84b6d400106 # timeout=10
Commit message: "[InstCombine] Negator: 0 - (X + Y)  -->  (-X) - Y  iff a single operand negated"
 > git rev-list --no-walk 719954eacb704236cb726fa3db5503f650a89b81 # timeout=10
[Pipeline] }
[Pipeline] // dir
[Pipeline] dir
Running in /Users/buildslave/jenkins/workspace/lldb-cmake/llvm-zorg
[Pipeline] {
[Pipeline] checkout
No credentials specified
Fetching changes from the remote Git repository
Checking out Revision 74e099cb9569f67ddb4341839eea408abc67e04e (refs/remotes/origin/master)
Commit message: "Added automatic cluster config and  deployment"
 > git rev-parse --is-inside-work-tree # timeout=10
 > git config remote.origin.url http://labmaster3.local/git/llvm-zorg.git # timeout=10
Fetching upstream changes from http://labmaster3.local/git/llvm-zorg.git
 > git --version # timeout=10
 > git fetch --tags --force --progress -- http://labmaster3.local/git/llvm-zorg.git +refs/heads/*:refs/remotes/origin/* # timeout=10
 > git rev-parse refs/remotes/origin/master^{commit} # timeout=10
 > git rev-parse refs/remotes/origin/origin/master^{commit} # timeout=10
 > git config core.sparsecheckout # timeout=10
 > git checkout -f 74e099cb9569f67ddb4341839eea408abc67e04e # timeout=10
 > git rev-list --no-walk 74e099cb9569f67ddb4341839eea408abc67e04e # timeout=10
[Pipeline] }
[Pipeline] // dir
[Pipeline] }
[Pipeline] // timeout
[Pipeline] }
[Pipeline] // stage
[Pipeline] stage
[Pipeline] { (Fetch Host Compiler)
[Pipeline] timeout
Timeout set to expire in 10 min
[Pipeline] {
[Pipeline] sh
+ python llvm-zorg/zorg/jenkins/monorepo_build.py fetch
Fetching Compiler

Hide Details

@@@ Fetching Compiler @@@ GETting http://labmaster2.local/artifacts//clang-stage1-RA/latest to /Users/buildslave/jenkins/workspace/lldb-cmake/host-compiler.tar.gz ... done. Decompressing... cd /Users/buildslave/jenkins/workspace/lldb-cmake/host-compiler/ 'tar' 'zxf' '../host-compiler.tar.gz' Completed at: 2020-08-05T10:08:22 @@@@@@
[Pipeline] } [Pipeline] // timeout [Pipeline] } [Pipeline] // stage [Pipeline] stage [Pipeline] { (Build) [Pipeline] timeout Timeout set to expire in 2 hr 0 min [Pipeline] { [Pipeline] sh + set -u + rm -rf build.properties + cd llvm-project + git tag -a -m 'First Commit' first_commit 97724f18c79c7cc81ced24239eb5e883bf1398ef fatal: tag 'first_commit' already exists + true ++ git describe --match first_commit + git_desc=first_commit-362524-g3a3c9519e27 ++ echo first_commit-362524-g3a3c9519e27 ++ cut -f 2 -d - + export GIT_DISTANCE=362524 + GIT_DISTANCE=362524 ++ echo first_commit-362524-g3a3c9519e27 ++ cut -f 3 -d - + sha=g3a3c9519e27 + export GIT_SHA=3a3c9519e27 + GIT_SHA=3a3c9519e27 + cd - /Users/buildslave/jenkins/workspace/lldb-cmake + python llvm-zorg/zorg/jenkins/monorepo_build.py lldb-cmake build --assertions '--projects=clang;libcxx;libcxxabi;compiler-rt;lld;lldb;debuginfo-tests' --compiler-flag=-Wdocumentation --cmake-type=Release You are using pip version 18.1, however version 20.2 is available. You should consider upgrading via the 'pip install --upgrade pip' command. You are using pip version 18.1, however version 20.2 is available. You should consider upgrading via the 'pip install --upgrade pip' command. Dependency met os_version v10.15.5 Dependency met brew cmake v3.17.2 Dependency met brew ninja v1.8.2 Dependency met pip psutil v5.4.5 Dependency met pip six v1.11.0 Dependency met xcode v11.5
Clean

Hide Details

@@@ Clean @@@ Completed at: 2020-08-05T10:09:36 @@@@@@
Cmake

Hide Details

@@@ Cmake @@@ cd /Users/buildslave/jenkins/workspace/lldb-cmake/lldb-build '/usr/local/bin/cmake' '-G' 'Ninja' '/Users/buildslave/jenkins/workspace/lldb-cmake/llvm-project/llvm' '-DCMAKE_BUILD_TYPE=Release' '-DCMAKE_EXPORT_COMPILE_COMMANDS=ON' '-DCMAKE_INSTALL_PREFIX=/Users/buildslave/jenkins/workspace/lldb-cmake/lldb-install' '-DCMAKE_MAKE_PROGRAM=/usr/local/bin/ninja' '-DLLDB_TEST_USER_ARGS=--arch;x86_64;--build-dir;/Users/buildslave/jenkins/workspace/lldb-cmake/lldb-build/lldb-test-build.noindex;-s=/Users/buildslave/jenkins/workspace/lldb-cmake/test/logs;-t;--env;TERM=vt100' '-DLLDB_ENABLE_PYTHON=On' '-DLLVM_ENABLE_ASSERTIONS:BOOL=TRUE' '-DLLVM_ENABLE_MODULES=On' '-DLLVM_ENABLE_PROJECTS=clang;libcxx;libcxxabi;compiler-rt;lld;lldb;debuginfo-tests' '-DLLVM_LIT_ARGS=-v --time-tests --shuffle --xunit-xml-output=/Users/buildslave/jenkins/workspace/lldb-cmake/test/results.xml -v' '-DLLVM_VERSION_PATCH=99' '-DCMAKE_C_FLAGS=-Wdocumentation' '-DCMAKE_CXX_FLAGS=-Wdocumentation' '-DCMAKE_C_COMPILER=/Users/buildslave/jenkins/workspace/lldb-cmake/host-compiler/bin/clang' '-DCMAKE_CXX_COMPILER=/Users/buildslave/jenkins/workspace/lldb-cmake/host-compiler/bin/clang++' -- clang project is enabled -- clang-tools-extra project is disabled -- compiler-rt project is enabled -- debuginfo-tests project is enabled -- libc project is disabled -- libclc project is disabled -- libcxx project is enabled -- libcxxabi project is enabled -- libunwind project is disabled -- lld project is enabled -- lldb project is enabled -- mlir project is disabled -- openmp project is disabled -- parallel-libs project is disabled -- polly project is disabled -- pstl project is disabled -- flang project is disabled -- Found libtool - /Applications/Xcode.app/Contents/Developer/Toolchains/XcodeDefault.xctoolchain/usr/bin/libtool -- Found LibXml2: /usr/lib/libxml2.dylib (found version "2.9.4") -- Native target architecture is X86 -- Threads enabled. -- Doxygen disabled. -- Go bindings disabled. -- Ninja version: 1.8.2 -- Found ld64 - /Applications/Xcode.app/Contents/Developer/Toolchains/XcodeDefault.xctoolchain/usr/bin/ld -- Could NOT find OCaml (missing: OCAMLFIND OCAML_VERSION OCAML_STDLIB_PATH) -- Could NOT find OCaml (missing: OCAMLFIND OCAML_VERSION OCAML_STDLIB_PATH) -- OCaml bindings disabled. -- LLVM host triple: x86_64-apple-darwin19.5.0 -- LLVM default target triple: x86_64-apple-darwin19.5.0 -- Building with -fPIC -- Found Python3: /usr/local/Frameworks/Python.framework/Versions/3.7/bin/python3.7 (found version "3.7.1") found components: Interpreter -- Constructing LLVMBuild project information -- Targeting AArch64 -- Targeting AMDGPU -- Targeting ARM -- Targeting AVR -- Targeting BPF -- Targeting Hexagon -- Targeting Lanai -- Targeting Mips -- Targeting MSP430 -- Targeting NVPTX -- Targeting PowerPC -- Targeting RISCV -- Targeting Sparc -- Targeting SystemZ -- Targeting WebAssembly -- Targeting X86 -- Targeting XCore -- Libc++abi will be using libc++ includes from /Users/buildslave/jenkins/workspace/lldb-cmake/llvm-project/libcxxabi/../libcxx/include -- Could not find CrashReporterClient, not linking against it -- Could not find ParallelSTL, libc++abi will not attempt to use it but the build may fail if the libc++ in use needs it to be available. -- Looking for cxxabi.h in /Users/buildslave/jenkins/workspace/lldb-cmake/llvm-project/libcxx/../libcxxabi/include -- Looking for cxxabi.h in /Users/buildslave/jenkins/workspace/lldb-cmake/llvm-project/libcxx/../libcxxabi/include - found -- Looking for __cxxabi_config.h in /Users/buildslave/jenkins/workspace/lldb-cmake/llvm-project/libcxx/../libcxxabi/include -- Looking for __cxxabi_config.h in /Users/buildslave/jenkins/workspace/lldb-cmake/llvm-project/libcxx/../libcxxabi/include - found -- Found OSX_SYSROOT: /Applications/Xcode.app/Contents/Developer/Platforms/MacOSX.platform/Developer/SDKs/MacOSX10.15.sdk -- Got ld supported ARCHES: armv6 armv7 armv7s arm64 arm64e arm64_32 i386 x86_64 x86_64h armv6m armv7k armv7m armv7em -- Toolchain supported arches: armv6;armv7;armv7s;arm64;arm64e;arm64_32;i386;x86_64;x86_64h;armv6m;armv7k;armv7m;armv7em -- Using cached valid architectures for osx. -- OSX supported arches: x86_64;x86_64h -- Using cached valid architectures for iossim. -- ios Simulator supported arches: i386;x86_64 -- Using cached valid architectures for ios. -- ios supported arches: armv6;armv7;armv7s;arm64;armv7k -- Compiler-RT supported architectures: x86_64;x86_64h;i386;armv6;armv7;armv7s;arm64;armv7k -- No arm64 support in /Applications/Xcode.app/Contents/Developer/Platforms/MacOSX.platform/Developer/SDKs/MacOSX10.15.sdk/SDKSettings.plist -- No arm64e support in /Applications/Xcode.app/Contents/Developer/Platforms/MacOSX.platform/Developer/SDKs/MacOSX10.15.sdk/SDKSettings.plist -- Using cached valid architectures for osx. -- OSX supported builtin arches: i386;x86_64;x86_64h -- Using cached valid architectures for iossim. -- ios Simulator supported builtin arches: i386;x86_64 -- Using cached valid architectures for ios. -- ios supported builtin arches: arm64;armv7;armv7k;armv7s -- Builtin supported architectures: i386;x86_64;x86_64h;armv7;armv7k;armv7s;arm64 -- For osx_i386 builtins preferring i386/fp_mode.c to fp_mode.c -- For osx_i386 builtins preferring i386/ashldi3.S to ashldi3.c -- For osx_i386 builtins preferring i386/ashrdi3.S to ashrdi3.c -- For osx_i386 builtins preferring i386/divdi3.S to divdi3.c -- For osx_i386 builtins preferring i386/floatdidf.S to floatdidf.c -- For osx_i386 builtins preferring i386/floatdisf.S to floatdisf.c -- For osx_i386 builtins preferring i386/floatundidf.S to floatundidf.c -- For osx_i386 builtins preferring i386/floatundisf.S to floatundisf.c -- For osx_i386 builtins preferring i386/lshrdi3.S to lshrdi3.c -- For osx_i386 builtins preferring i386/moddi3.S to moddi3.c -- For osx_i386 builtins preferring i386/muldi3.S to muldi3.c -- For osx_i386 builtins preferring i386/udivdi3.S to udivdi3.c -- For osx_i386 builtins preferring i386/umoddi3.S to umoddi3.c -- For osx_i386 builtins preferring i386/floatdixf.S to floatdixf.c -- For osx_i386 builtins preferring i386/floatundixf.S to floatundixf.c -- For osx_x86_64 builtins preferring i386/fp_mode.c to fp_mode.c -- For osx_x86_64 builtins preferring x86_64/floatdidf.c to floatdidf.c -- For osx_x86_64 builtins preferring x86_64/floatdisf.c to floatdisf.c -- For osx_x86_64 builtins preferring x86_64/floatundidf.S to floatundidf.c -- For osx_x86_64 builtins preferring x86_64/floatundisf.S to floatundisf.c -- For osx_x86_64 builtins preferring x86_64/floatdixf.c to floatdixf.c -- For osx_x86_64 builtins preferring x86_64/floatundixf.S to floatundixf.c -- For osx_x86_64h builtins preferring i386/fp_mode.c to fp_mode.c -- For osx_x86_64h builtins preferring x86_64/floatdidf.c to floatdidf.c -- For osx_x86_64h builtins preferring x86_64/floatdisf.c to floatdisf.c -- For osx_x86_64h builtins preferring x86_64/floatundidf.S to floatundidf.c -- For osx_x86_64h builtins preferring x86_64/floatundisf.S to floatundisf.c -- For osx_x86_64h builtins preferring x86_64/floatdixf.c to floatdixf.c -- For osx_x86_64h builtins preferring x86_64/floatundixf.S to floatundixf.c -- For cc_kext_osx_i386 builtins preferring i386/fp_mode.c to fp_mode.c -- For cc_kext_osx_i386 builtins preferring i386/ashldi3.S to ashldi3.c -- For cc_kext_osx_i386 builtins preferring i386/ashrdi3.S to ashrdi3.c -- For cc_kext_osx_i386 builtins preferring i386/divdi3.S to divdi3.c -- For cc_kext_osx_i386 builtins preferring i386/floatdidf.S to floatdidf.c -- For cc_kext_osx_i386 builtins preferring i386/floatdisf.S to floatdisf.c -- For cc_kext_osx_i386 builtins preferring i386/floatundidf.S to floatundidf.c -- For cc_kext_osx_i386 builtins preferring i386/floatundisf.S to floatundisf.c -- For cc_kext_osx_i386 builtins preferring i386/lshrdi3.S to lshrdi3.c -- For cc_kext_osx_i386 builtins preferring i386/moddi3.S to moddi3.c -- For cc_kext_osx_i386 builtins preferring i386/muldi3.S to muldi3.c -- For cc_kext_osx_i386 builtins preferring i386/udivdi3.S to udivdi3.c -- For cc_kext_osx_i386 builtins preferring i386/umoddi3.S to umoddi3.c -- For cc_kext_osx_i386 builtins preferring i386/floatdixf.S to floatdixf.c -- For cc_kext_osx_i386 builtins preferring i386/floatundixf.S to floatundixf.c -- For cc_kext_osx_x86_64 builtins preferring i386/fp_mode.c to fp_mode.c -- For cc_kext_osx_x86_64 builtins preferring x86_64/floatdidf.c to floatdidf.c -- For cc_kext_osx_x86_64 builtins preferring x86_64/floatdisf.c to floatdisf.c -- For cc_kext_osx_x86_64 builtins preferring x86_64/floatundidf.S to floatundidf.c -- For cc_kext_osx_x86_64 builtins preferring x86_64/floatundisf.S to floatundisf.c -- For cc_kext_osx_x86_64 builtins preferring x86_64/floatdixf.c to floatdixf.c -- For cc_kext_osx_x86_64 builtins preferring x86_64/floatundixf.S to floatundixf.c -- For cc_kext_osx_x86_64h builtins preferring i386/fp_mode.c to fp_mode.c -- For cc_kext_osx_x86_64h builtins preferring x86_64/floatdidf.c to floatdidf.c -- For cc_kext_osx_x86_64h builtins preferring x86_64/floatdisf.c to floatdisf.c -- For cc_kext_osx_x86_64h builtins preferring x86_64/floatundidf.S to floatundidf.c -- For cc_kext_osx_x86_64h builtins preferring x86_64/floatundisf.S to floatundisf.c -- For cc_kext_osx_x86_64h builtins preferring x86_64/floatdixf.c to floatdixf.c -- For cc_kext_osx_x86_64h builtins preferring x86_64/floatundixf.S to floatundixf.c -- For iossim_i386 builtins preferring i386/fp_mode.c to fp_mode.c -- For iossim_i386 builtins preferring i386/ashldi3.S to ashldi3.c -- For iossim_i386 builtins preferring i386/ashrdi3.S to ashrdi3.c -- For iossim_i386 builtins preferring i386/divdi3.S to divdi3.c -- For iossim_i386 builtins preferring i386/floatdidf.S to floatdidf.c -- For iossim_i386 builtins preferring i386/floatdisf.S to floatdisf.c -- For iossim_i386 builtins preferring i386/floatundidf.S to floatundidf.c -- For iossim_i386 builtins preferring i386/floatundisf.S to floatundisf.c -- For iossim_i386 builtins preferring i386/lshrdi3.S to lshrdi3.c -- For iossim_i386 builtins preferring i386/moddi3.S to moddi3.c -- For iossim_i386 builtins preferring i386/muldi3.S to muldi3.c -- For iossim_i386 builtins preferring i386/udivdi3.S to udivdi3.c -- For iossim_i386 builtins preferring i386/umoddi3.S to umoddi3.c -- For iossim_i386 builtins preferring i386/floatdixf.S to floatdixf.c -- For iossim_i386 builtins preferring i386/floatundixf.S to floatundixf.c -- For iossim_x86_64 builtins preferring i386/fp_mode.c to fp_mode.c -- For iossim_x86_64 builtins preferring x86_64/floatdidf.c to floatdidf.c -- For iossim_x86_64 builtins preferring x86_64/floatdisf.c to floatdisf.c -- For iossim_x86_64 builtins preferring x86_64/floatundidf.S to floatundidf.c -- For iossim_x86_64 builtins preferring x86_64/floatundisf.S to floatundisf.c -- For iossim_x86_64 builtins preferring x86_64/floatdixf.c to floatdixf.c -- For iossim_x86_64 builtins preferring x86_64/floatundixf.S to floatundixf.c -- For ios_arm64 builtins preferring aarch64/fp_mode.c to fp_mode.c -- For ios_armv7 builtins preferring arm/fp_mode.c to fp_mode.c -- For ios_armv7 builtins preferring arm/comparesf2.S to comparesf2.c -- For ios_armv7k builtins preferring arm/fp_mode.c to fp_mode.c -- For ios_armv7k builtins preferring arm/bswapdi2.S to bswapdi2.c -- For ios_armv7k builtins preferring arm/bswapsi2.S to bswapsi2.c -- For ios_armv7k builtins preferring arm/clzdi2.S to clzdi2.c -- For ios_armv7k builtins preferring arm/clzsi2.S to clzsi2.c -- For ios_armv7k builtins preferring arm/comparesf2.S to comparesf2.c -- For ios_armv7k builtins preferring arm/divmodsi4.S to divmodsi4.c -- For ios_armv7k builtins preferring arm/divsi3.S to divsi3.c -- For ios_armv7k builtins preferring arm/modsi3.S to modsi3.c -- For ios_armv7k builtins preferring arm/udivmodsi4.S to udivmodsi4.c -- For ios_armv7k builtins preferring arm/udivsi3.S to udivsi3.c -- For ios_armv7k builtins preferring arm/umodsi3.S to umodsi3.c -- For ios_armv7s builtins preferring arm/fp_mode.c to fp_mode.c -- For ios_armv7s builtins preferring arm/comparesf2.S to comparesf2.c -- For cc_kext_ios_arm64 builtins preferring aarch64/fp_mode.c to fp_mode.c -- For cc_kext_ios_armv7 builtins preferring arm/fp_mode.c to fp_mode.c -- For cc_kext_ios_armv7 builtins preferring arm/bswapdi2.S to bswapdi2.c -- For cc_kext_ios_armv7 builtins preferring arm/bswapsi2.S to bswapsi2.c -- For cc_kext_ios_armv7 builtins preferring arm/clzdi2.S to clzdi2.c -- For cc_kext_ios_armv7 builtins preferring arm/clzsi2.S to clzsi2.c -- For cc_kext_ios_armv7 builtins preferring arm/comparesf2.S to comparesf2.c -- For cc_kext_ios_armv7 builtins preferring arm/divmodsi4.S to divmodsi4.c -- For cc_kext_ios_armv7 builtins preferring arm/divsi3.S to divsi3.c -- For cc_kext_ios_armv7 builtins preferring arm/modsi3.S to modsi3.c -- For cc_kext_ios_armv7 builtins preferring arm/udivmodsi4.S to udivmodsi4.c -- For cc_kext_ios_armv7 builtins preferring arm/udivsi3.S to udivsi3.c -- For cc_kext_ios_armv7 builtins preferring arm/umodsi3.S to umodsi3.c -- For cc_kext_ios_armv7k builtins preferring arm/fp_mode.c to fp_mode.c -- For cc_kext_ios_armv7k builtins preferring arm/bswapdi2.S to bswapdi2.c -- For cc_kext_ios_armv7k builtins preferring arm/bswapsi2.S to bswapsi2.c -- For cc_kext_ios_armv7k builtins preferring arm/clzdi2.S to clzdi2.c -- For cc_kext_ios_armv7k builtins preferring arm/clzsi2.S to clzsi2.c -- For cc_kext_ios_armv7k builtins preferring arm/comparesf2.S to comparesf2.c -- For cc_kext_ios_armv7k builtins preferring arm/divmodsi4.S to divmodsi4.c -- For cc_kext_ios_armv7k builtins preferring arm/divsi3.S to divsi3.c -- For cc_kext_ios_armv7k builtins preferring arm/modsi3.S to modsi3.c -- For cc_kext_ios_armv7k builtins preferring arm/udivmodsi4.S to udivmodsi4.c -- For cc_kext_ios_armv7k builtins preferring arm/udivsi3.S to udivsi3.c -- For cc_kext_ios_armv7k builtins preferring arm/umodsi3.S to umodsi3.c -- For cc_kext_ios_armv7s builtins preferring arm/fp_mode.c to fp_mode.c -- For cc_kext_ios_armv7s builtins preferring arm/bswapdi2.S to bswapdi2.c -- For cc_kext_ios_armv7s builtins preferring arm/bswapsi2.S to bswapsi2.c -- For cc_kext_ios_armv7s builtins preferring arm/clzdi2.S to clzdi2.c -- For cc_kext_ios_armv7s builtins preferring arm/clzsi2.S to clzsi2.c -- For cc_kext_ios_armv7s builtins preferring arm/comparesf2.S to comparesf2.c -- For cc_kext_ios_armv7s builtins preferring arm/divmodsi4.S to divmodsi4.c -- For cc_kext_ios_armv7s builtins preferring arm/divsi3.S to divsi3.c -- For cc_kext_ios_armv7s builtins preferring arm/modsi3.S to modsi3.c -- For cc_kext_ios_armv7s builtins preferring arm/udivmodsi4.S to udivmodsi4.c -- For cc_kext_ios_armv7s builtins preferring arm/udivsi3.S to udivsi3.c -- For cc_kext_ios_armv7s builtins preferring arm/umodsi3.S to umodsi3.c -- For macho_embedded_armv6m builtins preferring arm/divsi3.S to divsi3.c -- For macho_embedded_armv6m builtins preferring arm/udivsi3.S to udivsi3.c -- For macho_embedded_armv6m builtins preferring arm/comparesf2.S to comparesf2.c -- For macho_embedded_armv6m builtins preferring arm/addsf3.S to addsf3.c -- For macho_embedded_armv7m builtins preferring arm/clzdi2.S to clzdi2.c -- For macho_embedded_armv7m builtins preferring arm/clzsi2.S to clzsi2.c -- For macho_embedded_armv7m builtins preferring arm/comparesf2.S to comparesf2.c -- For macho_embedded_armv7m builtins preferring arm/divmodsi4.S to divmodsi4.c -- For macho_embedded_armv7m builtins preferring arm/divsi3.S to divsi3.c -- For macho_embedded_armv7m builtins preferring arm/modsi3.S to modsi3.c -- For macho_embedded_armv7m builtins preferring arm/udivmodsi4.S to udivmodsi4.c -- For macho_embedded_armv7m builtins preferring arm/udivsi3.S to udivsi3.c -- For macho_embedded_armv7m builtins preferring arm/umodsi3.S to umodsi3.c -- For macho_embedded_armv7em builtins preferring arm/clzdi2.S to clzdi2.c -- For macho_embedded_armv7em builtins preferring arm/clzsi2.S to clzsi2.c -- For macho_embedded_armv7em builtins preferring arm/comparesf2.S to comparesf2.c -- For macho_embedded_armv7em builtins preferring arm/divmodsi4.S to divmodsi4.c -- For macho_embedded_armv7em builtins preferring arm/divsi3.S to divsi3.c -- For macho_embedded_armv7em builtins preferring arm/modsi3.S to modsi3.c -- For macho_embedded_armv7em builtins preferring arm/udivmodsi4.S to udivmodsi4.c -- For macho_embedded_armv7em builtins preferring arm/udivsi3.S to udivsi3.c -- For macho_embedded_armv7em builtins preferring arm/umodsi3.S to umodsi3.c -- For macho_embedded_armv7 builtins preferring arm/clzdi2.S to clzdi2.c -- For macho_embedded_armv7 builtins preferring arm/clzsi2.S to clzsi2.c -- For macho_embedded_armv7 builtins preferring arm/comparesf2.S to comparesf2.c -- For macho_embedded_armv7 builtins preferring arm/divmodsi4.S to divmodsi4.c -- For macho_embedded_armv7 builtins preferring arm/divsi3.S to divsi3.c -- For macho_embedded_armv7 builtins preferring arm/modsi3.S to modsi3.c -- For macho_embedded_armv7 builtins preferring arm/udivmodsi4.S to udivmodsi4.c -- For macho_embedded_armv7 builtins preferring arm/udivsi3.S to udivsi3.c -- For macho_embedded_armv7 builtins preferring arm/umodsi3.S to umodsi3.c -- For macho_embedded_i386 builtins preferring i386/ashldi3.S to ashldi3.c -- For macho_embedded_i386 builtins preferring i386/ashrdi3.S to ashrdi3.c -- For macho_embedded_i386 builtins preferring i386/divdi3.S to divdi3.c -- For macho_embedded_i386 builtins preferring i386/floatdidf.S to floatdidf.c -- For macho_embedded_i386 builtins preferring i386/floatdisf.S to floatdisf.c -- For macho_embedded_i386 builtins preferring i386/floatundidf.S to floatundidf.c -- For macho_embedded_i386 builtins preferring i386/floatundisf.S to floatundisf.c -- For macho_embedded_i386 builtins preferring i386/lshrdi3.S to lshrdi3.c -- For macho_embedded_i386 builtins preferring i386/moddi3.S to moddi3.c -- For macho_embedded_i386 builtins preferring i386/muldi3.S to muldi3.c -- For macho_embedded_i386 builtins preferring i386/udivdi3.S to udivdi3.c -- For macho_embedded_i386 builtins preferring i386/umoddi3.S to umoddi3.c -- For macho_embedded_x86_64 builtins preferring x86_64/floatdidf.c to floatdidf.c -- For macho_embedded_x86_64 builtins preferring x86_64/floatdisf.c to floatdisf.c -- For macho_embedded_x86_64 builtins preferring x86_64/floatundidf.S to floatundidf.c -- For macho_embedded_x86_64 builtins preferring x86_64/floatundisf.S to floatundisf.c -- No arm64 support in /Applications/Xcode.app/Contents/Developer/Platforms/MacOSX.platform/Developer/SDKs/MacOSX10.15.sdk/SDKSettings.plist -- No arm64e support in /Applications/Xcode.app/Contents/Developer/Platforms/MacOSX.platform/Developer/SDKs/MacOSX10.15.sdk/SDKSettings.plist -- Using cached valid architectures for osx. -- OSX supported builtin arches: i386;x86_64;x86_64h -- Using cached valid architectures for iossim. -- ios Simulator supported builtin arches: i386;x86_64 -- Using cached valid architectures for ios. -- ios supported builtin arches: arm64;armv7;armv7k;armv7s -- Builtin supported architectures: i386;x86_64;x86_64h;armv7;armv7k;armv7s;arm64 -- check-interception does nothing. -- Generated Sanitizer SUPPORTED_TOOLS list on "Darwin" is "asan;lsan;tsan;ubsan" -- sanitizer_common tests on "Darwin" will run against "asan;lsan;tsan;ubsan" -- Clang version: 12.0.99 -- LLD version: 12.0.99 -- Enable editline support in LLDB: TRUE -- Enable curses support in LLDB: TRUE -- Enable LZMA compression support in LLDB: TRUE -- Could NOT find Lua (missing: LUA_LIBRARIES LUA_INCLUDE_DIR) (Required is at least version "5.3") -- Could NOT find LuaAndSwig (missing: LUA_LIBRARIES LUA_INCLUDE_DIR) -- Enable Lua scripting support in LLDB: FALSE -- Found Python3: /usr/local/Frameworks/Python.framework/Versions/3.7/bin/python3.7 (found version "3.7.1") found components: Interpreter Development -- Enable Python scripting support in LLDB: TRUE -- Found LibXml2: /usr/lib/libxml2.dylib (found suitable version "2.9.4", minimum required is "2.8") -- Enable Libxml 2 support in LLDB: TRUE -- LLDB version: 12.0.99git -- Symbols (liblldb): exporting all symbols from the lldb namespace CMake Warning at /Users/buildslave/jenkins/workspace/lldb-cmake/llvm-project/lldb/tools/debugserver/source/CMakeLists.txt:44 (message): Development code sign identity not found: 'lldb_codesign' This will cause failures in the test suite.Pass '-DLLDB_USE_SYSTEM_DEBUGSERVER=ON' to use the system one instead.See 'Code Signing on macOS' in the documentation. Call Stack (most recent call first): /Users/buildslave/jenkins/workspace/lldb-cmake/llvm-project/lldb/tools/debugserver/source/CMakeLists.txt:92 (get_debugserver_codesign_identity)

Hide Details

Hide Details

-- LLDB debugserver energy support is disabled -- Could NOT find Doxygen (missing: DOXYGEN_EXECUTABLE) -- Could NOT find epydoc -- LLDB Tests use just-built debugserver: /Users/buildslave/jenkins/workspace/lldb-cmake/lldb-build/./bin/debugserver -- Registering Bye as a pass plugin (static build: OFF) -- LLVM FileCheck Found: /usr/local/bin/FileCheck -- Version: 0.0.0 -- Performing Test HAVE_THREAD_SAFETY_ATTRIBUTES -- failed to compile -- Performing Test HAVE_GNU_POSIX_REGEX -- failed to compile -- Performing Test HAVE_POSIX_REGEX -- success -- Performing Test HAVE_STEADY_CLOCK -- success -- Configuring done -- Generating done -- Build files have been written to: /Users/buildslave/jenkins/workspace/lldb-cmake/lldb-build Completed at: 2020-08-05T10:10:33 @@@@@@
Build

Hide Details

@@@ Build @@@ cd /Users/buildslave/jenkins/workspace/lldb-cmake/lldb-build '/usr/local/bin/ninja' '-v' [1/2966] cd /Users/buildslave/jenkins/workspace/lldb-cmake/lldb-build && /Users/buildslave/jenkins/workspace/lldb-cmake/lldb-build/bin/llvm-tblgen -gen-attrs -I /Users/buildslave/jenkins/workspace/lldb-cmake/llvm-project/llvm/include/llvm/IR -I /Applications/Xcode.app/Contents/Developer/Platforms/MacOSX.platform/Developer/SDKs/MacOSX10.15.sdk/usr/include/libxml2 -I /Users/buildslave/jenkins/workspace/lldb-cmake/lldb-build/include -I /Users/buildslave/jenkins/workspace/lldb-cmake/llvm-project/llvm/include /Users/buildslave/jenkins/workspace/lldb-cmake/llvm-project/llvm/include/llvm/IR/Attributes.td --write-if-changed -o include/llvm/IR/Attributes.inc -d include/llvm/IR/Attributes.inc.d [2/2966] cd /Users/buildslave/jenkins/workspace/lldb-cmake/lldb-build && /Users/buildslave/jenkins/workspace/lldb-cmake/lldb-build/bin/llvm-tblgen -gen-intrinsic-enums -intrinsic-prefix=bpf -I /Users/buildslave/jenkins/workspace/lldb-cmake/llvm-project/llvm/include/llvm/IR -I /Applications/Xcode.app/Contents/Developer/Platforms/MacOSX.platform/Developer/SDKs/MacOSX10.15.sdk/usr/include/libxml2 -I /Users/buildslave/jenkins/workspace/lldb-cmake/lldb-build/include -I /Users/buildslave/jenkins/workspace/lldb-cmake/llvm-project/llvm/include /Users/buildslave/jenkins/workspace/lldb-cmake/llvm-project/llvm/include/llvm/IR/Intrinsics.td --write-if-changed -o include/llvm/IR/IntrinsicsBPF.h -d include/llvm/IR/IntrinsicsBPF.h.d [3/2966] cd /Users/buildslave/jenkins/workspace/lldb-cmake/lldb-build && /Users/buildslave/jenkins/workspace/lldb-cmake/lldb-build/bin/llvm-tblgen -gen-intrinsic-enums -intrinsic-prefix=mips -I /Users/buildslave/jenkins/workspace/lldb-cmake/llvm-project/llvm/include/llvm/IR -I /Applications/Xcode.app/Contents/Developer/Platforms/MacOSX.platform/Developer/SDKs/MacOSX10.15.sdk/usr/include/libxml2 -I /Users/buildslave/jenkins/workspace/lldb-cmake/lldb-build/include -I /Users/buildslave/jenkins/workspace/lldb-cmake/llvm-project/llvm/include /Users/buildslave/jenkins/workspace/lldb-cmake/llvm-project/llvm/include/llvm/IR/Intrinsics.td --write-if-changed -o include/llvm/IR/IntrinsicsMips.h -d include/llvm/IR/IntrinsicsMips.h.d [4/2966] cd /Users/buildslave/jenkins/workspace/lldb-cmake/lldb-build && /Users/buildslave/jenkins/workspace/lldb-cmake/lldb-build/bin/llvm-tblgen -gen-intrinsic-enums -intrinsic-prefix=ppc -I /Users/buildslave/jenkins/workspace/lldb-cmake/llvm-project/llvm/include/llvm/IR -I /Applications/Xcode.app/Contents/Developer/Platforms/MacOSX.platform/Developer/SDKs/MacOSX10.15.sdk/usr/include/libxml2 -I /Users/buildslave/jenkins/workspace/lldb-cmake/lldb-build/include -I /Users/buildslave/jenkins/workspace/lldb-cmake/llvm-project/llvm/include /Users/buildslave/jenkins/workspace/lldb-cmake/llvm-project/llvm/include/llvm/IR/Intrinsics.td --write-if-changed -o include/llvm/IR/IntrinsicsPowerPC.h -d include/llvm/IR/IntrinsicsPowerPC.h.d [5/2965] cd /Users/buildslave/jenkins/workspace/lldb-cmake/lldb-build && /Users/buildslave/jenkins/workspace/lldb-cmake/lldb-build/bin/llvm-tblgen -gen-intrinsic-enums -intrinsic-prefix=amdgcn -I /Users/buildslave/jenkins/workspace/lldb-cmake/llvm-project/llvm/include/llvm/IR -I /Applications/Xcode.app/Contents/Developer/Platforms/MacOSX.platform/Developer/SDKs/MacOSX10.15.sdk/usr/include/libxml2 -I /Users/buildslave/jenkins/workspace/lldb-cmake/lldb-build/include -I /Users/buildslave/jenkins/workspace/lldb-cmake/llvm-project/llvm/include /Users/buildslave/jenkins/workspace/lldb-cmake/llvm-project/llvm/include/llvm/IR/Intrinsics.td --write-if-changed -o include/llvm/IR/IntrinsicsAMDGPU.h -d include/llvm/IR/IntrinsicsAMDGPU.h.d [6/2964] cd /Users/buildslave/jenkins/workspace/lldb-cmake/lldb-build && /Users/buildslave/jenkins/workspace/lldb-cmake/lldb-build/bin/llvm-tblgen -gen-intrinsic-enums -intrinsic-prefix=nvvm -I /Users/buildslave/jenkins/workspace/lldb-cmake/llvm-project/llvm/include/llvm/IR -I /Applications/Xcode.app/Contents/Developer/Platforms/MacOSX.platform/Developer/SDKs/MacOSX10.15.sdk/usr/include/libxml2 -I /Users/buildslave/jenkins/workspace/lldb-cmake/lldb-build/include -I /Users/buildslave/jenkins/workspace/lldb-cmake/llvm-project/llvm/include /Users/buildslave/jenkins/workspace/lldb-cmake/llvm-project/llvm/include/llvm/IR/Intrinsics.td --write-if-changed -o include/llvm/IR/IntrinsicsNVPTX.h -d include/llvm/IR/IntrinsicsNVPTX.h.d [7/2961] cd /Users/buildslave/jenkins/workspace/lldb-cmake/lldb-build && /Users/buildslave/jenkins/workspace/lldb-cmake/lldb-build/bin/llvm-tblgen -gen-intrinsic-enums -intrinsic-prefix=arm -I /Users/buildslave/jenkins/workspace/lldb-cmake/llvm-project/llvm/include/llvm/IR -I /Applications/Xcode.app/Contents/Developer/Platforms/MacOSX.platform/Developer/SDKs/MacOSX10.15.sdk/usr/include/libxml2 -I /Users/buildslave/jenkins/workspace/lldb-cmake/lldb-build/include -I /Users/buildslave/jenkins/workspace/lldb-cmake/llvm-project/llvm/include /Users/buildslave/jenkins/workspace/lldb-cmake/llvm-project/llvm/include/llvm/IR/Intrinsics.td --write-if-changed -o include/llvm/IR/IntrinsicsARM.h -d include/llvm/IR/IntrinsicsARM.h.d [8/2961] cd /Users/buildslave/jenkins/workspace/lldb-cmake/lldb-build && /Users/buildslave/jenkins/workspace/lldb-cmake/lldb-build/bin/llvm-tblgen -gen-intrinsic-enums -I /Users/buildslave/jenkins/workspace/lldb-cmake/llvm-project/llvm/include/llvm/IR -I /Applications/Xcode.app/Contents/Developer/Platforms/MacOSX.platform/Developer/SDKs/MacOSX10.15.sdk/usr/include/libxml2 -I /Users/buildslave/jenkins/workspace/lldb-cmake/lldb-build/include -I /Users/buildslave/jenkins/workspace/lldb-cmake/llvm-project/llvm/include /Users/buildslave/jenkins/workspace/lldb-cmake/llvm-project/llvm/include/llvm/IR/Intrinsics.td --write-if-changed -o include/llvm/IR/IntrinsicEnums.inc -d include/llvm/IR/IntrinsicEnums.inc.d [9/2961] cd /Users/buildslave/jenkins/workspace/lldb-cmake/lldb-build && /Users/buildslave/jenkins/workspace/lldb-cmake/lldb-build/bin/llvm-tblgen -gen-intrinsic-enums -intrinsic-prefix=aarch64 -I /Users/buildslave/jenkins/workspace/lldb-cmake/llvm-project/llvm/include/llvm/IR -I /Applications/Xcode.app/Contents/Developer/Platforms/MacOSX.platform/Developer/SDKs/MacOSX10.15.sdk/usr/include/libxml2 -I /Users/buildslave/jenkins/workspace/lldb-cmake/lldb-build/include -I /Users/buildslave/jenkins/workspace/lldb-cmake/llvm-project/llvm/include /Users/buildslave/jenkins/workspace/lldb-cmake/llvm-project/llvm/include/llvm/IR/Intrinsics.td --write-if-changed -o include/llvm/IR/IntrinsicsAArch64.h -d include/llvm/IR/IntrinsicsAArch64.h.d [10/2961] cd /Users/buildslave/jenkins/workspace/lldb-cmake/lldb-build && /Users/buildslave/jenkins/workspace/lldb-cmake/lldb-build/bin/llvm-tblgen -gen-intrinsic-enums -intrinsic-prefix=hexagon -I /Users/buildslave/jenkins/workspace/lldb-cmake/llvm-project/llvm/include/llvm/IR -I /Applications/Xcode.app/Contents/Developer/Platforms/MacOSX.platform/Developer/SDKs/MacOSX10.15.sdk/usr/include/libxml2 -I /Users/buildslave/jenkins/workspace/lldb-cmake/lldb-build/include -I /Users/buildslave/jenkins/workspace/lldb-cmake/llvm-project/llvm/include /Users/buildslave/jenkins/workspace/lldb-cmake/llvm-project/llvm/include/llvm/IR/Intrinsics.td --write-if-changed -o include/llvm/IR/IntrinsicsHexagon.h -d include/llvm/IR/IntrinsicsHexagon.h.d [11/2958] cd /Users/buildslave/jenkins/workspace/lldb-cmake/lldb-build && /Users/buildslave/jenkins/workspace/lldb-cmake/lldb-build/bin/llvm-tblgen --gen-directive-decl -I /Users/buildslave/jenkins/workspace/lldb-cmake/llvm-project/llvm/include/llvm/Frontend/OpenACC -I /Applications/Xcode.app/Contents/Developer/Platforms/MacOSX.platform/Developer/SDKs/MacOSX10.15.sdk/usr/include/libxml2 -I /Users/buildslave/jenkins/workspace/lldb-cmake/lldb-build/include -I /Users/buildslave/jenkins/workspace/lldb-cmake/llvm-project/llvm/include /Users/buildslave/jenkins/workspace/lldb-cmake/llvm-project/llvm/include/llvm/Frontend/OpenACC/ACC.td --write-if-changed -o include/llvm/Frontend/OpenACC/ACC.h.inc -d include/llvm/Frontend/OpenACC/ACC.h.inc.d [12/2958] cd /Users/buildslave/jenkins/workspace/lldb-cmake/lldb-build && /Users/buildslave/jenkins/workspace/lldb-cmake/lldb-build/bin/llvm-tblgen --gen-directive-gen -I /Users/buildslave/jenkins/workspace/lldb-cmake/llvm-project/llvm/include/llvm/Frontend/OpenACC -I /Applications/Xcode.app/Contents/Developer/Platforms/MacOSX.platform/Developer/SDKs/MacOSX10.15.sdk/usr/include/libxml2 -I /Users/buildslave/jenkins/workspace/lldb-cmake/lldb-build/include -I /Users/buildslave/jenkins/workspace/lldb-cmake/llvm-project/llvm/include /Users/buildslave/jenkins/workspace/lldb-cmake/llvm-project/llvm/include/llvm/Frontend/OpenACC/ACC.td --write-if-changed -o include/llvm/Frontend/OpenACC/ACC.cpp.inc -d include/llvm/Frontend/OpenACC/ACC.cpp.inc.d [13/2958] cd /Users/buildslave/jenkins/workspace/lldb-cmake/lldb-build && /Users/buildslave/jenkins/workspace/lldb-cmake/lldb-build/bin/llvm-tblgen --gen-directive-decl -I /Users/buildslave/jenkins/workspace/lldb-cmake/llvm-project/llvm/include/llvm/Frontend/OpenMP -I /Applications/Xcode.app/Contents/Developer/Platforms/MacOSX.platform/Developer/SDKs/MacOSX10.15.sdk/usr/include/libxml2 -I /Users/buildslave/jenkins/workspace/lldb-cmake/lldb-build/include -I /Users/buildslave/jenkins/workspace/lldb-cmake/llvm-project/llvm/include /Users/buildslave/jenkins/workspace/lldb-cmake/llvm-project/llvm/include/llvm/Frontend/OpenMP/OMP.td --write-if-changed -o include/llvm/Frontend/OpenMP/OMP.h.inc -d include/llvm/Frontend/OpenMP/OMP.h.inc.d [14/2958] cd /Users/buildslave/jenkins/workspace/lldb-cmake/lldb-build && /Users/buildslave/jenkins/workspace/lldb-cmake/lldb-build/bin/llvm-tblgen --gen-directive-impl -I /Users/buildslave/jenkins/workspace/lldb-cmake/llvm-project/llvm/lib/Frontend/OpenACC -I /Applications/Xcode.app/Contents/Developer/Platforms/MacOSX.platform/Developer/SDKs/MacOSX10.15.sdk/usr/include/libxml2 -I /Users/buildslave/jenkins/workspace/lldb-cmake/lldb-build/include -I /Users/buildslave/jenkins/workspace/lldb-cmake/llvm-project/llvm/include /Users/buildslave/jenkins/workspace/lldb-cmake/llvm-project/llvm/include/llvm/Frontend/OpenACC/ACC.td --write-if-changed -o lib/Frontend/OpenACC/ACC.cpp -d lib/Frontend/OpenACC/ACC.cpp.d [15/2958] cd /Users/buildslave/jenkins/workspace/lldb-cmake/lldb-build && /Users/buildslave/jenkins/workspace/lldb-cmake/lldb-build/bin/llvm-tblgen --gen-directive-gen -I /Users/buildslave/jenkins/workspace/lldb-cmake/llvm-project/llvm/include/llvm/Frontend/OpenMP -I /Applications/Xcode.app/Contents/Developer/Platforms/MacOSX.platform/Developer/SDKs/MacOSX10.15.sdk/usr/include/libxml2 -I /Users/buildslave/jenkins/workspace/lldb-cmake/lldb-build/include -I /Users/buildslave/jenkins/workspace/lldb-cmake/llvm-project/llvm/include /Users/buildslave/jenkins/workspace/lldb-cmake/llvm-project/llvm/include/llvm/Frontend/OpenMP/OMP.td --write-if-changed -o include/llvm/Frontend/OpenMP/OMP.cpp.inc -d include/llvm/Frontend/OpenMP/OMP.cpp.inc.d [16/2958] cd /Users/buildslave/jenkins/workspace/lldb-cmake/lldb-build && /Users/buildslave/jenkins/workspace/lldb-cmake/lldb-build/bin/llvm-tblgen --gen-directive-impl -I /Users/buildslave/jenkins/workspace/lldb-cmake/llvm-project/llvm/lib/Frontend/OpenMP -I /Applications/Xcode.app/Contents/Developer/Platforms/MacOSX.platform/Developer/SDKs/MacOSX10.15.sdk/usr/include/libxml2 -I /Users/buildslave/jenkins/workspace/lldb-cmake/lldb-build/include -I /Users/buildslave/jenkins/workspace/lldb-cmake/llvm-project/llvm/include /Users/buildslave/jenkins/workspace/lldb-cmake/llvm-project/llvm/include/llvm/Frontend/OpenMP/OMP.td --write-if-changed -o lib/Frontend/OpenMP/OMP.cpp -d lib/Frontend/OpenMP/OMP.cpp.d [17/2958] cd /Users/buildslave/jenkins/workspace/lldb-cmake/lldb-build && /Users/buildslave/jenkins/workspace/lldb-cmake/lldb-build/bin/llvm-tblgen -gen-intrinsic-enums -intrinsic-prefix=riscv -I /Users/buildslave/jenkins/workspace/lldb-cmake/llvm-project/llvm/include/llvm/IR -I /Applications/Xcode.app/Contents/Developer/Platforms/MacOSX.platform/Developer/SDKs/MacOSX10.15.sdk/usr/include/libxml2 -I /Users/buildslave/jenkins/workspace/lldb-cmake/lldb-build/include -I /Users/buildslave/jenkins/workspace/lldb-cmake/llvm-project/llvm/include /Users/buildslave/jenkins/workspace/lldb-cmake/llvm-project/llvm/include/llvm/IR/Intrinsics.td --write-if-changed -o include/llvm/IR/IntrinsicsRISCV.h -d include/llvm/IR/IntrinsicsRISCV.h.d [18/2958] cd /Users/buildslave/jenkins/workspace/lldb-cmake/lldb-build && /Users/buildslave/jenkins/workspace/lldb-cmake/lldb-build/bin/llvm-tblgen -gen-intrinsic-enums -intrinsic-prefix=s390 -I /Users/buildslave/jenkins/workspace/lldb-cmake/llvm-project/llvm/include/llvm/IR -I /Applications/Xcode.app/Contents/Developer/Platforms/MacOSX.platform/Developer/SDKs/MacOSX10.15.sdk/usr/include/libxml2 -I /Users/buildslave/jenkins/workspace/lldb-cmake/lldb-build/include -I /Users/buildslave/jenkins/workspace/lldb-cmake/llvm-project/llvm/include /Users/buildslave/jenkins/workspace/lldb-cmake/llvm-project/llvm/include/llvm/IR/Intrinsics.td --write-if-changed -o include/llvm/IR/IntrinsicsS390.h -d include/llvm/IR/IntrinsicsS390.h.d [19/2958] cd /Users/buildslave/jenkins/workspace/lldb-cmake/lldb-build && /Users/buildslave/jenkins/workspace/lldb-cmake/lldb-build/bin/llvm-tblgen -gen-intrinsic-enums -intrinsic-prefix=r600 -I /Users/buildslave/jenkins/workspace/lldb-cmake/llvm-project/llvm/include/llvm/IR -I /Applications/Xcode.app/Contents/Developer/Platforms/MacOSX.platform/Developer/SDKs/MacOSX10.15.sdk/usr/include/libxml2 -I /Users/buildslave/jenkins/workspace/lldb-cmake/lldb-build/include -I /Users/buildslave/jenkins/workspace/lldb-cmake/llvm-project/llvm/include /Users/buildslave/jenkins/workspace/lldb-cmake/llvm-project/llvm/include/llvm/IR/Intrinsics.td --write-if-changed -o include/llvm/IR/IntrinsicsR600.h -d include/llvm/IR/IntrinsicsR600.h.d [20/2958] cd /Users/buildslave/jenkins/workspace/lldb-cmake/lldb-build && /Users/buildslave/jenkins/workspace/lldb-cmake/lldb-build/bin/llvm-tblgen -gen-intrinsic-impl -I /Users/buildslave/jenkins/workspace/lldb-cmake/llvm-project/llvm/include/llvm/IR -I /Applications/Xcode.app/Contents/Developer/Platforms/MacOSX.platform/Developer/SDKs/MacOSX10.15.sdk/usr/include/libxml2 -I /Users/buildslave/jenkins/workspace/lldb-cmake/lldb-build/include -I /Users/buildslave/jenkins/workspace/lldb-cmake/llvm-project/llvm/include /Users/buildslave/jenkins/workspace/lldb-cmake/llvm-project/llvm/include/llvm/IR/Intrinsics.td --write-if-changed -o include/llvm/IR/IntrinsicImpl.inc -d include/llvm/IR/IntrinsicImpl.inc.d [21/2958] cd /Users/buildslave/jenkins/workspace/lldb-cmake/lldb-build && /Users/buildslave/jenkins/workspace/lldb-cmake/lldb-build/bin/llvm-tblgen -gen-intrinsic-enums -intrinsic-prefix=wasm -I /Users/buildslave/jenkins/workspace/lldb-cmake/llvm-project/llvm/include/llvm/IR -I /Applications/Xcode.app/Contents/Developer/Platforms/MacOSX.platform/Developer/SDKs/MacOSX10.15.sdk/usr/include/libxml2 -I /Users/buildslave/jenkins/workspace/lldb-cmake/lldb-build/include -I /Users/buildslave/jenkins/workspace/lldb-cmake/llvm-project/llvm/include /Users/buildslave/jenkins/workspace/lldb-cmake/llvm-project/llvm/include/llvm/IR/Intrinsics.td --write-if-changed -o include/llvm/IR/IntrinsicsWebAssembly.h -d include/llvm/IR/IntrinsicsWebAssembly.h.d [22/2957] cd /Users/buildslave/jenkins/workspace/lldb-cmake/lldb-build && /Users/buildslave/jenkins/workspace/lldb-cmake/lldb-build/bin/llvm-tblgen -gen-intrinsic-enums -intrinsic-prefix=x86 -I /Users/buildslave/jenkins/workspace/lldb-cmake/llvm-project/llvm/include/llvm/IR -I /Applications/Xcode.app/Contents/Developer/Platforms/MacOSX.platform/Developer/SDKs/MacOSX10.15.sdk/usr/include/libxml2 -I /Users/buildslave/jenkins/workspace/lldb-cmake/lldb-build/include -I /Users/buildslave/jenkins/workspace/lldb-cmake/llvm-project/llvm/include /Users/buildslave/jenkins/workspace/lldb-cmake/llvm-project/llvm/include/llvm/IR/Intrinsics.td --write-if-changed -o include/llvm/IR/IntrinsicsX86.h -d include/llvm/IR/IntrinsicsX86.h.d [23/2957] cd /Users/buildslave/jenkins/workspace/lldb-cmake/lldb-build && /Users/buildslave/jenkins/workspace/lldb-cmake/lldb-build/bin/llvm-tblgen -gen-intrinsic-enums -intrinsic-prefix=xcore -I /Users/buildslave/jenkins/workspace/lldb-cmake/llvm-project/llvm/include/llvm/IR -I /Applications/Xcode.app/Contents/Developer/Platforms/MacOSX.platform/Developer/SDKs/MacOSX10.15.sdk/usr/include/libxml2 -I /Users/buildslave/jenkins/workspace/lldb-cmake/lldb-build/include -I /Users/buildslave/jenkins/workspace/lldb-cmake/llvm-project/llvm/include /Users/buildslave/jenkins/workspace/lldb-cmake/llvm-project/llvm/include/llvm/IR/Intrinsics.td --write-if-changed -o include/llvm/IR/IntrinsicsXCore.h -d include/llvm/IR/IntrinsicsXCore.h.d [24/2957] cd /Users/buildslave/jenkins/workspace/lldb-cmake/lldb-build/include/llvm/Support && /usr/local/Cellar/cmake/3.17.2/bin/cmake -DNAMES=LLVM -DLLVM_SOURCE_DIR=/Users/buildslave/jenkins/workspace/lldb-cmake/llvm-project/llvm -DHEADER_FILE=/Users/buildslave/jenkins/workspace/lldb-cmake/lldb-build/include/llvm/Support/VCSRevision.h -P /Users/buildslave/jenkins/workspace/lldb-cmake/llvm-project/llvm/cmake/modules/GenerateVersionFromVCS.cmake [25/2957] cd /Users/buildslave/jenkins/workspace/lldb-cmake/lldb-build && /Users/buildslave/jenkins/workspace/lldb-cmake/lldb-build/bin/llvm-tblgen -gen-opt-parser-defs -I /Users/buildslave/jenkins/workspace/lldb-cmake/llvm-project/llvm/lib/ToolDrivers/llvm-dlltool -I /Applications/Xcode.app/Contents/Developer/Platforms/MacOSX.platform/Developer/SDKs/MacOSX10.15.sdk/usr/include/libxml2 -I /Users/buildslave/jenkins/workspace/lldb-cmake/lldb-build/include -I /Users/buildslave/jenkins/workspace/lldb-cmake/llvm-project/llvm/include /Users/buildslave/jenkins/workspace/lldb-cmake/llvm-project/llvm/lib/ToolDrivers/llvm-dlltool/Options.td --write-if-changed -o lib/ToolDrivers/llvm-dlltool/Options.inc -d lib/ToolDrivers/llvm-dlltool/Options.inc.d [26/2957] cd /Users/buildslave/jenkins/workspace/lldb-cmake/lldb-build && /Users/buildslave/jenkins/workspace/lldb-cmake/lldb-build/bin/llvm-tblgen -gen-opt-parser-defs -I /Users/buildslave/jenkins/workspace/lldb-cmake/llvm-project/llvm/lib/ToolDrivers/llvm-lib -I /Applications/Xcode.app/Contents/Developer/Platforms/MacOSX.platform/Developer/SDKs/MacOSX10.15.sdk/usr/include/libxml2 -I /Users/buildslave/jenkins/workspace/lldb-cmake/lldb-build/include -I /Users/buildslave/jenkins/workspace/lldb-cmake/llvm-project/llvm/include /Users/buildslave/jenkins/workspace/lldb-cmake/llvm-project/llvm/lib/ToolDrivers/llvm-lib/Options.td --write-if-changed -o lib/ToolDrivers/llvm-lib/Options.inc -d lib/ToolDrivers/llvm-lib/Options.inc.d [27/2957] cd /Users/buildslave/jenkins/workspace/lldb-cmake/lldb-build && /Users/buildslave/jenkins/workspace/lldb-cmake/lldb-build/bin/llvm-tblgen -gen-callingconv -I /Users/buildslave/jenkins/workspace/lldb-cmake/llvm-project/llvm/lib/Target/Mips -I /Applications/Xcode.app/Contents/Developer/Platforms/MacOSX.platform/Developer/SDKs/MacOSX10.15.sdk/usr/include/libxml2 -I /Users/buildslave/jenkins/workspace/lldb-cmake/lldb-build/include -I /Users/buildslave/jenkins/workspace/lldb-cmake/llvm-project/llvm/include -I /Users/buildslave/jenkins/workspace/lldb-cmake/llvm-project/llvm/lib/Target /Users/buildslave/jenkins/workspace/lldb-cmake/llvm-project/llvm/lib/Target/Mips/Mips.td --write-if-changed -o lib/Target/Mips/MipsGenCallingConv.inc -d lib/Target/Mips/MipsGenCallingConv.inc.d [28/2957] cd /Users/buildslave/jenkins/workspace/lldb-cmake/lldb-build && /Users/buildslave/jenkins/workspace/lldb-cmake/lldb-build/bin/llvm-tblgen -gen-asm-writer -I /Users/buildslave/jenkins/workspace/lldb-cmake/llvm-project/llvm/lib/Target/Mips -I /Applications/Xcode.app/Contents/Developer/Platforms/MacOSX.platform/Developer/SDKs/MacOSX10.15.sdk/usr/include/libxml2 -I /Users/buildslave/jenkins/workspace/lldb-cmake/lldb-build/include -I /Users/buildslave/jenkins/workspace/lldb-cmake/llvm-project/llvm/include -I /Users/buildslave/jenkins/workspace/lldb-cmake/llvm-project/llvm/lib/Target /Users/buildslave/jenkins/workspace/lldb-cmake/llvm-project/llvm/lib/Target/Mips/Mips.td --write-if-changed -o lib/Target/Mips/MipsGenAsmWriter.inc -d lib/Target/Mips/MipsGenAsmWriter.inc.d [29/2957] : && "/Applications/Xcode.app/Contents/Developer/Toolchains/XcodeDefault.xctoolchain/usr/bin/libtool" -static -no_warning_for_no_symbols -o lib/clang/12.0.99/lib/darwin/libclang_rt.fuzzer_ios.a projects/compiler-rt/lib/fuzzer/CMakeFiles/RTfuzzer.ios.dir/FuzzerCrossOver.cpp.o projects/compiler-rt/lib/fuzzer/CMakeFiles/RTfuzzer.ios.dir/FuzzerDataFlowTrace.cpp.o projects/compiler-rt/lib/fuzzer/CMakeFiles/RTfuzzer.ios.dir/FuzzerDriver.cpp.o projects/compiler-rt/lib/fuzzer/CMakeFiles/RTfuzzer.ios.dir/FuzzerExtFunctionsDlsym.cpp.o projects/compiler-rt/lib/fuzzer/CMakeFiles/RTfuzzer.ios.dir/FuzzerExtFunctionsWeak.cpp.o projects/compiler-rt/lib/fuzzer/CMakeFiles/RTfuzzer.ios.dir/FuzzerExtFunctionsWindows.cpp.o projects/compiler-rt/lib/fuzzer/CMakeFiles/RTfuzzer.ios.dir/FuzzerExtraCounters.cpp.o projects/compiler-rt/lib/fuzzer/CMakeFiles/RTfuzzer.ios.dir/FuzzerFork.cpp.o projects/compiler-rt/lib/fuzzer/CMakeFiles/RTfuzzer.ios.dir/FuzzerIO.cpp.o projects/compiler-rt/lib/fuzzer/CMakeFiles/RTfuzzer.ios.dir/FuzzerIOPosix.cpp.o projects/compiler-rt/lib/fuzzer/CMakeFiles/RTfuzzer.ios.dir/FuzzerIOWindows.cpp.o projects/compiler-rt/lib/fuzzer/CMakeFiles/RTfuzzer.ios.dir/FuzzerLoop.cpp.o projects/compiler-rt/lib/fuzzer/CMakeFiles/RTfuzzer.ios.dir/FuzzerMerge.cpp.o projects/compiler-rt/lib/fuzzer/CMakeFiles/RTfuzzer.ios.dir/FuzzerMutate.cpp.o projects/compiler-rt/lib/fuzzer/CMakeFiles/RTfuzzer.ios.dir/FuzzerSHA1.cpp.o projects/compiler-rt/lib/fuzzer/CMakeFiles/RTfuzzer.ios.dir/FuzzerTracePC.cpp.o projects/compiler-rt/lib/fuzzer/CMakeFiles/RTfuzzer.ios.dir/FuzzerUtil.cpp.o projects/compiler-rt/lib/fuzzer/CMakeFiles/RTfuzzer.ios.dir/FuzzerUtilDarwin.cpp.o projects/compiler-rt/lib/fuzzer/CMakeFiles/RTfuzzer.ios.dir/FuzzerUtilFuchsia.cpp.o projects/compiler-rt/lib/fuzzer/CMakeFiles/RTfuzzer.ios.dir/FuzzerUtilLinux.cpp.o projects/compiler-rt/lib/fuzzer/CMakeFiles/RTfuzzer.ios.dir/FuzzerUtilPosix.cpp.o projects/compiler-rt/lib/fuzzer/CMakeFiles/RTfuzzer.ios.dir/FuzzerUtilWindows.cpp.o projects/compiler-rt/lib/fuzzer/CMakeFiles/RTfuzzer_main.ios.dir/FuzzerMain.cpp.o && : [30/2957] : && "/Applications/Xcode.app/Contents/Developer/Toolchains/XcodeDefault.xctoolchain/usr/bin/libtool" -static -no_warning_for_no_symbols -o lib/clang/12.0.99/lib/darwin/libclang_rt.fuzzer_no_main_ios.a projects/compiler-rt/lib/fuzzer/CMakeFiles/RTfuzzer.ios.dir/FuzzerCrossOver.cpp.o projects/compiler-rt/lib/fuzzer/CMakeFiles/RTfuzzer.ios.dir/FuzzerDataFlowTrace.cpp.o projects/compiler-rt/lib/fuzzer/CMakeFiles/RTfuzzer.ios.dir/FuzzerDriver.cpp.o projects/compiler-rt/lib/fuzzer/CMakeFiles/RTfuzzer.ios.dir/FuzzerExtFunctionsDlsym.cpp.o projects/compiler-rt/lib/fuzzer/CMakeFiles/RTfuzzer.ios.dir/FuzzerExtFunctionsWeak.cpp.o projects/compiler-rt/lib/fuzzer/CMakeFiles/RTfuzzer.ios.dir/FuzzerExtFunctionsWindows.cpp.o projects/compiler-rt/lib/fuzzer/CMakeFiles/RTfuzzer.ios.dir/FuzzerExtraCounters.cpp.o projects/compiler-rt/lib/fuzzer/CMakeFiles/RTfuzzer.ios.dir/FuzzerFork.cpp.o projects/compiler-rt/lib/fuzzer/CMakeFiles/RTfuzzer.ios.dir/FuzzerIO.cpp.o projects/compiler-rt/lib/fuzzer/CMakeFiles/RTfuzzer.ios.dir/FuzzerIOPosix.cpp.o projects/compiler-rt/lib/fuzzer/CMakeFiles/RTfuzzer.ios.dir/FuzzerIOWindows.cpp.o projects/compiler-rt/lib/fuzzer/CMakeFiles/RTfuzzer.ios.dir/FuzzerLoop.cpp.o projects/compiler-rt/lib/fuzzer/CMakeFiles/RTfuzzer.ios.dir/FuzzerMerge.cpp.o projects/compiler-rt/lib/fuzzer/CMakeFiles/RTfuzzer.ios.dir/FuzzerMutate.cpp.o projects/compiler-rt/lib/fuzzer/CMakeFiles/RTfuzzer.ios.dir/FuzzerSHA1.cpp.o projects/compiler-rt/lib/fuzzer/CMakeFiles/RTfuzzer.ios.dir/FuzzerTracePC.cpp.o projects/compiler-rt/lib/fuzzer/CMakeFiles/RTfuzzer.ios.dir/FuzzerUtil.cpp.o projects/compiler-rt/lib/fuzzer/CMakeFiles/RTfuzzer.ios.dir/FuzzerUtilDarwin.cpp.o projects/compiler-rt/lib/fuzzer/CMakeFiles/RTfuzzer.ios.dir/FuzzerUtilFuchsia.cpp.o projects/compiler-rt/lib/fuzzer/CMakeFiles/RTfuzzer.ios.dir/FuzzerUtilLinux.cpp.o projects/compiler-rt/lib/fuzzer/CMakeFiles/RTfuzzer.ios.dir/FuzzerUtilPosix.cpp.o projects/compiler-rt/lib/fuzzer/CMakeFiles/RTfuzzer.ios.dir/FuzzerUtilWindows.cpp.o && : [31/2957] cd /Users/buildslave/jenkins/workspace/lldb-cmake/lldb-build && /Users/buildslave/jenkins/workspace/lldb-cmake/lldb-build/bin/llvm-tblgen -gen-asm-matcher -I /Users/buildslave/jenkins/workspace/lldb-cmake/llvm-project/llvm/lib/Target/Mips -I /Applications/Xcode.app/Contents/Developer/Platforms/MacOSX.platform/Developer/SDKs/MacOSX10.15.sdk/usr/include/libxml2 -I /Users/buildslave/jenkins/workspace/lldb-cmake/lldb-build/include -I /Users/buildslave/jenkins/workspace/lldb-cmake/llvm-project/llvm/include -I /Users/buildslave/jenkins/workspace/lldb-cmake/llvm-project/llvm/lib/Target /Users/buildslave/jenkins/workspace/lldb-cmake/llvm-project/llvm/lib/Target/Mips/Mips.td --write-if-changed -o lib/Target/Mips/MipsGenAsmMatcher.inc -d lib/Target/Mips/MipsGenAsmMatcher.inc.d [32/2957] : && "/Applications/Xcode.app/Contents/Developer/Toolchains/XcodeDefault.xctoolchain/usr/bin/libtool" -static -no_warning_for_no_symbols -o lib/clang/12.0.99/lib/darwin/libclang_rt.fuzzer_osx.a projects/compiler-rt/lib/fuzzer/CMakeFiles/RTfuzzer.osx.dir/FuzzerCrossOver.cpp.o projects/compiler-rt/lib/fuzzer/CMakeFiles/RTfuzzer.osx.dir/FuzzerDataFlowTrace.cpp.o projects/compiler-rt/lib/fuzzer/CMakeFiles/RTfuzzer.osx.dir/FuzzerDriver.cpp.o projects/compiler-rt/lib/fuzzer/CMakeFiles/RTfuzzer.osx.dir/FuzzerExtFunctionsDlsym.cpp.o projects/compiler-rt/lib/fuzzer/CMakeFiles/RTfuzzer.osx.dir/FuzzerExtFunctionsWeak.cpp.o projects/compiler-rt/lib/fuzzer/CMakeFiles/RTfuzzer.osx.dir/FuzzerExtFunctionsWindows.cpp.o projects/compiler-rt/lib/fuzzer/CMakeFiles/RTfuzzer.osx.dir/FuzzerExtraCounters.cpp.o projects/compiler-rt/lib/fuzzer/CMakeFiles/RTfuzzer.osx.dir/FuzzerFork.cpp.o projects/compiler-rt/lib/fuzzer/CMakeFiles/RTfuzzer.osx.dir/FuzzerIO.cpp.o projects/compiler-rt/lib/fuzzer/CMakeFiles/RTfuzzer.osx.dir/FuzzerIOPosix.cpp.o projects/compiler-rt/lib/fuzzer/CMakeFiles/RTfuzzer.osx.dir/FuzzerIOWindows.cpp.o projects/compiler-rt/lib/fuzzer/CMakeFiles/RTfuzzer.osx.dir/FuzzerLoop.cpp.o projects/compiler-rt/lib/fuzzer/CMakeFiles/RTfuzzer.osx.dir/FuzzerMerge.cpp.o projects/compiler-rt/lib/fuzzer/CMakeFiles/RTfuzzer.osx.dir/FuzzerMutate.cpp.o projects/compiler-rt/lib/fuzzer/CMakeFiles/RTfuzzer.osx.dir/FuzzerSHA1.cpp.o projects/compiler-rt/lib/fuzzer/CMakeFiles/RTfuzzer.osx.dir/FuzzerTracePC.cpp.o projects/compiler-rt/lib/fuzzer/CMakeFiles/RTfuzzer.osx.dir/FuzzerUtil.cpp.o projects/compiler-rt/lib/fuzzer/CMakeFiles/RTfuzzer.osx.dir/FuzzerUtilDarwin.cpp.o projects/compiler-rt/lib/fuzzer/CMakeFiles/RTfuzzer.osx.dir/FuzzerUtilFuchsia.cpp.o projects/compiler-rt/lib/fuzzer/CMakeFiles/RTfuzzer.osx.dir/FuzzerUtilLinux.cpp.o projects/compiler-rt/lib/fuzzer/CMakeFiles/RTfuzzer.osx.dir/FuzzerUtilPosix.cpp.o projects/compiler-rt/lib/fuzzer/CMakeFiles/RTfuzzer.osx.dir/FuzzerUtilWindows.cpp.o projects/compiler-rt/lib/fuzzer/CMakeFiles/RTfuzzer_main.osx.dir/FuzzerMain.cpp.o && : [33/2957] cd /Users/buildslave/jenkins/workspace/lldb-cmake/lldb-build && /Users/buildslave/jenkins/workspace/lldb-cmake/lldb-build/bin/llvm-tblgen -gen-dag-isel -I /Users/buildslave/jenkins/workspace/lldb-cmake/llvm-project/llvm/lib/Target/Mips -I /Applications/Xcode.app/Contents/Developer/Platforms/MacOSX.platform/Developer/SDKs/MacOSX10.15.sdk/usr/include/libxml2 -I /Users/buildslave/jenkins/workspace/lldb-cmake/lldb-build/include -I /Users/buildslave/jenkins/workspace/lldb-cmake/llvm-project/llvm/include -I /Users/buildslave/jenkins/workspace/lldb-cmake/llvm-project/llvm/lib/Target -omit-comments /Users/buildslave/jenkins/workspace/lldb-cmake/llvm-project/llvm/lib/Target/Mips/Mips.td --write-if-changed -o lib/Target/Mips/MipsGenDAGISel.inc -d lib/Target/Mips/MipsGenDAGISel.inc.d [34/2957] : && /Users/buildslave/jenkins/workspace/lldb-cmake/host-compiler/bin/clang++ -Wdocumentation -fPIC -fvisibility-inlines-hidden -Werror=date-time -Werror=unguarded-availability-new -fmodules -fmodules-cache-path=/Users/buildslave/jenkins/workspace/lldb-cmake/lldb-build/module.cache -fcxx-modules -Xclang -fmodules-local-submodule-visibility -Wall -Wextra -Wno-unused-parameter -Wwrite-strings -Wcast-qual -Wmissing-field-initializers -pedantic -Wno-long-long -Wimplicit-fallthrough -Wcovered-switch-default -Wno-noexcept-type -Wnon-virtual-dtor -Wdelete-non-virtual-dtor -Wsuggest-override -Wstring-conversion -fdiagnostics-color -Wall -std=c++14 -Wno-unused-parameter -O3 -arch x86_64 -isysroot /Applications/Xcode.app/Contents/Developer/Platforms/MacOSX.platform/Developer/SDKs/MacOSX10.15.sdk -dynamiclib -Wl,-headerpad_max_install_names -stdlib=libc++ -lc++ -lc++abi -fapplication-extension -mios-simulator-version-min=9.0 -isysroot /Applications/Xcode.app/Contents/Developer/Platforms/iPhoneSimulator.platform/Developer/SDKs/iPhoneSimulator13.5.sdk -nodefaultlibs -o lib/clang/12.0.99/lib/darwin/libclang_rt.fuzzer_no_main_iossim_dynamic.dylib -install_name @rpath/libclang_rt.fuzzer_no_main_iossim_dynamic.dylib projects/compiler-rt/lib/fuzzer/CMakeFiles/RTfuzzer.iossim.dir/FuzzerCrossOver.cpp.o projects/compiler-rt/lib/fuzzer/CMakeFiles/RTfuzzer.iossim.dir/FuzzerDataFlowTrace.cpp.o projects/compiler-rt/lib/fuzzer/CMakeFiles/RTfuzzer.iossim.dir/FuzzerDriver.cpp.o projects/compiler-rt/lib/fuzzer/CMakeFiles/RTfuzzer.iossim.dir/FuzzerExtFunctionsDlsym.cpp.o projects/compiler-rt/lib/fuzzer/CMakeFiles/RTfuzzer.iossim.dir/FuzzerExtFunctionsWeak.cpp.o projects/compiler-rt/lib/fuzzer/CMakeFiles/RTfuzzer.iossim.dir/FuzzerExtFunctionsWindows.cpp.o projects/compiler-rt/lib/fuzzer/CMakeFiles/RTfuzzer.iossim.dir/FuzzerExtraCounters.cpp.o projects/compiler-rt/lib/fuzzer/CMakeFiles/RTfuzzer.iossim.dir/FuzzerFork.cpp.o projects/compiler-rt/lib/fuzzer/CMakeFiles/RTfuzzer.iossim.dir/FuzzerIO.cpp.o projects/compiler-rt/lib/fuzzer/CMakeFiles/RTfuzzer.iossim.dir/FuzzerIOPosix.cpp.o projects/compiler-rt/lib/fuzzer/CMakeFiles/RTfuzzer.iossim.dir/FuzzerIOWindows.cpp.o projects/compiler-rt/lib/fuzzer/CMakeFiles/RTfuzzer.iossim.dir/FuzzerLoop.cpp.o projects/compiler-rt/lib/fuzzer/CMakeFiles/RTfuzzer.iossim.dir/FuzzerMerge.cpp.o projects/compiler-rt/lib/fuzzer/CMakeFiles/RTfuzzer.iossim.dir/FuzzerMutate.cpp.o projects/compiler-rt/lib/fuzzer/CMakeFiles/RTfuzzer.iossim.dir/FuzzerSHA1.cpp.o projects/compiler-rt/lib/fuzzer/CMakeFiles/RTfuzzer.iossim.dir/FuzzerTracePC.cpp.o projects/compiler-rt/lib/fuzzer/CMakeFiles/RTfuzzer.iossim.dir/FuzzerUtil.cpp.o projects/compiler-rt/lib/fuzzer/CMakeFiles/RTfuzzer.iossim.dir/FuzzerUtilDarwin.cpp.o projects/compiler-rt/lib/fuzzer/CMakeFiles/RTfuzzer.iossim.dir/FuzzerUtilFuchsia.cpp.o projects/compiler-rt/lib/fuzzer/CMakeFiles/RTfuzzer.iossim.dir/FuzzerUtilLinux.cpp.o projects/compiler-rt/lib/fuzzer/CMakeFiles/RTfuzzer.iossim.dir/FuzzerUtilPosix.cpp.o projects/compiler-rt/lib/fuzzer/CMakeFiles/RTfuzzer.iossim.dir/FuzzerUtilWindows.cpp.o -Wl,-rpath,@loader_path/../lib -lc -lstdc++ -lm -lpthread && cd /Users/buildslave/jenkins/workspace/lldb-cmake/lldb-build/lib/clang/12.0.99/lib/darwin && codesign --sign - /Users/buildslave/jenkins/workspace/lldb-cmake/lldb-build/lib/clang/12.0.99/lib/darwin/libclang_rt.fuzzer_no_main_iossim_dynamic.dylib FAILED: lib/clang/12.0.99/lib/darwin/libclang_rt.fuzzer_no_main_iossim_dynamic.dylib : && /Users/buildslave/jenkins/workspace/lldb-cmake/host-compiler/bin/clang++ -Wdocumentation -fPIC -fvisibility-inlines-hidden -Werror=date-time -Werror=unguarded-availability-new -fmodules -fmodules-cache-path=/Users/buildslave/jenkins/workspace/lldb-cmake/lldb-build/module.cache -fcxx-modules -Xclang -fmodules-local-submodule-visibility -Wall -Wextra -Wno-unused-parameter -Wwrite-strings -Wcast-qual -Wmissing-field-initializers -pedantic -Wno-long-long -Wimplicit-fallthrough -Wcovered-switch-default -Wno-noexcept-type -Wnon-virtual-dtor -Wdelete-non-virtual-dtor -Wsuggest-override -Wstring-conversion -fdiagnostics-color -Wall -std=c++14 -Wno-unused-parameter -O3 -arch x86_64 -isysroot /Applications/Xcode.app/Contents/Developer/Platforms/MacOSX.platform/Developer/SDKs/MacOSX10.15.sdk -dynamiclib -Wl,-headerpad_max_install_names -stdlib=libc++ -lc++ -lc++abi -fapplication-extension -mios-simulator-version-min=9.0 -isysroot /Applications/Xcode.app/Contents/Developer/Platforms/iPhoneSimulator.platform/Developer/SDKs/iPhoneSimulator13.5.sdk -nodefaultlibs -o lib/clang/12.0.99/lib/darwin/libclang_rt.fuzzer_no_main_iossim_dynamic.dylib -install_name @rpath/libclang_rt.fuzzer_no_main_iossim_dynamic.dylib projects/compiler-rt/lib/fuzzer/CMakeFiles/RTfuzzer.iossim.dir/FuzzerCrossOver.cpp.o projects/compiler-rt/lib/fuzzer/CMakeFiles/RTfuzzer.iossim.dir/FuzzerDataFlowTrace.cpp.o projects/compiler-rt/lib/fuzzer/CMakeFiles/RTfuzzer.iossim.dir/FuzzerDriver.cpp.o projects/compiler-rt/lib/fuzzer/CMakeFiles/RTfuzzer.iossim.dir/FuzzerExtFunctionsDlsym.cpp.o projects/compiler-rt/lib/fuzzer/CMakeFiles/RTfuzzer.iossim.dir/FuzzerExtFunctionsWeak.cpp.o projects/compiler-rt/lib/fuzzer/CMakeFiles/RTfuzzer.iossim.dir/FuzzerExtFunctionsWindows.cpp.o projects/compiler-rt/lib/fuzzer/CMakeFiles/RTfuzzer.iossim.dir/FuzzerExtraCounters.cpp.o projects/compiler-rt/lib/fuzzer/CMakeFiles/RTfuzzer.iossim.dir/FuzzerFork.cpp.o projects/compiler-rt/lib/fuzzer/CMakeFiles/RTfuzzer.iossim.dir/FuzzerIO.cpp.o projects/compiler-rt/lib/fuzzer/CMakeFiles/RTfuzzer.iossim.dir/FuzzerIOPosix.cpp.o projects/compiler-rt/lib/fuzzer/CMakeFiles/RTfuzzer.iossim.dir/FuzzerIOWindows.cpp.o projects/compiler-rt/lib/fuzzer/CMakeFiles/RTfuzzer.iossim.dir/FuzzerLoop.cpp.o projects/compiler-rt/lib/fuzzer/CMakeFiles/RTfuzzer.iossim.dir/FuzzerMerge.cpp.o projects/compiler-rt/lib/fuzzer/CMakeFiles/RTfuzzer.iossim.dir/FuzzerMutate.cpp.o projects/compiler-rt/lib/fuzzer/CMakeFiles/RTfuzzer.iossim.dir/FuzzerSHA1.cpp.o projects/compiler-rt/lib/fuzzer/CMakeFiles/RTfuzzer.iossim.dir/FuzzerTracePC.cpp.o projects/compiler-rt/lib/fuzzer/CMakeFiles/RTfuzzer.iossim.dir/FuzzerUtil.cpp.o projects/compiler-rt/lib/fuzzer/CMakeFiles/RTfuzzer.iossim.dir/FuzzerUtilDarwin.cpp.o projects/compiler-rt/lib/fuzzer/CMakeFiles/RTfuzzer.iossim.dir/FuzzerUtilFuchsia.cpp.o projects/compiler-rt/lib/fuzzer/CMakeFiles/RTfuzzer.iossim.dir/FuzzerUtilLinux.cpp.o projects/compiler-rt/lib/fuzzer/CMakeFiles/RTfuzzer.iossim.dir/FuzzerUtilPosix.cpp.o projects/compiler-rt/lib/fuzzer/CMakeFiles/RTfuzzer.iossim.dir/FuzzerUtilWindows.cpp.o -Wl,-rpath,@loader_path/../lib -lc -lstdc++ -lm -lpthread && cd /Users/buildslave/jenkins/workspace/lldb-cmake/lldb-build/lib/clang/12.0.99/lib/darwin && codesign --sign - /Users/buildslave/jenkins/workspace/lldb-cmake/lldb-build/lib/clang/12.0.99/lib/darwin/libclang_rt.fuzzer_no_main_iossim_dynamic.dylib ld: library not found for -lstdc++ clang-12: error: linker command failed with exit code 1 (use -v to see invocation) [35/2957] cd /Users/buildslave/jenkins/workspace/lldb-cmake/lldb-build && /Users/buildslave/jenkins/workspace/lldb-cmake/lldb-build/bin/llvm-tblgen -gen-emitter -I /Users/buildslave/jenkins/workspace/lldb-cmake/llvm-project/llvm/lib/Target/Mips -I /Applications/Xcode.app/Contents/Developer/Platforms/MacOSX.platform/Developer/SDKs/MacOSX10.15.sdk/usr/include/libxml2 -I /Users/buildslave/jenkins/workspace/lldb-cmake/lldb-build/include -I /Users/buildslave/jenkins/workspace/lldb-cmake/llvm-project/llvm/include -I /Users/buildslave/jenkins/workspace/lldb-cmake/llvm-project/llvm/lib/Target /Users/buildslave/jenkins/workspace/lldb-cmake/llvm-project/llvm/lib/Target/Mips/Mips.td --write-if-changed -o lib/Target/Mips/MipsGenMCCodeEmitter.inc -d lib/Target/Mips/MipsGenMCCodeEmitter.inc.d [36/2957] cd /Users/buildslave/jenkins/workspace/lldb-cmake/lldb-build && /Users/buildslave/jenkins/workspace/lldb-cmake/lldb-build/bin/llvm-tblgen -gen-pseudo-lowering -I /Users/buildslave/jenkins/workspace/lldb-cmake/llvm-project/llvm/lib/Target/Mips -I /Applications/Xcode.app/Contents/Developer/Platforms/MacOSX.platform/Developer/SDKs/MacOSX10.15.sdk/usr/include/libxml2 -I /Users/buildslave/jenkins/workspace/lldb-cmake/lldb-build/include -I /Users/buildslave/jenkins/workspace/lldb-cmake/llvm-project/llvm/include -I /Users/buildslave/jenkins/workspace/lldb-cmake/llvm-project/llvm/lib/Target /Users/buildslave/jenkins/workspace/lldb-cmake/llvm-project/llvm/lib/Target/Mips/Mips.td --write-if-changed -o lib/Target/Mips/MipsGenMCPseudoLowering.inc -d lib/Target/Mips/MipsGenMCPseudoLowering.inc.d [37/2957] cd /Users/buildslave/jenkins/workspace/lldb-cmake/lldb-build && /Users/buildslave/jenkins/workspace/lldb-cmake/lldb-build/bin/llvm-tblgen -gen-fast-isel -I /Users/buildslave/jenkins/workspace/lldb-cmake/llvm-project/llvm/lib/Target/Mips -I /Applications/Xcode.app/Contents/Developer/Platforms/MacOSX.platform/Developer/SDKs/MacOSX10.15.sdk/usr/include/libxml2 -I /Users/buildslave/jenkins/workspace/lldb-cmake/lldb-build/include -I /Users/buildslave/jenkins/workspace/lldb-cmake/llvm-project/llvm/include -I /Users/buildslave/jenkins/workspace/lldb-cmake/llvm-project/llvm/lib/Target /Users/buildslave/jenkins/workspace/lldb-cmake/llvm-project/llvm/lib/Target/Mips/Mips.td --write-if-changed -o lib/Target/Mips/MipsGenFastISel.inc -d lib/Target/Mips/MipsGenFastISel.inc.d [38/2957] : && /Users/buildslave/jenkins/workspace/lldb-cmake/host-compiler/bin/clang++ -Wdocumentation -fPIC -fvisibility-inlines-hidden -Werror=date-time -Werror=unguarded-availability-new -fmodules -fmodules-cache-path=/Users/buildslave/jenkins/workspace/lldb-cmake/lldb-build/module.cache -fcxx-modules -Xclang -fmodules-local-submodule-visibility -Wall -Wextra -Wno-unused-parameter -Wwrite-strings -Wcast-qual -Wmissing-field-initializers -pedantic -Wno-long-long -Wimplicit-fallthrough -Wcovered-switch-default -Wno-noexcept-type -Wnon-virtual-dtor -Wdelete-non-virtual-dtor -Wsuggest-override -Wstring-conversion -fdiagnostics-color -Wall -std=c++14 -Wno-unused-parameter -O3 -arch arm64 -isysroot /Applications/Xcode.app/Contents/Developer/Platforms/MacOSX.platform/Developer/SDKs/MacOSX10.15.sdk -dynamiclib -Wl,-headerpad_max_install_names -stdlib=libc++ -lc++ -lc++abi -fapplication-extension -miphoneos-version-min=9.0 -isysroot /Applications/Xcode.app/Contents/Developer/Platforms/iPhoneOS.platform/Developer/SDKs/iPhoneOS13.5.sdk -nodefaultlibs -o lib/clang/12.0.99/lib/darwin/libclang_rt.fuzzer_no_main_ios_dynamic.dylib -install_name @rpath/libclang_rt.fuzzer_no_main_ios_dynamic.dylib projects/compiler-rt/lib/fuzzer/CMakeFiles/RTfuzzer.ios.dir/FuzzerCrossOver.cpp.o projects/compiler-rt/lib/fuzzer/CMakeFiles/RTfuzzer.ios.dir/FuzzerDataFlowTrace.cpp.o projects/compiler-rt/lib/fuzzer/CMakeFiles/RTfuzzer.ios.dir/FuzzerDriver.cpp.o projects/compiler-rt/lib/fuzzer/CMakeFiles/RTfuzzer.ios.dir/FuzzerExtFunctionsDlsym.cpp.o projects/compiler-rt/lib/fuzzer/CMakeFiles/RTfuzzer.ios.dir/FuzzerExtFunctionsWeak.cpp.o projects/compiler-rt/lib/fuzzer/CMakeFiles/RTfuzzer.ios.dir/FuzzerExtFunctionsWindows.cpp.o projects/compiler-rt/lib/fuzzer/CMakeFiles/RTfuzzer.ios.dir/FuzzerExtraCounters.cpp.o projects/compiler-rt/lib/fuzzer/CMakeFiles/RTfuzzer.ios.dir/FuzzerFork.cpp.o projects/compiler-rt/lib/fuzzer/CMakeFiles/RTfuzzer.ios.dir/FuzzerIO.cpp.o projects/compiler-rt/lib/fuzzer/CMakeFiles/RTfuzzer.ios.dir/FuzzerIOPosix.cpp.o projects/compiler-rt/lib/fuzzer/CMakeFiles/RTfuzzer.ios.dir/FuzzerIOWindows.cpp.o projects/compiler-rt/lib/fuzzer/CMakeFiles/RTfuzzer.ios.dir/FuzzerLoop.cpp.o projects/compiler-rt/lib/fuzzer/CMakeFiles/RTfuzzer.ios.dir/FuzzerMerge.cpp.o projects/compiler-rt/lib/fuzzer/CMakeFiles/RTfuzzer.ios.dir/FuzzerMutate.cpp.o projects/compiler-rt/lib/fuzzer/CMakeFiles/RTfuzzer.ios.dir/FuzzerSHA1.cpp.o projects/compiler-rt/lib/fuzzer/CMakeFiles/RTfuzzer.ios.dir/FuzzerTracePC.cpp.o projects/compiler-rt/lib/fuzzer/CMakeFiles/RTfuzzer.ios.dir/FuzzerUtil.cpp.o projects/compiler-rt/lib/fuzzer/CMakeFiles/RTfuzzer.ios.dir/FuzzerUtilDarwin.cpp.o projects/compiler-rt/lib/fuzzer/CMakeFiles/RTfuzzer.ios.dir/FuzzerUtilFuchsia.cpp.o projects/compiler-rt/lib/fuzzer/CMakeFiles/RTfuzzer.ios.dir/FuzzerUtilLinux.cpp.o projects/compiler-rt/lib/fuzzer/CMakeFiles/RTfuzzer.ios.dir/FuzzerUtilPosix.cpp.o projects/compiler-rt/lib/fuzzer/CMakeFiles/RTfuzzer.ios.dir/FuzzerUtilWindows.cpp.o -Wl,-rpath,@loader_path/../lib -lc -lstdc++ -lm -lpthread && cd /Users/buildslave/jenkins/workspace/lldb-cmake/lldb-build/lib/clang/12.0.99/lib/darwin && codesign --sign - /Users/buildslave/jenkins/workspace/lldb-cmake/lldb-build/lib/clang/12.0.99/lib/darwin/libclang_rt.fuzzer_no_main_ios_dynamic.dylib FAILED: lib/clang/12.0.99/lib/darwin/libclang_rt.fuzzer_no_main_ios_dynamic.dylib : && /Users/buildslave/jenkins/workspace/lldb-cmake/host-compiler/bin/clang++ -Wdocumentation -fPIC -fvisibility-inlines-hidden -Werror=date-time -Werror=unguarded-availability-new -fmodules -fmodules-cache-path=/Users/buildslave/jenkins/workspace/lldb-cmake/lldb-build/module.cache -fcxx-modules -Xclang -fmodules-local-submodule-visibility -Wall -Wextra -Wno-unused-parameter -Wwrite-strings -Wcast-qual -Wmissing-field-initializers -pedantic -Wno-long-long -Wimplicit-fallthrough -Wcovered-switch-default -Wno-noexcept-type -Wnon-virtual-dtor -Wdelete-non-virtual-dtor -Wsuggest-override -Wstring-conversion -fdiagnostics-color -Wall -std=c++14 -Wno-unused-parameter -O3 -arch arm64 -isysroot /Applications/Xcode.app/Contents/Developer/Platforms/MacOSX.platform/Developer/SDKs/MacOSX10.15.sdk -dynamiclib -Wl,-headerpad_max_install_names -stdlib=libc++ -lc++ -lc++abi -fapplication-extension -miphoneos-version-min=9.0 -isysroot /Applications/Xcode.app/Contents/Developer/Platforms/iPhoneOS.platform/Developer/SDKs/iPhoneOS13.5.sdk -nodefaultlibs -o lib/clang/12.0.99/lib/darwin/libclang_rt.fuzzer_no_main_ios_dynamic.dylib -install_name @rpath/libclang_rt.fuzzer_no_main_ios_dynamic.dylib projects/compiler-rt/lib/fuzzer/CMakeFiles/RTfuzzer.ios.dir/FuzzerCrossOver.cpp.o projects/compiler-rt/lib/fuzzer/CMakeFiles/RTfuzzer.ios.dir/FuzzerDataFlowTrace.cpp.o projects/compiler-rt/lib/fuzzer/CMakeFiles/RTfuzzer.ios.dir/FuzzerDriver.cpp.o projects/compiler-rt/lib/fuzzer/CMakeFiles/RTfuzzer.ios.dir/FuzzerExtFunctionsDlsym.cpp.o projects/compiler-rt/lib/fuzzer/CMakeFiles/RTfuzzer.ios.dir/FuzzerExtFunctionsWeak.cpp.o projects/compiler-rt/lib/fuzzer/CMakeFiles/RTfuzzer.ios.dir/FuzzerExtFunctionsWindows.cpp.o projects/compiler-rt/lib/fuzzer/CMakeFiles/RTfuzzer.ios.dir/FuzzerExtraCounters.cpp.o projects/compiler-rt/lib/fuzzer/CMakeFiles/RTfuzzer.ios.dir/FuzzerFork.cpp.o projects/compiler-rt/lib/fuzzer/CMakeFiles/RTfuzzer.ios.dir/FuzzerIO.cpp.o projects/compiler-rt/lib/fuzzer/CMakeFiles/RTfuzzer.ios.dir/FuzzerIOPosix.cpp.o projects/compiler-rt/lib/fuzzer/CMakeFiles/RTfuzzer.ios.dir/FuzzerIOWindows.cpp.o projects/compiler-rt/lib/fuzzer/CMakeFiles/RTfuzzer.ios.dir/FuzzerLoop.cpp.o projects/compiler-rt/lib/fuzzer/CMakeFiles/RTfuzzer.ios.dir/FuzzerMerge.cpp.o projects/compiler-rt/lib/fuzzer/CMakeFiles/RTfuzzer.ios.dir/FuzzerMutate.cpp.o projects/compiler-rt/lib/fuzzer/CMakeFiles/RTfuzzer.ios.dir/FuzzerSHA1.cpp.o projects/compiler-rt/lib/fuzzer/CMakeFiles/RTfuzzer.ios.dir/FuzzerTracePC.cpp.o projects/compiler-rt/lib/fuzzer/CMakeFiles/RTfuzzer.ios.dir/FuzzerUtil.cpp.o projects/compiler-rt/lib/fuzzer/CMakeFiles/RTfuzzer.ios.dir/FuzzerUtilDarwin.cpp.o projects/compiler-rt/lib/fuzzer/CMakeFiles/RTfuzzer.ios.dir/FuzzerUtilFuchsia.cpp.o projects/compiler-rt/lib/fuzzer/CMakeFiles/RTfuzzer.ios.dir/FuzzerUtilLinux.cpp.o projects/compiler-rt/lib/fuzzer/CMakeFiles/RTfuzzer.ios.dir/FuzzerUtilPosix.cpp.o projects/compiler-rt/lib/fuzzer/CMakeFiles/RTfuzzer.ios.dir/FuzzerUtilWindows.cpp.o -Wl,-rpath,@loader_path/../lib -lc -lstdc++ -lm -lpthread && cd /Users/buildslave/jenkins/workspace/lldb-cmake/lldb-build/lib/clang/12.0.99/lib/darwin && codesign --sign - /Users/buildslave/jenkins/workspace/lldb-cmake/lldb-build/lib/clang/12.0.99/lib/darwin/libclang_rt.fuzzer_no_main_ios_dynamic.dylib ld: library not found for -lstdc++ clang-12: error: linker command failed with exit code 1 (use -v to see invocation) [39/2957] cd /Users/buildslave/jenkins/workspace/lldb-cmake/lldb-build && /Users/buildslave/jenkins/workspace/lldb-cmake/lldb-build/bin/llvm-tblgen -gen-disassembler -I /Users/buildslave/jenkins/workspace/lldb-cmake/llvm-project/llvm/lib/Target/Mips -I /Applications/Xcode.app/Contents/Developer/Platforms/MacOSX.platform/Developer/SDKs/MacOSX10.15.sdk/usr/include/libxml2 -I /Users/buildslave/jenkins/workspace/lldb-cmake/lldb-build/include -I /Users/buildslave/jenkins/workspace/lldb-cmake/llvm-project/llvm/include -I /Users/buildslave/jenkins/workspace/lldb-cmake/llvm-project/llvm/lib/Target /Users/buildslave/jenkins/workspace/lldb-cmake/llvm-project/llvm/lib/Target/Mips/Mips.td --write-if-changed -o lib/Target/Mips/MipsGenDisassemblerTables.inc -d lib/Target/Mips/MipsGenDisassemblerTables.inc.d [40/2957] cd /Users/buildslave/jenkins/workspace/lldb-cmake/lldb-build && /Users/buildslave/jenkins/workspace/lldb-cmake/lldb-build/bin/llvm-tblgen -gen-register-info -I /Users/buildslave/jenkins/workspace/lldb-cmake/llvm-project/llvm/lib/Target/Mips -I /Applications/Xcode.app/Contents/Developer/Platforms/MacOSX.platform/Developer/SDKs/MacOSX10.15.sdk/usr/include/libxml2 -I /Users/buildslave/jenkins/workspace/lldb-cmake/lldb-build/include -I /Users/buildslave/jenkins/workspace/lldb-cmake/llvm-project/llvm/include -I /Users/buildslave/jenkins/workspace/lldb-cmake/llvm-project/llvm/lib/Target /Users/buildslave/jenkins/workspace/lldb-cmake/llvm-project/llvm/lib/Target/Mips/Mips.td --write-if-changed -o lib/Target/Mips/MipsGenRegisterInfo.inc -d lib/Target/Mips/MipsGenRegisterInfo.inc.d [41/2957] cd /Users/buildslave/jenkins/workspace/lldb-cmake/lldb-build && /Users/buildslave/jenkins/workspace/lldb-cmake/lldb-build/bin/llvm-tblgen -gen-global-isel -I /Users/buildslave/jenkins/workspace/lldb-cmake/llvm-project/llvm/lib/Target/Mips -I /Applications/Xcode.app/Contents/Developer/Platforms/MacOSX.platform/Developer/SDKs/MacOSX10.15.sdk/usr/include/libxml2 -I /Users/buildslave/jenkins/workspace/lldb-cmake/lldb-build/include -I /Users/buildslave/jenkins/workspace/lldb-cmake/llvm-project/llvm/include -I /Users/buildslave/jenkins/workspace/lldb-cmake/llvm-project/llvm/lib/Target /Users/buildslave/jenkins/workspace/lldb-cmake/llvm-project/llvm/lib/Target/Mips/Mips.td --write-if-changed -o lib/Target/Mips/MipsGenGlobalISel.inc -d lib/Target/Mips/MipsGenGlobalISel.inc.d [42/2957] cd /Users/buildslave/jenkins/workspace/lldb-cmake/lldb-build && /Users/buildslave/jenkins/workspace/lldb-cmake/lldb-build/bin/llvm-tblgen -gen-instr-info -I /Users/buildslave/jenkins/workspace/lldb-cmake/llvm-project/llvm/lib/Target/Mips -I /Applications/Xcode.app/Contents/Developer/Platforms/MacOSX.platform/Developer/SDKs/MacOSX10.15.sdk/usr/include/libxml2 -I /Users/buildslave/jenkins/workspace/lldb-cmake/lldb-build/include -I /Users/buildslave/jenkins/workspace/lldb-cmake/llvm-project/llvm/include -I /Users/buildslave/jenkins/workspace/lldb-cmake/llvm-project/llvm/lib/Target /Users/buildslave/jenkins/workspace/lldb-cmake/llvm-project/llvm/lib/Target/Mips/Mips.td --write-if-changed -o lib/Target/Mips/MipsGenInstrInfo.inc -d lib/Target/Mips/MipsGenInstrInfo.inc.d [43/2957] /Users/buildslave/jenkins/workspace/lldb-cmake/host-compiler/bin/clang++ -DGTEST_HAS_RTTI=0 -D_DEBUG -D__STDC_CONSTANT_MACROS -D__STDC_FORMAT_MACROS -D__STDC_LIMIT_MACROS -Ilib/Frontend/OpenACC -I/Users/buildslave/jenkins/workspace/lldb-cmake/llvm-project/llvm/lib/Frontend/OpenACC -I/Applications/Xcode.app/Contents/Developer/Platforms/MacOSX.platform/Developer/SDKs/MacOSX10.15.sdk/usr/include/libxml2 -Iinclude -I/Users/buildslave/jenkins/workspace/lldb-cmake/llvm-project/llvm/include -Wdocumentation -fPIC -fvisibility-inlines-hidden -Werror=date-time -Werror=unguarded-availability-new -fmodules -fmodules-cache-path=/Users/buildslave/jenkins/workspace/lldb-cmake/lldb-build/module.cache -fcxx-modules -Xclang -fmodules-local-submodule-visibility -Wall -Wextra -Wno-unused-parameter -Wwrite-strings -Wcast-qual -Wmissing-field-initializers -pedantic -Wno-long-long -Wimplicit-fallthrough -Wcovered-switch-default -Wno-noexcept-type -Wnon-virtual-dtor -Wdelete-non-virtual-dtor -Wsuggest-override -Wstring-conversion -fdiagnostics-color -O3 -isysroot /Applications/Xcode.app/Contents/Developer/Platforms/MacOSX.platform/Developer/SDKs/MacOSX10.15.sdk -fno-exceptions -fno-rtti -UNDEBUG -std=c++14 -MD -MT lib/Frontend/OpenACC/CMakeFiles/LLVMFrontendOpenACC.dir/ACC.cpp.o -MF lib/Frontend/OpenACC/CMakeFiles/LLVMFrontendOpenACC.dir/ACC.cpp.o.d -o lib/Frontend/OpenACC/CMakeFiles/LLVMFrontendOpenACC.dir/ACC.cpp.o -c lib/Frontend/OpenACC/ACC.cpp ninja: build stopped: subcommand failed. Command failed: Command '['/usr/local/bin/ninja', '-v']' returned non-zero exit status 1 Command: ['/usr/local/bin/ninja', '-v'] [Pipeline] } [Pipeline] // timeout [Pipeline] } [Pipeline] // stage [Pipeline] stage [Pipeline] { (Test) Stage "Test" skipped due to earlier failure(s) [Pipeline] } [Pipeline] // stage [Pipeline] stage [Pipeline] { (Declarative: Post Actions) [Pipeline] scanForIssues [Clang (LLVM based)] Sleeping for 5 seconds due to JENKINS-32191... [Clang (LLVM based)] Parsing console log (workspace: '/Users/buildslave/jenkins/workspace/lldb-cmake') [Clang (LLVM based)] Successfully parsed console log [Clang (LLVM based)] -> found 0 issues (skipped 0 duplicates) [Clang (LLVM based)] Skipping post processing [Clang (LLVM based)] No filter has been set, publishing all 0 issues [Pipeline] junit Recording test results Test reports were found but none of them are new. Did leafNodes run? For example, /Users/buildslave/jenkins/workspace/lldb-cmake/test/results.xml is 25 min old

Hide Details

Error when executing always post condition: Also: hudson.remoting.Channel$CallSiteStackTrace: Remote call to green-dragon-10 at hudson.remoting.Channel.attachCallSiteStackTrace(Channel.java:1788) at hudson.remoting.UserRequest$ExceptionResponse.retrieve(UserRequest.java:356) at hudson.remoting.Channel.call(Channel.java:998) at hudson.FilePath.act(FilePath.java:1069) at hudson.FilePath.act(FilePath.java:1058) at hudson.tasks.junit.JUnitParser.parseResult(JUnitParser.java:114) at hudson.tasks.junit.JUnitResultArchiver.parse(JUnitResultArchiver.java:137) at hudson.tasks.junit.JUnitResultArchiver.parseAndAttach(JUnitResultArchiver.java:167) at hudson.tasks.junit.pipeline.JUnitResultsStepExecution.run(JUnitResultsStepExecution.java:52) at hudson.tasks.junit.pipeline.JUnitResultsStepExecution.run(JUnitResultsStepExecution.java:25) at org.jenkinsci.plugins.workflow.steps.SynchronousNonBlockingStepExecution.lambda$start$0(SynchronousNonBlockingStepExecution.java:47) at java.util.concurrent.Executors$RunnableAdapter.call(Executors.java:511) at java.util.concurrent.FutureTask.run(FutureTask.java:266) at java.util.concurrent.ThreadPoolExecutor.runWorker(ThreadPoolExecutor.java:1149) at java.util.concurrent.ThreadPoolExecutor$Worker.run(ThreadPoolExecutor.java:624) at java.lang.Thread.run(Thread.java:748) hudson.AbortException: Test reports were found but none of them are new. Did leafNodes run? For example, /Users/buildslave/jenkins/workspace/lldb-cmake/test/results.xml is 25 min old

Hide Details

at hudson.tasks.junit.TestResult.parse(TestResult.java:222) at hudson.tasks.junit.TestResult.parse(TestResult.java:178) at hudson.tasks.junit.TestResult.<init>(TestResult.java:143) at hudson.tasks.junit.JUnitParser$ParseResultCallable.invoke(JUnitParser.java:146) at hudson.tasks.junit.JUnitParser$ParseResultCallable.invoke(JUnitParser.java:118) at hudson.FilePath$FileCallableWrapper.call(FilePath.java:3073) at hudson.remoting.UserRequest.perform(UserRequest.java:211) at hudson.remoting.UserRequest.perform(UserRequest.java:54) at hudson.remoting.Request$2.run(Request.java:369) at hudson.remoting.InterceptingExecutorService$1.call(InterceptingExecutorService.java:72) at java.util.concurrent.FutureTask.run(Unknown Source) at java.util.concurrent.ThreadPoolExecutor.runWorker(Unknown Source) at java.util.concurrent.ThreadPoolExecutor$Worker.run(Unknown Source) at java.lang.Thread.run(Unknown Source)

Hide Details

[Pipeline] } [Pipeline] // stage [Pipeline] } [Pipeline] // withEnv [Pipeline] } [Pipeline] // node [Pipeline] End of Pipeline ERROR: script returned exit code 1 Finished: FAILURE