FailedConsole Output

Skipping 9,015 KB.. Full Log
rter.CompleteFwdDeclWithOtherOrigin (667 of 2152)
PASS: lldb-unit :: Symbol/./SymbolTests/Type.GetTypeScopeAndBasename (668 of 2152)
PASS: lldb-api :: functionalities/data-formatter/dump_dynamic/TestDumpDynamic.py (669 of 2152)
PASS: lldb-unit :: UnwindAssembly/x86/./UnwindAssemblyx86Tests/Testx86AssemblyInspectionEngine.Test64bitFramelessSmallStackFrame (670 of 2152)
UNSUPPORTED: lldb-shell :: SymbolFile/PDB/class-layout.test (671 of 2152)
PASS: lldb-api :: tools/lldb-server/commandline/TestStubSetSID.py (672 of 2152)
PASS: lldb-unit :: UnwindAssembly/x86/./UnwindAssemblyx86Tests/Testx86AssemblyInspectionEngine.Test32bitFramelessBigStackFrame (673 of 2152)
PASS: lldb-api :: functionalities/data-formatter/pyobjsynthprovider/TestPyObjSynthProvider.py (674 of 2152)
PASS: lldb-unit :: Utility/./UtilityTests/UriParserTest.BracketedHostnameWithPortIPv6 (675 of 2152)
PASS: lldb-api :: commands/target/stop-hook/disable/TestTargetStopHookDisable.py (676 of 2152)
PASS: lldb-api :: lang/cpp/const_this/TestConstThis.py (677 of 2152)
PASS: lldb-unit :: Process/gdb-remote/./ProcessGdbRemoteTests/GDBRemoteCommunicationClientTest.WriteRegister (678 of 2152)
PASS: lldb-shell :: SymbolFile/NativePDB/nested-types.cpp (679 of 2152)
PASS: lldb-api :: functionalities/breakpoint/dummy_target_breakpoints/TestBreakpointsWithNoTargets.py (680 of 2152)
PASS: lldb-unit :: ScriptInterpreter/Python/./ScriptInterpreterPythonTests/PythonDataObjectsTest.TestPythonCallableInvoke (681 of 2152)
PASS: lldb-shell :: Quit/TestQuitExitCodeTooManyArgs.test (682 of 2152)
UNSUPPORTED: lldb-shell :: SymbolFile/PDB/calling-conventions.test (683 of 2152)
PASS: lldb-shell :: SymbolFile/DWARF/find-basic-type.cpp (684 of 2152)
PASS: lldb-unit :: UnwindAssembly/x86/./UnwindAssemblyx86Tests/Testx86AssemblyInspectionEngine.TestPushEDX (685 of 2152)
PASS: lldb-unit :: UnwindAssembly/ARM64/./Arm64InstEmulationTests/TestArm64InstEmulation.TestSimpleDarwinFunction (686 of 2152)
PASS: lldb-api :: commands/expression/call-function/TestCallStopAndContinue.py (687 of 2152)
PASS: lldb-api :: macosx/profile_vrs_detach/TestDetachVrsProfile.py (688 of 2152)
PASS: lldb-unit :: Utility/./UtilityTests/UriParserTest.PortOverflow (689 of 2152)
PASS: lldb-unit :: Utility/./UtilityTests/BinaryStreamTest.PutULEB128MaxValue (690 of 2152)
PASS: lldb-unit :: Process/gdb-remote/./ProcessGdbRemoteTests/GDBRemoteCommunicationClientTest.ReadRegister (691 of 2152)
PASS: lldb-api :: commands/expression/import-std-module/deque-basic/TestDequeFromStdModule.py (692 of 2152)
PASS: lldb-api :: commands/expression/function_template_specialization_temp_args/TestFunctionTemplateSpecializationTempArgs.py (693 of 2152)
PASS: lldb-unit :: ObjectFile/Breakpad/./ObjectFileBreakpadTests/FuncRecord.parse (694 of 2152)
PASS: lldb-unit :: Utility/./UtilityTests/StreamTest.PutMaxHex64ByteOrderBig (695 of 2152)
PASS: lldb-unit :: Process/minidump/./LLDBMinidumpTests/MinidumpParserTest.GetMiscInfo_no_stream (696 of 2152)
PASS: lldb-api :: functionalities/gdb_remote_client/TestIOSSimulator.py (697 of 2152)
PASS: lldb-unit :: Process/gdb-remote/./ProcessGdbRemoteTests/GDBRemoteClientBaseTest.SendContinueDelegateStructuredDataReceipt (698 of 2152)
PASS: lldb-api :: functionalities/breakpoint/breakpoint_by_file_colon_line/TestBreakpointByFileColonLine.py (699 of 2152)
PASS: lldb-api :: commands/expression/static-initializers/TestStaticInitializers.py (700 of 2152)
PASS: lldb-api :: commands/expression/import-std-module/deque-dbg-info-content/TestDbgInfoContentDequeFromStdModule.py (701 of 2152)
PASS: lldb-unit :: Expression/./ExpressionTests/CppModuleConfigurationTest.AmbiguousLibCpp (702 of 2152)
PASS: lldb-unit :: Utility/./UtilityTests/RegularExpression.Empty (703 of 2152)
PASS: lldb-unit :: Utility/./UtilityTests/StreamTest.PutBytesAsRawHex8ToLittleEndian (704 of 2152)
XFAIL: lldb-shell :: Register/x86-mm-xmm-write.test (705 of 2152)
PASS: lldb-api :: lang/cpp/virtual-overload/TestVirtualOverload.py (706 of 2152)
PASS: lldb-unit :: ObjectFile/PECOFF/./ObjectFilePECOFFTests/PECallFrameInfoTest.Chained_eh (707 of 2152)
PASS: lldb-shell :: SymbolFile/DWARF/win-i386-line-table.s (708 of 2152)
PASS: lldb-unit :: UnwindAssembly/x86/./UnwindAssemblyx86Tests/Testx86AssemblyInspectionEngine.TestPushImm (709 of 2152)
PASS: lldb-unit :: Symbol/./SymbolTests/TestTypeSystemClang.TestGetTypeClassTypeOfExpr (710 of 2152)
PASS: lldb-api :: lang/cpp/incomplete-types/TestCppIncompleteTypes.py (711 of 2152)
PASS: lldb-unit :: Utility/./UtilityTests/ConstStringTest.YAML (712 of 2152)
PASS: lldb-api :: commands/expression/import-std-module/shared_ptr-dbg-info-content/TestSharedPtrDbgInfoContentFromStdModule.py (713 of 2152)
PASS: lldb-unit :: Core/./LLDBCoreTests/ModuleSpecTest.InvalidInMemoryBuffer (714 of 2152)
PASS: lldb-unit :: Utility/./UtilityTests/ScalarTest.Scalar_512 (715 of 2152)
PASS: lldb-unit :: Utility/./UtilityTests/ArgsTest.TestTrailingBackslash (716 of 2152)
PASS: lldb-shell :: Minidump/Windows/arm-fp-unwind.test (717 of 2152)
PASS: lldb-api :: functionalities/unwind/sigtramp/TestSigtrampUnwind.py (718 of 2152)
PASS: lldb-shell :: ObjectFile/ELF/PT_LOAD.yaml (719 of 2152)
PASS: lldb-unit :: Utility/./UtilityTests/RangeTest.Constructor (720 of 2152)
PASS: lldb-unit :: Utility/./UtilityTests/RegularExpression.CopyAssignment (721 of 2152)
PASS: lldb-shell :: Quit/TestQuitExitCodeNonInt.test (722 of 2152)
PASS: lldb-shell :: Reproducer/Functionalities/TestExpressionEvaluation.test (723 of 2152)
PASS: lldb-unit :: SymbolFile/NativePDB/./SymbolFileNativePDBTests/PDBFPOProgramToDWARFExpressionTests.DependencyChain (724 of 2152)
PASS: lldb-unit :: Expression/./ExpressionTests/DiagnosticManagerTest.GetStringBasic (725 of 2152)
PASS: lldb-api :: macosx/function-starts/TestFunctionStarts.py (726 of 2152)
UNSUPPORTED: lldb-api :: functionalities/darwin_log/filter/regex/category/TestDarwinLogFilterRegexCategory.py (727 of 2152)
UNSUPPORTED: lldb-shell :: ScriptInterpreter/Lua/breakpoint_callback.test (728 of 2152)
PASS: lldb-api :: functionalities/inferior-crashing/recursive-inferior/TestRecursiveInferiorStep.py (729 of 2152)
PASS: lldb-api :: functionalities/asan/TestReportData.py (730 of 2152)
PASS: lldb-shell :: Quit/TestQuitExitCodeHexA.test (731 of 2152)
PASS: lldb-unit :: UnwindAssembly/x86/./UnwindAssemblyx86Tests/Testx86AssemblyInspectionEngine.TestDisassemblyJunkBytes (732 of 2152)
PASS: lldb-unit :: Expression/./ExpressionTests/DiagnosticManagerTest.FixedExpression (733 of 2152)
PASS: lldb-api :: lang/cpp/type_lookup/TestCppTypeLookup.py (734 of 2152)
PASS: lldb-unit :: Symbol/./SymbolTests/TestTypeSystemClang.TestDeletingImplicitCopyCstrDueToMoveCStr (735 of 2152)
PASS: lldb-unit :: Host/./HostTests/MainLoopTest.ReadObject (736 of 2152)
UNSUPPORTED: lldb-api :: functionalities/breakpoint/breakpoint_in_delayslot/TestAvoidBreakpointInDelaySlot.py (737 of 2152)
PASS: lldb-api :: types/TestIntegerType.py (738 of 2152)
PASS: lldb-shell :: Commands/command-regex-delete.test (739 of 2152)
PASS: lldb-api :: commands/expression/import_builtin_fileid/TestImportBuiltinFileID.py (740 of 2152)
PASS: lldb-unit :: Utility/./UtilityTests/FileSpecTest.PrependPathComponent (741 of 2152)
UNSUPPORTED: lldb-api :: functionalities/process_save_core/TestProcessSaveCore.py (742 of 2152)
PASS: lldb-api :: commands/expression/radar_9673664/TestExprHelpExamples.py (743 of 2152)
PASS: lldb-api :: commands/expression/pr35310/TestExprsBug35310.py (744 of 2152)
PASS: lldb-unit :: Utility/./UtilityTests/OptionsWithRawTest.LeadingSpaceArgs (745 of 2152)
PASS: lldb-unit :: Utility/./UtilityTests/RangeTest.Slide (746 of 2152)
PASS: lldb-unit :: UnwindAssembly/x86/./UnwindAssemblyx86Tests/Testx86AssemblyInspectionEngine.TestPushExtended (747 of 2152)
UNSUPPORTED: lldb-api :: python_api/event/TestEvents.py (748 of 2152)
PASS: lldb-unit :: Utility/./UtilityTests/Predicate.WaitForValueEqualTo (749 of 2152)
PASS: lldb-unit :: ObjectFile/Breakpad/./ObjectFileBreakpadTests/FileRecord.parse (750 of 2152)
PASS: lldb-unit :: Utility/./UtilityTests/VASprintfTest.EncodingError (751 of 2152)
PASS: lldb-api :: tools/lldb-vscode/module/TestVSCode_module.py (752 of 2152)
PASS: lldb-shell :: Breakpoint/jitbp_elf.test (753 of 2152)
PASS: lldb-unit :: Utility/./UtilityTests/PassiveReplayTest.InstrumentedBar (754 of 2152)
PASS: lldb-api :: functionalities/memory-region/TestMemoryRegion.py (755 of 2152)
PASS: lldb-api :: python_api/value/TestValueAPI.py (756 of 2152)
PASS: lldb-api :: functionalities/thread/concurrent_events/TestConcurrentBreakpointOneDelayBreakpointThreads.py (757 of 2152)
PASS: lldb-unit :: Utility/./UtilityTests/LogChannelEnabledTest.LLDB_LOG_ERROR (758 of 2152)
PASS: lldb-unit :: Utility/./UtilityTests/ProcessInstanceInfo.DumpTable (759 of 2152)
PASS: lldb-shell :: ExecControl/StopHook/stop-hook.test (760 of 2152)
PASS: lldb-api :: commands/expression/unwind_expression/TestUnwindExpression.py (761 of 2152)
UNSUPPORTED: lldb-shell :: SymbolFile/NativePDB/stack_unwinding01.cpp (762 of 2152)
PASS: lldb-api :: lang/cpp/breakpoint_in_member_func_w_non_primitive_params/TestBreakpointInMemberFuncWNonPrimitiveParams.py (763 of 2152)
UNSUPPORTED: lldb-api :: linux/mix-dwo-and-regular-objects/TestMixedDwarfBinary.py (764 of 2152)
PASS: lldb-api :: lang/c/inlines/TestRedefinitionsInInlines.py (765 of 2152)
PASS: lldb-unit :: Utility/./UtilityTests/FileSpecTest.GetPath (766 of 2152)
PASS: lldb-api :: functionalities/data-formatter/summary-string-onfail/Test-rdar-9974002.py (767 of 2152)
PASS: lldb-unit :: Utility/./UtilityTests/LogChannelTest.Disable (768 of 2152)
PASS: lldb-unit :: Symbol/./SymbolTests/TestTypeSystemClang.TestGetBasicTypeFromName (769 of 2152)
PASS: lldb-unit :: tools/lldb-server/tests/./LLDBServerTests/TestBase.LaunchModePreservesEnvironment (770 of 2152)
PASS: lldb-shell :: ScriptInterpreter/Python/eof.test (771 of 2152)
PASS: lldb-api :: functionalities/breakpoint/auto_continue/TestBreakpointAutoContinue.py (772 of 2152)
PASS: lldb-api :: macosx/order/TestOrderFile.py (773 of 2152)
UNSUPPORTED: lldb-api :: tools/lldb-server/TestGdbRemoteModuleInfo.py (774 of 2152)
PASS: lldb-unit :: UnwindAssembly/x86/./UnwindAssemblyx86Tests/Testx86AssemblyInspectionEngine.TestPushEBP (775 of 2152)
PASS: lldb-api :: functionalities/thread/concurrent_events/TestConcurrentTwoWatchpointsOneSignal.py (776 of 2152)
PASS: lldb-shell :: SymbolFile/DWARF/debug_aranges-empty-section.s (777 of 2152)
PASS: lldb-unit :: Utility/./UtilityTests/SubsystemRAIITest.NormalSubsystem (778 of 2152)
PASS: lldb-unit :: Utility/./UtilityTests/StreamTest.AddressPrefix (779 of 2152)
PASS: lldb-unit :: Utility/./UtilityTests/StringExtractorTest.GetU32LittleEndian (780 of 2152)
PASS: lldb-shell :: SymbolFile/DWARF/anon_class_w_and_wo_export_symbols.ll (781 of 2152)
PASS: lldb-unit :: Utility/./UtilityTests/DataExtractorTest.GetDoubleUnaligned (782 of 2152)
PASS: lldb-unit :: Utility/./UtilityTests/FileSpecTest.CopyByAppendingPathComponent (783 of 2152)
PASS: lldb-unit :: Utility/./UtilityTests/ListenerTest.GetEventWait (784 of 2152)
UNSUPPORTED: lldb-api :: arm/breakpoint-thumb-codesection/TestBreakpointThumbCodesection.py (785 of 2152)
PASS: lldb-api :: lang/cpp/typeof/TestTypeOfDeclTypeExpr.py (786 of 2152)
PASS: lldb-unit :: Target/./TargetTests/ExecutionContextTest.GetByteOrderTarget (787 of 2152)
PASS: lldb-unit :: ScriptInterpreter/Python/./ScriptInterpreterPythonTests/PythonDataObjectsTest.TestPythonInteger (788 of 2152)
PASS: lldb-api :: commands/expression/entry-bp/TestExprEntryBP.py (789 of 2152)
UNSUPPORTED: lldb-api :: functionalities/data-formatter/data-formatter-stl/libstdcpp/list/TestDataFormatterStdList.py (790 of 2152)
PASS: lldb-api :: functionalities/gdb_remote_client/TestNoGPacketSupported.py (791 of 2152)
PASS: lldb-unit :: Expression/./ExpressionTests/DiagnosticManagerTest.GetStringMultiline (792 of 2152)
PASS: lldb-api :: functionalities/data-formatter/data-formatter-stl/libcxx/list/TestDataFormatterLibcxxList.py (793 of 2152)
PASS: lldb-unit :: Core/./LLDBCoreTests/SourceFileCache.FindSourceFileNotFound (794 of 2152)
UNSUPPORTED: lldb-api :: functionalities/tty/TestTerminal.py (795 of 2152)
PASS: lldb-unit :: Utility/./UtilityTests/ArchSpecTest.TestSetTriple (796 of 2152)
PASS: lldb-shell :: Breakpoint/ppc64-localentry.test (797 of 2152)
PASS: lldb-unit :: Utility/./UtilityTests/BinaryStreamTest.PutSLEB128ThreeBytes (798 of 2152)
PASS: lldb-unit :: Language/Highlighting/./HighlighterTests/HighlighterTest.ClangScalarLiterals (799 of 2152)
PASS: lldb-unit :: DataFormatter/./LLDBFormatterTests/StringPrinterTests.SwiftUTF8 (800 of 2152)
PASS: lldb-api :: lang/objc/direct-dispatch-step/TestObjCDirectDispatchStepping.py (801 of 2152)
PASS: lldb-api :: commands/expression/radar_9531204/TestPrintfAfterUp.py (802 of 2152)
UNSUPPORTED: lldb-shell :: ScriptInterpreter/Lua/lua.test (803 of 2152)
PASS: lldb-unit :: Utility/./UtilityTests/StringListTest.SetSize (804 of 2152)
PASS: lldb-unit :: Utility/./UtilityTests/Flags.AnyClear (805 of 2152)
PASS: lldb-unit :: Utility/./UtilityTests/ArgsTest.TestSingleArgWithQuotedSpace (806 of 2152)
PASS: lldb-unit :: Utility/./UtilityTests/ConstStringTest.NullAndEmptyStates (807 of 2152)
PASS: lldb-unit :: Utility/./UtilityTests/StringListTest.CopyListEmpty (808 of 2152)
UNSUPPORTED: lldb-api :: functionalities/longjmp/TestLongjmp.py (809 of 2152)
PASS: lldb-unit :: Core/./LLDBCoreTests/ModuleSpecTest.TestELFFile (810 of 2152)
PASS: lldb-api :: commands/watchpoints/watchpoint_commands/command/TestWatchpointCommandPython.py (811 of 2152)
UNSUPPORTED: lldb-shell :: SymbolFile/DWARF/split-dwarf-expression-eval-bug.cpp (812 of 2152)
PASS: lldb-unit :: Utility/./UtilityTests/StreamTest.AddressNoSuffix (813 of 2152)
PASS: lldb-unit :: Utility/./UtilityTests/StringListTest.InsertStringAtIndexOutOfBounds (814 of 2152)
PASS: lldb-shell :: Minidump/memory-region.yaml (815 of 2152)
PASS: lldb-shell :: Settings/TestFrameFormatNoColor.test (816 of 2152)
PASS: lldb-api :: commands/expression/rdar42038760/TestScalarURem.py (817 of 2152)
PASS: lldb-unit :: Utility/./UtilityTests/StringLexerTest.NextIfList (818 of 2152)
PASS: lldb-api :: commands/gui/basic/TestGuiBasic.py (819 of 2152)
PASS: lldb-api :: python_api/value/linked_list/TestValueAPILinkedList.py (820 of 2152)
PASS: lldb-unit :: Language/Highlighting/./HighlighterTests/HighlighterTest.ClangStringLiterals (821 of 2152)
PASS: lldb-unit :: Utility/./UtilityTests/BinaryStreamTest.PutSLEB128SixBytes (822 of 2152)
UNSUPPORTED: lldb-shell :: BuildScript/toolchain-msvc.test (823 of 2152)
PASS: lldb-unit :: Utility/./UtilityTests/UriParserTest.BadPort (824 of 2152)
PASS: lldb-unit :: ObjectFile/ELF/./ObjectFileELFTests/ObjectFileELFTest.GetSymtab_NoSymEntryPointArmAddressClass (825 of 2152)
PASS: lldb-unit :: Utility/./UtilityTests/RangeTest.Union (826 of 2152)
PASS: lldb-unit :: Utility/./UtilityTests/StringListTest.ShiftCString (827 of 2152)
PASS: lldb-unit :: Utility/./UtilityTests/ArgsTest.TestAppendArg (828 of 2152)
PASS: lldb-unit :: SymbolFile/DWARF/./SymbolFileDWARFTests/SymbolFileDWARFTests.TestAbbrevOrder1Start5 (829 of 2152)
PASS: lldb-shell :: SymbolFile/Breakpad/stack-cfi-parsing.test (830 of 2152)
UNSUPPORTED: lldb-shell :: Register/x86-64-zmm-read.test (831 of 2152)
PASS: lldb-shell :: ObjectFile/ELF/section-types.yaml (832 of 2152)
PASS: lldb-unit :: Expression/./ExpressionTests/DiagnosticManagerTest.GetStringSeverityLabels (833 of 2152)
PASS: lldb-unit :: Process/gdb-remote/./ProcessGdbRemoteTests/GDBRemoteCommunicationClientTest.SendStartTracePacket (834 of 2152)
PASS: lldb-unit :: Host/./HostTests/SocketTest.DomainGetConnectURI (835 of 2152)
PASS: lldb-unit :: Utility/./UtilityTests/StreamTeeTest.SetStreamAtIndexOutOfBounds (836 of 2152)
PASS: lldb-shell :: SymbolFile/DWARF/debug_ranges_and_rnglists.test (837 of 2152)
PASS: lldb-unit :: Target/./TargetTests/RemoteAwarePlatformTest.TestResolveExecutabelOnClientByPlatform (838 of 2152)
PASS: lldb-unit :: Host/./HostTests/MainLoopTest.TerminatesImmediately (839 of 2152)
PASS: lldb-api :: lang/objc/global_ptrs/TestGlobalObjects.py (840 of 2152)
PASS: lldb-unit :: Process/minidump/./LLDBMinidumpTests/MinidumpParserTest.GetThreadContext_x86_32 (841 of 2152)
PASS: lldb-shell :: SymbolFile/NativePDB/source-list.cpp (842 of 2152)
PASS: lldb-api :: functionalities/tail_call_frames/disambiguate_tail_call_seq/TestDisambiguateTailCallSeq.py (843 of 2152)
PASS: lldb-api :: functionalities/data-formatter/data-formatter-objc/TestDataFormatterObjCNSData.py (844 of 2152)
PASS: lldb-unit :: Utility/./UtilityTests/DataExtractorTest.GetDouble (845 of 2152)
PASS: lldb-unit :: Interpreter/./InterpreterTests/OptionValueFileColonLine.setFromString (846 of 2152)
PASS: lldb-unit :: Host/./HostTests/File.GetWaitableHandleFileno (847 of 2152)
PASS: lldb-unit :: Utility/./UtilityTests/StringListTest.JoinThree (848 of 2152)
UNSUPPORTED: lldb-shell :: Expr/TestIRMemoryMapWindows.test (849 of 2152)
PASS: lldb-unit :: Utility/./UtilityTests/FileSpecTest.EqualDotsPosixRoot (850 of 2152)
PASS: lldb-api :: functionalities/tsan/thread_numbers/TestTsanThreadNumbers.py (851 of 2152)
PASS: lldb-unit :: Utility/./UtilityTests/UriParserTest.BracketedHostnamePort (852 of 2152)
PASS: lldb-api :: functionalities/tail_call_frames/ambiguous_tail_call_seq2/TestAmbiguousTailCallSeq2.py (853 of 2152)
PASS: lldb-shell :: SymbolFile/DWARF/dwp-debug-types.s (854 of 2152)
PASS: lldb-unit :: tools/lldb-server/tests/./LLDBServerTests/StandardStartupTest.TestStopReplyContainsThreadPcs (855 of 2152)
PASS: lldb-unit :: Utility/./UtilityTests/StreamTest.PutSLEB128 (856 of 2152)
PASS: lldb-api :: python_api/disassemble-raw-data/TestDisassembleRawData.py (857 of 2152)
PASS: lldb-shell :: SymbolFile/DWARF/DW_AT_location-DW_AT_const_value.s (858 of 2152)
PASS: lldb-unit :: Utility/./UtilityTests/FileSpecTest.OperatorBool (859 of 2152)
UNSUPPORTED: lldb-shell :: BuildScript/toolchain-clang-cl.test (860 of 2152)
PASS: lldb-api :: lang/objc/print-obj/TestPrintObj.py (861 of 2152)
PASS: lldb-unit :: Host/./HostTests/SocketTest.TCPListen0ConnectAccept (862 of 2152)
PASS: lldb-api :: commands/settings/use_source_cache/TestUseSourceCache.py (863 of 2152)
PASS: lldb-api :: commands/process/signal/TestProcessSignal.py (864 of 2152)
PASS: lldb-api :: functionalities/data-formatter/frameformat_smallstruct/TestFrameFormatSmallStruct.py (865 of 2152)
PASS: lldb-unit :: Utility/./UtilityTests/ArgsTest.TestSingleArg (866 of 2152)
PASS: lldb-unit :: Utility/./UtilityTests/StringExtractorTest.InitEmpty (867 of 2152)
PASS: lldb-unit :: Language/Highlighting/./HighlighterTests/HighlighterTest.ClangBraces (868 of 2152)
PASS: lldb-unit :: Utility/./UtilityTests/Flags.AllClear (869 of 2152)
PASS: lldb-api :: functionalities/thread/concurrent_events/TestConcurrentManyCrash.py (870 of 2152)
PASS: lldb-api :: functionalities/ubsan/user-expression/TestUbsanUserExpression.py (871 of 2152)
PASS: lldb-unit :: Utility/./UtilityTests/VMRange.Comparison (872 of 2152)
PASS: lldb-api :: python_api/findvalue_duplist/TestSBFrameFindValue.py (873 of 2152)
PASS: lldb-unit :: Utility/./UtilityTests/TimerTest.CategoryTimesNested (874 of 2152)
PASS: lldb-unit :: Utility/./UtilityTests/BinaryStreamTest.PutSLEB128EightBytes (875 of 2152)
PASS: lldb-shell :: ObjectFile/Breakpad/sections-trailing-func.test (876 of 2152)
PASS: lldb-unit :: Core/./LLDBCoreTests/ModuleSpecTest.TestCOFFFile (877 of 2152)
PASS: lldb-unit :: UnwindAssembly/x86/./UnwindAssemblyx86Tests/Testx86AssemblyInspectionEngine.TestPushRBP (878 of 2152)
PASS: lldb-api :: commands/expression/unicode-in-variable/TestUnicodeInVariable.py (879 of 2152)
PASS: lldb-api :: commands/expression/namespace_local_var_same_name_obj_c/TestNamespaceLocalVarSameNameObjC.py (880 of 2152)
PASS: lldb-api :: functionalities/limit-debug-info/TestLimitDebugInfo.py (881 of 2152)
PASS: lldb-unit :: Utility/./UtilityTests/GeneratorTest.Get (882 of 2152)
PASS: lldb-api :: commands/frame/diagnose/inheritance/TestDiagnoseInheritance.py (883 of 2152)
PASS: lldb-unit :: Utility/./UtilityTests/UUIDTest.SetFromStringRef (884 of 2152)
PASS: lldb-api :: lang/cpp/nsimport/TestCppNsImport.py (885 of 2152)
PASS: lldb-unit :: Utility/./UtilityTests/UriParserTest.Minimal (886 of 2152)
PASS: lldb-unit :: Process/minidump/./LLDBMinidumpTests/MinidumpParserTest.GetArchitecture (887 of 2152)
PASS: lldb-api :: functionalities/data-formatter/data-formatter-objc/TestDataFormatterObjCNSDate.py (888 of 2152)
PASS: lldb-unit :: Utility/./UtilityTests/ProcessInstanceInfo.DumpTable_invalidUID (889 of 2152)
UNSUPPORTED: lldb-shell :: Register/x86-64-zmm-write.test (890 of 2152)
PASS: lldb-api :: functionalities/type_completion/TestTypeCompletion.py (891 of 2152)
PASS: lldb-unit :: Utility/./UtilityTests/StringListTest.GetMaxStringLengthDecreasingSize (892 of 2152)
PASS: lldb-api :: functionalities/data-formatter/parray/TestPrintArray.py (893 of 2152)
PASS: lldb-unit :: Symbol/./SymbolTests/TestClangASTImporter.RecordLayout (894 of 2152)
PASS: lldb-unit :: debugserver/./debugserverTests/RNBSocket.LoopBackListenIPv4 (895 of 2152)
PASS: lldb-api :: commands/version/TestVersion.py (896 of 2152)
PASS: lldb-shell :: Commands/CommandScriptImmediateOutput/CommandScriptImmediateOutputFile.test (897 of 2152)
PASS: lldb-api :: functionalities/plugins/python_os_plugin/stepping_plugin_threads/TestOSPluginStepping.py (898 of 2152)
PASS: lldb-api :: macosx/lc-note/firmware-corefile/TestFirmwareCorefiles.py (899 of 2152)
PASS: lldb-unit :: Utility/./UtilityTests/StreamTeeTest.GetStreamAtIndexOutOfBoundsEmpty (900 of 2152)
PASS: lldb-unit :: ScriptInterpreter/Python/./ScriptInterpreterPythonTests/PythonDataObjectsTest.TestPythonIntegerToStructuredInteger (901 of 2152)
PASS: lldb-shell :: SymbolFile/DWARF/dwarf5-partial-index.cpp (902 of 2152)
PASS: lldb-api :: functionalities/recursion/TestValueObjectRecursion.py (903 of 2152)
PASS: lldb-api :: commands/expression/scoped_enums/TestScopedEnumType.py (904 of 2152)
PASS: lldb-api :: functionalities/data-formatter/data-formatter-objc/TestDataFormatterObjCNSContainer.py (905 of 2152)
PASS: lldb-api :: functionalities/inline-stepping/TestInlineStepping.py (906 of 2152)
PASS: lldb-unit :: Thread/./ThreadTests/ThreadTest.SetStopInfo (907 of 2152)
PASS: lldb-unit :: Utility/./UtilityTests/TimerTest.CategoryTimesStats (908 of 2152)
PASS: lldb-unit :: Utility/./UtilityTests/StreamTeeTest.Assignment (909 of 2152)
PASS: lldb-api :: python_api/value/empty_class/TestValueAPIEmptyClass.py (910 of 2152)
PASS: lldb-api :: functionalities/data-formatter/data-formatter-stl/libcxx/atomic/TestLibCxxAtomic.py (911 of 2152)
PASS: lldb-api :: lang/c/anonymous/TestAnonymous.py (912 of 2152)
PASS: lldb-unit :: SymbolFile/NativePDB/./SymbolFileNativePDBTests/PDBFPOProgramToDWARFExpressionTests.UnsupportedRASearch (913 of 2152)
PASS: lldb-shell :: SymbolFile/NativePDB/break-by-line.cpp (914 of 2152)
PASS: lldb-api :: functionalities/postmortem/minidump-new/TestMiniDumpNew.py (915 of 2152)
PASS: lldb-api :: python_api/sbenvironment/TestSBEnvironment.py (916 of 2152)
PASS: lldb-shell :: SymbolFile/dissassemble-entry-point.s (917 of 2152)
PASS: lldb-unit :: Language/Highlighting/./HighlighterTests/HighlighterTest.HighlighterSelectionType (918 of 2152)
PASS: lldb-unit :: Utility/./UtilityTests/RangeTest.ContainsRangeStartingFromZero (919 of 2152)
PASS: lldb-api :: lang/cpp/operators/TestCppOperators.py (920 of 2152)
PASS: lldb-unit :: Platform/./LLDBPlatformTests/PlatformDarwinTest.FindComponentInPath (921 of 2152)
PASS: lldb-api :: sample_test/TestSampleInlineTest.py (922 of 2152)
PASS: lldb-api :: python_api/value/change_values/TestChangeValueAPI.py (923 of 2152)
PASS: lldb-unit :: Interpreter/./InterpreterTests/OptionArgParserTest.toChar (924 of 2152)
PASS: lldb-api :: python_api/signals/TestSignalsAPI.py (925 of 2152)
PASS: lldb-api :: lang/cpp/signed_types/TestSignedTypes.py (926 of 2152)
PASS: lldb-api :: functionalities/data-formatter/data-formatter-stl/libcxx/function/TestLibCxxFunction.py (927 of 2152)
PASS: lldb-unit :: Utility/./UtilityTests/ArgsTest.ReplaceArgumentAtIndexLonger (928 of 2152)
PASS: lldb-shell :: ObjectFile/wasm/unified-debug-sections.yaml (929 of 2152)
UNSUPPORTED: lldb-shell :: Unwind/unwind-plan-dwarf-dump.test (930 of 2152)
PASS: lldb-api :: functionalities/breakpoint/address_breakpoints/TestAddressBreakpoints.py (931 of 2152)
UNSUPPORTED: lldb-api :: tools/lldb-server/TestGdbRemoteAuxvSupport.py (932 of 2152)
PASS: lldb-unit :: Utility/./UtilityTests/StreamTest.PutHex16ByteOrderLittle (933 of 2152)
PASS: lldb-api :: lang/cpp/template-function/TestTemplateFunctions.py (934 of 2152)
PASS: lldb-api :: functionalities/thread/concurrent_events/TestConcurrentTwoBreakpointsOneWatchpoint.py (935 of 2152)
PASS: lldb-api :: commands/expression/import-std-module/unique_ptr-dbg-info-content/TestUniquePtrDbgInfoContent.py (936 of 2152)
PASS: lldb-api :: commands/process/attach/attach_denied/TestAttachDenied.py (937 of 2152)
PASS: lldb-api :: api/multiple-debuggers/TestMultipleDebuggers.py (938 of 2152)
PASS: lldb-unit :: Utility/./UtilityTests/UriParserTest.LongPath (939 of 2152)
PASS: lldb-unit :: Utility/./UtilityTests/SerializationRountripTest.SerializeDeserializeCStringArrayNullptr (940 of 2152)
PASS: lldb-shell :: Reproducer/TestDump.test (941 of 2152)
PASS: lldb-api :: lang/objc/objc-checker/TestObjCCheckers.py (942 of 2152)
PASS: lldb-api :: commands/log/basic/TestLogging.py (943 of 2152)
UNSUPPORTED: lldb-shell :: Register/aarch64-fp-read.test (944 of 2152)
PASS: lldb-api :: commands/expression/import-std-module/forward_list-dbg-info-content/TestDbgInfoContentForwardListFromStdModule.py (945 of 2152)
PASS: lldb-unit :: Utility/./UtilityTests/OptionsWithRawTest.EmptyInput (946 of 2152)
PASS: lldb-api :: lang/cpp/bitfields/TestCppBitfields.py (947 of 2152)
UNSUPPORTED: lldb-api :: functionalities/data-formatter/data-formatter-stl/libstdcpp/smart_ptr/TestDataFormatterStdSmartPtr.py (948 of 2152)
PASS: lldb-unit :: Utility/./UtilityTests/FileSpecTest.Match (949 of 2152)
PASS: lldb-api :: python_api/exprpath_synthetic/TestExprPathSynthetic.py (950 of 2152)
PASS: lldb-unit :: Utility/./UtilityTests/StreamTest.AddressPrefixAndSuffix (951 of 2152)
PASS: lldb-unit :: Core/./LLDBCoreTests/StreamCallbackTest.Callback (952 of 2152)
PASS: lldb-unit :: Symbol/./SymbolTests/TestTypeSystemClang.TestGetTypeClassDeclType (953 of 2152)
PASS: lldb-api :: commands/expression/expr-in-syscall/TestExpressionInSyscall.py (954 of 2152)
PASS: lldb-api :: functionalities/tail_call_frames/disambiguate_paths_to_common_sink/TestDisambiguatePathsToCommonSink.py (955 of 2152)
PASS: lldb-api :: commands/watchpoints/watchpoint_disable/TestWatchpointDisable.py (956 of 2152)
PASS: lldb-api :: functionalities/data-formatter/data-formatter-stl/libcxx/iterator/TestDataFormatterLibccIterator.py (957 of 2152)
PASS: lldb-unit :: Symbol/./SymbolTests/DWARFCallFrameInfoTest.Basic_dwarf4 (958 of 2152)
PASS: lldb-unit :: Language/Highlighting/./HighlighterTests/HighlighterTest.ClangCursorPos (959 of 2152)
PASS: lldb-api :: lang/objc/objc-static-method-stripped/TestObjCStaticMethodStripped.py (960 of 2152)
PASS: lldb-unit :: Utility/./UtilityTests/StringListTest.CopyList (961 of 2152)
PASS: lldb-unit :: Expression/./ExpressionTests/CppModuleConfigurationTest.MissingUsrInclude (962 of 2152)
PASS: lldb-api :: lang/cpp/scope/TestCppScope.py (963 of 2152)
PASS: lldb-api :: lang/cpp/bool/TestCPPBool.py (964 of 2152)
PASS: lldb-unit :: UnwindAssembly/x86/./UnwindAssemblyx86Tests/Testx86AssemblyInspectionEngine.TestPushR14 (965 of 2152)
PASS: lldb-api :: commands/watchpoints/multiple_threads/TestWatchpointMultipleThreads.py (966 of 2152)
UNSUPPORTED: lldb-api :: tools/lldb-server/thread-name/TestGdbRemoteThreadName.py (967 of 2152)
PASS: lldb-unit :: Utility/./UtilityTests/RangeTest.ContainsAddr (968 of 2152)
PASS: lldb-api :: macosx/thread-names/TestInterruptThreadNames.py (969 of 2152)
PASS: lldb-unit :: Utility/./UtilityTests/Flags.AllSet (970 of 2152)
PASS: lldb-unit :: Utility/./UtilityTests/ArchSpecTest.YAML (971 of 2152)
PASS: lldb-api :: types/TestDoubleTypesExpr.py (972 of 2152)
PASS: lldb-unit :: ObjectFile/Breakpad/./ObjectFileBreakpadTests/ModuleRecord.parse (973 of 2152)
PASS: lldb-shell :: ObjectFile/PECOFF/section-types.yaml (974 of 2152)
PASS: lldb-unit :: UnwindAssembly/x86/./UnwindAssemblyx86Tests/Testx86AssemblyInspectionEngine.TestPopR15 (975 of 2152)
PASS: lldb-api :: macosx/find-dsym/deep-bundle/TestDeepBundle.py (976 of 2152)
PASS: lldb-api :: functionalities/data-formatter/data-formatter-objc/TestDataFormatterObjCNSURL.py (977 of 2152)
PASS: lldb-unit :: Utility/./UtilityTests/StringLexerTest.PutBack (978 of 2152)
PASS: lldb-api :: functionalities/data-formatter/poarray/TestPrintObjectArray.py (979 of 2152)
PASS: lldb-api :: python_api/lldbutil/iter/TestLLDBIterator.py (980 of 2152)
PASS: lldb-api :: functionalities/data-formatter/data-formatter-objc/TestDataFormatterObjCKVO.py (981 of 2152)
PASS: lldb-unit :: Process/minidump/./LLDBMinidumpTests/MinidumpParserTest.MinidumpDuplicateModuleMappedSecond (982 of 2152)
PASS: lldb-api :: functionalities/show_location/TestShowLocationDwarf5.py (983 of 2152)
PASS: lldb-unit :: Utility/./UtilityTests/OptionsWithRawTest.WhitespaceSuffix (984 of 2152)
PASS: lldb-api :: commands/expression/import-std-module/queue/TestQueueFromStdModule.py (985 of 2152)
PASS: lldb-unit :: Core/./LLDBCoreTests/MangledTest.NameIndexes_FindFunctionSymbols (986 of 2152)
PASS: lldb-shell :: SymbolFile/DWARF/debug-types-missing-signature.test (987 of 2152)
PASS: lldb-unit :: Utility/./UtilityTests/BinaryStreamTest.PutULEB128FourBytes (988 of 2152)
PASS: lldb-shell :: Settings/TestDisableColor.test (989 of 2152)
PASS: lldb-api :: lang/c/array_types/TestArrayTypes.py (990 of 2152)
PASS: lldb-shell :: ObjectFile/ELF/base-address.yaml (991 of 2152)
PASS: lldb-unit :: Utility/./UtilityTests/BinaryStreamTest.PutSLEB128FiveBytes (992 of 2152)
UNSUPPORTED: lldb-shell :: Register/x86-gp-write.test (993 of 2152)
PASS: lldb-api :: api/multiple-targets/TestMultipleTargets.py (994 of 2152)
PASS: lldb-unit :: Process/./ProcessEventDataTests/ProcessEventDataTest.ShouldStop (995 of 2152)
PASS: lldb-unit :: Utility/./UtilityTests/XcodeSDKTest.GetCanonicalNameAndConstruct (996 of 2152)
UNSUPPORTED: lldb-api :: functionalities/unwind/standard/TestStandardUnwind.py (997 of 2152)
PASS: lldb-unit :: Host/./HostTests/SocketTest.DecodeHostAndPort (998 of 2152)
PASS: lldb-api :: lang/objc/objc-dyn-sbtype/TestObjCDynamicSBType.py (999 of 2152)
PASS: lldb-unit :: Utility/./UtilityTests/OptionsWithRawTest.WhitespaceInput (1000 of 2152)
PASS: lldb-unit :: Utility/./UtilityTests/StringListTest.JoinSingle (1001 of 2152)
PASS: lldb-unit :: Process/gdb-remote/./ProcessGdbRemoteTests/GDBRemoteCommunicationClientTest.GetModulesInfo (1002 of 2152)
PASS: lldb-shell :: Register/x86-64-ymm-read.test (1003 of 2152)
UNSUPPORTED: lldb-shell :: ScriptInterpreter/Lua/quit.test (1004 of 2152)
PASS: lldb-shell :: SymbolFile/NativePDB/s_constant.cpp (1005 of 2152)
PASS: lldb-unit :: Utility/./UtilityTests/OptionsWithRawTest.EmptySuffix (1006 of 2152)
PASS: lldb-api :: functionalities/postmortem/mach-core/TestMachCore.py (1007 of 2152)
PASS: lldb-unit :: Utility/./UtilityTests/Flags.GetBitSize (1008 of 2152)
PASS: lldb-shell :: SymbolFile/NativePDB/globals-bss.cpp (1009 of 2152)
PASS: lldb-api :: functionalities/data-formatter/data-formatter-objc/TestDataFormatterObjNSException.py (1010 of 2152)
PASS: lldb-api :: commands/expression/import-std-module/weak_ptr-dbg-info-content/TestDbgInfoContentWeakPtrFromStdModule.py (1011 of 2152)
PASS: lldb-shell :: Driver/TestError.test (1012 of 2152)
PASS: lldb-api :: lang/c/complex/TestComplexC99.py (1013 of 2152)
PASS: lldb-shell :: SymbolFile/DWARF/split-dwarf-inlining.cpp (1014 of 2152)
PASS: lldb-api :: functionalities/breakpoint/breakpoint_options/TestBreakpointOptions.py (1015 of 2152)
PASS: lldb-unit :: Language/CPlusPlus/./LanguageCPlusPlusTests/CPlusPlusLanguage.CPlusPlusNameParser (1016 of 2152)
PASS: lldb-shell :: ObjectFile/ELF/basic-info.yaml (1017 of 2152)
PASS: lldb-unit :: Utility/./UtilityTests/RangeTest.SlideZero (1018 of 2152)
PASS: lldb-api :: commands/frame/var/TestFrameVar.py (1019 of 2152)
PASS: lldb-unit :: UnwindAssembly/x86/./UnwindAssemblyx86Tests/Testx86AssemblyInspectionEngine.TestSubESP (1020 of 2152)
PASS: lldb-api :: commands/expression/char/TestExprsChar.py (1021 of 2152)
PASS: lldb-unit :: ScriptInterpreter/Python/./ScriptInterpreterPythonTests/PythonDataObjectsTest.TestPythonTupleToStructuredList (1022 of 2152)
PASS: lldb-api :: functionalities/tail_call_frames/sbapi_support/TestTailCallFrameSBAPI.py (1023 of 2152)
PASS: lldb-api :: macosx/duplicate-archive-members/TestDuplicateMembers.py (1024 of 2152)
UNSUPPORTED: lldb-api :: benchmarks/startup/TestStartupDelays.py (1025 of 2152)
PASS: lldb-unit :: Utility/./UtilityTests/ArgsTest.GetArgumentArrayRef (1026 of 2152)
PASS: lldb-api :: commands/command/invalid-args/TestInvalidArgsCommand.py (1027 of 2152)
PASS: lldb-unit :: Utility/./UtilityTests/DataExtractorTest.GetCStr (1028 of 2152)
PASS: lldb-api :: lang/objc/radar-9691614/TestObjCMethodReturningBOOL.py (1029 of 2152)
PASS: lldb-unit :: Utility/./UtilityTests/StreamTest.PutRawBytesToBigEndian (1030 of 2152)
PASS: lldb-shell :: SymbolFile/DWARF/DW_AT_declaration-with-children.s (1031 of 2152)
UNSUPPORTED: lldb-shell :: Process/Windows/exception_access_violation.cpp (1032 of 2152)
PASS: lldb-api :: tools/lldb-vscode/breakpoint-events/TestVSCode_breakpointEvents.py (1033 of 2152)
PASS: lldb-api :: lang/cpp/member-and-local-vars-with-same-name/TestMembersAndLocalsWithSameName.py (1034 of 2152)
PASS: lldb-api :: commands/frame/diagnose/dereference-argument/TestDiagnoseDereferenceArgument.py (1035 of 2152)
PASS: lldb-unit :: DataFormatter/./LLDBFormatterTests/TypeMatcherTests.GetMatchStringRegex (1036 of 2152)
PASS: lldb-api :: commands/expression/fixits/TestFixIts.py (1037 of 2152)
PASS: lldb-unit :: Utility/./UtilityTests/StreamTest.PutHex32ByteOrderLittle (1038 of 2152)
PASS: lldb-unit :: UnwindAssembly/x86/./UnwindAssemblyx86Tests/Testx86AssemblyInspectionEngine.TestLEAVE (1039 of 2152)
UNSUPPORTED: lldb-shell :: ScriptInterpreter/Lua/independent_state.test (1040 of 2152)
PASS: lldb-unit :: Utility/./UtilityTests/StringListTest.GetMaxStringLengthEmpty (1041 of 2152)
PASS: lldb-unit :: Host/./HostTests/SocketAddressTest.GetAddressInfo (1042 of 2152)
PASS: lldb-unit :: Utility/./UtilityTests/UriParserTest.BracketedHostnameWithColon (1043 of 2152)
PASS: lldb-unit :: Utility/./UtilityTests/LogChannelEnabledTest.log_options (1044 of 2152)
PASS: lldb-shell :: Breakpoint/single-file-split-dwarf.test (1045 of 2152)
PASS: lldb-api :: lang/cpp/dynamic-value/TestDynamicValue.py (1046 of 2152)
PASS: lldb-unit :: Utility/./UtilityTests/StringListTest.PopBack (1047 of 2152)
PASS: lldb-unit :: Utility/./UtilityTests/StreamTest.PutStringAsRawHex8 (1048 of 2152)
PASS: lldb-api :: lang/objc/objc_direct-methods/TestObjCDirectMethods.py (1049 of 2152)
PASS: lldb-shell :: Breakpoint/debug_rnglistx_rlex.test (1050 of 2152)
PASS: lldb-unit :: Utility/./UtilityTests/EnvironmentTest.EnvpConstruction (1051 of 2152)
PASS: lldb-unit :: ScriptInterpreter/Python/./ScriptInterpreterPythonTests/PythonDataObjectsTest.TestExtractingUInt64ThroughStructuredData (1052 of 2152)
PASS: lldb-unit :: Symbol/./SymbolTests/PostfixExpression.ParseOneExpression (1053 of 2152)
PASS: lldb-api :: functionalities/thread/exit_during_break/TestExitDuringBreak.py (1054 of 2152)
PASS: lldb-unit :: Utility/./UtilityTests/OptionsWithRawTest.EmptyArgsOnlySuffix (1055 of 2152)
PASS: lldb-unit :: Core/./LLDBCoreTests/MangledTest.ResultForBlockInvocation (1056 of 2152)
PASS: lldb-unit :: DataFormatter/./LLDBFormatterTests/TypeMatcherTests.GetMatchStringExactName (1057 of 2152)
PASS: lldb-api :: commands/platform/file/close/TestPlatformFileClose.py (1058 of 2152)
UNSUPPORTED: lldb-shell :: Unwind/eh-frame-small-fde.test (1059 of 2152)
PASS: lldb-unit :: Utility/./UtilityTests/AnsiTerminal.Incomplete (1060 of 2152)
PASS: lldb-unit :: Symbol/./SymbolTests/TestTypeSystemClang.TemplateArguments (1061 of 2152)
PASS: lldb-api :: terminal/TestEditline.py (1062 of 2152)
PASS: lldb-unit :: Utility/./UtilityTests/BinaryStreamTest.PutULEB128One (1063 of 2152)
UNSUPPORTED: lldb-api :: commands/register/register/intel_xtended_registers/mpx_bound_violation/TestBoundViolation.py (1064 of 2152)
PASS: lldb-api :: tools/lldb-server/TestGdbRemoteAttach.py (1065 of 2152)
PASS: lldb-api :: python_api/sbtype_typeclass/TestSBTypeTypeClass.py (1066 of 2152)
PASS: lldb-unit :: Utility/./UtilityTests/FileSpecTest.FormatFileSpec (1067 of 2152)
PASS: lldb-unit :: Symbol/./SymbolTests/TestTypeSystemClang.TestGetBasicTypeFromEnum (1068 of 2152)
PASS: lldb-shell :: Settings/TestLineMarkerColor.test (1069 of 2152)
PASS: lldb-unit :: Utility/./UtilityTests/TimerTest.CategoryTimes (1070 of 2152)
PASS: lldb-api :: functionalities/thread/concurrent_events/TestConcurrentSignalNWatchNBreak.py (1071 of 2152)
PASS: lldb-shell :: SymbolFile/DWARF/find-basic-function.cpp (1072 of 2152)
PASS: lldb-api :: lang/c/modules/TestCModules.py (1073 of 2152)
PASS: lldb-unit :: Utility/./UtilityTests/UriParserTest.BracketedHostname (1074 of 2152)
PASS: lldb-shell :: Driver/TestCore.test (1075 of 2152)
PASS: lldb-unit :: Utility/./UtilityTests/BinaryStreamTest.PutULEB128FiveBytes (1076 of 2152)
PASS: lldb-unit :: Utility/./UtilityTests/RangeTest.LessThanInvalid (1077 of 2152)
PASS: lldb-unit :: Expression/./ExpressionTests/DiagnosticManagerTest.GetStringNoDiags (1078 of 2152)
PASS: lldb-unit :: Utility/./UtilityTests/StreamTeeTest.Constructor1Stream (1079 of 2152)
PASS: lldb-api :: functionalities/gdb_remote_client/TestqOffsets.py (1080 of 2152)
PASS: lldb-api :: commands/command/script/import/TestImport.py (1081 of 2152)
PASS: lldb-api :: lang/objc/bitfield_ivars/TestBitfieldIvars.py (1082 of 2152)
PASS: lldb-api :: functionalities/pointer_num_children/TestPointerNumChildren.py (1083 of 2152)
PASS: lldb-api :: commands/expression/no-deadlock/TestExprDoesntBlock.py (1084 of 2152)
PASS: lldb-unit :: Utility/./UtilityTests/ScalarTest.ComparisonFloat (1085 of 2152)
PASS: lldb-shell :: Reproducer/TestRelativePath.test (1086 of 2152)
PASS: lldb-shell :: ObjectFile/ELF/avr-basic-info.yaml (1087 of 2152)
PASS: lldb-unit :: UnwindAssembly/x86/./UnwindAssemblyx86Tests/Testx86AssemblyInspectionEngine.TestSpillRegToStackViaMOVx86_64 (1088 of 2152)
PASS: lldb-unit :: Utility/./UtilityTests/AnsiTerminal.Twice (1089 of 2152)
PASS: lldb-api :: functionalities/thread/concurrent_events/TestConcurrentTwoBreakpointThreads.py (1090 of 2152)
PASS: lldb-unit :: Utility/./UtilityTests/ConstStringTest.CompareStringRef (1091 of 2152)
PASS: lldb-api :: python_api/sbstructureddata/TestStructuredDataAPI.py (1092 of 2152)
PASS: lldb-unit :: Target/./TargetTests/ModuleCacheTest.GetAndPut (1093 of 2152)
PASS: lldb-unit :: Language/Highlighting/./HighlighterTests/HighlighterTest.ClangUnterminatedString (1094 of 2152)
PASS: lldb-unit :: Utility/./UtilityTests/ArchSpecTest.MergeFromMachOUnknown (1095 of 2152)
PASS: lldb-api :: lang/objc/exceptions/TestObjCExceptions.py (1096 of 2152)
PASS: lldb-unit :: Utility/./UtilityTests/StateTest.Formatv (1097 of 2152)
PASS: lldb-shell :: BuildScript/compiler-full-path.test (1098 of 2152)
PASS: lldb-unit :: SymbolFile/DWARF/./SymbolFileDWARFTests/SymbolFileDWARFTests.TestAbbrevInvalidNULLTag (1099 of 2152)
PASS: lldb-api :: commands/gui/breakpoints/TestGuiBreakpoints.py (1100 of 2152)
PASS: lldb-api :: lang/cpp/call-function/TestCallCPPFunction.py (1101 of 2152)
PASS: lldb-api :: functionalities/inferior-changed/TestInferiorChanged.py (1102 of 2152)
PASS: lldb-api :: tools/lldb-vscode/breakpoint/TestVSCode_setExceptionBreakpoints.py (1103 of 2152)
PASS: lldb-unit :: Disassembler/./DisassemblerTests/TestArm64Disassembly.TestArmv81Instruction (1104 of 2152)
PASS: lldb-unit :: Utility/./UtilityTests/SerializationRountripTest.SerializeDeserializeCStringNull (1105 of 2152)
PASS: lldb-api :: commands/expression/calculator_mode/TestCalculatorMode.py (1106 of 2152)
PASS: lldb-unit :: Expression/./ExpressionTests/DWARFExpression.DW_OP_unknown (1107 of 2152)
PASS: lldb-unit :: Utility/./UtilityTests/ArgsTest.TestQuotedTrailingBackslash (1108 of 2152)
PASS: lldb-api :: functionalities/breakpoint/breakpoint_command/TestRegexpBreakCommand.py (1109 of 2152)
PASS: lldb-api :: types/TestShortTypeExpr.py (1110 of 2152)
PASS: lldb-unit :: Platform/./LLDBPlatformTests/PlatformAppleSimulatorTest.TestSimHasSimEnvionament (1111 of 2152)
PASS: lldb-api :: commands/command/source/TestCommandSource.py (1112 of 2152)
UNSUPPORTED: lldb-api :: functionalities/darwin_log/source/info/TestDarwinLogSourceInfo.py (1113 of 2152)
PASS: lldb-api :: commands/expression/import-std-module/forward_decl_from_module/TestForwardDeclFromStdModule.py (1114 of 2152)
PASS: lldb-api :: commands/frame/diagnose/virtual-method-call/TestDiagnoseDereferenceVirtualMethodCall.py (1115 of 2152)
PASS: lldb-unit :: ObjectFile/PECOFF/./ObjectFilePECOFFTests/PECallFrameInfoTest.Basic_eh (1116 of 2152)
PASS: lldb-api :: commands/expression/import-std-module/empty-module/TestEmptyStdModule.py (1117 of 2152)
PASS: lldb-shell :: Register/x86-64-gp-read.test (1118 of 2152)
UNSUPPORTED: lldb-api :: functionalities/darwin_log/format/TestDarwinLogMessageFormat.py (1119 of 2152)
PASS: lldb-api :: python_api/objc_type/TestObjCType.py (1120 of 2152)
PASS: lldb-shell :: BuildScript/toolchain-clang.test (1121 of 2152)
PASS: lldb-unit :: Core/./LLDBCoreTests/SourceFileCache.FindSourceFileFound (1122 of 2152)
UNSUPPORTED: lldb-shell :: Register/aarch64-gp-read.test (1123 of 2152)
PASS: lldb-api :: lang/cpp/unicode-literals/TestUnicodeLiterals.py (1124 of 2152)
PASS: lldb-unit :: Utility/./UtilityTests/StreamTest.PutHex8 (1125 of 2152)
PASS: lldb-api :: commands/expression/ir-interpreter/TestIRInterpreter.py (1126 of 2152)
PASS: lldb-unit :: Utility/./UtilityTests/BinaryStreamTest.PutULEB128SixBytes (1127 of 2152)
UNSUPPORTED: lldb-shell :: SymbolFile/PDB/func-symbols.test (1128 of 2152)
PASS: lldb-api :: functionalities/thread/concurrent_events/TestConcurrentBreakpointDelayBreakpointOneSignal.py (1129 of 2152)
PASS: lldb-api :: commands/target/stop-hooks/TestStopHooks.py (1130 of 2152)
PASS: lldb-api :: functionalities/data-formatter/data-formatter-stl/libcxx/map/TestDataFormatterLibccMap.py (1131 of 2152)
PASS: lldb-api :: functionalities/avoids-fd-leak/TestFdLeak.py (1132 of 2152)
UNSUPPORTED: lldb-api :: commands/expression/macros/TestMacros.py (1133 of 2152)
PASS: lldb-unit :: Process/minidump/./LLDBMinidumpTests/MinidumpParserTest.MinidumpDuplicateModuleSeparateCode (1134 of 2152)
UNSUPPORTED: lldb-shell :: ObjectFile/ELF/minidebuginfo-set-and-hit-breakpoint.test (1135 of 2152)
PASS: lldb-api :: lang/cpp/auto/TestCPPAuto.py (1136 of 2152)
PASS: lldb-unit :: Utility/./UtilityTests/StringListTest.LongestCommonPrefixEmpty (1137 of 2152)
PASS: lldb-api :: commands/expression/save_jit_objects/TestSaveJITObjects.py (1138 of 2152)
PASS: lldb-shell :: SymbolFile/DWARF/dir-separator-windows.s (1139 of 2152)
PASS: lldb-shell :: Reproducer/Functionalities/TestStepping.test (1140 of 2152)
PASS: lldb-unit :: Utility/./UtilityTests/StreamTest.PutHex64ByteOrderLittle (1141 of 2152)
PASS: lldb-unit :: Utility/./UtilityTests/DataExtractorTest.GetMaxU64_unchecked (1142 of 2152)
PASS: lldb-unit :: UnwindAssembly/x86/./UnwindAssemblyx86Tests/Testx86AssemblyInspectionEngine.Test32BitOnlyInstruction (1143 of 2152)
PASS: lldb-unit :: Utility/./UtilityTests/StringExtractorTest.GetU32BigEndian (1144 of 2152)
PASS: lldb-unit :: Symbol/./SymbolTests/TestTypeSystemClang.TestGetEnumIntegerTypeInvalid (1145 of 2152)
PASS: lldb-unit :: Host/./HostTests/MainLoopTest.Signal (1146 of 2152)
PASS: lldb-unit :: Utility/./UtilityTests/StringExtractorTest.GetHexU8_Underflow (1147 of 2152)
PASS: lldb-shell :: SymbolFile/DWARF/DW_AT_const_value.s (1148 of 2152)
PASS: lldb-api :: lang/cpp/enum_types/TestCPP11EnumTypes.py (1149 of 2152)
PASS: lldb-api :: functionalities/data-formatter/data-formatter-stl/libcxx/bitset/TestDataFormatterLibcxxBitset.py (1150 of 2152)
PASS: lldb-api :: lang/objc/objc-struct-argument/TestObjCStructArgument.py (1151 of 2152)
UNSUPPORTED: lldb-api :: functionalities/darwin_log/filter/exact_match/subsystem/TestDarwinLogFilterMatchSubsystem.py (1152 of 2152)
PASS: lldb-api :: functionalities/paths/TestPaths.py (1153 of 2152)
PASS: lldb-shell :: Reproducer/TestGDBRemoteRepro.test (1154 of 2152)
PASS: lldb-api :: commands/expression/class_template_specialization_empty_pack/TestClassTemplateSpecializationParametersHandling.py (1155 of 2152)
PASS: lldb-api :: python_api/section/TestSectionAPI.py (1156 of 2152)
PASS: lldb-api :: functionalities/data-formatter/data-formatter-globals/TestDataFormatterGlobals.py (1157 of 2152)
PASS: lldb-unit :: Utility/./UtilityTests/StreamTest.AddressSuffix (1158 of 2152)
PASS: lldb-shell :: SymbolFile/Breakpad/line-table-missing-file.test (1159 of 2152)
PASS: lldb-unit :: Utility/./UtilityTests/ScalarTest.Getters (1160 of 2152)
PASS: lldb-api :: functionalities/thread/thread_exit/TestThreadExit.py (1161 of 2152)
PASS: lldb-shell :: ObjectFile/ELF/PT_TLS-overlap-PT_LOAD.yaml (1162 of 2152)
PASS: lldb-api :: commands/platform/process/list/TestProcessList.py (1163 of 2152)
XFAIL: lldb-shell :: SymbolFile/DWARF/find-type-in-function.cpp (1164 of 2152)
PASS: lldb-unit :: Language/Highlighting/./HighlighterTests/HighlighterTest.ClangCommas (1165 of 2152)
PASS: lldb-unit :: Symbol/./SymbolTests/TestTypeSystemClang.TestBuiltinTypeForEncodingAndBitSize (1166 of 2152)
FAIL: lldb-api :: functionalities/gdb_remote_client/TestQemuAArch64TargetXml.py (1167 of 2152)
******************** TEST 'lldb-api :: functionalities/gdb_remote_client/TestQemuAArch64TargetXml.py' FAILED ********************
Script:
--
/usr/local/Frameworks/Python.framework/Versions/3.7/bin/python3.7 /Users/buildslave/jenkins/workspace/lldb-cmake/llvm-project/lldb/test/API/dotest.py -s /Users/buildslave/jenkins/workspace/lldb-cmake/lldb-build/lldb-test-traces -S nm -u CXXFLAGS -u CFLAGS --codesign-identity - --server /Users/buildslave/jenkins/workspace/lldb-cmake/lldb-build/./bin/debugserver --arch x86_64 --build-dir /Users/buildslave/jenkins/workspace/lldb-cmake/lldb-build/lldb-test-build.noindex -s=/Users/buildslave/jenkins/workspace/lldb-cmake/test/logs -t --env TERM=vt100 --env LLVM_LIBS_DIR=/Users/buildslave/jenkins/workspace/lldb-cmake/lldb-build/./lib --arch x86_64 --build-dir /Users/buildslave/jenkins/workspace/lldb-cmake/lldb-build/lldb-test-build.noindex --lldb-module-cache-dir /Users/buildslave/jenkins/workspace/lldb-cmake/lldb-build/lldb-test-build.noindex/module-cache-lldb/lldb-api --clang-module-cache-dir /Users/buildslave/jenkins/workspace/lldb-cmake/lldb-build/lldb-test-build.noindex/module-cache-clang/lldb-api --executable /Users/buildslave/jenkins/workspace/lldb-cmake/lldb-build/./bin/lldb --compiler /Users/buildslave/jenkins/workspace/lldb-cmake/lldb-build/./bin/clang --dsymutil /Users/buildslave/jenkins/workspace/lldb-cmake/lldb-build/./bin/dsymutil --filecheck /Users/buildslave/jenkins/workspace/lldb-cmake/lldb-build/./bin/FileCheck --yaml2obj /Users/buildslave/jenkins/workspace/lldb-cmake/lldb-build/./bin/yaml2obj --lldb-libs-dir /Users/buildslave/jenkins/workspace/lldb-cmake/lldb-build/./lib /Users/buildslave/jenkins/workspace/lldb-cmake/llvm-project/lldb/test/API/functionalities/gdb_remote_client -p TestQemuAArch64TargetXml.py
--
Exit Code: 1

Hide Details

Command Output (stdout): -- lldb version 12.0.99 clang revision bd19876dc60c69f50a7110740e97c6878e56be60 llvm revision bd19876dc60c69f50a7110740e97c6878e56be60 libstdcxx tests will not be run because: Don't know how to build with libstdcxx on macosx Skipping following debug info categories: ['dwo']

Hide Details

-- Command Output (stderr): --

Hide Details

Session logs for test failures/errors/unexpected successes will go into directory '/Users/buildslave/jenkins/workspace/lldb-cmake/test/logs' Change dir to: /Users/buildslave/jenkins/workspace/lldb-cmake/llvm-project/lldb/test/API/functionalities/gdb_remote_client runCmd: settings clear -all output:

Hide Details

runCmd: settings set symbols.enable-external-lookup false output:

Hide Details

runCmd: settings set target.inherit-tcc true output:

Hide Details

runCmd: settings set target.auto-apply-fixits false output:

Hide Details

runCmd: settings set plugin.process.gdb-remote.packet-timeout 60 output:

Hide Details

runCmd: settings set symbols.clang-modules-cache-path "/Users/buildslave/jenkins/workspace/lldb-cmake/lldb-build/lldb-test-build.noindex/module-cache-lldb/lldb-api" output:

Hide Details

runCmd: settings set use-color false output:

Hide Details

runCmd: setting set target.prefer-dynamic-value no-dynamic-values output:

Hide Details

FAIL: LLDB (/Users/buildslave/jenkins/workspace/lldb-cmake/lldb-build/bin/clang-x86_64) :: test_register_augmentation (TestQemuAArch64TargetXml.TestQemuAarch64TargetXml) <bound method SBProcess.Kill of <lldb.SBProcess; proxy of <Swig Object of type 'lldb::SBProcess *' at 0x10901e600> >>: success

Hide Details

Restore dir to: /Users/buildslave/jenkins/workspace/lldb-cmake/lldb-build/tools/lldb/test ====================================================================== FAIL: test_register_augmentation (TestQemuAArch64TargetXml.TestQemuAarch64TargetXml) ---------------------------------------------------------------------- Traceback (most recent call last): File "/Users/buildslave/jenkins/workspace/lldb-cmake/llvm-project/lldb/test/API/functionalities/gdb_remote_client/TestQemuAArch64TargetXml.py", line 67, in test_register_augmentation process = self.connect(target) File "/Users/buildslave/jenkins/workspace/lldb-cmake/llvm-project/lldb/test/API/functionalities/gdb_remote_client/gdbclientutils.py", line 524, in connect self.assertTrue(error.Success(), error.description) AssertionError: False is not True : failed to get reply to handshake packet Config=x86_64-/Users/buildslave/jenkins/workspace/lldb-cmake/lldb-build/bin/clang ---------------------------------------------------------------------- Ran 1 test in 102.859s

Hide Details

RESULT: FAILED (0 passes, 1 failures, 0 errors, 0 skipped, 0 expected failures, 0 unexpected successes)

Hide Details

--

Hide Details

******************** PASS: lldb-api :: lang/cpp/exceptions/TestCPPExceptionBreakpoints.py (1168 of 2152) PASS: lldb-unit :: Utility/./UtilityTests/RegisterValueTest.GetSet8 (1169 of 2152) PASS: lldb-api :: lang/c/stepping/TestStepAndBreakpoints.py (1170 of 2152) PASS: lldb-shell :: Reproducer/Functionalities/TestImageList.test (1171 of 2152) PASS: lldb-unit :: Utility/./UtilityTests/ScalarTest.Comparison (1172 of 2152) PASS: lldb-shell :: Reproducer/TestHomeDir.test (1173 of 2152) PASS: lldb-unit :: SymbolFile/NativePDB/./SymbolFileNativePDBTests/PDBFPOProgramToDWARFExpressionTests.InvalidAssignmentSingle (1174 of 2152) PASS: lldb-api :: commands/expression/result_numbering/TestResultNumbering.py (1175 of 2152) PASS: lldb-api :: python_api/lldbutil/iter/TestRegistersIterator.py (1176 of 2152) PASS: lldb-unit :: Utility/./UtilityTests/LogChannelTest.Enable (1177 of 2152) PASS: lldb-unit :: Utility/./UtilityTests/StreamTest.PutMaxHex64ByteOrderLittle (1178 of 2152) PASS: lldb-unit :: Utility/./UtilityTests/StreamTest.QuotedCString (1179 of 2152) PASS: lldb-unit :: Process/gdb-remote/./ProcessGdbRemoteTests/GDBRemoteCommunicationClientTest.GetMemoryRegionInfo (1180 of 2152) PASS: lldb-shell :: Minidump/breakpad-symbols.test (1181 of 2152) PASS: lldb-unit :: Utility/./UtilityTests/OptionsWithRawTest.MultiWordSuffix (1182 of 2152) UNSUPPORTED: lldb-api :: lang/objc/objc-dynamic-value/TestObjCDynamicValue.py (1183 of 2152) PASS: lldb-unit :: Utility/./UtilityTests/SharedCluster.ClusterManager (1184 of 2152) UNSUPPORTED: lldb-api :: commands/trace/TestTraceLoad.py (1185 of 2152) PASS: lldb-api :: api/check_public_api_headers/TestPublicAPIHeaders.py (1186 of 2152) PASS: lldb-unit :: Utility/./UtilityTests/FileSpecTest.EqualSeparator (1187 of 2152) PASS: lldb-unit :: Utility/./UtilityTests/StringListTest.AppendList (1188 of 2152) PASS: lldb-api :: tools/lldb-server/inferior-crash/TestGdbRemoteSegFault.py (1189 of 2152) PASS: lldb-api :: functionalities/thread/backtrace_all/TestBacktraceAll.py (1190 of 2152) PASS: lldb-api :: lang/c/struct_types/TestStructTypes.py (1191 of 2152) PASS: lldb-api :: functionalities/data-formatter/user-format-vs-summary/TestUserFormatVsSummary.py (1192 of 2152) PASS: lldb-unit :: Utility/./UtilityTests/OptionsWithRawTest.TerminatedQuote (1193 of 2152) UNSUPPORTED: lldb-shell :: ScriptInterpreter/Lua/nested_sessions.test (1194 of 2152) PASS: lldb-unit :: Process/gdb-remote/./ProcessGdbRemoteTests/GDBRemoteCommunicationServerTest.SendErrorResponse_StringError (1195 of 2152) PASS: lldb-api :: functionalities/thread/num_threads/TestNumThreads.py (1196 of 2152) PASS: lldb-unit :: Process/minidump/./LLDBMinidumpTests/MinidumpParserTest.FindMemoryRange (1197 of 2152) UNSUPPORTED: lldb-api :: functionalities/data-formatter/data-formatter-stl/libstdcpp/string/TestDataFormatterStdString.py (1198 of 2152) PASS: lldb-unit :: Utility/./UtilityTests/ArchSpecTest.TestParseMachCPUDashSubtypeTripleSimple (1199 of 2152) PASS: lldb-unit :: Utility/./UtilityTests/StringExtractorTest.GetHexBytesAvail_Underflow (1200 of 2152) PASS: lldb-api :: functionalities/thread/crash_during_step/TestCrashDuringStep.py (1201 of 2152) PASS: lldb-api :: functionalities/thread/concurrent_events/TestConcurrentManyBreakpoints.py (1202 of 2152) PASS: lldb-unit :: Utility/./UtilityTests/StreamTest.PutPtr (1203 of 2152) PASS: lldb-api :: lang/objc/foundation/TestFoundationDisassembly.py (1204 of 2152) PASS: lldb-unit :: Language/Highlighting/./HighlighterTests/HighlighterTest.ClangTrailingBackslashBeforeNewline (1205 of 2152) PASS: lldb-api :: commands/platform/file/read/TestPlatformFileRead.py (1206 of 2152) PASS: lldb-api :: commands/watchpoints/watchpoint_commands/command/TestWatchpointCommandLLDB.py (1207 of 2152) PASS: lldb-api :: lang/cpp/namespace/TestNamespaceLookup.py (1208 of 2152) PASS: lldb-api :: functionalities/gdb_remote_client/TestTargetXMLArch.py (1209 of 2152) PASS: lldb-unit :: Symbol/./SymbolTests/TestTypeSystemClang.TestGetEnumIntegerTypeUnexpectedType (1210 of 2152) PASS: lldb-unit :: Utility/./UtilityTests/ArchSpecTest.Compatibility (1211 of 2152) PASS: lldb-unit :: Utility/./UtilityTests/RangeTest.EqualInvalid (1212 of 2152) PASS: lldb-unit :: Utility/./UtilityTests/ConstStringTest.MangledCounterpart (1213 of 2152) PASS: lldb-unit :: Utility/./UtilityTests/SerializationRountripTest.SerializeDeserializePodPointers (1214 of 2152) PASS: lldb-unit :: Utility/./UtilityTests/ConstStringTest.FromMidOfBufferStringRef (1215 of 2152) PASS: lldb-api :: lang/c/stepping/TestThreadStepping.py (1216 of 2152) PASS: lldb-api :: lang/objcxx/cxx-bridged-po/TestObjCXXBridgedPO.py (1217 of 2152) PASS: lldb-unit :: Utility/./UtilityTests/StringLexerTest.GetUnlexed (1218 of 2152) PASS: lldb-unit :: Utility/./UtilityTests/RecordReplayTest.InstrumentedFoo (1219 of 2152) PASS: lldb-api :: commands/expression/import-std-module/vector-bool/TestVectorBoolFromStdModule.py (1220 of 2152) PASS: lldb-unit :: Utility/./UtilityTests/ArgsTest.TestUnknownEscape (1221 of 2152) PASS: lldb-unit :: Utility/./UtilityTests/StreamTest.PutULEB128 (1222 of 2152) PASS: lldb-api :: lang/objc/modules-inline-functions/TestModulesInlineFunctions.py (1223 of 2152) PASS: lldb-api :: commands/command/script/import/rdar-12586188/TestRdar12586188.py (1224 of 2152) PASS: lldb-unit :: Host/./HostTests/NativeProcessProtocolTest.SetBreakpointFailVerify (1225 of 2152) PASS: lldb-api :: python_api/watchpoint/TestSetWatchpoint.py (1226 of 2152) PASS: lldb-unit :: UnwindAssembly/x86/./UnwindAssemblyx86Tests/Testx86AssemblyInspectionEngine.TestSimplex86_64Augmented (1227 of 2152) PASS: lldb-unit :: Utility/./UtilityTests/UriParserTest.SchemeHostSeparator (1228 of 2152) PASS: lldb-api :: tools/lldb-server/TestGdbRemoteRegisterState.py (1229 of 2152) PASS: lldb-shell :: Reproducer/TestVersionCheck.test (1230 of 2152) UNSUPPORTED: lldb-api :: commands/trace/TestTraceSchema.py (1231 of 2152) PASS: lldb-shell :: ObjectFile/ELF/aarch64-relocations.yaml (1232 of 2152) PASS: lldb-api :: tools/lldb-server/TestGdbRemoteKill.py (1233 of 2152) PASS: lldb-unit :: ScriptInterpreter/Python/./ScriptInterpreterPythonTests/PythonDataObjectsTest.TestPythonListValueEquality (1234 of 2152) PASS: lldb-shell :: SymbolFile/NativePDB/global-classes.cpp (1235 of 2152) PASS: lldb-api :: functionalities/breakpoint/breakpoint_by_line_and_column/TestBreakpointByLineAndColumn.py (1236 of 2152) PASS: lldb-unit :: Utility/./UtilityTests/LogChannelTest.List (1237 of 2152) UNSUPPORTED: lldb-shell :: SymbolFile/PDB/type-quals.test (1238 of 2152) PASS: lldb-unit :: Utility/./UtilityTests/VMRange.IsValid (1239 of 2152) PASS: lldb-api :: python_api/lldbutil/frame/TestFrameUtils.py (1240 of 2152) PASS: lldb-api :: functionalities/postmortem/wow64_minidump/TestWow64MiniDump.py (1241 of 2152) UNSUPPORTED: lldb-api :: functionalities/thread/concurrent_events/TestConcurrentManySignals.py (1242 of 2152) PASS: lldb-api :: commands/watchpoints/watchpoint_count/TestWatchpointCount.py (1243 of 2152) PASS: lldb-api :: functionalities/set-data/TestSetData.py (1244 of 2152) PASS: lldb-unit :: ObjectFile/MachO/./ObjectFileMachOTests/ObjectFileMachOTest.ModuleFromSharedCacheInfo (1245 of 2152) PASS: lldb-api :: python_api/value_var_update/TestValueVarUpdate.py (1246 of 2152) PASS: lldb-api :: lang/cpp/template/TestTemplateArgs.py (1247 of 2152) PASS: lldb-unit :: Target/./TargetTests/ModuleCacheTest.GetAndPutUuidExists (1248 of 2152) PASS: lldb-unit :: Host/./HostTests/SocketTest.UDPConnect (1249 of 2152) PASS: lldb-unit :: Editline/./EditlineTests/EditlineTestFixture.EditlineReceivesMultiLineText (1250 of 2152) UNSUPPORTED: lldb-api :: lang/cpp/function-template-parameter-pack/TestFunctionTemplateParameterPack.py (1251 of 2152) UNSUPPORTED: lldb-shell :: Breakpoint/case-insensitive.test (1252 of 2152) PASS: lldb-api :: functionalities/thread/concurrent_events/TestConcurrentSignalWatch.py (1253 of 2152) PASS: lldb-api :: commands/quit/TestQuit.py (1254 of 2152) PASS: lldb-api :: commands/expression/import-std-module/basic/TestImportStdModule.py (1255 of 2152) UNSUPPORTED: lldb-api :: tools/lldb-vscode/completions/TestVSCode_completions.py (1256 of 2152) PASS: lldb-shell :: SymbolFile/DWARF/debug-types-dwarf5.s (1257 of 2152) PASS: lldb-unit :: Utility/./UtilityTests/BroadcasterTest.EventTypeHasListeners (1258 of 2152) PASS: lldb-api :: commands/expression/import-std-module/shared_ptr/TestSharedPtrFromStdModule.py (1259 of 2152) PASS: lldb-api :: linux/builtin_trap/TestBuiltinTrap.py (1260 of 2152) PASS: lldb-shell :: Settings/TestFrameFormatMangling.test (1261 of 2152) PASS: lldb-shell :: Reproducer/TestReuseDirectory.test (1262 of 2152) PASS: lldb-api :: commands/gui/invalid-args/TestInvalidArgsGui.py (1263 of 2152) UNSUPPORTED: lldb-shell :: ObjectFile/ELF/minidebuginfo-no-lzma.yaml (1264 of 2152) PASS: lldb-shell :: Driver/TestFile.test (1265 of 2152) PASS: lldb-shell :: ObjectFile/ELF/netbsd-core-amd64.test (1266 of 2152) UNSUPPORTED: lldb-api :: benchmarks/continue/TestBenchmarkContinue.py (1267 of 2152) PASS: lldb-api :: lang/cpp/class_types/TestClassTypesDisassembly.py (1268 of 2152) UNSUPPORTED: lldb-shell :: SymbolFile/PDB/function-nested-block.test (1269 of 2152) PASS: lldb-api :: lang/cpp/modules-import/TestCXXModulesImport.py (1270 of 2152) PASS: lldb-unit :: Utility/./UtilityTests/StringListTest.AppendStringStdString (1271 of 2152) PASS: lldb-api :: lang/objc/orderedset/TestOrderedSet.py (1272 of 2152) PASS: lldb-unit :: ScriptInterpreter/Python/./ScriptInterpreterPythonTests/PythonDataObjectsTest.TestBorrowedReferences (1273 of 2152) PASS: lldb-api :: commands/command/script_alias/TestCommandScriptAlias.py (1274 of 2152) PASS: lldb-unit :: Utility/./UtilityTests/BroadcasterTest.BroadcastEvent (1275 of 2152) UNSUPPORTED: lldb-api :: functionalities/thread/multi_break/TestMultipleBreakpoints.py (1276 of 2152) PASS: lldb-api :: lang/objc/objc-ivar-stripped/TestObjCIvarStripped.py (1277 of 2152) PASS: lldb-unit :: Expression/./ExpressionTests/DiagnosticManagerTest.AppendMessageSubsequentDiags (1278 of 2152) PASS: lldb-unit :: Utility/./UtilityTests/StringListTest.GetSize (1279 of 2152) PASS: lldb-unit :: Language/Highlighting/./HighlighterTests/HighlighterTest.DefaultHighlighter (1280 of 2152) PASS: lldb-shell :: SymbolFile/NativePDB/ast-functions.cpp (1281 of 2152) PASS: lldb-unit :: Utility/./UtilityTests/RecordReplayTest.InstrumentedBar (1282 of 2152) PASS: lldb-shell :: Settings/TestSettingsWrite.test (1283 of 2152) PASS: lldb-unit :: Utility/./UtilityTests/DataExtractorTest.GetSLEB128_bit63 (1284 of 2152) PASS: lldb-api :: lang/c/enum_types/TestEnumTypes.py (1285 of 2152) PASS: lldb-shell :: Breakpoint/split-dwarf-5-addrbase.test (1286 of 2152) PASS: lldb-api :: functionalities/data-formatter/data-formatter-stl/libcxx/set/TestDataFormatterLibcxxSet.py (1287 of 2152) PASS: lldb-api :: lang/objc/objc++/TestObjCXX.py (1288 of 2152) PASS: lldb-unit :: Utility/./UtilityTests/StringExtractorTest.GetHexU8_Underflow2_NoEof (1289 of 2152) PASS: lldb-shell :: SymbolFile/DWARF/DW_AT_low_pc-addrx.s (1290 of 2152) PASS: lldb-shell :: ObjectFile/ELF/section-addresses.yaml (1291 of 2152) PASS: lldb-shell :: ObjectFile/ELF/PT_LOAD-overlap.yaml (1292 of 2152) PASS: lldb-shell :: ObjectFile/MachO/lc_version_min.yaml (1293 of 2152) PASS: lldb-api :: commands/expression/invalid-args/TestInvalidArgsExpression.py (1294 of 2152) PASS: lldb-api :: commands/target/create-deps/TestTargetCreateDeps.py (1295 of 2152) PASS: lldb-api :: lang/objc/foundation/TestSymbolTable.py (1296 of 2152) PASS: lldb-unit :: UnwindAssembly/x86/./UnwindAssemblyx86Tests/Testx86AssemblyInspectionEngine.TestPushR15 (1297 of 2152) PASS: lldb-unit :: Utility/./UtilityTests/RangeTest.ContainsAddrInvalid (1298 of 2152) PASS: lldb-api :: lang/objc/single-entry-dictionary/TestObjCSingleEntryDictionary.py (1299 of 2152) PASS: lldb-shell :: Commands/command-disassemble-process.yaml (1300 of 2152) PASS: lldb-api :: functionalities/float-display/TestFloatDisplay.py (1301 of 2152) UNSUPPORTED: lldb-shell :: SymbolFile/PDB/variables.test (1302 of 2152) PASS: lldb-api :: python_api/target/TestTargetAPI.py (1303 of 2152) PASS: lldb-unit :: UnwindAssembly/x86/./UnwindAssemblyx86Tests/Testx86AssemblyInspectionEngine.TestPopEBP (1304 of 2152) PASS: lldb-unit :: Utility/./UtilityTests/SerializationRountripTest.SerializeDeserializePodReferences (1305 of 2152) PASS: lldb-unit :: Utility/./UtilityTests/StreamTest.PutCharNull (1306 of 2152) UNSUPPORTED: lldb-api :: functionalities/darwin_log/filter/regex/subsystem/TestDarwinLogFilterRegexSubsystem.py (1307 of 2152) PASS: lldb-api :: api/command-return-object/TestSBCommandReturnObject.py (1308 of 2152) PASS: lldb-api :: functionalities/gdb_remote_client/TestJLink6Armv7RegisterDefinition.py (1309 of 2152) PASS: lldb-unit :: Expression/./ExpressionTests/CppModuleConfigurationTest.AmbiguousCLib (1310 of 2152) PASS: lldb-unit :: Utility/./UtilityTests/StringListTest.AppendListCStringArray (1311 of 2152) PASS: lldb-api :: lang/cpp/llvm-style/TestLLVMStyle.py (1312 of 2152) PASS: lldb-api :: functionalities/inferior-crashing/TestInferiorCrashing.py (1313 of 2152) PASS: lldb-api :: commands/command/delete/TestCommandDelete.py (1314 of 2152) PASS: lldb-api :: lang/c/bitfields/TestBitfields.py (1315 of 2152) PASS: lldb-unit :: SymbolFile/DWARF/./SymbolFileDWARFTests/SymbolFileDWARFTests.TestAbbrevMissingTerminator (1316 of 2152) PASS: lldb-api :: lang/cpp/frame-var-anon-unions/TestFrameVariableAnonymousUnions.py (1317 of 2152) PASS: lldb-api :: commands/apropos/basic/TestApropos.py (1318 of 2152) PASS: lldb-unit :: ScriptInterpreter/Python/./ScriptInterpreterPythonTests/PythonDataObjectsTest.TestModuleNameResolutionNoDot (1319 of 2152) PASS: lldb-unit :: Utility/./UtilityTests/RecordReplayTest.InstrumentedFooSameThis (1320 of 2152) PASS: lldb-api :: tools/lldb-server/TestGdbRemoteExitCode.py (1321 of 2152) PASS: lldb-unit :: UnwindAssembly/x86/./UnwindAssemblyx86Tests/Testx86AssemblyInspectionEngine.TestSimple64bitFrameFunction (1322 of 2152) PASS: lldb-api :: lang/objc/objc-new-syntax/TestObjCNewSyntaxArray.py (1323 of 2152) PASS: lldb-api :: functionalities/thread/concurrent_events/TestConcurrentSignalDelayBreak.py (1324 of 2152) PASS: lldb-unit :: Utility/./UtilityTests/SerializationRountripTest.SerializeDeserializeObjectPointer (1325 of 2152) UNSUPPORTED: lldb-api :: arm/breakpoint-it/TestBreakpointIt.py (1326 of 2152) PASS: lldb-api :: functionalities/tail_call_frames/thread_step_out_or_return/TestSteppingOutWithArtificialFrames.py (1327 of 2152) PASS: lldb-unit :: Utility/./UtilityTests/StringExtractorTest.GetHexBytes_OddPair (1328 of 2152) PASS: lldb-api :: tools/lldb-vscode/step/TestVSCode_step.py (1329 of 2152) PASS: lldb-api :: functionalities/breakpoint/cpp/TestCPPBreakpointLocations.py (1330 of 2152) PASS: lldb-api :: lang/objc/objc-struct-return/TestObjCStructReturn.py (1331 of 2152) PASS: lldb-unit :: Utility/./UtilityTests/RangeTest.ContainsEndInclusiveInvalid (1332 of 2152) PASS: lldb-api :: functionalities/inferior-crashing/recursive-inferior/TestRecursiveInferior.py (1333 of 2152) PASS: lldb-shell :: ObjectFile/ELF/PT_LOAD-empty.yaml (1334 of 2152) PASS: lldb-api :: commands/help/TestHelp.py (1335 of 2152) PASS: lldb-unit :: Utility/./UtilityTests/UriParserTest.MinimalPort (1336 of 2152) PASS: lldb-api :: lang/objc/modules-non-objc-target/TestObjCModulesNonObjCTarget.py (1337 of 2152) PASS: lldb-api :: functionalities/ptr_refs/TestPtrRefs.py (1338 of 2152) PASS: lldb-api :: commands/register/register/register_command/TestRegisters.py (1339 of 2152) PASS: lldb-unit :: Target/./TargetTests/PathMappingListTest.RemapRoot (1340 of 2152) PASS: lldb-unit :: Utility/./UtilityTests/VASprintfTest.BufferResize (1341 of 2152) UNSUPPORTED: lldb-api :: functionalities/darwin_log/filter/exact_match/message/TestDarwinLogFilterMatchMessage.py (1342 of 2152) PASS: lldb-unit :: Language/Highlighting/./HighlighterTests/HighlighterTest.ClangPPDirectives (1343 of 2152) PASS: lldb-shell :: SymbolFile/DWARF/debug_line-tombstone.s (1344 of 2152) PASS: lldb-unit :: Utility/./UtilityTests/StreamTeeTest.SetStreamAtIndexOverwrite (1345 of 2152) PASS: lldb-api :: commands/expression/po_verbosity/TestPoVerbosity.py (1346 of 2152) PASS: lldb-unit :: Host/./HostTests/FileSystemTest.EnumerateDirectory (1347 of 2152) PASS: lldb-api :: functionalities/breakpoint/breakpoint_set_restart/TestBreakpointSetRestart.py (1348 of 2152) PASS: lldb-unit :: Utility/./UtilityTests/ArchSpecTest.OperatorBool (1349 of 2152) PASS: lldb-shell :: SymbolFile/DWARF/find-method.cpp (1350 of 2152) PASS: lldb-unit :: Core/./LLDBCoreTests/MangledTest.ResultForValidName (1351 of 2152) PASS: lldb-api :: functionalities/signal/handle-abrt/TestHandleAbort.py (1352 of 2152) PASS: lldb-shell :: SymbolFile/Breakpad/line-table-discontinuous-file-ids.test (1353 of 2152) UNSUPPORTED: lldb-shell :: Register/x86-64-gp-write.test (1354 of 2152) PASS: lldb-unit :: Utility/./UtilityTests/StringExtractorTest.DecodeHexU8_Exact (1355 of 2152) PASS: lldb-api :: macosx/find-dsym/bundle-with-dot-in-filename/TestBundleWithDotInFilename.py (1356 of 2152) PASS: lldb-unit :: Utility/./UtilityTests/LogChannelEnabledTest.LogGetLogThread (1357 of 2152) PASS: lldb-api :: sample_test/TestSampleTest.py (1358 of 2152) PASS: lldb-api :: functionalities/data-formatter/nsdictionarysynth/TestNSDictionarySynthetic.py (1359 of 2152) PASS: lldb-shell :: Settings/TestDisassemblyFormat.test (1360 of 2152) PASS: lldb-api :: functionalities/load_using_paths/TestLoadUsingPaths.py (1361 of 2152) PASS: lldb-unit :: Utility/./UtilityTests/XcodeSDKTest.SDKSupportsModules (1362 of 2152) PASS: lldb-shell :: ScriptInterpreter/Python/scripted_breakpoint.test (1363 of 2152) PASS: lldb-shell :: SymbolFile/DWARF/dwarf5-index-is-used.cpp (1364 of 2152) PASS: lldb-unit :: Utility/./UtilityTests/ProcessInfoTest.Constructor (1365 of 2152) UNSUPPORTED: lldb-api :: commands/target/auto-install-main-executable/TestAutoInstallMainExecutable.py (1366 of 2152) PASS: lldb-api :: lang/objc/modules-compile-error/TestModulesCompileError.py (1367 of 2152) PASS: lldb-unit :: Expression/./ExpressionTests/DiagnosticManagerTest.HasFixits (1368 of 2152) PASS: lldb-unit :: Utility/./UtilityTests/StringListTest.LongestCommonPrefixDuplicateElement (1369 of 2152) PASS: lldb-api :: commands/frame/var-scope/TestFrameVariableScope.py (1370 of 2152) PASS: lldb-api :: functionalities/gdb_remote_client/TestWriteMemory.py (1371 of 2152) PASS: lldb-unit :: Process/gdb-remote/./ProcessGdbRemoteTests/GDBRemoteCommunicationClientTest.GetMemoryRegionInfoInvalidResponse (1372 of 2152) PASS: lldb-unit :: UnwindAssembly/ARM64/./Arm64InstEmulationTests/TestArm64InstEmulation.TestRegisterSavedTwice (1373 of 2152) PASS: lldb-api :: lang/cpp/breakpoint-commands/TestCPPBreakpointCommands.py (1374 of 2152) PASS: lldb-unit :: Utility/./UtilityTests/SerializationRountripTest.SerializeDeserializeCString (1375 of 2152) PASS: lldb-unit :: Utility/./UtilityTests/StringExtractorTest.GetU64BigEndian (1376 of 2152) PASS: lldb-api :: tools/lldb-server/register-reading/TestGdbRemoteGPacket.py (1377 of 2152) PASS: lldb-unit :: Utility/./UtilityTests/StringListTest.AppendListCStringArrayEmpty (1378 of 2152) PASS: lldb-api :: functionalities/target_var/no_vars/TestTargetVarNoVars.py (1379 of 2152) PASS: lldb-unit :: Utility/./UtilityTests/ScalarTest.TruncOrExtendTo (1380 of 2152) PASS: lldb-shell :: Breakpoint/debug_rnglist_basic.test (1381 of 2152) PASS: lldb-shell :: SymbolFile/DWARF/find-qualified-variable.cpp (1382 of 2152) UNSUPPORTED: lldb-api :: benchmarks/stepping/TestSteppingSpeed.py (1383 of 2152) PASS: lldb-unit :: Utility/./UtilityTests/StringListTest.SplitIntoLines (1384 of 2152) PASS: lldb-api :: functionalities/data-formatter/data-formatter-smart-array/TestDataFormatterSmartArray.py (1385 of 2152) PASS: lldb-api :: python_api/interpreter/TestRunCommandInterpreterAPI.py (1386 of 2152) PASS: lldb-unit :: Utility/./UtilityTests/DataExtractorTest.PeekData (1387 of 2152) UNSUPPORTED: lldb-shell :: SymbolFile/DWARF/debug-types-expressions.test (1388 of 2152) PASS: lldb-unit :: Process/minidump/./LLDBMinidumpTests/MinidumpParserTest.GetThreadContext_x86_64 (1389 of 2152) PASS: lldb-unit :: Utility/./UtilityTests/StreamTeeTest.CopyConstructor (1390 of 2152) PASS: lldb-shell :: SymbolFile/DWARF/DW_TAG_variable-invalid_location.s (1391 of 2152) PASS: lldb-api :: iohandler/unicode/TestUnicode.py (1392 of 2152) PASS: lldb-unit :: Utility/./UtilityTests/DataExtractorTest.GetCStrEmpty (1393 of 2152) PASS: lldb-api :: python_api/sbvalue_const_addrof/TestSBValueConstAddrOf.py (1394 of 2152) PASS: lldb-shell :: SymbolFile/DWARF/debug_loclists-dwo.s (1395 of 2152) PASS: lldb-api :: commands/expression/import-std-module/vector-dbg-info-content/TestDbgInfoContentVectorFromStdModule.py (1396 of 2152) UNSUPPORTED: lldb-api :: commands/register/register/intel_xtended_registers/TestMPXRegisters.py (1397 of 2152) PASS: lldb-unit :: Utility/./UtilityTests/DataExtractorTest.GetMaxU64 (1398 of 2152) PASS: lldb-api :: functionalities/data-formatter/data-formatter-ptr-to-array/TestPtrToArrayFormatting.py (1399 of 2152) PASS: lldb-shell :: Commands/command-target-modules-dump-sections.yaml (1400 of 2152) PASS: lldb-shell :: SymbolFile/NativePDB/tag-types.cpp (1401 of 2152) PASS: lldb-unit :: UnwindAssembly/x86/./UnwindAssemblyx86Tests/Testx86AssemblyInspectionEngine.TestSubRSP (1402 of 2152) PASS: lldb-unit :: Utility/./UtilityTests/StringListTest.ForRangeEmpty (1403 of 2152) PASS: lldb-unit :: Expression/./ExpressionTests/DiagnosticManagerTest.PutStringMultiple (1404 of 2152) PASS: lldb-api :: commands/process/attach/TestProcessAttach.py (1405 of 2152) PASS: lldb-api :: functionalities/abbreviation/TestCommonShortSpellings.py (1406 of 2152) PASS: lldb-api :: sanity/TestModuleCacheSanity.py (1407 of 2152) UNSUPPORTED: lldb-api :: commands/expression/completion-crash-invalid-iterator/TestInvalidIteratorCompletionCrash.py (1408 of 2152) PASS: lldb-api :: commands/expression/context-object/TestContextObject.py (1409 of 2152) PASS: lldb-shell :: SymbolFile/DWARF/debug-types-address-ranges.s (1410 of 2152) PASS: lldb-api :: functionalities/data-formatter/data-formatter-categories/TestDataFormatterCategories.py (1411 of 2152) PASS: lldb-unit :: Expression/./ExpressionTests/CppModuleConfigurationTest.Xcode (1412 of 2152) PASS: lldb-unit :: Host/./HostTests/NativeProcessProtocolTest.ReadMemoryWithoutTrap (1413 of 2152) PASS: lldb-api :: commands/expression/diagnostics/TestExprDiagnostics.py (1414 of 2152) PASS: lldb-unit :: Utility/./UtilityTests/PassiveReplayTest.InstrumentedFoo (1415 of 2152) PASS: lldb-api :: functionalities/data-formatter/data-formatter-stl/libcxx/optional/TestDataFormatterLibcxxOptional.py (1416 of 2152) PASS: lldb-unit :: Expression/./ExpressionTests/CppModuleConfigurationTest.MissingLibCpp (1417 of 2152) PASS: lldb-shell :: ObjectFile/ELF/gnu-debuglink.yaml (1418 of 2152) PASS: lldb-api :: commands/thread/select/TestThreadSelect.py (1419 of 2152) PASS: lldb-unit :: Process/minidump/./LLDBMinidumpTests/MinidumpParserTest.GetThreadContext_x86_32_wow64 (1420 of 2152) PASS: lldb-api :: functionalities/completion/TestCompletion.py (1421 of 2152) PASS: lldb-api :: functionalities/tail_call_frames/cross_dso/TestCrossDSOTailCalls.py (1422 of 2152) PASS: lldb-shell :: Driver/TestProcessAttach.test (1423 of 2152) PASS: lldb-shell :: SymbolFile/DWARF/clang-ast-from-dwarf-objc-property.m (1424 of 2152) PASS: lldb-unit :: SymbolFile/DWARF/./SymbolFileDWARFTests/SymbolFileDWARFTests.TestAbbrevOutOfOrder (1425 of 2152) PASS: lldb-unit :: Utility/./UtilityTests/BinaryStreamTest.PutSLEB128OneByte (1426 of 2152) PASS: lldb-unit :: Symbol/./SymbolTests/DWARFCallFrameInfoTest.Basic_eh (1427 of 2152) PASS: lldb-api :: commands/expression/persistent_types/TestNestedPersistentTypes.py (1428 of 2152) PASS: lldb-api :: lang/objc/objc-super/TestObjCSuper.py (1429 of 2152) PASS: lldb-api :: lang/objc/modules-auto-import/TestModulesAutoImport.py (1430 of 2152) PASS: lldb-api :: functionalities/data-formatter/data-formatter-stl/libcxx/vector/TestDataFormatterLibcxxVector.py (1431 of 2152) PASS: lldb-unit :: DataFormatter/./LLDBFormatterTests/TypeMatcherTests.RegexName (1432 of 2152) PASS: lldb-unit :: tools/lldb-server/tests/./LLDBServerTests/TestBase.DebugserverEnv (1433 of 2152) PASS: lldb-unit :: Symbol/./SymbolTests/Type.CompilerContextPattern (1434 of 2152) PASS: lldb-api :: commands/frame/recognizer/TestFrameRecognizer.py (1435 of 2152) PASS: lldb-shell :: SymbolFile/NativePDB/ast-methods.cpp (1436 of 2152) PASS: lldb-shell :: Watchpoint/SetErrorCases.test (1437 of 2152) PASS: lldb-api :: lang/cpp/inlines/TestInlines.py (1438 of 2152) PASS: lldb-api :: lang/cpp/covariant-return-types/TestCovariantReturnTypes.py (1439 of 2152) PASS: lldb-api :: commands/gui/viewlarge/TestGuiViewLarge.py (1440 of 2152) PASS: lldb-unit :: Language/Highlighting/./HighlighterTests/HighlighterTest.ClangPreserveNewLine (1441 of 2152) PASS: lldb-api :: functionalities/tsan/cpp_global_location/TestTsanCPPGlobalLocation.py (1442 of 2152) PASS: lldb-api :: functionalities/thread/concurrent_events/TestConcurrentWatchBreakDelay.py (1443 of 2152) PASS: lldb-unit :: Utility/./UtilityTests/StringExtractorTest.GetHexBytes_OddPair2 (1444 of 2152) PASS: lldb-unit :: SymbolFile/NativePDB/./SymbolFileNativePDBTests/PDBFPOProgramToDWARFExpressionTests.InvalidOpBinary (1445 of 2152) PASS: lldb-api :: functionalities/exec/TestExec.py (1446 of 2152) PASS: lldb-unit :: Symbol/./SymbolTests/TestTypeSystemClang.TestFunctionTemplateConstruction (1447 of 2152) PASS: lldb-api :: commands/disassemble/basic/TestDisassembleBreakpoint.py (1448 of 2152) PASS: lldb-api :: python_api/interpreter/TestCommandInterpreterAPI.py (1449 of 2152) PASS: lldb-api :: lang/objc/objc-ivar-offsets/TestObjCIvarOffsets.py (1450 of 2152) PASS: lldb-api :: functionalities/gdb_remote_client/TestNestedRegDefinitions.py (1451 of 2152) PASS: lldb-unit :: Host/./HostTests/HostInfoTest.GetAugmentedArchSpec (1452 of 2152) PASS: lldb-api :: lang/objc/foundation/TestRuntimeTypes.py (1453 of 2152) PASS: lldb-shell :: SymbolFile/DWARF/debug_loc_and_loclists.s (1454 of 2152) PASS: lldb-unit :: UnwindAssembly/ARM64/./Arm64InstEmulationTests/TestArm64InstEmulation.TestMediumDarwinFunction (1455 of 2152) PASS: lldb-api :: functionalities/gdb_remote_client/TestArmRegisterDefinition.py (1456 of 2152) PASS: lldb-api :: lang/c/unicode/TestUnicodeSymbols.py (1457 of 2152) PASS: lldb-unit :: UnwindAssembly/x86/./UnwindAssemblyx86Tests/Testx86AssemblyInspectionEngine.TestPopRBPWithREX (1458 of 2152) PASS: lldb-unit :: Process/gdb-remote/./ProcessGdbRemoteTests/GDBRemoteCommunicationServerTest.SendErrorResponse_UnimplementedError (1459 of 2152) PASS: lldb-shell :: ObjectFile/PECOFF/basic-info-arm64.yaml (1460 of 2152) PASS: lldb-api :: lang/c/step_over_no_deadlock/TestStepOverDoesntBlock.py (1461 of 2152) PASS: lldb-api :: commands/frame/diagnose/complicated-expression/TestComplicatedExpression.py (1462 of 2152) XFAIL: lldb-shell :: Register/x86-64-write.test (1463 of 2152) PASS: lldb-api :: lang/c/blocks/TestBlocks.py (1464 of 2152) PASS: lldb-unit :: Utility/./UtilityTests/ArgsTest.ReplaceArgumentAtIndexFarOutOfRange (1465 of 2152) PASS: lldb-unit :: Process/minidump/./LLDBMinidumpTests/MinidumpParserTest.InvalidMinidump (1466 of 2152) UNSUPPORTED: lldb-shell :: Register/x86-ymm-read.test (1467 of 2152) PASS: lldb-unit :: Expression/./ExpressionTests/CppModuleConfigurationTest.LinuxLocalLibCpp (1468 of 2152) PASS: lldb-unit :: Utility/./UtilityTests/StreamTest.ShiftOperatorPtr (1469 of 2152) PASS: lldb-api :: lang/objc/objc-baseclass-sbtype/TestObjCBaseClassSBType.py (1470 of 2152) PASS: lldb-unit :: Utility/./UtilityTests/ArgsTest.ReplaceArgumentAtIndexOutOfRange (1471 of 2152) PASS: lldb-api :: python_api/class_members/TestSBTypeClassMembers.py (1472 of 2152) PASS: lldb-unit :: Utility/./UtilityTests/StreamTest.AddressRangeSize (1473 of 2152) PASS: lldb-api :: lang/cpp/global_variables/TestCPPGlobalVariables.py (1474 of 2152) PASS: lldb-unit :: Utility/./UtilityTests/CompletionRequest.DuplicateFiltering (1475 of 2152) PASS: lldb-unit :: Utility/./UtilityTests/TildeExpressionResolver.ResolveFullPath (1476 of 2152) PASS: lldb-unit :: Utility/./UtilityTests/StreamTest.PutHex64ByteOrderBig (1477 of 2152) PASS: lldb-unit :: Utility/./UtilityTests/StringExtractorTest.GetHexU8_Extra (1478 of 2152) PASS: lldb-api :: commands/expression/import-std-module/sysroot/TestStdModuleSysroot.py (1479 of 2152) PASS: lldb-api :: commands/frame/language/TestGuessLanguage.py (1480 of 2152) PASS: lldb-shell :: ScriptInterpreter/Python/sb_address_exception.test (1481 of 2152) PASS: lldb-api :: lang/objc/modules-update/TestClangModulesUpdate.py (1482 of 2152) PASS: lldb-api :: lang/cpp/offsetof/TestOffsetofCpp.py (1483 of 2152) PASS: lldb-unit :: Utility/./UtilityTests/VMRange.Reset (1484 of 2152) PASS: lldb-api :: functionalities/tail_call_frames/cross_object/TestCrossObjectTailCalls.py (1485 of 2152) PASS: lldb-api :: types/TestLongTypesExpr.py (1486 of 2152) PASS: lldb-unit :: Utility/./UtilityTests/TimeoutTest.Construction (1487 of 2152) PASS: lldb-api :: commands/session/history/TestSessionHistory.py (1488 of 2152) PASS: lldb-api :: functionalities/thread/concurrent_events/TestConcurrentDelaySignalWatch.py (1489 of 2152) UNSUPPORTED: lldb-shell :: ScriptInterpreter/Lua/convenience_variables.test (1490 of 2152) PASS: lldb-api :: commands/expression/call-function/TestCallStdStringFunction.py (1491 of 2152) PASS: lldb-api :: tools/lldb-server/TestGdbRemote_qThreadStopInfo.py (1492 of 2152) PASS: lldb-unit :: ScriptInterpreter/Python/./ScriptInterpreterPythonTests/PythonDataObjectsTest.TestExceptions (1493 of 2152) PASS: lldb-unit :: UnwindAssembly/x86/./UnwindAssemblyx86Tests/Testx86AssemblyInspectionEngine.TestSpillRegToStackViaMOVi386 (1494 of 2152) PASS: lldb-unit :: Expression/./ExpressionTests/DWARFExpression.DW_OP_stack_value (1495 of 2152) PASS: lldb-unit :: Language/Highlighting/./HighlighterTests/HighlighterTest.ClangComments (1496 of 2152) PASS: lldb-api :: lang/objc/objc-builtin-types/TestObjCBuiltinTypes.py (1497 of 2152) PASS: lldb-unit :: Process/gdb-remote/./ProcessGdbRemoteTests/GDBRemoteClientBaseTest.SendContinueAndAsyncSignal (1498 of 2152) PASS: lldb-unit :: UnwindAssembly/x86/./UnwindAssemblyx86Tests/Testx86AssemblyInspectionEngine.TestPopEDI (1499 of 2152) PASS: lldb-unit :: UnwindAssembly/ARM64/./Arm64InstEmulationTests/TestArm64InstEmulation.TestFramelessThreeEpilogueFunction (1500 of 2152) PASS: lldb-api :: types/TestCharTypeExpr.py (1501 of 2152) PASS: lldb-unit :: Utility/./UtilityTests/DataExtractorTest.GetFloat (1502 of 2152) PASS: lldb-unit :: Platform/Android/./AdbClientTests/AdbClientTest.CreateByDeviceId_ByEnvVar (1503 of 2152) PASS: lldb-unit :: ScriptInterpreter/Python/./ScriptInterpreterPythonTests/PythonDataObjectsTest.TestCallable (1504 of 2152) PASS: lldb-unit :: Core/./LLDBCoreTests/RichManglingContextTest.Basic (1505 of 2152) PASS: lldb-api :: tools/lldb-vscode/launch/TestVSCode_launch.py (1506 of 2152) PASS: lldb-shell :: SymbolFile/Breakpad/unwind-via-stack-win-no-memory-info.yaml (1507 of 2152) PASS: lldb-unit :: Utility/./UtilityTests/DataExtractorTest.UncommonAddressSize (1508 of 2152) PASS: lldb-unit :: Process/gdb-remote/./ProcessGdbRemoteTests/GDBRemoteCommunicationClientTest.SendSignalsToIgnore (1509 of 2152) PASS: lldb-api :: commands/platform/basic/TestPlatformPython.py (1510 of 2152) PASS: lldb-api :: macosx/thread_suspend/TestInternalThreadSuspension.py (1511 of 2152) PASS: lldb-unit :: SymbolFile/NativePDB/./SymbolFileNativePDBTests/PDBFPOProgramToDWARFExpressionTests.InvalidOpUnary (1512 of 2152) PASS: lldb-api :: lang/cpp/constructors/TestCppConstructors.py (1513 of 2152) PASS: lldb-shell :: Process/UnsupportedLanguage.test (1514 of 2152) PASS: lldb-unit :: Utility/./UtilityTests/SubsystemRAIITest.SubsystemWithErrorFailure (1515 of 2152) PASS: lldb-unit :: Host/./HostTests/SocketTest.UDPGetConnectURI (1516 of 2152) PASS: lldb-unit :: Utility/./UtilityTests/StatusTest.Formatv (1517 of 2152) PASS: lldb-shell :: SymbolFile/DWARF/module-ownership.mm (1518 of 2152) PASS: lldb-unit :: Utility/./UtilityTests/StringExtractorTest.InitMisc (1519 of 2152) PASS: lldb-api :: functionalities/memory/read/TestMemoryRead.py (1520 of 2152) PASS: lldb-shell :: SymbolFile/DWARF/find-variable-dwo.cpp (1521 of 2152) PASS: lldb-unit :: UnwindAssembly/ARM64/./Arm64InstEmulationTests/TestArm64InstEmulation.TestCFARegisterTrackedAcrossJumps (1522 of 2152) PASS: lldb-api :: functionalities/thread/jump/TestThreadJump.py (1523 of 2152) PASS: lldb-api :: functionalities/data-formatter/data-formatter-objc/TestDataFormatterObjCNSError.py (1524 of 2152) PASS: lldb-unit :: Signals/./SignalsTests/UnixSignalsTest.GetInfo (1525 of 2152) PASS: lldb-api :: functionalities/postmortem/netbsd-core/TestNetBSDCore.py (1526 of 2152) PASS: lldb-unit :: Utility/./UtilityTests/VMRange.ContainsRange (1527 of 2152) PASS: lldb-unit :: Utility/./UtilityTests/StringExtractorTest.GetHexU8_Underflow_NoEof (1528 of 2152) PASS: lldb-unit :: ObjectFile/ELF/./ObjectFileELFTests/ObjectFileELFTest.SectionsResolveConsistently (1529 of 2152) PASS: lldb-shell :: SymbolFile/Breakpad/symtab-macho.test (1530 of 2152) PASS: lldb-api :: lang/cpp/multiple-inheritance/TestCppMultipleInheritance.py (1531 of 2152) PASS: lldb-unit :: ObjectFile/ELF/./ObjectFileELFTests/ObjectFileELFTest.GetModuleSpecifications_EarlySectionHeaders (1532 of 2152) PASS: lldb-unit :: Process/minidump/./LLDBMinidumpTests/RegisterContextMinidump.ConvertMinidumpContext_x86_64 (1533 of 2152) PASS: lldb-shell :: ObjectFile/ELF/PT_LOAD-overlap-PT_INTERP.yaml (1534 of 2152) PASS: lldb-unit :: UnwindAssembly/x86/./UnwindAssemblyx86Tests/Testx86AssemblyInspectionEngine.TestCALLNextInsn (1535 of 2152) PASS: lldb-unit :: Utility/./UtilityTests/RangeDataVector.CustomSort (1536 of 2152) PASS: lldb-unit :: Utility/./UtilityTests/CompletionRequest.TryCompleteCurrentArgMode (1537 of 2152) PASS: lldb-shell :: SymbolFile/DWARF/parallel-indexing-stress.s (1538 of 2152) PASS: lldb-api :: commands/statistics/basic/TestStats.py (1539 of 2152) UNSUPPORTED: lldb-api :: functionalities/data-formatter/data-formatter-stl/libstdcpp/iterator/TestDataFormatterStdIterator.py (1540 of 2152) PASS: lldb-api :: functionalities/data-formatter/data-formatter-stl/libcxx/vbool/TestDataFormatterLibcxxVBool.py (1541 of 2152) PASS: lldb-unit :: Utility/./UtilityTests/FileSpecTest.GuessPathStyle (1542 of 2152) PASS: lldb-api :: functionalities/data-formatter/data-formatter-stl/libcxx/variant/TestDataFormatterLibcxxVariant.py (1543 of 2152) PASS: lldb-unit :: Process/minidump/./LLDBMinidumpTests/MinidumpParserTest.GetMemoryRegionInfoFromMemory64List (1544 of 2152) PASS: lldb-api :: commands/expression/codegen-crash-typedefdecl-not-in_declcontext/TestCodegenCrashTypedefDeclNotInDeclContext.py (1545 of 2152) PASS: lldb-api :: lang/cpp/limit-debug-info/TestWithLimitDebugInfo.py (1546 of 2152) UNSUPPORTED: lldb-api :: macosx/macCatalystAppMacOSFramework/TestMacCatalystAppWithMacOSFramework.py (1547 of 2152) UNSUPPORTED: lldb-api :: functionalities/data-formatter/data-formatter-stl/libstdcpp/unique_ptr/TestDataFormatterStdUniquePtr.py (1548 of 2152) PASS: lldb-shell :: Minidump/Windows/Sigsegv/sigsegv.test (1549 of 2152) PASS: lldb-api :: lang/cpp/this_class_type_mixing/TestThisClassTypeMixing.py (1550 of 2152) UNSUPPORTED: lldb-api :: functionalities/darwin_log/basic/TestDarwinLogBasic.py (1551 of 2152) PASS: lldb-unit :: Utility/./UtilityTests/RangeDataVector.FindEntryIndexesThatContain_Overlap (1552 of 2152) PASS: lldb-shell :: SymbolFile/DWARF/DW_TAG_variable-DW_AT_const_value.s (1553 of 2152) UNSUPPORTED: lldb-shell :: ScriptInterpreter/Lua/bindings.test (1554 of 2152) PASS: lldb-unit :: Target/./TargetTests/ExecutionContextTest.GetByteOrder (1555 of 2152) PASS: lldb-unit :: Host/./HostTests/SocketTest.DomainListenConnectAccept (1556 of 2152) PASS: lldb-unit :: Process/minidump/./LLDBMinidumpTests/MinidumpParserTest.GetLinuxProcStatus (1557 of 2152) PASS: lldb-shell :: SymbolFile/DWARF/array-sizes.s (1558 of 2152) PASS: lldb-unit :: Host/./HostTests/FileSystemTest.EmptyTest (1559 of 2152) PASS: lldb-unit :: Host/./HostTests/Host.WaitStatusFormat (1560 of 2152) PASS: lldb-unit :: Utility/./UtilityTests/BinaryStreamTest.PutSLEB128NineBytes (1561 of 2152) PASS: lldb-api :: functionalities/breakpoint/breakpoint_hit_count/TestBreakpointHitCount.py (1562 of 2152) PASS: lldb-api :: macosx/simulator/TestSimulatorPlatform.py (1563 of 2152) PASS: lldb-api :: lang/cpp/global_operators/TestCppGlobalOperators.py (1564 of 2152) PASS: lldb-unit :: Utility/./UtilityTests/BinaryStreamTest.PutSLEB128SevenBytes (1565 of 2152) PASS: lldb-api :: python_api/breakpoint/TestBreakpointAPI.py (1566 of 2152) PASS: lldb-api :: functionalities/thread_plan/TestThreadPlanCommands.py (1567 of 2152) UNSUPPORTED: lldb-shell :: SymbolFile/PDB/typedefs.test (1568 of 2152) UNSUPPORTED: lldb-api :: commands/expression/call-restarts/TestCallThatRestarts.py (1569 of 2152) PASS: lldb-api :: lang/cpp/subst_template_type_param/TestSubstTemplateTypeParam.py (1570 of 2152) PASS: lldb-api :: python_api/lldbutil/TestSwigVersion.py (1571 of 2152) PASS: lldb-shell :: Reproducer/TestDebugSymbols.test (1572 of 2152) PASS: lldb-api :: lang/c/local_types/TestUseClosestType.py (1573 of 2152) PASS: lldb-unit :: Utility/./UtilityTests/GeneratorTest.YamlMultiProvider (1574 of 2152) PASS: lldb-shell :: Commands/command-backtrace.test (1575 of 2152) PASS: lldb-shell :: Settings/TestEchoCommands.test (1576 of 2152) PASS: lldb-api :: commands/expression/timeout/TestCallWithTimeout.py (1577 of 2152) PASS: lldb-shell :: Reproducer/TestFileRepro.test (1578 of 2152) PASS: lldb-unit :: Utility/./UtilityTests/StringListTest.InsertStringAtIndexStart (1579 of 2152) PASS: lldb-shell :: Expr/TestIRMemoryMap.test (1580 of 2152) PASS: lldb-api :: commands/expression/top-level/TestTopLevelExprs.py (1581 of 2152) PASS: lldb-api :: commands/add-dsym/uuid/TestAddDsymCommand.py (1582 of 2152) PASS: lldb-unit :: Utility/./UtilityTests/ScalarTest.SetValueFromCString (1583 of 2152) PASS: lldb-unit :: Process/minidump/./LLDBMinidumpTests/MinidumpParserTest.MinidumpDuplicateModuleMappedFirst (1584 of 2152) PASS: lldb-api :: lang/objc/objc-runtime-ivars/TestRuntimeIvars.py (1585 of 2152) PASS: lldb-unit :: Host/./HostTests/NativeProcessProtocolTest.SetBreakpointFailWrite (1586 of 2152) PASS: lldb-unit :: Utility/./UtilityTests/GeneratorTest.Create (1587 of 2152) PASS: lldb-api :: functionalities/data-formatter/data-formatter-stl/libcxx/string/TestDataFormatterLibcxxString.py (1588 of 2152) PASS: lldb-api :: commands/expression/vector_of_enums/TestVectorOfEnums.py (1589 of 2152) PASS: lldb-api :: lang/objc/variadic_methods/TestVariadicMethods.py (1590 of 2152) PASS: lldb-unit :: UnwindAssembly/x86/./UnwindAssemblyx86Tests/Testx86AssemblyInspectionEngine.TestPushEBX (1591 of 2152) PASS: lldb-api :: functionalities/data-formatter/vector-types/TestVectorTypesFormatting.py (1592 of 2152) PASS: lldb-api :: lang/cpp/class_types/TestClassTypes.py (1593 of 2152) PASS: lldb-unit :: Utility/./UtilityTests/LogChannelTest.EnableOptions (1594 of 2152) PASS: lldb-unit :: Process/minidump/./LLDBMinidumpTests/MinidumpParserTest.MinidumpDuplicateModuleMinAddress (1595 of 2152) PASS: lldb-unit :: Host/./HostTests/MainLoopTest.UnmonitoredSignal (1596 of 2152) PASS: lldb-api :: python_api/process/TestProcessAPI.py (1597 of 2152) PASS: lldb-api :: tools/lldb-server/commandline/TestStubReverseConnect.py (1598 of 2152) PASS: lldb-unit :: Utility/./UtilityTests/StringListTest.InsertStringAtIndexMove (1599 of 2152) PASS: lldb-api :: functionalities/data-formatter/language_category_updates/TestDataFormatterLanguageCategoryUpdates.py (1600 of 2152) PASS: lldb-unit :: Utility/./UtilityTests/LogTest.Register (1601 of 2152) PASS: lldb-api :: functionalities/thread/concurrent_events/TestConcurrentTwoWatchpointsOneDelayBreakpoint.py (1602 of 2152) PASS: lldb-api :: commands/expression/call-function/TestCallBuiltinFunction.py (1603 of 2152) PASS: lldb-unit :: Host/./HostTests/FileSystemTest.OpenErrno (1604 of 2152) PASS: lldb-unit :: Utility/./UtilityTests/StreamTeeTest.Constructor2Streams (1605 of 2152) PASS: lldb-unit :: Utility/./UtilityTests/ProcessInstanceInfoList.Yaml (1606 of 2152) PASS: lldb-api :: functionalities/thread/concurrent_events/TestConcurrentTwoBreakpointsOneSignal.py (1607 of 2152) PASS: lldb-api :: functionalities/fat_archives/TestFatArchives.py (1608 of 2152) PASS: lldb-unit :: Symbol/./SymbolTests/TestTypeSystemClang.TestConvertAccessTypeToAccessSpecifier (1609 of 2152) PASS: lldb-unit :: Utility/./UtilityTests/Flags.IsClear (1610 of 2152) PASS: lldb-api :: functionalities/plugins/command_plugin/TestPluginCommands.py (1611 of 2152) PASS: lldb-unit :: Utility/./UtilityTests/NameMatchesTest.StartsWith (1612 of 2152) PASS: lldb-unit :: Utility/./UtilityTests/StringExtractorTest.GetNameColonValueSuccess (1613 of 2152) PASS: lldb-api :: functionalities/data-formatter/data-formatter-synthtype/TestDataFormatterSynthType.py (1614 of 2152) PASS: lldb-api :: functionalities/thread/concurrent_events/TestConcurrentWatchBreak.py (1615 of 2152) PASS: lldb-unit :: Utility/./UtilityTests/DataExtractorTest.GetCStrAtEnd (1616 of 2152) PASS: lldb-unit :: Utility/./UtilityTests/StringExtractorTest.GetHexU8_Extra_NoEof (1617 of 2152) PASS: lldb-unit :: Utility/./UtilityTests/RecordReplayTest.InstrumentedBarPtr (1618 of 2152) PASS: lldb-unit :: Utility/./UtilityTests/RangeDataVector.FindEntryIndexesThatContain (1619 of 2152) PASS: lldb-api :: commands/expression/two-files/TestObjCTypeQueryFromOtherCompileUnit.py (1620 of 2152) PASS: lldb-unit :: Utility/./UtilityTests/FileSpecTest.AppendPathComponent (1621 of 2152) PASS: lldb-shell :: ObjectFile/ELF/section-overlap.yaml (1622 of 2152) PASS: lldb-api :: commands/expression/persistent_ptr_update/TestPersistentPtrUpdate.py (1623 of 2152) PASS: lldb-unit :: Utility/./UtilityTests/OptionsWithRawTest.EmptySuffixSingleWhitespace (1624 of 2152) UNSUPPORTED: lldb-api :: commands/register/register/intel_xtended_registers/mpx_offset_intersection/TestMPXOffsetIntersection.py (1625 of 2152) PASS: lldb-api :: functionalities/breakpoint/breakpoint_language/TestBreakpointLanguage.py (1626 of 2152) PASS: lldb-api :: functionalities/var_path/TestVarPath.py (1627 of 2152) PASS: lldb-api :: commands/frame/select/TestFrameSelect.py (1628 of 2152) PASS: lldb-api :: lang/cpp/symbols/TestSymbols.py (1629 of 2152) PASS: lldb-unit :: Utility/./UtilityTests/BinaryStreamTest.PutULEB128ThreeBytes (1630 of 2152) PASS: lldb-unit :: Utility/./UtilityTests/StringListTest.SplitIntoLinesSingleTrailingCR (1631 of 2152) PASS: lldb-shell :: Reproducer/TestDSYM.test (1632 of 2152) UNSUPPORTED: lldb-api :: benchmarks/turnaround/TestCompileRunToBreakpointTurnaround.py (1633 of 2152) PASS: lldb-api :: functionalities/thread/concurrent_events/TestConcurrentBreakpointsDelayedBreakpointOneWatchpoint.py (1634 of 2152) PASS: lldb-api :: python_api/type/TestTypeList.py (1635 of 2152) UNSUPPORTED: lldb-api :: functionalities/darwin_log/filter/regex/message/TestDarwinLogFilterRegexMessage.py (1636 of 2152) PASS: lldb-unit :: ScriptInterpreter/Python/./ScriptInterpreterPythonTests/PythonDataObjectsTest.TestPythonDictionaryToStructuredDictionary (1637 of 2152) PASS: lldb-unit :: Expression/./ExpressionTests/DiagnosticManagerTest.GetStringMultipleDiags (1638 of 2152) PASS: lldb-unit :: Signals/./SignalsTests/UnixSignalsTest.Iteration (1639 of 2152) PASS: lldb-api :: python_api/sblaunchinfo/TestSBLaunchInfo.py (1640 of 2152) PASS: lldb-unit :: Interpreter/./InterpreterTests/CompletionTest.FileCompletionAbsolute (1641 of 2152) PASS: lldb-unit :: Utility/./UtilityTests/StringExtractorTest.GetHexBytesAvail_FullString (1642 of 2152) PASS: lldb-shell :: SymbolFile/DWARF/inline-function-address.ll (1643 of 2152) PASS: lldb-unit :: Language/Highlighting/./HighlighterTests/HighlighterTest.ClangCursorPosAfterOtherToken (1644 of 2152) PASS: lldb-api :: tools/lldb-server/TestGdbRemote_vCont.py (1645 of 2152) UNSUPPORTED: lldb-shell :: ExecControl/StopHook/stop-hook-threads.test (1646 of 2152) PASS: lldb-unit :: Utility/./UtilityTests/ConstStringTest.UpdateMangledCounterpart (1647 of 2152) PASS: lldb-unit :: Utility/./UtilityTests/OptionsWithRawTest.UnterminatedQuote (1648 of 2152) PASS: lldb-api :: iohandler/autosuggestion/TestAutosuggestion.py (1649 of 2152) PASS: lldb-api :: functionalities/postmortem/elf-core/thread_crash/TestLinuxCoreThreads.py (1650 of 2152) PASS: lldb-unit :: Process/gdb-remote/./ProcessGdbRemoteTests/GDBRemoteClientBaseTest.SendContinueAndAsyncPacket (1651 of 2152) PASS: lldb-api :: functionalities/data-formatter/data-formatter-advanced/TestDataFormatterAdv.py (1652 of 2152) UNSUPPORTED: lldb-shell :: SymbolFile/target-symbols-add-unwind.test (1653 of 2152) PASS: lldb-api :: python_api/module_section/TestModuleAndSection.py (1654 of 2152) PASS: lldb-api :: tools/lldb-vscode/attach/TestVSCode_attach.py (1655 of 2152) UNSUPPORTED: lldb-api :: functionalities/data-formatter/data-formatter-stl/libstdcpp/vbool/TestDataFormatterStdVBool.py (1656 of 2152) PASS: lldb-shell :: Reproducer/TestDiscard.test (1657 of 2152) PASS: lldb-unit :: Expression/./ExpressionTests/CppModuleConfigurationTest.UnknownLibCppFile (1658 of 2152) PASS: lldb-unit :: Expression/./ExpressionTests/DiagnosticManagerTest.PutString (1659 of 2152) PASS: lldb-api :: functionalities/tail_call_frames/ambiguous_tail_call_seq1/TestAmbiguousTailCallSeq1.py (1660 of 2152) PASS: lldb-shell :: Quit/TestQuitExitCodeHex0.test (1661 of 2152) PASS: lldb-unit :: Host/./HostTests/HostInfoTest.GetXcodeSDK (1662 of 2152) PASS: lldb-api :: functionalities/breakpoint/inlined_breakpoints/TestInlinedBreakpoints.py (1663 of 2152) PASS: lldb-api :: functionalities/data-formatter/data-formatter-stl/libcxx/tuple/TestDataFormatterLibcxxTuple.py (1664 of 2152) UNSUPPORTED: lldb-shell :: Register/arm-fp-read.test (1665 of 2152) PASS: lldb-unit :: Symbol/./SymbolTests/TestTypeSystemClang.TestNotDeletingUserCopyCstrDueToMoveCStr (1666 of 2152) PASS: lldb-unit :: Utility/./UtilityTests/ArchSpecTest.TestParseMachCPUDashSubtypeTripleExtra (1667 of 2152) PASS: lldb-unit :: ScriptInterpreter/Python/./ScriptInterpreterPythonTests/PythonDataObjectsTest.TestPythonDictionaryManipulation (1668 of 2152) PASS: lldb-shell :: ObjectFile/PECOFF/basic-info-arm.yaml (1669 of 2152) PASS: lldb-shell :: SymbolFile/DWARF/debug_ranges.s (1670 of 2152) PASS: lldb-api :: lang/c/function_types/TestFunctionTypes.py (1671 of 2152) PASS: lldb-unit :: Process/gdb-remote/./ProcessGdbRemoteTests/GDBRemoteCommunicationClientTest.SaveRestoreRegistersNoSuffix (1672 of 2152) PASS: lldb-unit :: SymbolFile/NativePDB/./SymbolFileNativePDBTests/PDBFPOProgramToDWARFExpressionTests.InvalidAssignmentMultiple (1673 of 2152) UNSUPPORTED: lldb-api :: functionalities/unwind/ehframe/TestEhFrameUnwind.py (1674 of 2152) PASS: lldb-shell :: Reproducer/TestMultipleTargets.test (1675 of 2152) PASS: lldb-unit :: Utility/./UtilityTests/Flags.Clear (1676 of 2152) UNSUPPORTED: lldb-api :: functionalities/thread/state/TestThreadStates.py (1677 of 2152) PASS: lldb-api :: functionalities/thread/concurrent_events/TestConcurrentCrashWithWatchpointBreakpointSignal.py (1678 of 2152) UNSUPPORTED: lldb-api :: functionalities/darwin_log/filter/exact_match/activity-chain/TestDarwinLogFilterMatchActivityChain.py (1679 of 2152) PASS: lldb-unit :: debugserver/./debugserverTests/RNBSocket.LoopBackConnectIPv6 (1680 of 2152) PASS: lldb-unit :: Utility/./UtilityTests/StringExtractorTest.GetHexBytes_Underflow (1681 of 2152) PASS: lldb-api :: commands/expression/persist_objc_pointeetype/TestPersistObjCPointeeType.py (1682 of 2152) PASS: lldb-unit :: Language/Highlighting/./HighlighterTests/HighlighterTest.FallbackHighlighter (1683 of 2152) PASS: lldb-shell :: SymbolFile/NativePDB/globals-fundamental.cpp (1684 of 2152) PASS: lldb-unit :: UnwindAssembly/x86/./UnwindAssemblyx86Tests/Testx86AssemblyInspectionEngine.TestPopRBX (1685 of 2152) PASS: lldb-unit :: Expression/./ExpressionTests/DiagnosticManagerTest.AppendMessageNoDiag (1686 of 2152) PASS: lldb-api :: functionalities/data-formatter/data-formatter-skip-summary/TestDataFormatterSkipSummary.py (1687 of 2152) PASS: lldb-unit :: Symbol/./SymbolTests/TestTypeSystemClang.TestDisplayName (1688 of 2152) PASS: lldb-unit :: Utility/./UtilityTests/StringListTest.AppendStringCString (1689 of 2152) UNSUPPORTED: lldb-shell :: SymbolFile/PDB/compilands.test (1690 of 2152) PASS: lldb-unit :: Utility/./UtilityTests/DataExtractorTest.GetMaxS64 (1691 of 2152) PASS: lldb-unit :: Utility/./UtilityTests/UUIDTest.Validity (1692 of 2152) PASS: lldb-unit :: Expression/./ExpressionTests/DiagnosticManagerTest.GetStringPreserveOrder (1693 of 2152) PASS: lldb-unit :: Utility/./UtilityTests/ArgsTest.ReplaceArgumentAtIndexShort (1694 of 2152) PASS: lldb-unit :: ScriptInterpreter/Python/./ScriptInterpreterPythonTests/PythonDataObjectsTest.TestPythonTupleValues (1695 of 2152) PASS: lldb-shell :: ObjectFile/PECOFF/basic-info.yaml (1696 of 2152) PASS: lldb-unit :: SymbolFile/NativePDB/./SymbolFileNativePDBTests/PDBFPOProgramToDWARFExpressionTests.SingleAssignmentRegisterRef (1697 of 2152) PASS: lldb-unit :: Language/Highlighting/./HighlighterTests/HighlighterTest.DefaultHighlighterWithCursorOutOfBounds (1698 of 2152) PASS: lldb-unit :: UnwindAssembly/x86/./UnwindAssemblyx86Tests/Testx86AssemblyInspectionEngine.TestPopR14 (1699 of 2152) PASS: lldb-unit :: ObjectFile/Breakpad/./ObjectFileBreakpadTests/Record.classify (1700 of 2152) PASS: lldb-unit :: Symbol/./SymbolTests/TestTypeSystemClang.TestIsClangType (1701 of 2152) PASS: lldb-api :: commands/target/stop-hook/delete/TestTargetStopHookDelete.py (1702 of 2152) UNSUPPORTED: lldb-shell :: ScriptInterpreter/Lua/persistent_state.test (1703 of 2152) PASS: lldb-shell :: SymbolFile/DWARF/limit-debug-info.s (1704 of 2152) PASS: lldb-api :: functionalities/data-formatter/refpointer-recursion/TestDataFormatterRefPtrRecursion.py (1705 of 2152) PASS: lldb-api :: functionalities/tail_call_frames/inlining_and_tail_calls/TestInliningAndTailCalls.py (1706 of 2152) PASS: lldb-unit :: Utility/./UtilityTests/StringExtractorTest.GetNameColonValueNoSemicolon (1707 of 2152) PASS: lldb-unit :: Utility/./UtilityTests/RangeTest.SizeTypes (1708 of 2152) PASS: lldb-api :: functionalities/thread/step_out/TestThreadStepOut.py (1709 of 2152) PASS: lldb-unit :: Editline/./EditlineTests/EditlineTestFixture.EditlineReceivesSingleLineText (1710 of 2152) PASS: lldb-unit :: Utility/./UtilityTests/ArgsTest.TestArgv (1711 of 2152) PASS: lldb-unit :: Utility/./UtilityTests/DeserializerTest.HasData (1712 of 2152) PASS: lldb-shell :: ObjectFile/MachO/lc_build_version.yaml (1713 of 2152) PASS: lldb-api :: commands/target/dump-symtab-demangle/TestDumpSymtabDemangle.py (1714 of 2152) PASS: lldb-api :: functionalities/thread/concurrent_events/TestConcurrentNWatchNBreak.py (1715 of 2152) PASS: lldb-unit :: Utility/./UtilityTests/StatusTest.ErrorConstructor (1716 of 2152) UNSUPPORTED: lldb-api :: linux/add-symbols/TestTargetSymbolsAddCommand.py (1717 of 2152) PASS: lldb-api :: functionalities/reproducers/attach/TestReproducerAttach.py (1718 of 2152) PASS: lldb-shell :: ScriptInterpreter/Python/crashlog.test (1719 of 2152) PASS: lldb-unit :: Utility/./UtilityTests/DataExtractorTest.GetBitfield (1720 of 2152) PASS: lldb-unit :: Utility/./UtilityTests/StringListTest.InsertStringAtIndexEnd (1721 of 2152) PASS: lldb-unit :: Host/./HostTests/FileSystemTest.MakeAbsolute (1722 of 2152) PASS: lldb-shell :: Process/Optimization.test (1723 of 2152) PASS: lldb-unit :: ScriptInterpreter/Python/./ScriptInterpreterPythonTests/PythonDataObjectsTest.TestPythonTupleInitializerList (1724 of 2152) PASS: lldb-unit :: UnwindAssembly/x86/./UnwindAssemblyx86Tests/Testx86AssemblyInspectionEngine.TestStackRealignMSVC_i386 (1725 of 2152) PASS: lldb-unit :: Utility/./UtilityTests/BinaryStreamTest.PutULEB128TwoBytes (1726 of 2152) PASS: lldb-api :: commands/source/info/TestSourceInfo.py (1727 of 2152) PASS: lldb-api :: functionalities/thread/exit_during_expression/TestExitDuringExpression.py (1728 of 2152) PASS: lldb-api :: functionalities/data-formatter/ptr_ref_typedef/TestPtrRef2Typedef.py (1729 of 2152) PASS: lldb-api :: iohandler/resize/TestIOHandlerResize.py (1730 of 2152) PASS: lldb-api :: functionalities/data-formatter/type_summary_list_script/TestTypeSummaryListScript.py (1731 of 2152) PASS: lldb-unit :: SymbolFile/DWARF/./SymbolFileDWARFTests/SymbolFileDWARFTests.TestAbilitiesForDWARF (1732 of 2152) PASS: lldb-unit :: Expression/./ExpressionTests/DiagnosticManagerTest.AddDiagnostic (1733 of 2152) PASS: lldb-unit :: Utility/./UtilityTests/LogTest.Unregister (1734 of 2152) PASS: lldb-api :: functionalities/data-formatter/data-formatter-named-summaries/TestDataFormatterNamedSummaries.py (1735 of 2152) PASS: lldb-api :: lang/cpp/this/TestCPPThis.py (1736 of 2152) PASS: lldb-api :: lang/objc/objc-foundation-dictionary-empty/TestNSDictionary0.py (1737 of 2152) PASS: lldb-unit :: SymbolFile/NativePDB/./SymbolFileNativePDBTests/PDBFPOProgramToDWARFExpressionTests.UnresolvedRegisterAssignmentReference (1738 of 2152) UNSUPPORTED: lldb-api :: functionalities/thread/thread_specific_break_plus_condition/TestThreadSpecificBpPlusCondition.py (1739 of 2152) PASS: lldb-unit :: Symbol/./SymbolTests/TestTypeSystemClang.TestFunctionTemplateInRecordConstruction (1740 of 2152) PASS: lldb-shell :: ObjectFile/ELF/build-id-case.yaml (1741 of 2152) PASS: lldb-shell :: ObjectFile/PECOFF/uuid.yaml (1742 of 2152) UNSUPPORTED: lldb-api :: functionalities/signal/handle-segv/TestHandleSegv.py (1743 of 2152) PASS: lldb-unit :: Utility/./UtilityTests/FileSpecTest.FileAndDirectoryComponents (1744 of 2152) PASS: lldb-unit :: Expression/./ExpressionTests/CppModuleConfigurationTest.IgnoreLibStdCpp (1745 of 2152) PASS: lldb-unit :: Utility/./UtilityTests/ListenerTest.GetEventImmediate (1746 of 2152) PASS: lldb-unit :: Utility/./UtilityTests/ScalarTest.SetValueFromData (1747 of 2152) UNSUPPORTED: lldb-api :: tools/lldb-server/libraries-svr4/TestGdbRemoteLibrariesSvr4Support.py (1748 of 2152) PASS: lldb-api :: lang/cpp/char1632_t/TestChar1632T.py (1749 of 2152) PASS: lldb-api :: commands/reproducer/invalid-args/TestInvalidArgsReproducer.py (1750 of 2152) PASS: lldb-api :: functionalities/data-formatter/stringprinter/TestStringPrinter.py (1751 of 2152) PASS: lldb-unit :: Utility/./UtilityTests/ArgsTest.StringListConstructor (1752 of 2152) PASS: lldb-unit :: Utility/./UtilityTests/StringExtractorTest.GetHexBytesAvail_OddPair (1753 of 2152) PASS: lldb-unit :: UnwindAssembly/x86/./UnwindAssemblyx86Tests/Testx86AssemblyInspectionEngine.Testi386IgnoredRegisters (1754 of 2152) PASS: lldb-unit :: Utility/./UtilityTests/RecordReplayTest.InstrumentedBarRef (1755 of 2152) PASS: lldb-unit :: Language/Highlighting/./HighlighterTests/HighlighterTest.Keywords (1756 of 2152) UNSUPPORTED: lldb-shell :: SymbolFile/PDB/pointers.test (1757 of 2152) PASS: lldb-api :: python_api/symbol-context/two-files/TestSymbolContextTwoFiles.py (1758 of 2152) PASS: lldb-unit :: Utility/./UtilityTests/StreamTest.AddressRange (1759 of 2152) PASS: lldb-unit :: Utility/./UtilityTests/RangeTest.DoesIntersect (1760 of 2152) XFAIL: lldb-shell :: Unwind/prefer-debug-over-eh-frame.test (1761 of 2152) PASS: lldb-unit :: Utility/./UtilityTests/ArgsTest.DoubleQuotedItem (1762 of 2152) PASS: lldb-unit :: Expression/./ExpressionTests/DiagnosticManagerTest.PutStringSeverities (1763 of 2152) PASS: lldb-api :: functionalities/type_lookup/TestTypeLookup.py (1764 of 2152) PASS: lldb-api :: macosx/dyld-trie-symbols/TestDyldTrieSymbols.py (1765 of 2152) PASS: lldb-unit :: Utility/./UtilityTests/StreamTest.PutCStringWithStringRef (1766 of 2152) PASS: lldb-api :: tools/lldb-server/TestGdbRemoteExpeditedRegisters.py (1767 of 2152) PASS: lldb-api :: functionalities/breakpoint/scripted_bkpt/TestScriptedResolver.py (1768 of 2152) PASS: lldb-shell :: ObjectFile/wasm/embedded-debug-sections.yaml (1769 of 2152) PASS: lldb-api :: commands/disassemble/basic/TestFrameDisassemble.py (1770 of 2152) PASS: lldb-unit :: Utility/./UtilityTests/StringExtractorTest.DecodeHexU8_InvalidHex (1771 of 2152) PASS: lldb-api :: tools/lldb-vscode/variables/TestVSCode_variables.py (1772 of 2152) PASS: lldb-unit :: Utility/./UtilityTests/RangeTest.ContainsEndInclusive (1773 of 2152) UNSUPPORTED: lldb-shell :: Register/x86-zmm-read.test (1774 of 2152) PASS: lldb-api :: functionalities/gdb_remote_client/TestPlatformClient.py (1775 of 2152) PASS: lldb-unit :: Utility/./UtilityTests/UriParserTest.TypicalPortPathIPv6 (1776 of 2152) PASS: lldb-unit :: Utility/./UtilityTests/OptionsWithRawTest.QuotedSuffix (1777 of 2152) PASS: lldb-unit :: Utility/./UtilityTests/StringExtractorTest.GetHexBytes_Partial (1778 of 2152) PASS: lldb-shell :: Minidump/Windows/find-module.test (1779 of 2152) PASS: lldb-api :: functionalities/gdb_remote_client/TestGDBRemoteDiskFileCompletion.py (1780 of 2152) PASS: lldb-shell :: Reproducer/TestSynchronous.test (1781 of 2152) PASS: lldb-api :: commands/expression/import-std-module/list/TestListFromStdModule.py (1782 of 2152) PASS: lldb-shell :: SymbolFile/DWARF/find-method-local-struct.cpp (1783 of 2152) PASS: lldb-api :: lang/c/offsetof/TestOffsetof.py (1784 of 2152) PASS: lldb-api :: lang/objc/foundation/TestObjCMethods2.py (1785 of 2152) PASS: lldb-unit :: Host/./HostTests/MainLoopTest.DetectsEOF (1786 of 2152) PASS: lldb-unit :: ScriptInterpreter/Python/./ScriptInterpreterPythonTests/PythonDataObjectsTest.TestPythonIntegerToStr (1787 of 2152) UNSUPPORTED: lldb-shell :: Unwind/eh-frame-augment-noop.test (1788 of 2152) PASS: lldb-api :: commands/process/launch/TestProcessLaunch.py (1789 of 2152) PASS: lldb-shell :: SymbolFile/Breakpad/unwind-via-raSearch.test (1790 of 2152) PASS: lldb-api :: functionalities/unwind/noreturn/TestNoreturnUnwind.py (1791 of 2152) PASS: lldb-shell :: SymbolFile/DWARF/apple-index-is-used.cpp (1792 of 2152) PASS: lldb-api :: lang/cpp/namespace_definitions/TestNamespaceDefinitions.py (1793 of 2152) PASS: lldb-shell :: Heap/heap-cstr.test (1794 of 2152) PASS: lldb-unit :: Utility/./UtilityTests/StringListTest.JoinNonSpace (1795 of 2152) PASS: lldb-unit :: SymbolFile/DWARF/./SymbolFileDWARFTests/SymbolFileDWARFTests.TestAbbrevOrder1Start1 (1796 of 2152) PASS: lldb-api :: tools/lldb-vscode/breakpoint/TestVSCode_setFunctionBreakpoints.py (1797 of 2152) PASS: lldb-unit :: Symbol/./SymbolTests/LineEntryTest.GetSameLineContiguousAddressRangeNoInlines (1798 of 2152) PASS: lldb-api :: macosx/load-kext/TestLoadKext.py (1799 of 2152) PASS: lldb-api :: functionalities/memory/cache/TestMemoryCache.py (1800 of 2152) UNSUPPORTED: lldb-shell :: Watchpoint/netbsd-nouserdbregs.test (1801 of 2152) PASS: lldb-unit :: UnwindAssembly/x86/./UnwindAssemblyx86Tests/Testx86AssemblyInspectionEngine.TestSimplei386ugmented (1802 of 2152) PASS: lldb-unit :: Symbol/./SymbolTests/LineEntryTest.GetSameLineContiguousAddressRangeNestedInline (1803 of 2152) PASS: lldb-unit :: Process/gdb-remote/./ProcessGdbRemoteTests/GDBRemoteClientBaseTest.SendContinueAndInterrupt (1804 of 2152) PASS: lldb-api :: tools/lldb-vscode/breakpoint/TestVSCode_setBreakpoints.py (1805 of 2152) PASS: lldb-api :: functionalities/stats_api/TestStatisticsAPI.py (1806 of 2152) PASS: lldb-api :: functionalities/archives/TestBSDArchives.py (1807 of 2152) PASS: lldb-unit :: Symbol/./SymbolTests/TestClangASTImporter.MetadataPropagationIndirectImport (1808 of 2152) PASS: lldb-shell :: Commands/CommandScriptImmediateOutput/CommandScriptImmediateOutputConsole.test (1809 of 2152) PASS: lldb-api :: lang/objc/real-definition/TestRealDefinition.py (1810 of 2152) PASS: lldb-unit :: Process/gdb-remote/./ProcessGdbRemoteTests/GDBRemoteCommunicationClientTest.SendGetTraceConfigPacket (1811 of 2152) PASS: lldb-api :: api/listeners/TestListener.py (1812 of 2152) PASS: lldb-unit :: Utility/./UtilityTests/StringListTest.GetMaxStringLengthEqualSize (1813 of 2152) PASS: lldb-unit :: Utility/./UtilityTests/StringExtractorTest.GetHexU8_InvalidHex (1814 of 2152) PASS: lldb-unit :: Utility/./UtilityTests/StringExtractorTest.GetNameColonValueContainsColon (1815 of 2152) PASS: lldb-api :: lang/c/record_decl_in_expr/TestRecordDeclInExpr.py (1816 of 2152) PASS: lldb-shell :: ObjectFile/wasm/stripped-debug-sections.yaml (1817 of 2152) PASS: lldb-api :: functionalities/data-formatter/data-formatter-python-synth/TestDataFormatterPythonSynth.py (1818 of 2152) PASS: lldb-unit :: Utility/./UtilityTests/UUIDTest.RelationalOperators (1819 of 2152) PASS: lldb-shell :: Host/TestCustomShell.test (1820 of 2152) PASS: lldb-unit :: Utility/./UtilityTests/SerializationRountripTest.SerializeDeserializeCStringArray (1821 of 2152) PASS: lldb-api :: lang/cpp/class_static/TestStaticVariables.py (1822 of 2152) PASS: lldb-unit :: ScriptInterpreter/Python/./ScriptInterpreterPythonTests/PythonDataObjectsTest.TestDictionaryResolutionWithDot (1823 of 2152) PASS: lldb-unit :: Utility/./UtilityTests/StringListTest.JoinMultiCharSeparator (1824 of 2152) PASS: lldb-unit :: Process/minidump/./LLDBMinidumpTests/MinidumpParserTest.GetPid (1825 of 2152) PASS: lldb-api :: python_api/watchpoint/condition/TestWatchpointConditionAPI.py (1826 of 2152) PASS: lldb-api :: lang/objc/objc-new-syntax/TestObjCNewSyntaxDictionary.py (1827 of 2152) PASS: lldb-shell :: Register/x86-64-read.test (1828 of 2152) PASS: lldb-unit :: Process/gdb-remote/./ProcessGdbRemoteTests/GDBRemoteClientBaseTest.SendContinueAndInterrupt2PacketBug (1829 of 2152) PASS: lldb-api :: functionalities/thread/concurrent_events/TestConcurrentTwoWatchpointsOneBreakpoint.py (1830 of 2152) PASS: lldb-api :: functionalities/source-map/TestTargetSourceMap.py (1831 of 2152) PASS: lldb-unit :: Host/./HostTests/NativeProcessProtocolTest.ReadCStringFromMemory (1832 of 2152) PASS: lldb-shell :: ObjectFile/ELF/minidebuginfo-find-symbols.yaml (1833 of 2152) PASS: lldb-api :: functionalities/return-value/TestReturnValue.py (1834 of 2152) PASS: lldb-unit :: Utility/./UtilityTests/StringListTest.AppendStringMove (1835 of 2152) PASS: lldb-api :: lang/objc/modules-app-update/TestClangModulesAppUpdate.py (1836 of 2152) PASS: lldb-api :: functionalities/jitloader_gdb/TestJITLoaderGDB.py (1837 of 2152) UNSUPPORTED: lldb-shell :: SymbolFile/PDB/variables-locations.test (1838 of 2152) PASS: lldb-shell :: Breakpoint/debug_rnglist_offset_pair.test (1839 of 2152) PASS: lldb-unit :: UnwindAssembly/x86/./UnwindAssemblyx86Tests/Testx86AssemblyInspectionEngine.TestPushR12 (1840 of 2152) PASS: lldb-unit :: Utility/./UtilityTests/XcodeSDKTest.ParseTest (1841 of 2152) PASS: lldb-api :: lang/objc/modules-incomplete/TestIncompleteModules.py (1842 of 2152) UNSUPPORTED: lldb-shell :: SymbolFile/DWARF/DW_TAG_GNU_call_site-DW_AT_low_pc.s (1843 of 2152) PASS: lldb-unit :: Host/./HostTests/NativeProcessProtocolTest.SetBreakpointFailRead (1844 of 2152) PASS: lldb-api :: commands/expression/import-std-module/vector/TestVectorFromStdModule.py (1845 of 2152) PASS: lldb-unit :: Expression/./ExpressionTests/DWARFExpression.DW_OP_pick (1846 of 2152) PASS: lldb-api :: functionalities/thread/concurrent_events/TestConcurrentSignalWatchBreak.py (1847 of 2152) PASS: lldb-api :: functionalities/data-formatter/builtin-formats/TestBuiltinFormats.py (1848 of 2152) PASS: lldb-api :: commands/watchpoints/step_over_watchpoint/TestStepOverWatchpoint.py (1849 of 2152) PASS: lldb-unit :: Utility/./UtilityTests/AnsiTerminal.WhiteSpace (1850 of 2152) PASS: lldb-shell :: Quit/TestQuitExitCode0.test (1851 of 2152) UNSUPPORTED: lldb-api :: functionalities/breakpoint/hardware_breakpoints/write_memory_with_hw_breakpoint/TestWriteMemoryWithHWBreakpoint.py (1852 of 2152) PASS: lldb-api :: commands/expression/anonymous-struct/TestCallUserAnonTypedef.py (1853 of 2152) PASS: lldb-api :: lang/cpp/namespace_conflicts/TestNamespaceConflicts.py (1854 of 2152) PASS: lldb-unit :: SymbolFile/NativePDB/./SymbolFileNativePDBTests/PDBFPOProgramToDWARFExpressionTests.UnresolvedCyclicRegisterAssignmentReference (1855 of 2152) PASS: lldb-api :: commands/expression/persistent_types/TestPersistentTypes.py (1856 of 2152) PASS: lldb-unit :: Utility/./UtilityTests/StringListTest.JoinEmpty (1857 of 2152) UNSUPPORTED: lldb-api :: lang/objc/rdar-12408181/TestRdar12408181.py (1858 of 2152) PASS: lldb-unit :: Utility/./UtilityTests/ScalarTest.APIntConstructor (1859 of 2152) PASS: lldb-unit :: Utility/./UtilityTests/Flags.AnySet (1860 of 2152) PASS: lldb-unit :: Utility/./UtilityTests/CompletionRequest.DuplicateFilteringWithComments (1861 of 2152) PASS: lldb-api :: types/TestCharType.py (1862 of 2152) PASS: lldb-unit :: Expression/./ExpressionTests/ClangExpressionDeclMapTest.TestUnknownIdentifierLookup (1863 of 2152) PASS: lldb-unit :: Utility/./UtilityTests/StringExtractorTest.DecodeHexU8_Extra (1864 of 2152) PASS: lldb-api :: commands/expression/import-std-module/list-dbg-info-content/TestDbgInfoContentListFromStdModule.py (1865 of 2152) UNSUPPORTED: lldb-api :: linux/sepdebugsymlink/TestTargetSymbolsSepDebugSymlink.py (1866 of 2152) PASS: lldb-unit :: ScriptInterpreter/Python/./ScriptInterpreterPythonTests/PythonDataObjectsTest.TestPythonListToStructuredList (1867 of 2152) PASS: lldb-unit :: Process/gdb-remote/./ProcessGdbRemoteTests/GDBRemoteCommunicationClientTest.GetModulesInfoInvalidResponse (1868 of 2152) PASS: lldb-unit :: Platform/Android/./AdbClientTests/AdbClientTest.CreateByDeviceId (1869 of 2152) PASS: lldb-unit :: Utility/./UtilityTests/UriParserTest.SchemeHostSeparator4 (1870 of 2152) PASS: lldb-unit :: Host/./HostTests/NativeProcessProtocolTest.ReadCStringFromMemory_MaxSize (1871 of 2152) PASS: lldb-unit :: Utility/./UtilityTests/CompletionRequest.TryCompleteCurrentArgGood (1872 of 2152) PASS: lldb-unit :: Symbol/./SymbolTests/TestClangASTImporter.MetadataPropagation (1873 of 2152) PASS: lldb-api :: commands/expression/rdar44436068/Test128BitsInteger.py (1874 of 2152) PASS: lldb-api :: commands/frame/diagnose/dereference-function-return/TestDiagnoseDereferenceFunctionReturn.py (1875 of 2152) PASS: lldb-api :: functionalities/breakpoint/breakpoint_ignore_count/TestBreakpointIgnoreCount.py (1876 of 2152) PASS: lldb-unit :: Utility/./UtilityTests/ScalarTest.CastOperations (1877 of 2152) PASS: lldb-unit :: Utility/./UtilityTests/StringExtractorTest.DecodeHexU8_Underflow (1878 of 2152) PASS: lldb-api :: lang/cpp/stl/TestSTL.py (1879 of 2152) PASS: lldb-api :: functionalities/data-formatter/data-formatter-stl/libcxx/queue/TestDataFormatterLibcxxQueue.py (1880 of 2152) PASS: lldb-unit :: Utility/./UtilityTests/StringExtractorTest.GetNameColonValueNoColon (1881 of 2152) PASS: lldb-shell :: Driver/TestUseColor.test (1882 of 2152) PASS: lldb-api :: commands/expression/import_base_class_when_class_has_derived_member/TestImportBaseClassWhenClassHasDerivedMember.py (1883 of 2152) PASS: lldb-unit :: Utility/./UtilityTests/RangeVector.CombineConsecutiveRanges (1884 of 2152) PASS: lldb-unit :: Utility/./UtilityTests/UriParserTest.MinimalPortPath (1885 of 2152) PASS: lldb-api :: functionalities/thread/concurrent_events/TestConcurrentDelayedCrashWithBreakpointSignal.py (1886 of 2152) PASS: lldb-unit :: Utility/./UtilityTests/ScalarTest.Division (1887 of 2152) PASS: lldb-api :: functionalities/data-formatter/typedef_array/TestTypedefArray.py (1888 of 2152) PASS: lldb-unit :: Host/./HostTests/Host.GetEnvironment (1889 of 2152) PASS: lldb-api :: functionalities/data-formatter/data-formatter-objc/TestDataFormatterObjCCF.py (1890 of 2152) PASS: lldb-unit :: Utility/./UtilityTests/BinaryStreamTest.PutULEB128OneByte (1891 of 2152) PASS: lldb-shell :: Commands/command-disassemble.s (1892 of 2152) PASS: lldb-api :: functionalities/plugins/python_os_plugin/TestPythonOSPlugin.py (1893 of 2152) PASS: lldb-api :: commands/target/modules/search-paths/insert/TestTargetModulesSearchpathsInsert.py (1894 of 2152) PASS: lldb-api :: lang/mixed/TestMixedLanguages.py (1895 of 2152) PASS: lldb-api :: lang/objc/foundation/TestObjectDescriptionAPI.py (1896 of 2152) PASS: lldb-unit :: Utility/./UtilityTests/FileSpecTest.RemoveLastPathComponent (1897 of 2152) PASS: lldb-unit :: Utility/./UtilityTests/UriParserTest.TypicalPortPathIPv4 (1898 of 2152) PASS: lldb-unit :: ScriptInterpreter/Python/./ScriptInterpreterPythonTests/PythonDataObjectsTest.TestPythonBoolean (1899 of 2152) PASS: lldb-api :: types/TestShortType.py (1900 of 2152) PASS: lldb-api :: functionalities/data-formatter/data-formatter-stl/libcxx/list/loop/TestDataFormatterLibcxxListLoop.py (1901 of 2152) PASS: lldb-api :: macosx/indirect_symbol/TestIndirectSymbols.py (1902 of 2152) PASS: lldb-api :: python_api/file_handle/TestFileHandle.py (1903 of 2152) PASS: lldb-api :: lang/c/vla/TestVLA.py (1904 of 2152) PASS: lldb-unit :: Utility/./UtilityTests/StringLexerTest.HasAtLeast (1905 of 2152) PASS: lldb-shell :: SymbolFile/Breakpad/symtab.test (1906 of 2152) PASS: lldb-unit :: Utility/./UtilityTests/ProcessInstanceInfo.Yaml (1907 of 2152) PASS: lldb-unit :: Utility/./UtilityTests/StringListTest.RemoveBlankLines (1908 of 2152) UNSUPPORTED: lldb-shell :: Register/arm-gp-read.test (1909 of 2152) PASS: lldb-unit :: Host/./HostTests/FileSystemTest.FileAndDirectoryComponents (1910 of 2152) UNSUPPORTED: lldb-shell :: SymbolFile/NativePDB/ast-functions-msvc.cpp (1911 of 2152) PASS: lldb-unit :: Host/./HostTests/ConnectionFileDescriptorTest.TCPGetURIv4 (1912 of 2152) PASS: lldb-unit :: Process/minidump/./LLDBMinidumpTests/MinidumpParserTest.GetMemoryRegionInfoLinuxMaps (1913 of 2152) PASS: lldb-api :: commands/command/nested_alias/TestNestedAlias.py (1914 of 2152) PASS: lldb-unit :: Utility/./UtilityTests/StringExtractorTest.GetHexU8_Underflow2 (1915 of 2152) PASS: lldb-unit :: Utility/./UtilityTests/StringLexerTest.NextIf (1916 of 2152) PASS: lldb-shell :: Minidump/dump-all.test (1917 of 2152) PASS: lldb-unit :: Utility/./UtilityTests/StructuredDataTest.ParseJSONFromFile (1918 of 2152) PASS: lldb-api :: functionalities/data-formatter/data-formatter-stl/libcxx/deque/TestDataFormatterLibcxxDeque.py (1919 of 2152) PASS: lldb-unit :: Utility/./UtilityTests/ScalarTest.GetValue (1920 of 2152) PASS: lldb-shell :: Driver/TestCommands.test (1921 of 2152) PASS: lldb-api :: functionalities/memory/find/TestMemoryFind.py (1922 of 2152) PASS: lldb-api :: commands/expression/multiline-navigation/TestMultilineNavigation.py (1923 of 2152) PASS: lldb-api :: python_api/function_symbol/TestDisasmAPI.py (1924 of 2152) PASS: lldb-unit :: Utility/./UtilityTests/StringListTest.GetMaxStringLengthMixed (1925 of 2152) PASS: lldb-unit :: Utility/./UtilityTests/Predicate.WaitForValueNotEqualTo (1926 of 2152) PASS: lldb-api :: functionalities/thread/concurrent_events/TestConcurrentSignalDelayWatch.py (1927 of 2152) PASS: lldb-unit :: Process/gdb-remote/./ProcessGdbRemoteTests/GDBRemoteCommunicationClientTest.GetModulesInfo_UUID20 (1928 of 2152) PASS: lldb-shell :: SymbolFile/DWARF/DW_OP_piece-smaller-than-struct.s (1929 of 2152) PASS: lldb-unit :: Expression/./ExpressionTests/ClangHostTest.MacOSX (1930 of 2152) PASS: lldb-api :: functionalities/thread/exit_during_step/TestExitDuringStep.py (1931 of 2152) PASS: lldb-api :: commands/gui/basicdebug/TestGuiBasicDebug.py (1932 of 2152) PASS: lldb-unit :: Language/Highlighting/./HighlighterTests/HighlighterTest.ClangOperators (1933 of 2152) PASS: lldb-api :: functionalities/load_unload/TestLoadUnload.py (1934 of 2152) PASS: lldb-api :: lang/c/step-target/TestStepTarget.py (1935 of 2152) PASS: lldb-api :: functionalities/thread/concurrent_events/TestConcurrentCrashWithWatchpoint.py (1936 of 2152) PASS: lldb-api :: functionalities/thread/ignore_suspended/TestIgnoreSuspendedThread.py (1937 of 2152) PASS: lldb-unit :: Utility/./UtilityTests/OptionsWithRawTest.SingleWordSuffix (1938 of 2152) PASS: lldb-unit :: Utility/./UtilityTests/DataExtractorTest.GetFloatUnaligned (1939 of 2152) PASS: lldb-unit :: Language/Highlighting/./HighlighterTests/HighlighterTest.HighlighterSelectionPath (1940 of 2152) PASS: lldb-unit :: Interpreter/./InterpreterTests/CompletionTest.DirCompletionUsername (1941 of 2152) PASS: lldb-unit :: ScriptInterpreter/Python/./ScriptInterpreterPythonTests/PythonDataObjectsTest.TestPythonDictionaryValueEquality (1942 of 2152) PASS: lldb-shell :: SymbolFile/DWARF/debug-line-basic.s (1943 of 2152) PASS: lldb-unit :: ObjectFile/Breakpad/./ObjectFileBreakpadTests/StackCFIRecord.parse (1944 of 2152) PASS: lldb-api :: commands/target/stop-hook/enable/TestTargetStopHookEnable.py (1945 of 2152) PASS: lldb-api :: functionalities/data-formatter/format-propagation/TestFormatPropagation.py (1946 of 2152) PASS: lldb-unit :: Utility/./UtilityTests/NameMatchesTest.Contains (1947 of 2152) PASS: lldb-shell :: Reproducer/TestDriverOptions.test (1948 of 2152) PASS: lldb-unit :: Utility/./UtilityTests/RegularExpression.Match (1949 of 2152) PASS: lldb-api :: lang/cpp/dynamic-value-same-basename/TestDynamicValueSameBase.py (1950 of 2152) PASS: lldb-api :: python_api/sbdata/TestSBData.py (1951 of 2152) PASS: lldb-api :: functionalities/thread/thread_specific_break/TestThreadSpecificBreakpoint.py (1952 of 2152) UNSUPPORTED: lldb-api :: tools/lldb-server/registers-target-xml-reading/TestGdbRemoteTargetXmlPacket.py (1953 of 2152) PASS: lldb-unit :: ScriptInterpreter/Python/./ScriptInterpreterPythonTests/PythonDataObjectsTest.TestResetting (1954 of 2152) UNSUPPORTED: lldb-api :: functionalities/breakpoint/hardware_breakpoints/hardware_breakpoint_on_multiple_threads/TestHWBreakMultiThread.py (1955 of 2152) PASS: lldb-api :: lang/objc/unicode-string/TestUnicodeString.py (1956 of 2152) PASS: lldb-unit :: Utility/./UtilityTests/StringListTest.InsertStringAtIndexStdString (1957 of 2152) PASS: lldb-api :: python_api/debugger/TestDebuggerAPI.py (1958 of 2152) PASS: lldb-unit :: Utility/./UtilityTests/OptionsWithRawTest.ArgsButNoDelimiter (1959 of 2152) PASS: lldb-shell :: Commands/command-script-import.test (1960 of 2152) PASS: lldb-api :: functionalities/breakpoint/consecutive_breakpoints/TestConsecutiveBreakpoints.py (1961 of 2152) PASS: lldb-unit :: Utility/./UtilityTests/StreamTest.ShiftOperatorChars (1962 of 2152) PASS: lldb-api :: functionalities/data-formatter/data-formatter-objc/nsstring/TestDataFormatterNSString.py (1963 of 2152) PASS: lldb-unit :: Utility/./UtilityTests/StreamTest.AddressRangeInvalidRange (1964 of 2152) PASS: lldb-unit :: Utility/./UtilityTests/StreamTeeTest.Write (1965 of 2152) PASS: lldb-unit :: ScriptInterpreter/Python/./ScriptInterpreterPythonTests/PythonDataObjectsTest.TestScript (1966 of 2152) PASS: lldb-unit :: DataFormatter/./LLDBFormatterTests/TypeMatcherTests.CreatedBySameMatchStringExactNamePrefixes (1967 of 2152) PASS: lldb-api :: commands/frame/diagnose/dereference-this/TestDiagnoseDereferenceThis.py (1968 of 2152) PASS: lldb-api :: functionalities/breakpoint/debugbreak/TestDebugBreak.py (1969 of 2152) PASS: lldb-shell :: Driver/TestHelp.test (1970 of 2152) PASS: lldb-api :: functionalities/data-formatter/data-formatter-disabling/TestDataFormatterDisabling.py (1971 of 2152) PASS: lldb-unit :: Utility/./UtilityTests/StreamTeeTest.AppendStream (1972 of 2152) PASS: lldb-unit :: Utility/./UtilityTests/NameMatchesTest.EndsWith (1973 of 2152) PASS: lldb-api :: macosx/safe-to-func-call/TestSafeFuncCalls.py (1974 of 2152) PASS: lldb-unit :: Utility/./UtilityTests/ScalarTest.ExtractBitfield (1975 of 2152) PASS: lldb-unit :: Utility/./UtilityTests/StringExtractorTest.DecodeHexU8_Underflow2 (1976 of 2152) PASS: lldb-unit :: SymbolFile/DWARF/./SymbolFileDWARFTests/SymbolFileDWARFTests.ParseArangesNonzeroSegmentSize (1977 of 2152) PASS: lldb-shell :: Reproducer/Modules/TestModuleCXX.test (1978 of 2152) PASS: lldb-unit :: DataFormatter/./LLDBFormatterTests/FormatManagerTests.CompatibleLangs (1979 of 2152) PASS: lldb-api :: commands/session/save/TestSessionSave.py (1980 of 2152) PASS: lldb-unit :: Utility/./UtilityTests/StreamTest.PutRawBytesToMixedEndian (1981 of 2152) PASS: lldb-unit :: Symbol/./SymbolTests/TestTypeSystemClang.TestGetEnumIntegerTypeBasicTypes (1982 of 2152) PASS: lldb-api :: functionalities/postmortem/minidump/TestMiniDump.py (1983 of 2152) PASS: lldb-unit :: Language/Highlighting/./HighlighterTests/HighlighterTest.ClangCursorPosEndOfLine (1984 of 2152) PASS: lldb-unit :: Utility/./UtilityTests/ArchSpecTest.TripleComponentsWereSpecified (1985 of 2152) PASS: lldb-unit :: Utility/./UtilityTests/IndexToObjectTest.ObjectForIndex (1986 of 2152) PASS: lldb-shell :: SymbolFile/DWARF/find-variable-file.cpp (1987 of 2152) PASS: lldb-unit :: ScriptInterpreter/Python/./ScriptInterpreterPythonTests/PythonDataObjectsTest.TestOwnedReferences (1988 of 2152) PASS: lldb-unit :: Process/gdb-remote/./ProcessGdbRemoteTests/GDBRemoteCommunicationClientTest.GetQOffsets (1989 of 2152) PASS: lldb-shell :: SymbolFile/DWARF/dwp.s (1990 of 2152) UNSUPPORTED: lldb-api :: tools/lldb-vscode/disconnect/TestVSCode_disconnect.py (1991 of 2152) PASS: lldb-api :: iohandler/completion/TestIOHandlerCompletion.py (1992 of 2152) PASS: lldb-unit :: Utility/./UtilityTests/SubsystemRAIITest.SubsystemWithErrorSuccess (1993 of 2152) PASS: lldb-api :: source-manager/TestSourceManager.py (1994 of 2152) PASS: lldb-api :: functionalities/inferior-assert/TestInferiorAssert.py (1995 of 2152) PASS: lldb-api :: functionalities/thread/concurrent_events/TestConcurrentDelaySignalBreak.py (1996 of 2152) PASS: lldb-shell :: SymbolFile/NativePDB/bitfields.cpp (1997 of 2152) PASS: lldb-api :: lang/cpp/operator-overload/TestOperatorOverload.py (1998 of 2152) PASS: lldb-api :: lang/objc/foundation/TestObjCMethodsString.py (1999 of 2152) PASS: lldb-shell :: Commands/command-regex-unalias.test (2000 of 2152) PASS: lldb-unit :: Process/gdb-remote/./ProcessGdbRemoteTests/GDBRemoteCommunicationServerTest.SendErrorResponse_Status (2001 of 2152) PASS: lldb-api :: functionalities/data-formatter/data-formatter-stl/libcxx/multimap/TestDataFormatterLibccMultiMap.py (2002 of 2152) PASS: lldb-unit :: Symbol/./SymbolTests/TestTypeSystemClang.TestUnifyAccessSpecifiers (2003 of 2152) PASS: lldb-api :: functionalities/data-formatter/nsarraysynth/TestNSArraySynthetic.py (2004 of 2152) PASS: lldb-unit :: Utility/./UtilityTests/CompletionRequest.TryCompleteCurrentArgBad (2005 of 2152) PASS: lldb-unit :: Utility/./UtilityTests/ScalarTest.Equality (2006 of 2152) PASS: lldb-unit :: Utility/./UtilityTests/RangeTest.NotEqual (2007 of 2152) PASS: lldb-api :: functionalities/optimized_code/TestNoASanExceptionAfterEvalOP_piece.py (2008 of 2152) PASS: lldb-unit :: ObjectFile/Breakpad/./ObjectFileBreakpadTests/InfoRecord.parse (2009 of 2152) PASS: lldb-shell :: ScriptInterpreter/None/import_module.test (2010 of 2152) UNSUPPORTED: lldb-shell :: Register/x86-gp-read.test (2011 of 2152) PASS: lldb-unit :: Disassembler/./DisassemblerTests/TestArmv7Disassembly.TestCortexFPDisass (2012 of 2152) PASS: lldb-api :: python_api/frame/get-variables/TestGetVariables.py (2013 of 2152) PASS: lldb-api :: macosx/DBGSourcePathRemapping/TestDSYMSourcePathRemapping.py (2014 of 2152) PASS: lldb-unit :: UnwindAssembly/x86/./UnwindAssemblyx86Tests/Testx86AssemblyInspectionEngine.TestPushEAX (2015 of 2152) PASS: lldb-unit :: Language/Highlighting/./HighlighterTests/HighlighterTest.ClangTrailingBackslashMissingNewLine (2016 of 2152) PASS: lldb-api :: functionalities/tsan/global_location/TestTsanGlobalLocation.py (2017 of 2152) PASS: lldb-shell :: Reproducer/TestCrash.test (2018 of 2152) PASS: lldb-unit :: Utility/./UtilityTests/SerializationRountripTest.SerializeDeserializeCStringArrayNullptrElem (2019 of 2152) PASS: lldb-unit :: UnwindAssembly/x86/./UnwindAssemblyx86Tests/Testx86AssemblyInspectionEngine.TestPushRBX (2020 of 2152) PASS: lldb-unit :: ObjectFile/ELF/./ObjectFileELFTests/ObjectFileELFTest.GetSymtab_NoSymEntryPointArmThumbAddressClass (2021 of 2152) PASS: lldb-unit :: SymbolFile/NativePDB/./SymbolFileNativePDBTests/PDBFPOProgramToDWARFExpressionTests.MultipleDependentAssignments (2022 of 2152) PASS: lldb-unit :: API/./APITests/SBCommandInterpreterTest.MultiWordCommand (2023 of 2152) PASS: lldb-unit :: Host/./HostTests/SocketTest.TCPGetConnectURI (2024 of 2152) PASS: lldb-unit :: Utility/./UtilityTests/EnvironmentTest.EnvpConversion (2025 of 2152) PASS: lldb-shell :: ObjectFile/ELF/short-build-id.yaml (2026 of 2152) PASS: lldb-api :: tools/lldb-server/TestGdbRemoteSingleStep.py (2027 of 2152) PASS: lldb-api :: commands/expression/ignore-artificial-constructors/TestIgnoreArtificialConstructors.py (2028 of 2152) PASS: lldb-api :: lang/cpp/gmodules-templates/TestGModules.py (2029 of 2152) PASS: lldb-unit :: Utility/./UtilityTests/UUIDTest.StringConverion (2030 of 2152) PASS: lldb-api :: commands/expression/import-std-module/conflicts/TestStdModuleWithConflicts.py (2031 of 2152) PASS: lldb-unit :: Utility/./UtilityTests/UriParserTest.MinimalPath (2032 of 2152) PASS: lldb-unit :: Symbol/./SymbolTests/TestTypeSystemClang.TestDisplayNameEmpty (2033 of 2152) PASS: lldb-unit :: Utility/./UtilityTests/SerializationRountripTest.SerializeDeserializePod (2034 of 2152) PASS: lldb-unit :: Utility/./UtilityTests/OptionsWithRawTest.ArgsButNoLeadingDash (2035 of 2152) PASS: lldb-unit :: ScriptInterpreter/Python/./ScriptInterpreterPythonTests/PythonDataObjectsTest.TestPythonStringToStr (2036 of 2152) PASS: lldb-shell :: SymbolFile/DWARF/gnu-style-compression.cpp (2037 of 2152) PASS: lldb-unit :: Utility/./UtilityTests/StringExtractorTest.GetHexBytesAvail_Partial (2038 of 2152) PASS: lldb-api :: lang/cpp/alignas_base_class/TestAlignAsBaseClass.py (2039 of 2152) PASS: lldb-unit :: UnwindAssembly/x86/./UnwindAssemblyx86Tests/Testx86AssemblyInspectionEngine.TestPopRBP (2040 of 2152) PASS: lldb-api :: functionalities/data-formatter/boolreference/TestFormattersBoolRefPtr.py (2041 of 2152) PASS: lldb-shell :: SymbolFile/DWARF/find-function-regex.cpp (2042 of 2152) PASS: lldb-api :: commands/expression/import-std-module/pair/TestPairFromStdModule.py (2043 of 2152) PASS: lldb-unit :: Language/CPlusPlus/./LanguageCPlusPlusTests/CPlusPlusLanguage.FindAlternateFunctionManglings (2044 of 2152) PASS: lldb-unit :: Utility/./UtilityTests/RangeDataVector.FindEntryThatContains_Overlap (2045 of 2152) UNSUPPORTED: lldb-api :: functionalities/thread/break_after_join/TestBreakAfterJoin.py (2046 of 2152) UNSUPPORTED: lldb-api :: tools/lldb-server/platform-process-connect/TestPlatformProcessConnect.py (2047 of 2152) PASS: lldb-api :: lang/cpp/nested-class-other-compilation-unit/TestNestedClassWithParentInAnotherCU.py (2048 of 2152) PASS: lldb-unit :: Utility/./UtilityTests/ProcessInstanceInfoMatch.Name (2049 of 2152) PASS: lldb-unit :: UnwindAssembly/x86/./UnwindAssemblyx86Tests/Testx86AssemblyInspectionEngine.TestPopEBX (2050 of 2152) PASS: lldb-shell :: ObjectFile/ELF/minidebuginfo-corrupt-xz.yaml (2051 of 2152) UNSUPPORTED: lldb-api :: functionalities/data-formatter/data-formatter-stl/libstdcpp/vector/TestDataFormatterStdVector.py (2052 of 2152) PASS: lldb-shell :: SymbolFile/DWARF/dir-separator-no-comp-dir-relative-name.s (2053 of 2152) UNSUPPORTED: lldb-shell :: SymbolFile/PDB/function-level-linking.test (2054 of 2152) PASS: lldb-unit :: SymbolFile/NativePDB/./SymbolFileNativePDBTests/PDBFPOProgramToDWARFExpressionTests.UnresolvedDependentCyclicRegisterAssignmentReference (2055 of 2152) PASS: lldb-unit :: Utility/./UtilityTests/AnsiTerminal.Unknown (2056 of 2152) PASS: lldb-unit :: debugserver/./debugserverTests/RNBSocket.LoopBackConnectIPv4 (2057 of 2152) PASS: lldb-unit :: Utility/./UtilityTests/ArgsTest.TestOverwriteArgs (2058 of 2152) PASS: lldb-unit :: Utility/./UtilityTests/StringLexerTest.AdvanceIf (2059 of 2152) PASS: lldb-shell :: ObjectFile/ELF/duplicate-section.yaml (2060 of 2152) PASS: lldb-api :: types/TestRecursiveTypes.py (2061 of 2152) PASS: lldb-unit :: Utility/./UtilityTests/ScalarTest.LongLongAssigmentOperator (2062 of 2152) PASS: lldb-api :: lang/objc/foundation/TestObjCMethods.py (2063 of 2152) PASS: lldb-api :: functionalities/thread/concurrent_events/TestConcurrentWatchpointDelayWatchpointOneBreakpoint.py (2064 of 2152) PASS: lldb-api :: commands/expression/argument_passing_restrictions/TestArgumentPassingRestrictions.py (2065 of 2152) PASS: lldb-api :: lang/cpp/overloaded-functions/TestOverloadedFunctions.py (2066 of 2152) PASS: lldb-shell :: SymbolFile/DWARF/DW_AT_const_value-bitfields.s (2067 of 2152) PASS: lldb-unit :: UnwindAssembly/x86/./UnwindAssemblyx86Tests/Testx86AssemblyInspectionEngine.TestDisassemblyMidFunctionEpilogues (2068 of 2152) PASS: lldb-unit :: SymbolFile/DWARF/./SymbolFileDWARFTests/SymbolFileDWARFTests.TestAbbrevNullAttrValidForm (2069 of 2152) PASS: lldb-unit :: Utility/./UtilityTests/FileSpecTest.EqualDotsWindows (2070 of 2152) PASS: lldb-unit :: Target/./TargetTests/StackFrameRecognizerTest.NullModuleRegex (2071 of 2152) PASS: lldb-unit :: Thread/./ThreadTests/ThreadTest.GetPrivateStopInfo (2072 of 2152) PASS: lldb-unit :: Utility/./UtilityTests/StringLexerTest.Next (2073 of 2152) PASS: lldb-unit :: Utility/./UtilityTests/XcodeSDKTest.FindXcodeContentsDirectoryInPath (2074 of 2152) PASS: lldb-unit :: Core/./LLDBCoreTests/RichManglingContextTest.IPDRealloc (2075 of 2152) PASS: lldb-unit :: Core/./LLDBCoreTests/MangledTest.EmptyForInvalidName (2076 of 2152) UNSUPPORTED: lldb-shell :: ScriptInterpreter/Lua/watchpoint_callback.test (2077 of 2152) PASS: lldb-api :: functionalities/breakpoint/global_constructor/TestBreakpointInGlobalConstructor.py (2078 of 2152) UNSUPPORTED: lldb-shell :: SymbolFile/NativePDB/local-variables.cpp (2079 of 2152) PASS: lldb-unit :: Process/gdb-remote/./ProcessGdbRemoteTests/GDBRemoteCommunicationTest.ReadPacket_checksum (2080 of 2152) PASS: lldb-unit :: ScriptInterpreter/Python/./ScriptInterpreterPythonTests/PythonDataObjectsTest.TestPythonByteArray (2081 of 2152) PASS: lldb-unit :: Utility/./UtilityTests/StreamTest.PutCString (2082 of 2152) PASS: lldb-api :: lang/cpp/thread_local/TestThreadLocal.py (2083 of 2152) PASS: lldb-unit :: Utility/./UtilityTests/ArgsTest.ReplaceArgumentAtIndexEqual (2084 of 2152) PASS: lldb-unit :: Utility/./UtilityTests/StringListTest.ShiftMove (2085 of 2152) PASS: lldb-api :: lang/objc/objc-static-method/TestObjCStaticMethod.py (2086 of 2152) PASS: lldb-unit :: Utility/./UtilityTests/StringExtractorTest.GetHexU8_Exact (2087 of 2152) UNSUPPORTED: lldb-shell :: Reproducer/TestLuaImport.test (2088 of 2152) PASS: lldb-unit :: Utility/./UtilityTests/VASprintfTest.NoBufferResize (2089 of 2152) PASS: lldb-unit :: Utility/./UtilityTests/CompletionRequest.TestCompletionOwnership (2090 of 2152) PASS: lldb-unit :: Utility/./UtilityTests/StringListTest.ShiftStdString (2091 of 2152) PASS: lldb-shell :: Minidump/memory-region-from-module.yaml (2092 of 2152) PASS: lldb-api :: functionalities/dead-strip/TestDeadStrip.py (2093 of 2152) PASS: lldb-api :: functionalities/asan/TestMemoryHistory.py (2094 of 2152) UNSUPPORTED: lldb-shell :: Register/x86-64-ymm16-read.test (2095 of 2152) PASS: lldb-unit :: Utility/./UtilityTests/StreamTest.PutRawBytesToLittleEndian (2096 of 2152) PASS: lldb-api :: commands/watchpoints/multiple_hits/TestMultipleHits.py (2097 of 2152) PASS: lldb-api :: functionalities/data-formatter/data-formatter-stl/libstdcpp/unique_ptr/invalid/TestDataFormatterInvalidStdUniquePtr.py (2098 of 2152) PASS: lldb-api :: functionalities/multiword-commands/TestMultiWordCommands.py (2099 of 2152) PASS: lldb-api :: functionalities/data-formatter/data-formatter-synth/TestDataFormatterSynth.py (2100 of 2152) PASS: lldb-unit :: Symbol/./SymbolTests/PostfixExpression.ToDWARF (2101 of 2152) UNSUPPORTED: lldb-api :: linux/thread/create_during_instruction_step/TestCreateDuringInstructionStep.py (2102 of 2152) PASS: lldb-api :: commands/target/basic/TestTargetCommand.py (2103 of 2152) PASS: lldb-api :: macosx/save_crashlog/TestSaveCrashlog.py (2104 of 2152) PASS: lldb-shell :: SymbolFile/DWARF/DW_AT_loclists_base.s (2105 of 2152) PASS: lldb-api :: python_api/lldbutil/process/TestPrintStackTraces.py (2106 of 2152) PASS: lldb-api :: lang/c/strings/TestCStrings.py (2107 of 2152) PASS: lldb-unit :: Symbol/./SymbolTests/TestClangASTImporter.DeportTypeTagDecl (2108 of 2152) PASS: lldb-unit :: Target/./TargetTests/ExecutionContextTest.GetByteOrderProcess (2109 of 2152) PASS: lldb-shell :: Minidump/no-process-id.yaml (2110 of 2152) PASS: lldb-unit :: Utility/./UtilityTests/ReproducerTest.SetReplay (2111 of 2152) PASS: lldb-api :: lang/c/local_variables/TestLocalVariables.py (2112 of 2152) PASS: lldb-shell :: ScriptInterpreter/Python/python.test (2113 of 2152) PASS: lldb-unit :: Utility/./UtilityTests/SerializationRountripTest.SerializeDeserializeObjectReference (2114 of 2152) PASS: lldb-api :: functionalities/breakpoint/serialize/TestBreakpointSerialization.py (2115 of 2152) PASS: lldb-shell :: Breakpoint/implicit_const_form_support.test (2116 of 2152) PASS: lldb-unit :: Utility/./UtilityTests/StringExtractorTest.GetHexBytesAvail (2117 of 2152) PASS: lldb-api :: functionalities/postmortem/minidump-new/TestMiniDumpUUID.py (2118 of 2152) PASS: lldb-unit :: Symbol/./SymbolTests/PostfixExpression.ParseFPOProgram (2119 of 2152) PASS: lldb-api :: functionalities/conditional_break/TestConditionalBreak.py (2120 of 2152) PASS: lldb-api :: lang/objc/objc-new-syntax/TestObjCNewSyntaxLiteral.py (2121 of 2152) PASS: lldb-unit :: ScriptInterpreter/Python/./ScriptInterpreterPythonTests/PythonDataObjectsTest.TestPythonBytes (2122 of 2152) PASS: lldb-api :: tools/lldb-server/TestGdbRemoteHostInfo.py (2123 of 2152) PASS: lldb-unit :: UnwindAssembly/x86/./UnwindAssemblyx86Tests/Testx86AssemblyInspectionEngine.TestPushR13 (2124 of 2152) PASS: lldb-unit :: Expression/./ExpressionTests/ClangHostTest.ComputeClangResourceDirectory (2125 of 2152) PASS: lldb-api :: lang/objc/foundation/TestObjCMethodsNSArray.py (2126 of 2152) PASS: lldb-unit :: Utility/./UtilityTests/UriParserTest.SchemeHostSeparator2 (2127 of 2152) PASS: lldb-shell :: Driver/TestSingleQuote.test (2128 of 2152) PASS: lldb-unit :: Host/./HostTests/HostInfoTest.GetHostname (2129 of 2152) PASS: lldb-unit :: Symbol/./SymbolTests/TestClangASTImporter.ImportInvalidType (2130 of 2152) PASS: lldb-unit :: Utility/./UtilityTests/StringExtractorTest.GetHexU8_InvalidHex_NoEof (2131 of 2152) PASS: lldb-unit :: Target/./TargetTests/ModuleCacheTest.GetAndPutStrangeHostname (2132 of 2152) PASS: lldb-api :: functionalities/breakpoint/breakpoint_command/TestBreakpointCommand.py (2133 of 2152) PASS: lldb-shell :: ObjectFile/MachO/symtab.yaml (2134 of 2152) PASS: lldb-api :: commands/settings/TestSettings.py (2135 of 2152) PASS: lldb-api :: functionalities/multidebugger_commands/TestMultipleDebuggersCommands.py (2136 of 2152) PASS: lldb-api :: functionalities/signal/raise/TestRaise.py (2137 of 2152) PASS: lldb-api :: functionalities/data-formatter/ostypeformatting/TestFormattersOsType.py (2138 of 2152) XFAIL: lldb-shell :: Register/x86-64-ymm-write.test (2139 of 2152) PASS: lldb-api :: functionalities/thread/state_after_expression/TestStateAfterExpression.py (2140 of 2152) PASS: lldb-shell :: Driver/TestTarget.test (2141 of 2152) PASS: lldb-unit :: ScriptInterpreter/Python/./ScriptInterpreterPythonTests/PythonDataObjectsTest.TestGlobalNameResolutionNoDot (2142 of 2152) PASS: lldb-api :: functionalities/rerun/TestRerun.py (2143 of 2152) PASS: lldb-unit :: UnwindAssembly/PPC64/./PPC64InstEmulationTests/TestPPC64InstEmulation.TestMediumFunction (2144 of 2152) PASS: lldb-shell :: SymbolFile/DWARF/DW_TAG_basic_type_DW_ATE_UTF_nonC.ll (2145 of 2152) PASS: lldb-api :: macosx/macCatalyst/TestMacCatalyst.py (2146 of 2152) PASS: lldb-api :: commands/expression/codegen-crash-import-def-arraytype-element/TestImportDefinitionArrayType.py (2147 of 2152) PASS: lldb-shell :: Commands/command-thread-select.test (2148 of 2152) PASS: lldb-unit :: Process/gdb-remote/./ProcessGdbRemoteTests/GDBRemoteCommunicationClientTest.SendGetDataPacket (2149 of 2152) PASS: lldb-api :: tools/lldb-server/inferior-crash/TestGdbRemoteAbort.py (2150 of 2152) PASS: lldb-api :: types/TestFloatTypesExpr.py (2151 of 2152) PASS: lldb-api :: lang/objc/foundation/TestObjCMethodsNSError.py (2152 of 2152) Slowest Tests: -------------------------------------------------------------------------- 462.66s: lldb-api :: macosx/simulator/TestSimulatorPlatform.py 198.09s: lldb-api :: lang/cpp/global_operators/TestCppGlobalOperators.py 146.70s: lldb-api :: functionalities/darwin_log/basic/TestDarwinLogBasic.py 128.58s: lldb-api :: functionalities/breakpoint/breakpoint_hit_count/TestBreakpointHitCount.py 103.33s: lldb-api :: functionalities/gdb_remote_client/TestQemuAArch64TargetXml.py 99.82s: lldb-api :: tools/lldb-server/TestLldbGdbServer.py 99.68s: lldb-api :: functionalities/postmortem/mach-core/TestMachCore.py 91.90s: lldb-api :: types/TestCharTypeExpr.py 87.87s: lldb-api :: types/TestLongTypesExpr.py 84.53s: lldb-api :: tools/lldb-vscode/launch/TestVSCode_launch.py 81.06s: lldb-api :: lang/objc/objc-new-syntax/TestObjCNewSyntaxArray.py 75.75s: lldb-api :: functionalities/set-data/TestSetData.py 74.48s: lldb-api :: functionalities/data-formatter/data-formatter-objc/TestDataFormatterObjCNSError.py 71.58s: lldb-api :: python_api/target/TestTargetAPI.py 69.12s: lldb-api :: lang/objc/exceptions/TestObjCExceptions.py 69.08s: lldb-api :: lang/cpp/namespace/TestNamespaceLookup.py 65.72s: lldb-api :: lang/objc/foundation/TestFoundationDisassembly.py 60.47s: lldb-api :: lang/objc/objc-builtin-types/TestObjCBuiltinTypes.py 60.21s: lldb-api :: functionalities/postmortem/wow64_minidump/TestWow64MiniDump.py 56.62s: lldb-api :: lang/objc/hidden-ivars/TestHiddenIvars.py

Hide Details

Tests Times: -------------------------------------------------------------------------- [ Range ] :: [ Percentage ] :: [ Count ] -------------------------------------------------------------------------- [460s,480s) :: [ ] :: [ 1/2152] [440s,460s) :: [ ] :: [ 0/2152] [420s,440s) :: [ ] :: [ 0/2152] [400s,420s) :: [ ] :: [ 0/2152] [380s,400s) :: [ ] :: [ 0/2152] [360s,380s) :: [ ] :: [ 0/2152] [340s,360s) :: [ ] :: [ 0/2152] [320s,340s) :: [ ] :: [ 0/2152] [300s,320s) :: [ ] :: [ 0/2152] [280s,300s) :: [ ] :: [ 0/2152] [260s,280s) :: [ ] :: [ 0/2152] [240s,260s) :: [ ] :: [ 0/2152] [220s,240s) :: [ ] :: [ 0/2152] [200s,220s) :: [ ] :: [ 1/2152] [180s,200s) :: [ ] :: [ 0/2152] [160s,180s) :: [ ] :: [ 0/2152] [140s,160s) :: [ ] :: [ 1/2152] [120s,140s) :: [ ] :: [ 1/2152] [100s,120s) :: [ ] :: [ 3/2152] [ 80s,100s) :: [ ] :: [ 4/2152] [ 60s, 80s) :: [ ] :: [ 8/2152] [ 40s, 60s) :: [ ] :: [ 23/2152] [ 20s, 40s) :: [* ] :: [ 54/2152] [ 0s, 20s) :: [************************************** ] :: [2056/2152] -------------------------------------------------------------------------- ******************** Failed Tests (1): lldb-api :: functionalities/gdb_remote_client/TestQemuAArch64TargetXml.py

Hide Details

Hide Details

Testing Time: 2297.90s Unsupported : 153 Passed : 1992 Expectedly Failed: 6 Failed : 1 FAILED: tools/lldb/test/CMakeFiles/check-lldb-lit cd /Users/buildslave/jenkins/workspace/lldb-cmake/lldb-build/tools/lldb/test && /usr/local/Frameworks/Python.framework/Versions/3.7/bin/python3.7 /Users/buildslave/jenkins/workspace/lldb-cmake/lldb-build/./bin/llvm-lit -v --time-tests --shuffle --xunit-xml-output=/Users/buildslave/jenkins/workspace/lldb-cmake/test/results.xml -v -j 4 /Users/buildslave/jenkins/workspace/lldb-cmake/lldb-build/tools/lldb/test ninja: build stopped: subcommand failed. Command failed: Command '['/usr/bin/env', 'TERM=vt100', '/usr/local/bin/ninja', '-v', 'check-lldb']' returned non-zero exit status 1 Command: ['/usr/bin/env', 'TERM=vt100', '/usr/local/bin/ninja', '-v', 'check-lldb'] [Pipeline] } [Pipeline] // timeout [Pipeline] } [Pipeline] // stage [Pipeline] stage [Pipeline] { (Declarative: Post Actions) [Pipeline] scanForIssues [Clang (LLVM based)] Sleeping for 5 seconds due to JENKINS-32191... [Clang (LLVM based)] Parsing console log (workspace: '/Users/buildslave/jenkins/workspace/lldb-cmake') [Clang (LLVM based)] Successfully parsed console log [Clang (LLVM based)] -> found 8 issues (skipped 12 duplicates) [Clang (LLVM based)] Post processing issues on 'green-dragon-10' with source code encoding 'UTF-8' [Clang (LLVM based)] Creating SCM blamer to obtain author and commit information for affected files [Clang (LLVM based)] Creating SCM miner to obtain statistics for affected repository files [Clang (LLVM based)] Resolving file names for all issues in source directory '/Users/buildslave/jenkins/workspace/lldb-cmake' [Clang (LLVM based)] -> resolved paths in source directory (6 found, 0 not found) [Clang (LLVM based)] Resolving module names from module definitions (build.xml, pom.xml, or Manifest.mf files) [Clang (LLVM based)] -> resolved module names for 8 issues [Clang (LLVM based)] Resolving package names (or namespaces) by parsing the affected files [Clang (LLVM based)] -> resolved package names of 6 affected files [Clang (LLVM based)] No filter has been set, publishing all 8 issues [Clang (LLVM based)] Creating fingerprints for all affected code blocks to track issues over different builds [Clang (LLVM based)] -> created fingerprints for 8 issues (skipped 0 issues) [Clang (LLVM based)] Copying affected files to Jenkins' build folder '/Users/Shared/Jenkins/Home/jobs/lldb-cmake/builds/24001/files-with-issues' [Clang (LLVM based)] -> 4 copied, 2 not in workspace, 0 not-found, 0 with I/O error [Pipeline] junit Recording test results [Pipeline] } [Pipeline] // stage [Pipeline] } [Pipeline] // withEnv [Pipeline] } [Pipeline] // node [Pipeline] End of Pipeline ERROR: script returned exit code 1 Finished: FAILURE