Started 3 hr 38 min ago
Took 2 hr 7 min

Failed Build clang-d385530-ge80f9cab0ab8-t20145-b20145.tar.gz (Apr 14, 2021 6:27:57 PM)

Issues

Found 3 issues:
Ninja target: macroblock.c.o
[5945/11549] /Users/buildslave/jenkins/workspace/test-suite-verify-machineinstrs-aarch64-O3/test-suite-build/tools/timeit --summary MultiSource/Applications/JM/lencod/CMakeFiles/lencod.dir/md_highfast.c.o.time /Users/buildslave/jenkins/workspace/test-suite-verify-machineinstrs-aarch64-O3/compiler/bin/clang -DNDEBUG  -B /Applications/Xcode.app/Contents/Developer/Toolchains/XcodeDefault.xctoolchain/usr/bin    -Wno-unused-command-line-argument -mllvm -verify-machineinstrs -O3 -arch arm64 -isysroot /Applications/Xcode.app/Contents/Developer/Platforms/iPhoneOS.platform/Developer/SDKs/iPhoneOS13.5.sdk   -w -Werror=date-time -fcommon -D__USE_LARGEFILE64 -D_FILE_OFFSET_BITS=64 -MD -MT MultiSource/Applications/JM/lencod/CMakeFiles/lencod.dir/md_highfast.c.o -MF MultiSource/Applications/JM/lencod/CMakeFiles/lencod.dir/md_highfast.c.o.d -o MultiSource/Applications/JM/lencod/CMakeFiles/lencod.dir/md_highfast.c.o   -c /Users/buildslave/jenkins/workspace/test-suite-verify-machineinstrs-aarch64-O3/test-suite/MultiSource/Applications/JM/lencod/md_highfast.c
[5946/11549] : && /Users/buildslave/jenkins/workspace/test-suite-verify-machineinstrs-aarch64-O3/test-suite-build/tools/timeit --summary MicroBenchmarks/MemFunctions/MemFunctions.link.time /Users/buildslave/jenkins/workspace/test-suite-verify-machineinstrs-aarch64-O3/compiler/bin/clang++  -B /Applications/Xcode.app/Contents/Developer/Toolchains/XcodeDefault.xctoolchain/usr/bin    -Wno-unused-command-line-argument -mllvm -verify-machineinstrs -O3 -arch arm64 -isysroot /Applications/Xcode.app/Contents/Developer/Platforms/iPhoneOS.platform/Developer/SDKs/iPhoneOS13.5.sdk -Wl,-search_paths_first -Wl,-headerpad_max_install_names -B /Applications/Xcode.app/Contents/Developer/Toolchains/XcodeDefault.xctoolchain/usr/bin MicroBenchmarks/MemFunctions/CMakeFiles/MemFunctions.dir/main.cpp.o  -o MicroBenchmarks/MemFunctions/MemFunctions  MicroBenchmarks/libs/benchmark-1.3.0/src/libbenchmark.a && :
[5947/11549] /Users/buildslave/jenkins/workspace/test-suite-verify-machineinstrs-aarch64-O3/test-suite-build/tools/timeit --summary MultiSource/Applications/JM/lencod/CMakeFiles/lencod.dir/md_highloss.c.o.time /Users/buildslave/jenkins/workspace/test-suite-verify-machineinstrs-aarch64-O3/compiler/bin/clang -DNDEBUG  -B /Applications/Xcode.app/Contents/Developer/Toolchains/XcodeDefault.xctoolchain/usr/bin    -Wno-unused-command-line-argument -mllvm -verify-machineinstrs -O3 -arch arm64 -isysroot /Applications/Xcode.app/Contents/Developer/Platforms/iPhoneOS.platform/Developer/SDKs/iPhoneOS13.5.sdk   -w -Werror=date-time -fcommon -D__USE_LARGEFILE64 -D_FILE_OFFSET_BITS=64 -MD -MT MultiSource/Applications/JM/lencod/CMakeFiles/lencod.dir/md_highloss.c.o -MF MultiSource/Applications/JM/lencod/CMakeFiles/lencod.dir/md_highloss.c.o.d -o MultiSource/Applications/JM/lencod/CMakeFiles/lencod.dir/md_highloss.c.o   -c /Users/buildslave/jenkins/workspace/test-suite-verify-machineinstrs-aarch64-O3/test-suite/MultiSource/Applications/JM/lencod/md_highloss.c
[5948/11549] /Users/buildslave/jenkins/workspace/test-suite-verify-machineinstrs-aarch64-O3/test-suite-build/tools/timeit --summary MultiSource/Applications/JM/lencod/CMakeFiles/lencod.dir/md_low.c.o.time /Users/buildslave/jenkins/workspace/test-suite-verify-machineinstrs-aarch64-O3/compiler/bin/clang -DNDEBUG  -B /Applications/Xcode.app/Contents/Developer/Toolchains/XcodeDefault.xctoolchain/usr/bin    -Wno-unused-command-line-argument -mllvm -verify-machineinstrs -O3 -arch arm64 -isysroot /Applications/Xcode.app/Contents/Developer/Platforms/iPhoneOS.platform/Developer/SDKs/iPhoneOS13.5.sdk   -w -Werror=date-time -fcommon -D__USE_LARGEFILE64 -D_FILE_OFFSET_BITS=64 -MD -MT MultiSource/Applications/JM/lencod/CMakeFiles/lencod.dir/md_low.c.o -MF MultiSource/Applications/JM/lencod/CMakeFiles/lencod.dir/md_low.c.o.d -o MultiSource/Applications/JM/lencod/CMakeFiles/lencod.dir/md_low.c.o   -c /Users/buildslave/jenkins/workspace/test-suite-verify-machineinstrs-aarch64-O3/test-suite/MultiSource/Applications/JM/lencod/md_low.c
[5949/11549] /Users/buildslave/jenkins/workspace/test-suite-verify-machineinstrs-aarch64-O3/test-suite-build/tools/timeit --summary MultiSource/Applications/JM/lencod/CMakeFiles/lencod.dir/macroblock.c.o.time /Users/buildslave/jenkins/workspace/test-suite-verify-machineinstrs-aarch64-O3/compiler/bin/clang -DNDEBUG  -B /Applications/Xcode.app/Contents/Developer/Toolchains/XcodeDefault.xctoolchain/usr/bin    -Wno-unused-command-line-argument -mllvm -verify-machineinstrs -O3 -arch arm64 -isysroot /Applications/Xcode.app/Contents/Developer/Platforms/iPhoneOS.platform/Developer/SDKs/iPhoneOS13.5.sdk   -w -Werror=date-time -fcommon -D__USE_LARGEFILE64 -D_FILE_OFFSET_BITS=64 -MD -MT MultiSource/Applications/JM/lencod/CMakeFiles/lencod.dir/macroblock.c.o -MF MultiSource/Applications/JM/lencod/CMakeFiles/lencod.dir/macroblock.c.o.d -o MultiSource/Applications/JM/lencod/CMakeFiles/lencod.dir/macroblock.c.o   -c /Users/buildslave/jenkins/workspace/test-suite-verify-machineinstrs-aarch64-O3/test-suite/MultiSource/Applications/JM/lencod/macroblock.c
FAILED: MultiSource/Applications/JM/lencod/CMakeFiles/lencod.dir/macroblock.c.o 
/Users/buildslave/jenkins/workspace/test-suite-verify-machineinstrs-aarch64-O3/test-suite-build/tools/timeit --summary MultiSource/Applications/JM/lencod/CMakeFiles/lencod.dir/macroblock.c.o.time /Users/buildslave/jenkins/workspace/test-suite-verify-machineinstrs-aarch64-O3/compiler/bin/clang -DNDEBUG  -B /Applications/Xcode.app/Contents/Developer/Toolchains/XcodeDefault.xctoolchain/usr/bin    -Wno-unused-command-line-argument -mllvm -verify-machineinstrs -O3 -arch arm64 -isysroot /Applications/Xcode.app/Contents/Developer/Platforms/iPhoneOS.platform/Developer/SDKs/iPhoneOS13.5.sdk   -w -Werror=date-time -fcommon -D__USE_LARGEFILE64 -D_FILE_OFFSET_BITS=64 -MD -MT MultiSource/Applications/JM/lencod/CMakeFiles/lencod.dir/macroblock.c.o -MF MultiSource/Applications/JM/lencod/CMakeFiles/lencod.dir/macroblock.c.o.d -o MultiSource/Applications/JM/lencod/CMakeFiles/lencod.dir/macroblock.c.o   -c /Users/buildslave/jenkins/workspace/test-suite-verify-machineinstrs-aarch64-O3/test-suite/MultiSource/Applications/JM/lencod/macroblock.c
Assertion failed: (!isInvalid() && "Loop not in a valid state!"), function getBlocks, file /Users/buildslave/jenkins/workspace/clang-stage1-RA/llvm-project/llvm/include/llvm/Analysis/LoopInfo.h, line 172.
assertion: !isInvalid() && "Loop not in a valid state!"
[5947/11549] /Users/buildslave/jenkins/workspace/test-suite-verify-machineinstrs-aarch64-O3/test-suite-build/tools/timeit --summary MultiSource/Applications/JM/lencod/CMakeFiles/lencod.dir/md_highloss.c.o.time /Users/buildslave/jenkins/workspace/test-suite-verify-machineinstrs-aarch64-O3/compiler/bin/clang -DNDEBUG  -B /Applications/Xcode.app/Contents/Developer/Toolchains/XcodeDefault.xctoolchain/usr/bin    -Wno-unused-command-line-argument -mllvm -verify-machineinstrs -O3 -arch arm64 -isysroot /Applications/Xcode.app/Contents/Developer/Platforms/iPhoneOS.platform/Developer/SDKs/iPhoneOS13.5.sdk   -w -Werror=date-time -fcommon -D__USE_LARGEFILE64 -D_FILE_OFFSET_BITS=64 -MD -MT MultiSource/Applications/JM/lencod/CMakeFiles/lencod.dir/md_highloss.c.o -MF MultiSource/Applications/JM/lencod/CMakeFiles/lencod.dir/md_highloss.c.o.d -o MultiSource/Applications/JM/lencod/CMakeFiles/lencod.dir/md_highloss.c.o   -c /Users/buildslave/jenkins/workspace/test-suite-verify-machineinstrs-aarch64-O3/test-suite/MultiSource/Applications/JM/lencod/md_highloss.c
[5948/11549] /Users/buildslave/jenkins/workspace/test-suite-verify-machineinstrs-aarch64-O3/test-suite-build/tools/timeit --summary MultiSource/Applications/JM/lencod/CMakeFiles/lencod.dir/md_low.c.o.time /Users/buildslave/jenkins/workspace/test-suite-verify-machineinstrs-aarch64-O3/compiler/bin/clang -DNDEBUG  -B /Applications/Xcode.app/Contents/Developer/Toolchains/XcodeDefault.xctoolchain/usr/bin    -Wno-unused-command-line-argument -mllvm -verify-machineinstrs -O3 -arch arm64 -isysroot /Applications/Xcode.app/Contents/Developer/Platforms/iPhoneOS.platform/Developer/SDKs/iPhoneOS13.5.sdk   -w -Werror=date-time -fcommon -D__USE_LARGEFILE64 -D_FILE_OFFSET_BITS=64 -MD -MT MultiSource/Applications/JM/lencod/CMakeFiles/lencod.dir/md_low.c.o -MF MultiSource/Applications/JM/lencod/CMakeFiles/lencod.dir/md_low.c.o.d -o MultiSource/Applications/JM/lencod/CMakeFiles/lencod.dir/md_low.c.o   -c /Users/buildslave/jenkins/workspace/test-suite-verify-machineinstrs-aarch64-O3/test-suite/MultiSource/Applications/JM/lencod/md_low.c
[5949/11549] /Users/buildslave/jenkins/workspace/test-suite-verify-machineinstrs-aarch64-O3/test-suite-build/tools/timeit --summary MultiSource/Applications/JM/lencod/CMakeFiles/lencod.dir/macroblock.c.o.time /Users/buildslave/jenkins/workspace/test-suite-verify-machineinstrs-aarch64-O3/compiler/bin/clang -DNDEBUG  -B /Applications/Xcode.app/Contents/Developer/Toolchains/XcodeDefault.xctoolchain/usr/bin    -Wno-unused-command-line-argument -mllvm -verify-machineinstrs -O3 -arch arm64 -isysroot /Applications/Xcode.app/Contents/Developer/Platforms/iPhoneOS.platform/Developer/SDKs/iPhoneOS13.5.sdk   -w -Werror=date-time -fcommon -D__USE_LARGEFILE64 -D_FILE_OFFSET_BITS=64 -MD -MT MultiSource/Applications/JM/lencod/CMakeFiles/lencod.dir/macroblock.c.o -MF MultiSource/Applications/JM/lencod/CMakeFiles/lencod.dir/macroblock.c.o.d -o MultiSource/Applications/JM/lencod/CMakeFiles/lencod.dir/macroblock.c.o   -c /Users/buildslave/jenkins/workspace/test-suite-verify-machineinstrs-aarch64-O3/test-suite/MultiSource/Applications/JM/lencod/macroblock.c
FAILED: MultiSource/Applications/JM/lencod/CMakeFiles/lencod.dir/macroblock.c.o 
/Users/buildslave/jenkins/workspace/test-suite-verify-machineinstrs-aarch64-O3/test-suite-build/tools/timeit --summary MultiSource/Applications/JM/lencod/CMakeFiles/lencod.dir/macroblock.c.o.time /Users/buildslave/jenkins/workspace/test-suite-verify-machineinstrs-aarch64-O3/compiler/bin/clang -DNDEBUG  -B /Applications/Xcode.app/Contents/Developer/Toolchains/XcodeDefault.xctoolchain/usr/bin    -Wno-unused-command-line-argument -mllvm -verify-machineinstrs -O3 -arch arm64 -isysroot /Applications/Xcode.app/Contents/Developer/Platforms/iPhoneOS.platform/Developer/SDKs/iPhoneOS13.5.sdk   -w -Werror=date-time -fcommon -D__USE_LARGEFILE64 -D_FILE_OFFSET_BITS=64 -MD -MT MultiSource/Applications/JM/lencod/CMakeFiles/lencod.dir/macroblock.c.o -MF MultiSource/Applications/JM/lencod/CMakeFiles/lencod.dir/macroblock.c.o.d -o MultiSource/Applications/JM/lencod/CMakeFiles/lencod.dir/macroblock.c.o   -c /Users/buildslave/jenkins/workspace/test-suite-verify-machineinstrs-aarch64-O3/test-suite/MultiSource/Applications/JM/lencod/macroblock.c
Assertion failed: (!isInvalid() && "Loop not in a valid state!"), function getBlocks, file /Users/buildslave/jenkins/workspace/clang-stage1-RA/llvm-project/llvm/include/llvm/Analysis/LoopInfo.h, line 172.
PLEASE submit a bug report to https://bugs.llvm.org/ and include the crash backtrace, preprocessed source, and associated run script.
Stack dump:
Error: clang frontend command failed with exit code 134 (use -v to see invocation)
59 clang                    0x000000010e5f983d clang::driver::Compilation::ExecuteJobs(clang::driver::JobList const&, llvm::SmallVectorImpl<std::__1::pair<int, clang::driver::Command const*> >&) const + 125
60 clang                    0x000000010e60fecc clang::driver::Driver::ExecuteCompilation(clang::driver::Compilation&, llvm::SmallVectorImpl<std::__1::pair<int, clang::driver::Command const*> >&) + 204
61 clang                    0x000000010bdc0b65 main + 10389
62 libdyld.dylib            0x00007fff72e18cc9 start + 1
63 libdyld.dylib            0x000000000000001a start + 18446603338588779346
clang-13: error: clang frontend command failed with exit code 134 (use -v to see invocation)
clang version 13.0.0 (https://github.com/llvm/llvm-project.git e80f9cab0ab82852b70b9a5edbdfb69bc35c135b)
Target: aarch64-apple-darwin19.5.0

Build Log

Changes
  1. NFC: Remove condition to simplify code (details)
  2. Revert "[InferAttributes] Materialize all infered attributes for declaration" (details)
  3. Revert "Fix buildbots after 61a85da" (details)
  4. [libcxx][nfc] Assign [ranges.primitives] in "RangesStatus." (details)
  5. [AST] Use IntrusiveRefCntPtr for Introspection LocationCall. (details)
  6. [AST][NFC] Remove temporary ASTTU file from Introspection generation. (details)
  7. [AST][Introspection] Fix args not being set. (details)
  8. [LLLDB] Adding additional check LibCppStdFunctionCallableInfo based on crash reports (details)
  9. Reapply "[InferAttributes] Materialize all infered attributes for declaration"" and follow on patches. (details)
  10. [Sema] Fold VLA types in compound literals to constant arrays. (details)
  11. [llvm-objdump] Switch command-line parsing from llvm::cl to OptTable (details)
  12. [hwasan] Fix lock contention on thread creation. (details)
  13. [llvm-objdump] try to fix hexagon and riscv tests after 1035123ac50db (details)

Started by upstream project relay-test-suite-verify-machineinstrs build number 9641
originally caused by:

This run spent:

  • 7.2 sec waiting;
  • 2 hr 7 min build duration;
  • 2 hr 7 min total from scheduled to completion.
Revision: f785f4216432aa0d249ee3ad1f86515caf4c7b10
  • refs/remotes/origin/main
Revision: e80f9cab0ab82852b70b9a5edbdfb69bc35c135b
  • detached
Revision: f48d431f44610e339d00a33d57564c6029c4ff43
  • refs/remotes/origin/main
Revision: d590d0b156e471cbe8db457c453341bf9536a009
  • refs/remotes/origin/main

Identified problems

Compile Error

This build failed because of a compile error. Below is a list of all errors in the build log:
Indication 1

Ninja target failed

Below is a link to the first failed ninja target.
Indication 2

Assertion failure

This build failed because of an assertion failure. Below is a list of all errors in the build log:
Indication 3