FailedConsole Output

Skipping 4,429 KB.. Full Log
_wrap_SBTarget_ConnectRemote(_object*, _object*) LLDBWrapPython.cpp:52799
    #12 0x10bad5226 in _PyMethodDef_RawFastCallKeywords+0xeb (Python:x86_64+0x1a226)
    #13 0x10bad48c6 in _PyCFunction_FastCallKeywords+0x2b (Python:x86_64+0x198c6)
    #14 0x10bb6a905 in call_function+0x1de (Python:x86_64+0xaf905)
    #15 0x10bb635ee in _PyEval_EvalFrameDefault+0x1b51 (Python:x86_64+0xa85ee)
    #16 0x10bad4ca1 in function_code_fastcall+0x6f (Python:x86_64+0x19ca1)
    #17 0x10bb6a97d in call_function+0x256 (Python:x86_64+0xaf97d)
    #18 0x10bb635d5 in _PyEval_EvalFrameDefault+0x1b38 (Python:x86_64+0xa85d5)
    #19 0x10bad4ca1 in function_code_fastcall+0x6f (Python:x86_64+0x19ca1)
    #20 0x10bb6a97d in call_function+0x256 (Python:x86_64+0xaf97d)
    #21 0x10bb635d5 in _PyEval_EvalFrameDefault+0x1b38 (Python:x86_64+0xa85d5)
    #22 0x10bad4ca1 in function_code_fastcall+0x6f (Python:x86_64+0x19ca1)
    #23 0x10bb6a97d in call_function+0x256 (Python:x86_64+0xaf97d)
    #24 0x10bb6368c in _PyEval_EvalFrameDefault+0x1bef (Python:x86_64+0xa868c)
    #25 0x10bad4ca1 in function_code_fastcall+0x6f (Python:x86_64+0x19ca1)
    #26 0x10bb6a97d in call_function+0x256 (Python:x86_64+0xaf97d)
    #27 0x10bb635d5 in _PyEval_EvalFrameDefault+0x1b38 (Python:x86_64+0xa85d5)
    #28 0x10bb6b2da in _PyEval_EvalCodeWithName+0x72a (Python:x86_64+0xb02da)
    #29 0x10bad44f4 in _PyFunction_FastCallDict+0x1b8 (Python:x86_64+0x194f4)
    #30 0x10bad5624 in _PyObject_Call_Prepend+0x95 (Python:x86_64+0x1a624)
    #31 0x10bad49d4 in PyObject_Call+0x87 (Python:x86_64+0x199d4)
    #32 0x10bb63905 in _PyEval_EvalFrameDefault+0x1e68 (Python:x86_64+0xa8905)
    #33 0x10bb6b2da in _PyEval_EvalCodeWithName+0x72a (Python:x86_64+0xb02da)
    #34 0x10bad44f4 in _PyFunction_FastCallDict+0x1b8 (Python:x86_64+0x194f4)
    #35 0x10bad5624 in _PyObject_Call_Prepend+0x95 (Python:x86_64+0x1a624)
    #36 0x10bb124af in slot_tp_call+0x46 (Python:x86_64+0x574af)
    #37 0x10bad472c in _PyObject_FastCallKeywords+0x166 (Python:x86_64+0x1972c)
    #38 0x10bb6a976 in call_function+0x24f (Python:x86_64+0xaf976)
    #39 0x10bb6368c in _PyEval_EvalFrameDefault+0x1bef (Python:x86_64+0xa868c)
    #40 0x10bb6b2da in _PyEval_EvalCodeWithName+0x72a (Python:x86_64+0xb02da)
    #41 0x10bad488b in _PyFunction_FastCallKeywords+0xe0 (Python:x86_64+0x1988b)
    #42 0x10bb6a97d in call_function+0x256 (Python:x86_64+0xaf97d)
    #43 0x10bb635d5 in _PyEval_EvalFrameDefault+0x1b38 (Python:x86_64+0xa85d5)
    #44 0x10bb6b2da in _PyEval_EvalCodeWithName+0x72a (Python:x86_64+0xb02da)
    #45 0x10bad488b in _PyFunction_FastCallKeywords+0xe0 (Python:x86_64+0x1988b)
    #46 0x10bb6a97d in call_function+0x256 (Python:x86_64+0xaf97d)
    #47 0x10bb635d5 in _PyEval_EvalFrameDefault+0x1b38 (Python:x86_64+0xa85d5)
    #48 0x10bad4ca1 in function_code_fastcall+0x6f (Python:x86_64+0x19ca1)
    #49 0x10bad5624 in _PyObject_Call_Prepend+0x95 (Python:x86_64+0x1a624)
    #50 0x10bad49d4 in PyObject_Call+0x87 (Python:x86_64+0x199d4)
    #51 0x10bb63905 in _PyEval_EvalFrameDefault+0x1e68 (Python:x86_64+0xa8905)
    #52 0x10bb6b2da in _PyEval_EvalCodeWithName+0x72a (Python:x86_64+0xb02da)
    #53 0x10bad44f4 in _PyFunction_FastCallDict+0x1b8 (Python:x86_64+0x194f4)
    #54 0x10bad5624 in _PyObject_Call_Prepend+0x95 (Python:x86_64+0x1a624)
    #55 0x10bb124af in slot_tp_call+0x46 (Python:x86_64+0x574af)
    #56 0x10bad472c in _PyObject_FastCallKeywords+0x166 (Python:x86_64+0x1972c)
    #57 0x10bb6a976 in call_function+0x24f (Python:x86_64+0xaf976)
    #58 0x10bb6368c in _PyEval_EvalFrameDefault+0x1bef (Python:x86_64+0xa868c)
    #59 0x10bad4ca1 in function_code_fastcall+0x6f (Python:x86_64+0x19ca1)
    #60 0x10bb6a97d in call_function+0x256 (Python:x86_64+0xaf97d)
    #61 0x10bb635d5 in _PyEval_EvalFrameDefault+0x1b38 (Python:x86_64+0xa85d5)
    #62 0x10bad4ca1 in function_code_fastcall+0x6f (Python:x86_64+0x19ca1)
    #63 0x10bb6a97d in call_function+0x256 (Python:x86_64+0xaf97d)
    #64 0x10bb635ee in _PyEval_EvalFrameDefault+0x1b51 (Python:x86_64+0xa85ee)
    #65 0x10bb6b2da in _PyEval_EvalCodeWithName+0x72a (Python:x86_64+0xb02da)
    #66 0x10bb61a14 in PyEval_EvalCode+0x29 (Python:x86_64+0xa6a14)
    #67 0x10bb902aa in run_mod+0x35 (Python:x86_64+0xd52aa)
    #68 0x10bb8f2c5 in PyRun_FileExFlags+0xa3 (Python:x86_64+0xd42c5)
    #69 0x10bb8e9a4 in PyRun_SimpleFileExFlags+0x114 (Python:x86_64+0xd39a4)
    #70 0x10bba6010 in pymain_main+0x13de (Python:x86_64+0xeb010)
    #71 0x10bba67b7 in _Py_UnixMain+0x67 (Python:x86_64+0xeb7b7)
    #72 0x7fff7a046084 in start+0x0 (libdyld.dylib:x86_64+0x17084)

Hide Details

0x615000016080 is located 0 bytes to the right of 512-byte region [0x615000015e80,0x615000016080) allocated by thread T0 here: #0 0x10ad8d60d in wrap__Znwm+0x7d (libclang_rt.asan_osx_dynamic.dylib:x86_64+0x5060d) #1 0x1118b1db0 in std::__1::vector<unsigned char, std::__1::allocator<unsigned char> >::__vallocate(unsigned long) new:253 #2 0x1118ad95f in std::__1::vector<unsigned char, std::__1::allocator<unsigned char> >::assign(unsigned long, unsigned char const&) vector:1481 #3 0x1118ad7aa in lldb_private::DataBufferHeap::DataBufferHeap(unsigned long long, unsigned char) DataBufferHeap.cpp:20 #4 0x111681cfd in lldb_private::MemoryCache::Read(unsigned long long, void*, unsigned long, lldb_private::Status&) Memory.cpp:228 #5 0x1111d6369 in lldb_private::Module::GetMemoryObjectFile(std::__1::shared_ptr<lldb_private::Process> const&, unsigned long long, lldb_private::Status&, unsigned long) Module.cpp:298 #6 0x1116d816f in lldb_private::Process::ReadModuleFromMemory(lldb_private::FileSpec const&, unsigned long long, unsigned long) Process.cpp:2402 #7 0x11116c5fb in lldb_private::DynamicLoader::LoadModuleAtAddress(lldb_private::FileSpec const&, unsigned long long, unsigned long long, bool) DynamicLoader.cpp:212 #8 0x111f0f25a in lldb_private::process_gdb_remote::ProcessGDBRemote::LoadModuleAtAddress(lldb_private::FileSpec const&, unsigned long long, unsigned long long, bool) ProcessGDBRemote.cpp:4767 #9 0x111f0f838 in lldb_private::process_gdb_remote::ProcessGDBRemote::LoadModules() ProcessGDBRemote.cpp:4801 #10 0x1119fec2a in lldb_private::wasm::DynamicLoaderWasmDYLD::DidAttach() DynamicLoaderWasmDYLD.cpp:63 #11 0x1116dcd17 in lldb_private::Process::CompleteAttach() Process.cpp:2930 #12 0x1116dfe5f in lldb_private::Process::ConnectRemote(lldb_private::Stream*, llvm::StringRef) Process.cpp:3015 #13 0x110a6f56e in lldb::SBTarget::ConnectRemote(lldb::SBListener&, char const*, char const*, lldb::SBError&) SBTarget.cpp:559 #14 0x110f5d1e1 in _wrap_SBTarget_ConnectRemote(_object*, _object*) LLDBWrapPython.cpp:52799 #15 0x10bad5226 in _PyMethodDef_RawFastCallKeywords+0xeb (Python:x86_64+0x1a226) #16 0x10bad48c6 in _PyCFunction_FastCallKeywords+0x2b (Python:x86_64+0x198c6) #17 0x10bb6a905 in call_function+0x1de (Python:x86_64+0xaf905) #18 0x10bb635ee in _PyEval_EvalFrameDefault+0x1b51 (Python:x86_64+0xa85ee) #19 0x10bad4ca1 in function_code_fastcall+0x6f (Python:x86_64+0x19ca1) #20 0x10bb6a97d in call_function+0x256 (Python:x86_64+0xaf97d) #21 0x10bb635d5 in _PyEval_EvalFrameDefault+0x1b38 (Python:x86_64+0xa85d5) #22 0x10bad4ca1 in function_code_fastcall+0x6f (Python:x86_64+0x19ca1) #23 0x10bb6a97d in call_function+0x256 (Python:x86_64+0xaf97d) #24 0x10bb635d5 in _PyEval_EvalFrameDefault+0x1b38 (Python:x86_64+0xa85d5) #25 0x10bad4ca1 in function_code_fastcall+0x6f (Python:x86_64+0x19ca1) #26 0x10bb6a97d in call_function+0x256 (Python:x86_64+0xaf97d) #27 0x10bb6368c in _PyEval_EvalFrameDefault+0x1bef (Python:x86_64+0xa868c) #28 0x10bad4ca1 in function_code_fastcall+0x6f (Python:x86_64+0x19ca1) #29 0x10bb6a97d in call_function+0x256 (Python:x86_64+0xaf97d)

Hide Details

HINT: if you don't care about these errors you may set ASAN_OPTIONS=detect_container_overflow=0. If you suspect a false positive see also: https://github.com/google/sanitizers/wiki/AddressSanitizerContainerOverflow. SUMMARY: AddressSanitizer: container-overflow (libclang_rt.asan_osx_dynamic.dylib:x86_64+0x418e2) in __asan_memcpy+0x1b2 Shadow bytes around the buggy address: 0x1c2a00002b90: 00 00 00 00 00 00 00 00 00 00 00 00 00 00 00 00 0x1c2a00002ba0: 00 00 00 00 00 00 00 00 00 00 00 00 00 00 00 00 0x1c2a00002bb0: 00 00 00 00 00 00 00 00 00 00 00 00 00 00 00 00 0x1c2a00002bc0: fa fa fa fa fa fa fa fa fa fa fa fa fa fa fa fa 0x1c2a00002bd0: 00 00 00 00 00 00 00 00 00 00 00 00 00 00 00 00 =>0x1c2a00002be0:[04]fc fc fc fc fc fc fc fc fc fc fc fc fc fc fc 0x1c2a00002bf0: fc fc fc fc fc fc fc fc fc fc fc fc fc fc fc fc 0x1c2a00002c00: fc fc fc fc fc fc fc fc fc fc fc fc fc fc fc fc 0x1c2a00002c10: fa fa fa fa fa fa fa fa fa fa fa fa fa fa fa fa 0x1c2a00002c20: fd fd fd fd fd fd fd fd fd fd fd fd fd fd fd fd 0x1c2a00002c30: fd fd fd fd fd fd fd fd fd fd fd fd fd fd fd fd Shadow byte legend (one shadow byte represents 8 application bytes): Addressable: 00 Partially addressable: 01 02 03 04 05 06 07 Heap left redzone: fa Freed heap region: fd Stack left redzone: f1 Stack mid redzone: f2 Stack right redzone: f3 Stack after return: f5 Stack use after scope: f8 Global redzone: f9 Global init order: f6 Poisoned by user: f7 Container overflow: fc Array cookie: ac Intra object redzone: bb ASan internal: fe Left alloca redzone: ca Right alloca redzone: cb Shadow gap: cc ==94998==ABORTING

Hide Details

--

Hide Details

******************** PASS: lldb-api :: functionalities/plugins/command_plugin/TestPluginCommands.py (588 of 1938) PASS: lldb-unit :: Utility/./UtilityTests/ConstStringTest.NullAndEmptyStates (589 of 1938) PASS: lldb-unit :: Process/gdb-remote/./ProcessGdbRemoteTests/GDBRemoteCommunicationClientTest.GetModulesInfo_UUID20 (590 of 1938) UNSUPPORTED: lldb-shell :: Register/x86-gp-read.test (591 of 1938) PASS: lldb-unit :: Host/./HostTests/FileSystemTest.Readable (592 of 1938) UNSUPPORTED: lldb-api :: macosx/macabi/TestMacABImacOSFramework.py (593 of 1938) PASS: lldb-api :: lang/objc/foundation/TestObjCMethodsString.py (594 of 1938) PASS: lldb-api :: functionalities/breakpoint/address_breakpoints/TestAddressBreakpoints.py (595 of 1938) PASS: lldb-api :: lang/cpp/scope/TestCppScope.py (596 of 1938) PASS: lldb-shell :: Reproducer/Functionalities/TestImageList.test (597 of 1938) PASS: lldb-api :: linux/builtin_trap/TestBuiltinTrap.py (598 of 1938) PASS: lldb-api :: functionalities/breakpoint/breakpoint_names/TestBreakpointNames.py (599 of 1938) PASS: lldb-api :: functionalities/data-formatter/language_category_updates/TestDataFormatterLanguageCategoryUpdates.py (600 of 1938) PASS: lldb-api :: driver/batch_mode/TestBatchMode.py (601 of 1938) PASS: lldb-unit :: UnwindAssembly/x86/./UnwindAssemblyx86Tests/Testx86AssemblyInspectionEngine.TestStackRealignMSVC_i386 (602 of 1938) PASS: lldb-unit :: Symbol/./SymbolTests/TestTypeSystemClang.TestRecordHasFields (603 of 1938) PASS: lldb-api :: lang/cpp/trivial_abi/TestTrivialABI.py (604 of 1938) PASS: lldb-api :: python_api/frame/TestFrames.py (605 of 1938) PASS: lldb-api :: functionalities/archives/TestBSDArchives.py (606 of 1938) PASS: lldb-shell :: Breakpoint/debug_rnglistx_rlex.test (607 of 1938) PASS: lldb-unit :: Utility/./UtilityTests/ArgsTest.DoubleQuotedItem (608 of 1938) PASS: lldb-api :: python_api/symbol-context/TestSymbolContext.py (609 of 1938) UNSUPPORTED: lldb-api :: commands/expression/completion-crash-invalid-iterator/TestInvalidIteratorCompletionCrash.py (610 of 1938) PASS: lldb-api :: functionalities/rerun/TestRerun.py (611 of 1938) PASS: lldb-shell :: Commands/CommandScriptImmediateOutput/CommandScriptImmediateOutputFile.test (612 of 1938) UNSUPPORTED: lldb-shell :: Unwind/eh-frame-small-fde.test (613 of 1938) PASS: lldb-api :: functionalities/data-formatter/data-formatter-stl/libcxx/atomic/TestLibCxxAtomic.py (614 of 1938) PASS: lldb-api :: functionalities/thread/jump/TestThreadJump.py (615 of 1938) UNSUPPORTED: lldb-shell :: Register/x86-zmm-write.test (616 of 1938) PASS: lldb-unit :: Utility/./UtilityTests/ArchSpecTest.MergeFromMachOUnknown (617 of 1938) PASS: lldb-api :: functionalities/pre_run_dylibs/TestPreRunDylibs.py (618 of 1938) PASS: lldb-unit :: Utility/./UtilityTests/StringExtractorTest.GetHexBytes_FullString (619 of 1938) PASS: lldb-shell :: SymbolFile/NativePDB/function-types-builtins.cpp (620 of 1938) PASS: lldb-unit :: Utility/./UtilityTests/FileSpecTest.GuessPathStyle (621 of 1938) UNSUPPORTED: lldb-shell :: ScriptInterpreter/Lua/watchpoint_callback.test (622 of 1938) PASS: lldb-unit :: ObjectFile/Breakpad/./ObjectFileBreakpadTests/PublicRecord.parse (623 of 1938) UNSUPPORTED: lldb-shell :: SymbolFile/DWARF/debug-types-expressions.test (624 of 1938) PASS: lldb-api :: api/listeners/TestListener.py (625 of 1938) PASS: lldb-unit :: Interpreter/./InterpreterTests/CompletionTest.DirCompletionAbsolute (626 of 1938) UNSUPPORTED: lldb-api :: functionalities/darwin_log/filter/regex/activity/TestDarwinLogFilterRegexActivity.py (627 of 1938) PASS: lldb-unit :: UnwindAssembly/x86/./UnwindAssemblyx86Tests/Testx86AssemblyInspectionEngine.TestStackRealign32BitDisp_x86_64 (628 of 1938) PASS: lldb-shell :: SymbolFile/DWARF/parallel-indexing-stress.s (629 of 1938) UNSUPPORTED: lldb-shell :: SymbolFile/target-symbols-add-unwind.test (630 of 1938) PASS: lldb-unit :: Process/gdb-remote/./ProcessGdbRemoteTests/GDBRemoteCommunicationServerTest.SendErrorResponse_Status (631 of 1938) PASS: lldb-api :: api/check_public_api_headers/TestPublicAPIHeaders.py (632 of 1938) PASS: lldb-unit :: Utility/./UtilityTests/UriParserTest.BadPort2 (633 of 1938) PASS: lldb-api :: commands/frame/diagnose/dereference-this/TestDiagnoseDereferenceThis.py (634 of 1938) PASS: lldb-unit :: debugserver/./debugserverTests/RNBSocket.LoopBackConnectIPv4 (635 of 1938) PASS: lldb-unit :: Utility/./UtilityTests/StreamTest.PutCharWhitespace (636 of 1938) UNSUPPORTED: lldb-api :: functionalities/breakpoint/breakpoint_in_delayslot/TestAvoidBreakpointInDelaySlot.py (637 of 1938) PASS: lldb-api :: functionalities/thread/concurrent_events/TestConcurrentNWatchNBreak.py (638 of 1938) PASS: lldb-shell :: SymbolFile/DWARF/debug_loclists-dwo.s (639 of 1938) PASS: lldb-api :: functionalities/tail_call_frames/disambiguate_tail_call_seq/TestDisambiguateTailCallSeq.py (640 of 1938) PASS: lldb-unit :: ScriptInterpreter/Python/./ScriptInterpreterPythonTests/PythonDataObjectsTest.TestExtractingUInt64ThroughStructuredData (641 of 1938) PASS: lldb-unit :: Utility/./UtilityTests/SerializationRountripTest.SerializeDeserializeCStringArrayNullptrElem (642 of 1938) PASS: lldb-api :: lang/cpp/virtual-functions/TestCppVirtualFunctions.py (643 of 1938) PASS: lldb-shell :: ObjectFile/ELF/base-address.yaml (644 of 1938) PASS: lldb-api :: python_api/lldbutil/frame/TestFrameUtils.py (645 of 1938) PASS: lldb-shell :: SymbolFile/NativePDB/source-list.cpp (646 of 1938) PASS: lldb-unit :: Utility/./UtilityTests/FileSpecTest.EqualDotsPosixRoot (647 of 1938) PASS: lldb-api :: lang/objc/foundation/TestObjCMethods.py (648 of 1938) PASS: lldb-api :: commands/expression/import-std-module/unique_ptr-dbg-info-content/TestUniquePtrDbgInfoContent.py (649 of 1938) UNSUPPORTED: lldb-api :: functionalities/data-formatter/data-formatter-stl/libstdcpp/tuple/TestDataFormatterStdTuple.py (650 of 1938) PASS: lldb-api :: lang/objc/modules-inline-functions/TestModulesInlineFunctions.py (651 of 1938) PASS: lldb-unit :: Utility/./UtilityTests/StreamTest.PutHex32ByteOrderLittle (652 of 1938) PASS: lldb-unit :: UnwindAssembly/x86/./UnwindAssemblyx86Tests/Testx86AssemblyInspectionEngine.TestSpArithx86_64Augmented (653 of 1938) PASS: lldb-shell :: SymbolFile/DWARF/debug_ranges-missing-section.s (654 of 1938) PASS: lldb-unit :: Process/gdb-remote/./ProcessGdbRemoteTests/GDBRemoteCommunicationServerTest.SendErrorResponse_ErrorNumber (655 of 1938) PASS: lldb-unit :: Utility/./UtilityTests/StringListTest.PopBack (656 of 1938) PASS: lldb-api :: lang/objc/objc-new-syntax/TestObjCNewSyntaxArray.py (657 of 1938) PASS: lldb-unit :: Utility/./UtilityTests/RangeTest.DefaultConstructor (658 of 1938) PASS: lldb-unit :: Utility/./UtilityTests/SerializationRountripTest.SerializeDeserializeCStringArray (659 of 1938) PASS: lldb-api :: functionalities/data-formatter/refpointer-recursion/TestDataFormatterRefPtrRecursion.py (660 of 1938) PASS: lldb-api :: arm/emulation/TestEmulations.py (661 of 1938) PASS: lldb-shell :: Expr/TestIRMemoryMap.test (662 of 1938) PASS: lldb-unit :: Host/./HostTests/TaskPoolTest.RunTasks (663 of 1938) PASS: lldb-api :: functionalities/abbreviation/TestAbbreviations.py (664 of 1938) PASS: lldb-unit :: Host/./HostTests/ProcessLaunchInfoTest.Constructor (665 of 1938) PASS: lldb-unit :: UnwindAssembly/x86/./UnwindAssemblyx86Tests/Testx86AssemblyInspectionEngine.TestPopESI (666 of 1938) PASS: lldb-unit :: UnwindAssembly/x86/./UnwindAssemblyx86Tests/Testx86AssemblyInspectionEngine.TestPushRBX (667 of 1938) PASS: lldb-api :: functionalities/data-formatter/data-formatter-objc/TestDataFormatterObjCKVO.py (668 of 1938) PASS: lldb-unit :: Host/./HostTests/FileSystemTest.Exists (669 of 1938) PASS: lldb-unit :: Utility/./UtilityTests/TildeExpressionResolver.ResolveFullPath (670 of 1938) UNSUPPORTED: lldb-shell :: Register/x86-64-ymm16-read.test (671 of 1938) PASS: lldb-unit :: Utility/./UtilityTests/StringExtractorTest.DecodeHexU8_Underflow2 (672 of 1938) PASS: lldb-unit :: UnwindAssembly/x86/./UnwindAssemblyx86Tests/Testx86AssemblyInspectionEngine.TestDisassemblyJunkBytes (673 of 1938) PASS: lldb-api :: functionalities/breakpoint/breakpoint_command/TestRegexpBreakCommand.py (674 of 1938) PASS: lldb-unit :: Utility/./UtilityTests/RangeTest.Clear (675 of 1938) PASS: lldb-api :: lang/cpp/accelerator-table/TestCPPAccelerator.py (676 of 1938) PASS: lldb-api :: functionalities/thread/concurrent_events/TestConcurrentDelayedCrashWithBreakpointWatchpoint.py (677 of 1938) PASS: lldb-api :: commands/register/register/register_command/TestRegisters.py (678 of 1938) PASS: lldb-unit :: Utility/./UtilityTests/StateTest.Formatv (679 of 1938) PASS: lldb-unit :: Utility/./UtilityTests/BinaryStreamTest.PutULEB128EightBytes (680 of 1938) PASS: lldb-unit :: Utility/./UtilityTests/RangeTest.ContainsRange (681 of 1938) PASS: lldb-unit :: Utility/./UtilityTests/Flags.AllSet (682 of 1938) PASS: lldb-unit :: UnwindAssembly/x86/./UnwindAssemblyx86Tests/Testx86AssemblyInspectionEngine.TestSubRSP (683 of 1938) PASS: lldb-unit :: Target/./TargetTests/PathMappingListTest.AbsoluteTests (684 of 1938) PASS: lldb-unit :: Utility/./UtilityTests/ArgsTest.AppendArguments (685 of 1938) PASS: lldb-shell :: BuildScript/toolchain-clang.test (686 of 1938) PASS: lldb-api :: commands/frame/diagnose/inheritance/TestDiagnoseInheritance.py (687 of 1938) PASS: lldb-api :: functionalities/stats_api/TestStatisticsAPI.py (688 of 1938) PASS: lldb-api :: lang/cpp/covariant-return-types/TestCovariantReturnTypes.py (689 of 1938) UNSUPPORTED: lldb-api :: commands/register/register/intel_xtended_registers/mpx_bound_violation/TestBoundViolation.py (690 of 1938) PASS: lldb-unit :: Process/gdb-remote/./ProcessGdbRemoteTests/GDBRemoteClientBaseTest.SendContinueAndInterrupt (691 of 1938) PASS: lldb-api :: functionalities/thread/concurrent_events/TestConcurrentTwoWatchpointsOneDelayBreakpoint.py (692 of 1938) PASS: lldb-api :: lang/cpp/unsigned_types/TestUnsignedTypes.py (693 of 1938) PASS: lldb-unit :: Symbol/./SymbolTests/TestTypeSystemClang.TestGetBasicTypeFromEnum (694 of 1938) PASS: lldb-unit :: Expression/./ExpressionTests/DiagnosticManagerTest.PutStringMultiple (695 of 1938) PASS: lldb-unit :: Utility/./UtilityTests/OptionsWithRawTest.LeadingSpaceArgs (696 of 1938) PASS: lldb-unit :: Utility/./UtilityTests/StreamTest.PutBytesAsRawHex8ToBigEndian (697 of 1938) PASS: lldb-api :: functionalities/target-new-solib-notifications/TestModuleLoadedNotifys.py (698 of 1938) PASS: lldb-unit :: UnwindAssembly/x86/./UnwindAssemblyx86Tests/Testx86AssemblyInspectionEngine.TestPushR15 (699 of 1938) PASS: lldb-unit :: Host/./HostTests/NativeProcessProtocolTest.SetBreakpointFailWrite (700 of 1938) UNSUPPORTED: lldb-shell :: Minidump/Windows/arm-fp-unwind.test (701 of 1938) PASS: lldb-api :: lang/objc/modules-update/TestClangModulesUpdate.py (702 of 1938) PASS: lldb-unit :: SymbolFile/NativePDB/./SymbolFileNativePDBTests/PDBFPOProgramToDWARFExpressionTests.InvalidAssignmentSingle (703 of 1938) PASS: lldb-api :: functionalities/conditional_break/TestConditionalBreak.py (704 of 1938) PASS: lldb-api :: lang/c/modules/TestCModules.py (705 of 1938) UNSUPPORTED: lldb-api :: functionalities/tsan/basic/TestTsanBasic.py (706 of 1938) PASS: lldb-unit :: Expression/./ExpressionTests/DiagnosticManagerTest.GetStringSeverityLabels (707 of 1938) PASS: lldb-api :: functionalities/var_path/TestVarPath.py (708 of 1938) PASS: lldb-unit :: ObjectFile/ELF/./ObjectFileELFTests/ObjectFileELFTest.GetSymtab_NoSymEntryPointArmAddressClass (709 of 1938) PASS: lldb-unit :: ScriptInterpreter/Python/./ScriptInterpreterPythonTests/PythonDataObjectsTest.TestInstanceNameResolutionNoDot (710 of 1938) PASS: lldb-unit :: Target/./TargetTests/PathMappingListTest.RelativeTests (711 of 1938) UNSUPPORTED: lldb-api :: functionalities/thread/state/TestThreadStates.py (712 of 1938) PASS: lldb-unit :: Utility/./UtilityTests/UriParserTest.MinimalPort (713 of 1938) PASS: lldb-unit :: Utility/./UtilityTests/ArgsTest.ReplaceArgumentAtIndexLonger (714 of 1938) PASS: lldb-unit :: Utility/./UtilityTests/StreamTest.PutHex32ByteOrderBig (715 of 1938) PASS: lldb-unit :: Utility/./UtilityTests/UriParserTest.MinimalPath (716 of 1938) PASS: lldb-unit :: Utility/./UtilityTests/RangeDataVector.FindEntryThatContains_Overlap (717 of 1938) PASS: lldb-unit :: Symbol/./SymbolTests/TestTypeSystemClang.TestRemoveFastQualifiers (718 of 1938) PASS: lldb-api :: functionalities/thread/concurrent_events/TestConcurrentDelaySignalWatch.py (719 of 1938) PASS: lldb-shell :: Driver/TestCore.test (720 of 1938) PASS: lldb-api :: lang/cpp/incomplete-types/TestCppIncompleteTypes.py (721 of 1938) UNSUPPORTED: lldb-api :: functionalities/tsan/multiple/TestTsanMultiple.py (722 of 1938) PASS: lldb-unit :: Utility/./UtilityTests/StringExtractorTest.GetHexBytesAvail_Partial (723 of 1938) PASS: lldb-shell :: Settings/TestFrameFormatColor.test (724 of 1938) PASS: lldb-unit :: Utility/./UtilityTests/ArgsTest.BareSingleQuote (725 of 1938) PASS: lldb-unit :: Utility/./UtilityTests/StringListTest.ForRange (726 of 1938) PASS: lldb-unit :: Utility/./UtilityTests/StreamTest.QuotedCString (727 of 1938) PASS: lldb-api :: lang/c/enum_types/TestEnumTypes.py (728 of 1938) UNSUPPORTED: lldb-api :: commands/register/register/intel_xtended_registers/TestMPXRegisters.py (729 of 1938) PASS: lldb-api :: functionalities/tail_call_frames/ambiguous_tail_call_seq2/TestAmbiguousTailCallSeq2.py (730 of 1938) PASS: lldb-unit :: Utility/./UtilityTests/ScalarTest.Equality (731 of 1938) PASS: lldb-unit :: Expression/./ExpressionTests/DWARFExpression.DW_OP_pick (732 of 1938) PASS: lldb-api :: macosx/thread-names/TestInterruptThreadNames.py (733 of 1938) PASS: lldb-unit :: Expression/./ExpressionTests/DiagnosticManagerTest.AppendMessageAttachToLastDiag (734 of 1938) PASS: lldb-api :: functionalities/inferior-crashing/recursive-inferior/TestRecursiveInferiorStep.py (735 of 1938) PASS: lldb-api :: tools/lldb-server/TestGdbRemote_qThreadStopInfo.py (736 of 1938) PASS: lldb-unit :: Process/minidump/./LLDBMinidumpTests/MinidumpParserTest.GetMemoryRegionInfoFromMemoryList (737 of 1938) PASS: lldb-api :: commands/expression/context-object/TestContextObject.py (738 of 1938) PASS: lldb-shell :: SymbolFile/DWARF/clang-ast-from-dwarf-objc-property.m (739 of 1938) UNSUPPORTED: lldb-api :: functionalities/unwind/standard/TestStandardUnwind.py (740 of 1938) PASS: lldb-api :: functionalities/data-formatter/data-formatter-objc/TestDataFormatterObjCCF.py (741 of 1938) PASS: lldb-shell :: SymbolFile/Breakpad/line-table-mixed-path-styles.test (742 of 1938) PASS: lldb-api :: lang/c/local_variables/TestLocalVariables.py (743 of 1938) PASS: lldb-unit :: ScriptInterpreter/Python/./ScriptInterpreterPythonTests/PythonDataObjectsTest.TestPythonString (744 of 1938) PASS: lldb-api :: functionalities/dynamic_value_child_count/TestDynamicValueChildCount.py (745 of 1938) PASS: lldb-api :: commands/frame/diagnose/array/TestArray.py (746 of 1938) PASS: lldb-unit :: Utility/./UtilityTests/StringListTest.AppendStringMove (747 of 1938) PASS: lldb-unit :: Expression/./ExpressionTests/DiagnosticManagerTest.GetStringMultiline (748 of 1938) PASS: lldb-shell :: ObjectFile/ELF/basic-info.yaml (749 of 1938) PASS: lldb-api :: commands/expression/static-initializers/TestStaticInitializers.py (750 of 1938) PASS: lldb-unit :: Utility/./UtilityTests/ListenerTest.GetEventImmediate (751 of 1938) PASS: lldb-unit :: Expression/./ExpressionTests/DiagnosticManagerTest.PutString (752 of 1938) UNSUPPORTED: lldb-api :: benchmarks/continue/TestBenchmarkContinue.py (753 of 1938) PASS: lldb-unit :: Host/./HostTests/FileSystemTest.OpenErrno (754 of 1938) PASS: lldb-api :: commands/command/nested_alias/TestNestedAlias.py (755 of 1938) PASS: lldb-shell :: SymbolFile/NativePDB/s_constant.cpp (756 of 1938) UNSUPPORTED: lldb-api :: functionalities/data-formatter/data-formatter-stl/libstdcpp/map/TestDataFormatterStdMap.py (757 of 1938) PASS: lldb-api :: python_api/type/TestTypeList.py (758 of 1938) PASS: lldb-api :: commands/expression/call-function/TestCallUserDefinedFunction.py (759 of 1938) UNSUPPORTED: lldb-api :: functionalities/darwin_log/filter/exact_match/subsystem/TestDarwinLogFilterMatchSubsystem.py (760 of 1938) PASS: lldb-unit :: Utility/./UtilityTests/ArchSpecTest.TestSetTriple (761 of 1938) PASS: lldb-api :: commands/reproducer/invalid-args/TestInvalidArgsReproducer.py (762 of 1938) PASS: lldb-unit :: Expression/./ExpressionTests/CppModuleConfigurationTest.AmbiguousCLib (763 of 1938) PASS: lldb-api :: lang/cpp/enum_types/TestCPP11EnumTypes.py (764 of 1938) PASS: lldb-unit :: Utility/./UtilityTests/DataExtractorTest.GetMaxS64 (765 of 1938) UNSUPPORTED: lldb-api :: functionalities/ubsan/basic/TestUbsanBasic.py (766 of 1938) PASS: lldb-unit :: Utility/./UtilityTests/NameMatchesTest.Contains (767 of 1938) PASS: lldb-shell :: ObjectFile/ELF/section-types-edgecases.yaml (768 of 1938) PASS: lldb-api :: functionalities/postmortem/minidump-new/TestMiniDumpUUID.py (769 of 1938) PASS: lldb-api :: lang/cpp/class_static/TestStaticVariables.py (770 of 1938) UNSUPPORTED: lldb-shell :: BuildScript/toolchain-clang-cl.test (771 of 1938) PASS: lldb-unit :: Utility/./UtilityTests/BinaryStreamTest.PutSLEB128SevenBytes (772 of 1938) PASS: lldb-unit :: Utility/./UtilityTests/Flags.Test (773 of 1938) PASS: lldb-shell :: SymbolFile/NativePDB/ast-functions.cpp (774 of 1938) PASS: lldb-api :: functionalities/data-formatter/data-formatter-synthval/TestDataFormatterSynthVal.py (775 of 1938) UNSUPPORTED: lldb-api :: tools/lldb-server/TestGdbRemoteModuleInfo.py (776 of 1938) PASS: lldb-api :: tools/lldb-vscode/breakpoint-events/TestVSCode_breakpointEvents.py (777 of 1938) PASS: lldb-unit :: ScriptInterpreter/Python/./ScriptInterpreterPythonTests/PythonDataObjectsTest.TestPythonStringToStr (778 of 1938) PASS: lldb-shell :: SymbolFile/DWARF/DW_AT_low_pc-addrx.s (779 of 1938) PASS: lldb-api :: tools/lldb-server/TestGdbRemoteThreadsInStopReply.py (780 of 1938) PASS: lldb-unit :: Utility/./UtilityTests/ArchSpecTest.TestParseMachCPUDashSubtypeTripleSimple (781 of 1938) PASS: lldb-api :: lang/objc/objc-property/TestObjCProperty.py (782 of 1938) PASS: lldb-unit :: Utility/./UtilityTests/StreamTest.PutRawBytesToLittleEndian (783 of 1938) PASS: lldb-shell :: SymbolFile/DWARF/inline-function-address-shared.test (784 of 1938) PASS: lldb-shell :: Quit/TestQuitExitCodeImplicit0.test (785 of 1938) PASS: lldb-shell :: Settings/TestModuleCacheSanity.test (786 of 1938) PASS: lldb-shell :: Quit/TestQuitExitCodeTooManyArgs.test (787 of 1938) PASS: lldb-unit :: Host/./HostTests/Host.WaitStatusFormat (788 of 1938) PASS: lldb-api :: functionalities/breakpoint/cpp/TestCPPBreakpointLocations.py (789 of 1938) PASS: lldb-unit :: Utility/./UtilityTests/StringExtractorTest.GetHexBytes_Partial (790 of 1938) PASS: lldb-unit :: Utility/./UtilityTests/RangeTest.Constructor (791 of 1938) PASS: lldb-unit :: Process/gdb-remote/./ProcessGdbRemoteTests/GDBRemoteCommunicationClientTest.GetModulesInfo (792 of 1938) PASS: lldb-unit :: Symbol/./SymbolTests/TestClangASTImporter.MetadataPropagationIndirectImport (793 of 1938) PASS: lldb-api :: functionalities/data-formatter/setvaluefromcstring/TestSetValueFromCString.py (794 of 1938) PASS: lldb-api :: functionalities/thread/concurrent_events/TestConcurrentSignalWatch.py (795 of 1938) PASS: lldb-api :: commands/source/info/TestSourceInfo.py (796 of 1938) PASS: lldb-api :: lang/objc/orderedset/TestOrderedSet.py (797 of 1938) PASS: lldb-unit :: ScriptInterpreter/Python/./ScriptInterpreterPythonTests/PythonDataObjectsTest.TestPythonFile (798 of 1938) PASS: lldb-unit :: Utility/./UtilityTests/StringListTest.GetMaxStringLengthMixed (799 of 1938) PASS: lldb-api :: functionalities/breakpoint/consecutive_breakpoints/TestConsecutiveBreakpoints.py (800 of 1938) PASS: lldb-shell :: Minidump/disassemble-no-module.yaml (801 of 1938) PASS: lldb-shell :: SymbolFile/NativePDB/globals-fundamental.cpp (802 of 1938) PASS: lldb-unit :: Utility/./UtilityTests/StringExtractorTest.GetNameColonValueNoSemicolon (803 of 1938) PASS: lldb-api :: lang/objc/objc-ivar-offsets/TestObjCIvarOffsets.py (804 of 1938) PASS: lldb-api :: functionalities/thread/concurrent_events/TestConcurrentManyBreakpoints.py (805 of 1938) PASS: lldb-api :: python_api/interpreter/TestCommandInterpreterAPI.py (806 of 1938) PASS: lldb-api :: functionalities/data-formatter/data-formatter-stl/libcxx/optional/TestDataFormatterLibcxxOptional.py (807 of 1938) PASS: lldb-unit :: Host/./HostTests/SocketTest.TCPGetConnectURI (808 of 1938) PASS: lldb-api :: functionalities/data-formatter/data-formatter-stl/libcxx/multiset/TestDataFormatterLibcxxMultiSet.py (809 of 1938) PASS: lldb-api :: functionalities/inferior-assert/TestInferiorAssert.py (810 of 1938) PASS: lldb-api :: functionalities/thread/concurrent_events/TestConcurrentCrashWithWatchpointBreakpointSignal.py (811 of 1938) PASS: lldb-api :: commands/expression/save_jit_objects/TestSaveJITObjects.py (812 of 1938) PASS: lldb-api :: types/TestCharTypeExpr.py (813 of 1938) PASS: lldb-api :: commands/watchpoints/watchpoint_commands/condition/TestWatchpointConditionCmd.py (814 of 1938) PASS: lldb-api :: lang/cpp/unique-types/TestUniqueTypes.py (815 of 1938) PASS: lldb-unit :: Utility/./UtilityTests/StreamTest.PutHex64ByteOrderBig (816 of 1938) PASS: lldb-api :: functionalities/data-formatter/parray/TestPrintArray.py (817 of 1938) PASS: lldb-unit :: SymbolFile/NativePDB/./SymbolFileNativePDBTests/PDBFPOProgramToDWARFExpressionTests.InvalidAssignmentMultiple (818 of 1938) PASS: lldb-unit :: Utility/./UtilityTests/StringListTest.CopyListSingle (819 of 1938) PASS: lldb-unit :: Process/gdb-remote/./ProcessGdbRemoteTests/GDBRemoteClientBaseTest.InterruptNoResponse (820 of 1938) PASS: lldb-api :: commands/expression/test/TestExprs.py (821 of 1938) PASS: lldb-shell :: Breakpoint/debug_rnglist_rlestartend.test (822 of 1938) PASS: lldb-unit :: Host/./HostTests/ConnectionFileDescriptorTest.TCPGetURIv4 (823 of 1938) PASS: lldb-unit :: Utility/./UtilityTests/Flags.GetBitSize (824 of 1938) PASS: lldb-api :: commands/expression/import-std-module/vector/TestVectorFromStdModule.py (825 of 1938) PASS: lldb-api :: types/TestShortType.py (826 of 1938) PASS: lldb-api :: lang/objc/objc-class-method/TestObjCClassMethod.py (827 of 1938) PASS: lldb-unit :: Utility/./UtilityTests/UserIDResolver.GetGroupName (828 of 1938) PASS: lldb-unit :: Utility/./UtilityTests/StringExtractorTest.GetHexBytesAvail_OddPair2 (829 of 1938) PASS: lldb-api :: functionalities/data-formatter/data-formatter-stl/libcxx/set/TestDataFormatterLibcxxSet.py (830 of 1938) PASS: lldb-shell :: BuildScript/modes.test (831 of 1938) PASS: lldb-api :: functionalities/data-formatter/data-formatter-stl/libcxx/initializerlist/TestInitializerList.py (832 of 1938) PASS: lldb-unit :: UnwindAssembly/x86/./UnwindAssemblyx86Tests/Testx86AssemblyInspectionEngine.TestSpillRegToStackViaMOVx86_64 (833 of 1938) PASS: lldb-unit :: UnwindAssembly/x86/./UnwindAssemblyx86Tests/Testx86AssemblyInspectionEngine.TestPopR15 (834 of 1938) PASS: lldb-unit :: Utility/./UtilityTests/RecordReplayTest.InstrumentedFoo (835 of 1938) PASS: lldb-unit :: Host/./HostTests/TaskPoolTest.AddTask (836 of 1938) PASS: lldb-api :: lang/cpp/thread_local/TestThreadLocal.py (837 of 1938) PASS: lldb-unit :: Core/./LLDBCoreTests/StreamCallbackTest.Callback (838 of 1938) PASS: lldb-unit :: Core/./LLDBCoreTests/RichManglingContextTest.Basic (839 of 1938) PASS: lldb-unit :: Utility/./UtilityTests/FileSpecTest.RemoveLastPathComponent (840 of 1938) PASS: lldb-unit :: Utility/./UtilityTests/ArgsTest.TestOverwriteArgs (841 of 1938) PASS: lldb-api :: functionalities/thread/num_threads/TestNumThreads.py (842 of 1938) PASS: lldb-unit :: Utility/./UtilityTests/BinaryStreamTest.PutSLEB128FourBytes (843 of 1938) PASS: lldb-unit :: UnwindAssembly/x86/./UnwindAssemblyx86Tests/Testx86AssemblyInspectionEngine.TestLEAVE (844 of 1938) PASS: lldb-unit :: Host/./HostTests/NativeProcessProtocolTest.SetBreakpoint (845 of 1938) PASS: lldb-api :: lang/cpp/modules-import/TestCXXModulesImport.py (846 of 1938) UNSUPPORTED: lldb-api :: functionalities/data-formatter/data-formatter-stl/libstdcpp/smart_ptr/TestDataFormatterStdSmartPtr.py (847 of 1938) PASS: lldb-api :: lang/objc/objc-static-method-stripped/TestObjCStaticMethodStripped.py (848 of 1938) PASS: lldb-api :: lang/objc/foundation/TestSymbolTable.py (849 of 1938) UNSUPPORTED: lldb-shell :: Register/x86-64-xmm16-read.test (850 of 1938) PASS: lldb-api :: lang/cpp/namespace/TestNamespace.py (851 of 1938) PASS: lldb-shell :: VSCode/TestOptions.test (852 of 1938) PASS: lldb-unit :: Utility/./UtilityTests/ArgsTest.TestTrailingBackslash (853 of 1938) PASS: lldb-unit :: Language/Highlighting/./HighlighterTests/HighlighterTest.ClangIdentifiers (854 of 1938) PASS: lldb-api :: commands/platform/basic/TestPlatformPython.py (855 of 1938) PASS: lldb-unit :: ScriptInterpreter/Python/./ScriptInterpreterPythonTests/PythonDataObjectsTest.TestPythonTupleValues (856 of 1938) PASS: lldb-unit :: Signals/./SignalsTests/UnixSignalsTest.VersionChange (857 of 1938) PASS: lldb-api :: functionalities/thread/concurrent_events/TestConcurrentSignalNWatchNBreak.py (858 of 1938) PASS: lldb-unit :: Expression/./ExpressionTests/DiagnosticManagerTest.AddDiagnostic (859 of 1938) PASS: lldb-api :: lang/objc/objc-baseclass-sbtype/TestObjCBaseClassSBType.py (860 of 1938) PASS: lldb-unit :: Utility/./UtilityTests/StringExtractorTest.DecodeHexU8_Exact (861 of 1938) PASS: lldb-api :: lang/cpp/multiple-inheritance/TestCppMultipleInheritance.py (862 of 1938) PASS: lldb-api :: lang/c/forward/TestForwardDeclaration.py (863 of 1938) PASS: lldb-unit :: tools/lldb-server/tests/./LLDBServerTests/TestBase.DebugserverEnv (864 of 1938) PASS: lldb-unit :: Utility/./UtilityTests/StringExtractorTest.GetHexU8_Extra_NoEof (865 of 1938) PASS: lldb-unit :: Host/./HostTests/SocketTest.UDPGetConnectURI (866 of 1938) PASS: lldb-unit :: Host/./HostTests/SocketTest.TCPListen0ConnectAccept (867 of 1938) PASS: lldb-api :: lang/c/stepping/TestStepAndBreakpoints.py (868 of 1938) PASS: lldb-unit :: Utility/./UtilityTests/StringListTest.Clear (869 of 1938) PASS: lldb-api :: functionalities/step-avoids-no-debug/TestStepNoDebug.py (870 of 1938) PASS: lldb-api :: python_api/disassemble-raw-data/TestDisassembleRawData.py (871 of 1938) UNSUPPORTED: lldb-api :: benchmarks/stepping/TestSteppingSpeed.py (872 of 1938) PASS: lldb-unit :: Utility/./UtilityTests/StringListTest.Assignment (873 of 1938) PASS: lldb-unit :: Symbol/./SymbolTests/LineEntryTest.GetSameLineContiguousAddressRangeNestedInline (874 of 1938) PASS: lldb-unit :: Utility/./UtilityTests/LogChannelEnabledTest.LogGetLogThread (875 of 1938) PASS: lldb-api :: lang/cpp/dynamic-value-same-basename/TestDynamicValueSameBase.py (876 of 1938) PASS: lldb-unit :: Utility/./UtilityTests/TimerTest.CategoryTimesNested (877 of 1938) PASS: lldb-unit :: Utility/./UtilityTests/BinaryStreamTest.PutULEB128MaxValue (878 of 1938) PASS: lldb-shell :: Breakpoint/implicit_const_form_support.test (879 of 1938) PASS: lldb-unit :: Utility/./UtilityTests/StringExtractorTest.GetHexBytes_OddPair2 (880 of 1938) PASS: lldb-unit :: Utility/./UtilityTests/DataExtractorTest.GetCStrEmpty (881 of 1938) PASS: lldb-api :: python_api/function_symbol/TestDisasmAPI.py (882 of 1938) UNSUPPORTED: lldb-api :: functionalities/darwin_log/source/debug/TestDarwinLogSourceDebug.py (883 of 1938) PASS: lldb-unit :: Symbol/./SymbolTests/LineEntryTest.GetSameLineContiguousAddressRangeNoInlines (884 of 1938) PASS: lldb-unit :: Utility/./UtilityTests/StreamTeeTest.CopyConstructor (885 of 1938) PASS: lldb-unit :: Symbol/./SymbolTests/TestTypeSystemClang.TestUnifyAccessSpecifiers (886 of 1938) UNSUPPORTED: lldb-api :: tools/lldb-server/platform-process-connect/TestPlatformProcessConnect.py (887 of 1938) PASS: lldb-shell :: Settings/TestDisassemblyFormat.test (888 of 1938) PASS: lldb-unit :: ObjectFile/PECOFF/./ObjectFilePECOFFTests/PECallFrameInfoTest.Chained_eh (889 of 1938) PASS: lldb-unit :: Process/gdb-remote/./ProcessGdbRemoteTests/GDBRemoteClientBaseTest.SendContinueAndWait (890 of 1938) UNSUPPORTED: lldb-api :: functionalities/darwin_log/format/TestDarwinLogMessageFormat.py (891 of 1938) PASS: lldb-api :: commands/expression/import-std-module/weak_ptr/TestWeakPtrFromStdModule.py (892 of 1938) PASS: lldb-unit :: Language/Highlighting/./HighlighterTests/HighlighterTest.ClangUnterminatedString (893 of 1938) PASS: lldb-api :: lang/objc/modules-hash-mismatch/TestClangModulesHashMismatch.py (894 of 1938) PASS: lldb-shell :: ObjectFile/ELF/section-permissions.yaml (895 of 1938) UNSUPPORTED: lldb-api :: linux/thread/create_during_instruction_step/TestCreateDuringInstructionStep.py (896 of 1938) PASS: lldb-api :: commands/expression/function_template_specialization_temp_args/TestFunctionTemplateSpecializationTempArgs.py (897 of 1938) PASS: lldb-unit :: Language/Highlighting/./HighlighterTests/HighlighterTest.ClangCursorPos (898 of 1938) PASS: lldb-api :: commands/expression/calculator_mode/TestCalculatorMode.py (899 of 1938) PASS: lldb-api :: functionalities/breakpoint/global_constructor/TestBreakpointInGlobalConstructor.py (900 of 1938) PASS: lldb-api :: functionalities/gdb_remote_client/TestTargetXMLArch.py (901 of 1938) PASS: lldb-shell :: ObjectFile/PECOFF/sections.yaml (902 of 1938) PASS: lldb-unit :: Utility/./UtilityTests/CompletionRequest.TryCompleteCurrentArgGood (903 of 1938) PASS: lldb-unit :: Host/./HostTests/SocketTest.DomainGetConnectURI (904 of 1938) PASS: lldb-unit :: Symbol/./SymbolTests/TestTypeSystemClang.TestDeletingImplicitCopyCstrDueToMoveCStr (905 of 1938) PASS: lldb-shell :: Settings/TestFrameFormatMangling.test (906 of 1938) PASS: lldb-unit :: SymbolFile/NativePDB/./SymbolFileNativePDBTests/PDBFPOProgramToDWARFExpressionTests.UnresolvedDependentCyclicRegisterAssignmentReference (907 of 1938) PASS: lldb-unit :: Core/./LLDBCoreTests/MangledTest.ResultForValidName (908 of 1938) PASS: lldb-shell :: SymbolFile/NativePDB/global-classes.cpp (909 of 1938) PASS: lldb-unit :: Host/./HostTests/ConnectionFileDescriptorTest.TCPGetURIv6 (910 of 1938) PASS: lldb-unit :: Utility/./UtilityTests/ProcessInstanceInfoMatch.Name (911 of 1938) PASS: lldb-api :: commands/expression/codegen-crash-typedefdecl-not-in_declcontext/TestCodegenCrashTypedefDeclNotInDeclContext.py (912 of 1938) UNSUPPORTED: lldb-shell :: SymbolFile/PDB/function-nested-block.test (913 of 1938) PASS: lldb-unit :: ScriptInterpreter/Python/./ScriptInterpreterPythonTests/PythonDataObjectsTest.TestRun (914 of 1938) PASS: lldb-shell :: Reproducer/TestSynchronous.test (915 of 1938) PASS: lldb-api :: functionalities/thread/concurrent_events/TestConcurrentWatchBreakDelay.py (916 of 1938) PASS: lldb-api :: python_api/sblaunchinfo/TestSBLaunchInfo.py (917 of 1938) PASS: lldb-api :: lang/objc/foundation/TestObjectDescriptionAPI.py (918 of 1938) PASS: lldb-api :: functionalities/deleted-executable/TestDeletedExecutable.py (919 of 1938) PASS: lldb-unit :: Utility/./UtilityTests/ProcessInstanceInfo.DumpTable_invalidUID (920 of 1938) PASS: lldb-unit :: Utility/./UtilityTests/ArgsTest.GetArgumentArrayRef (921 of 1938) PASS: lldb-api :: functionalities/thread/concurrent_events/TestConcurrentTwoBreakpointThreads.py (922 of 1938) PASS: lldb-unit :: ObjectFile/ELF/./ObjectFileELFTests/ObjectFileELFTest.SectionsResolveConsistently (923 of 1938) PASS: lldb-shell :: SymbolFile/DWARF/debug_loc-aslr.s (924 of 1938) PASS: lldb-unit :: Utility/./UtilityTests/StreamTeeTest.SetStreamAtIndexOutOfBounds (925 of 1938) PASS: lldb-api :: commands/apropos/with-process/TestAproposWithProcess.py (926 of 1938) PASS: lldb-unit :: Target/./TargetTests/StackFrameRecognizerTest.NullModuleRegex (927 of 1938) PASS: lldb-shell :: SymbolFile/DWARF/dwarf5-atomic.s (928 of 1938) PASS: lldb-unit :: Signals/./SignalsTests/UnixSignalsTest.GetFilteredSignals (929 of 1938) PASS: lldb-unit :: Expression/./ExpressionTests/DWARFExpression.DW_OP_piece (930 of 1938) PASS: lldb-api :: lang/cpp/namespace_conflicts/TestNamespaceConflicts.py (931 of 1938) PASS: lldb-unit :: tools/lldb-server/tests/./LLDBServerTests/TestBase.LaunchModePreservesEnvironment (932 of 1938) PASS: lldb-unit :: Utility/./UtilityTests/StreamTest.PutMaxHex64ByteOrderLittle (933 of 1938) PASS: lldb-api :: functionalities/tail_call_frames/sbapi_support/TestTailCallFrameSBAPI.py (934 of 1938) PASS: lldb-unit :: Utility/./UtilityTests/RangeTest.ContainsAddr (935 of 1938) PASS: lldb-unit :: UnwindAssembly/x86/./UnwindAssemblyx86Tests/Testx86AssemblyInspectionEngine.Test32BitOnlyInstruction (936 of 1938) PASS: lldb-shell :: Settings/TestStopCommandSourceOnError.test (937 of 1938) PASS: lldb-shell :: SymbolFile/DWARF/debug_rnglists-dwo.s (938 of 1938) PASS: lldb-unit :: Utility/./UtilityTests/StreamTest.PutULEB128 (939 of 1938) UNSUPPORTED: lldb-api :: commands/register/register/intel_xtended_registers/mpx_offset_intersection/TestMPXOffsetIntersection.py (940 of 1938) PASS: lldb-unit :: SymbolFile/NativePDB/./SymbolFileNativePDBTests/PDBFPOProgramToDWARFExpressionTests.UnresolvedCyclicRegisterAssignmentReference (941 of 1938) PASS: lldb-shell :: ObjectFile/Breakpad/uuid-matching-mac.test (942 of 1938) PASS: lldb-unit :: Process/gdb-remote/./ProcessGdbRemoteTests/GDBRemoteCommunicationClientTest.SyncThreadState (943 of 1938) PASS: lldb-api :: functionalities/object-file/TestImageListMultiArchitecture.py (944 of 1938) PASS: lldb-unit :: Utility/./UtilityTests/BinaryStreamTest.PutSLEB128One (945 of 1938) PASS: lldb-shell :: ObjectFile/ELF/compressed-sections.yaml (946 of 1938) PASS: lldb-unit :: Process/gdb-remote/./ProcessGdbRemoteTests/GDBRemoteCommunicationClientTest.SaveRestoreRegistersNoSuffix (947 of 1938) PASS: lldb-api :: commands/expression/dont_allow_jit/TestAllowJIT.py (948 of 1938) PASS: lldb-api :: lang/c/find_struct_type/TestFindStructTypes.py (949 of 1938) PASS: lldb-api :: lang/cpp/class_types/TestClassTypesDisassembly.py (950 of 1938) PASS: lldb-api :: functionalities/breakpoint/step_over_breakpoint/TestStepOverBreakpoint.py (951 of 1938) PASS: lldb-api :: python_api/sbvalue_persist/TestSBValuePersist.py (952 of 1938) PASS: lldb-api :: lang/c/shared_lib/TestSharedLib.py (953 of 1938) PASS: lldb-unit :: Utility/./UtilityTests/StreamTest.PutNHex8 (954 of 1938) PASS: lldb-unit :: Symbol/./SymbolTests/TestTypeSystemClang.TestGetTypeClassTypeOfExpr (955 of 1938) PASS: lldb-unit :: Utility/./UtilityTests/SerializationRountripTest.SerializeDeserializePodReferences (956 of 1938) UNSUPPORTED: lldb-api :: functionalities/tsan/thread_leak/TestTsanThreadLeak.py (957 of 1938) PASS: lldb-shell :: SymbolFile/DWARF/forward-declarations.s (958 of 1938) PASS: lldb-api :: macosx/find-dsym/deep-bundle/TestDeepBundle.py (959 of 1938) PASS: lldb-unit :: Utility/./UtilityTests/OptionsWithRawTest.SingleWhitespaceInput (960 of 1938) PASS: lldb-unit :: Host/./HostTests/File.GetWaitableHandleFileno (961 of 1938) PASS: lldb-unit :: Process/gdb-remote/./ProcessGdbRemoteTests/GDBRemoteCommunicationClientTest.GetMemoryRegionInfo (962 of 1938) PASS: lldb-unit :: Utility/./UtilityTests/VMRange.SetEndAddress (963 of 1938) PASS: lldb-api :: lang/objc/direct-dispatch-step/TestObjCDirectDispatchStepping.py (964 of 1938) PASS: lldb-unit :: Utility/./UtilityTests/StreamTest.AddressSuffix (965 of 1938) UNSUPPORTED: lldb-api :: functionalities/data-formatter/data-formatter-stl/libstdcpp/list/TestDataFormatterStdList.py (966 of 1938) PASS: lldb-unit :: Symbol/./SymbolTests/DWARFCallFrameInfoTest.Basic_eh (967 of 1938) PASS: lldb-api :: commands/log/basic/TestLogging.py (968 of 1938) PASS: lldb-api :: tools/lldb-server/TestGdbRemoteSingleStep.py (969 of 1938) PASS: lldb-api :: python_api/symbol-context/two-files/TestSymbolContextTwoFiles.py (970 of 1938) PASS: lldb-unit :: UnwindAssembly/x86/./UnwindAssemblyx86Tests/Testx86AssemblyInspectionEngine.TestPushESI (971 of 1938) PASS: lldb-unit :: Expression/./ExpressionTests/DiagnosticManagerTest.FixedExpression (972 of 1938) PASS: lldb-api :: functionalities/thread/concurrent_events/TestConcurrentSignalWatchBreak.py (973 of 1938) PASS: lldb-unit :: Symbol/./SymbolTests/PostfixExpression.ToDWARF (974 of 1938) PASS: lldb-unit :: Language/CPlusPlus/./LanguageCPlusPlusTests/CPlusPlusLanguage.FindAlternateFunctionManglings (975 of 1938) PASS: lldb-unit :: Utility/./UtilityTests/StreamTeeTest.SetStreamAtIndexOverwrite (976 of 1938) PASS: lldb-unit :: Utility/./UtilityTests/StringExtractorTest.DecodeHexU8_InvalidHex2 (977 of 1938) PASS: lldb-shell :: Reproducer/Modules/TestModuleCXX.test (978 of 1938) PASS: lldb-api :: commands/expression/persistent_ptr_update/TestPersistentPtrUpdate.py (979 of 1938) PASS: lldb-api :: tools/lldb-server/TestAppleSimulatorOSType.py (980 of 1938) PASS: lldb-unit :: UnwindAssembly/x86/./UnwindAssemblyx86Tests/Testx86AssemblyInspectionEngine.TestCALLNextInsn (981 of 1938) PASS: lldb-api :: functionalities/data-formatter/synthcapping/TestSyntheticCapping.py (982 of 1938) PASS: lldb-unit :: Utility/./UtilityTests/UriParserTest.BracketedHostnameWithColon (983 of 1938) UNSUPPORTED: lldb-api :: lang/objc/objc-dynamic-value/TestObjCDynamicValue.py (984 of 1938) PASS: lldb-unit :: Symbol/./SymbolTests/TestTypeSystemClang.TestGetTypeClassNested (985 of 1938) PASS: lldb-api :: python_api/target/TestTargetAPI.py (986 of 1938) PASS: lldb-api :: functionalities/breakpoint/auto_continue/TestBreakpointAutoContinue.py (987 of 1938) PASS: lldb-unit :: Host/./HostTests/NativeProcessProtocolTest.ReadCStringFromMemory_MaxSize (988 of 1938) UNSUPPORTED: lldb-shell :: Register/x86-64-zmm-write.test (989 of 1938) PASS: lldb-api :: functionalities/postmortem/elf-core/gcore/TestGCore.py (990 of 1938) PASS: lldb-shell :: SymbolFile/DWARF/find-basic-variable.cpp (991 of 1938) PASS: lldb-unit :: Utility/./UtilityTests/StringExtractorTest.GetNameColonValueNoColon (992 of 1938) PASS: lldb-api :: commands/expression/namespace_local_var_same_name_cpp_and_c/TestNamespaceLocalVarSameNameCppAndC.py (993 of 1938) PASS: lldb-unit :: Process/gdb-remote/./ProcessGdbRemoteTests/GDBRemoteCommunicationServerTest.SendErrorResponse_ErrorList (994 of 1938) PASS: lldb-shell :: SymbolFile/DWARF/find-function-regex.cpp (995 of 1938) PASS: lldb-unit :: Utility/./UtilityTests/DataExtractorTest.GetCStrUnterminated (996 of 1938) PASS: lldb-api :: functionalities/multidebugger_commands/TestMultipleDebuggersCommands.py (997 of 1938) PASS: lldb-api :: functionalities/thread/exit_during_step/TestExitDuringStep.py (998 of 1938) PASS: lldb-unit :: Utility/./UtilityTests/SerializationRountripTest.SerializeDeserializeObjectPointer (999 of 1938) PASS: lldb-api :: functionalities/process_group/TestChangeProcessGroup.py (1000 of 1938) PASS: lldb-shell :: SymbolFile/DWARF/dwarf5-partial-index.cpp (1001 of 1938) PASS: lldb-unit :: Language/Highlighting/./HighlighterTests/HighlighterTest.ClangCursorPosAfterOtherToken (1002 of 1938) PASS: lldb-unit :: ScriptInterpreter/Python/./ScriptInterpreterPythonTests/PythonDataObjectsTest.TestPythonTupleInitializerList (1003 of 1938) PASS: lldb-unit :: Utility/./UtilityTests/VASprintfTest.BufferResize (1004 of 1938) PASS: lldb-api :: functionalities/breakpoint/move_nearest/TestMoveNearest.py (1005 of 1938) PASS: lldb-api :: functionalities/gdb_remote_client/TestRecognizeBreakpoint.py (1006 of 1938) PASS: lldb-api :: types/TestLongTypes.py (1007 of 1938) PASS: lldb-api :: commands/expression/char/TestExprsChar.py (1008 of 1938) PASS: lldb-unit :: Language/Highlighting/./HighlighterTests/HighlighterTest.ClangTrailingBackslashMissingNewLine (1009 of 1938) PASS: lldb-unit :: Expression/./ExpressionTests/CppModuleConfigurationTest.Sysroot (1010 of 1938) PASS: lldb-api :: commands/target/dump-symtab-demangle/TestDumpSymtabDemangle.py (1011 of 1938) PASS: lldb-api :: lang/c/step_over_no_deadlock/TestStepOverDoesntBlock.py (1012 of 1938) PASS: lldb-shell :: Reproducer/TestRelativePath.test (1013 of 1938) PASS: lldb-api :: lang/c/global_variables/TestGlobalVariables.py (1014 of 1938) PASS: lldb-shell :: ObjectFile/ELF/many-sections.s (1015 of 1938) PASS: lldb-api :: lang/cpp/llvm-style/TestLLVMStyle.py (1016 of 1938) PASS: lldb-unit :: Process/minidump/./LLDBMinidumpTests/MinidumpParserTest.MinidumpDuplicateModuleMinAddress (1017 of 1938) PASS: lldb-api :: commands/expression/import-std-module/shared_ptr-dbg-info-content/TestSharedPtrDbgInfoContentFromStdModule.py (1018 of 1938) PASS: lldb-unit :: Utility/./UtilityTests/CompletionRequest.DuplicateFilteringWithComments (1019 of 1938) PASS: lldb-shell :: ObjectFile/PECOFF/basic-info-arm.yaml (1020 of 1938) PASS: lldb-unit :: Language/Highlighting/./HighlighterTests/HighlighterTest.ClangBraces (1021 of 1938) PASS: lldb-api :: tools/lldb-vscode/attach/TestVSCode_attach.py (1022 of 1938) PASS: lldb-unit :: Process/minidump/./LLDBMinidumpTests/MinidumpParserTest.GetArchitecture (1023 of 1938) PASS: lldb-shell :: Settings/TestSettingsWrite.test (1024 of 1938) PASS: lldb-api :: lang/cpp/gmodules/TestWithModuleDebugging.py (1025 of 1938) PASS: lldb-unit :: UnwindAssembly/x86/./UnwindAssemblyx86Tests/Testx86AssemblyInspectionEngine.Test32bitFramelessBigStackFrame (1026 of 1938) PASS: lldb-api :: commands/expression/fixits/TestFixIts.py (1027 of 1938) PASS: lldb-unit :: Symbol/./SymbolTests/TestTypeSystemClang.TestBuiltinTypeForEncodingAndBitSize (1028 of 1938) PASS: lldb-shell :: ObjectFile/ELF/short-build-id.yaml (1029 of 1938) PASS: lldb-unit :: Utility/./UtilityTests/StringListTest.ShiftCString (1030 of 1938) PASS: lldb-api :: commands/expression/ir-interpreter-phi-nodes/TestIRInterpreterPHINodes.py (1031 of 1938) PASS: lldb-api :: python_api/lldbutil/iter/TestRegistersIterator.py (1032 of 1938) PASS: lldb-unit :: Utility/./UtilityTests/BinaryStreamTest.PutSLEB128Zero (1033 of 1938) PASS: lldb-api :: functionalities/gdb_remote_client/TestArmRegisterDefinition.py (1034 of 1938) PASS: lldb-api :: python_api/process/io/TestProcessIO.py (1035 of 1938) PASS: lldb-shell :: Quit/TestQuitExitCodeNonInt.test (1036 of 1938) PASS: lldb-shell :: ObjectFile/wasm/unified-debug-sections.yaml (1037 of 1938) PASS: lldb-api :: lang/objc/exceptions/TestObjCExceptions.py (1038 of 1938) PASS: lldb-api :: functionalities/inferior-crashing/TestInferiorCrashing.py (1039 of 1938) PASS: lldb-unit :: Utility/./UtilityTests/StringLexerTest.AdvanceIf (1040 of 1938) PASS: lldb-api :: lang/objc/objc++/TestObjCXX.py (1041 of 1938) PASS: lldb-api :: lang/objc/objc-ivar-stripped/TestObjCIvarStripped.py (1042 of 1938) UNSUPPORTED: lldb-shell :: ScriptInterpreter/Lua/command_script_import.test (1043 of 1938) PASS: lldb-api :: functionalities/inferior-changed/TestInferiorChanged.py (1044 of 1938) PASS: lldb-api :: functionalities/paths/TestPaths.py (1045 of 1938) PASS: lldb-unit :: Utility/./UtilityTests/ArgsTest.TestQuotedTrailingBackslash (1046 of 1938) PASS: lldb-unit :: Utility/./UtilityTests/ArgsTest.ReplaceArgumentAtIndexFarOutOfRange (1047 of 1938) UNSUPPORTED: lldb-api :: functionalities/data-formatter/data-formatter-stl/libstdcpp/vbool/TestDataFormatterStdVBool.py (1048 of 1938) PASS: lldb-api :: commands/settings/TestSettings.py (1049 of 1938) PASS: lldb-api :: lang/cpp/bitfields/TestCppBitfields.py (1050 of 1938) PASS: lldb-unit :: Utility/./UtilityTests/Flags.AnyClear (1051 of 1938) PASS: lldb-shell :: SymbolFile/DWARF/find-variable-file.cpp (1052 of 1938) PASS: lldb-api :: macosx/function-starts/TestFunctionStarts.py (1053 of 1938) PASS: lldb-api :: functionalities/gdb_remote_client/TestGDBRemoteLoad.py (1054 of 1938) UNSUPPORTED: lldb-api :: functionalities/unwind/ehframe/TestEhFrameUnwind.py (1055 of 1938) PASS: lldb-unit :: Symbol/./SymbolTests/TestTypeSystemClang.TestGetEnumIntegerTypeUnexpectedType (1056 of 1938) PASS: lldb-shell :: Unwind/thread-step-out-ret-addr-check.test (1057 of 1938) PASS: lldb-api :: functionalities/breakpoint/breakpoint_hit_count/TestBreakpointHitCount.py (1058 of 1938) PASS: lldb-shell :: Settings/TestDisableColor.test (1059 of 1938) UNSUPPORTED: lldb-shell :: SymbolFile/PDB/enums-layout.test (1060 of 1938) PASS: lldb-unit :: Utility/./UtilityTests/SubsystemRAIITest.SubsystemWithErrorSuccess (1061 of 1938) PASS: lldb-api :: functionalities/data-formatter/dump_dynamic/TestDumpDynamic.py (1062 of 1938) PASS: lldb-api :: api/log/TestAPILog.py (1063 of 1938) PASS: lldb-api :: functionalities/thread/concurrent_events/TestConcurrentCrashWithBreak.py (1064 of 1938) PASS: lldb-api :: lang/cpp/operators/TestCppOperators.py (1065 of 1938) PASS: lldb-unit :: Utility/./UtilityTests/Flags.Reset (1066 of 1938) PASS: lldb-api :: python_api/sbtype_typeclass/TestSBTypeTypeClass.py (1067 of 1938) PASS: lldb-unit :: Expression/./ExpressionTests/CppModuleConfigurationTest.LinuxLocalLibCpp (1068 of 1938) PASS: lldb-unit :: Utility/./UtilityTests/StreamTest.PutRawBytesToBigEndian (1069 of 1938) PASS: lldb-api :: functionalities/thread/concurrent_events/TestConcurrentBreakpointsDelayedBreakpointOneWatchpoint.py (1070 of 1938) PASS: lldb-unit :: Utility/./UtilityTests/RangeTest.Equal (1071 of 1938) PASS: lldb-unit :: Utility/./UtilityTests/GeneratorTest.Create (1072 of 1938) PASS: lldb-unit :: UnwindAssembly/x86/./UnwindAssemblyx86Tests/Testx86AssemblyInspectionEngine.Test64bitFramelessSmallStackFrame (1073 of 1938) PASS: lldb-api :: lang/c/bitfields/TestBitfields.py (1074 of 1938) UNSUPPORTED: lldb-api :: lang/objc/bitfield_ivars/TestBitfieldIvars.py (1075 of 1938) UNSUPPORTED: lldb-shell :: Breakpoint/ppc64-localentry.test (1076 of 1938) UNSUPPORTED: lldb-shell :: ExecControl/StopHook/stop-hook-threads.test (1077 of 1938) PASS: lldb-api :: lang/cpp/template/TestTemplateArgs.py (1078 of 1938) PASS: lldb-unit :: Host/./HostTests/MainLoopTest.TerminatesImmediately (1079 of 1938) PASS: lldb-api :: lang/objc/unicode-string/TestUnicodeString.py (1080 of 1938) PASS: lldb-unit :: Utility/./UtilityTests/SubsystemRAIITest.SubsystemWithErrorFailure (1081 of 1938) PASS: lldb-unit :: Utility/./UtilityTests/FileSpecTest.Equal (1082 of 1938) PASS: lldb-api :: functionalities/tail_call_frames/cross_dso/TestCrossDSOTailCalls.py (1083 of 1938) PASS: lldb-api :: lang/cpp/member-and-local-vars-with-same-name/TestMembersAndLocalsWithSameName.py (1084 of 1938) PASS: lldb-api :: commands/command/script/TestCommandScript.py (1085 of 1938) PASS: lldb-api :: commands/disassemble/basic/TestDisassembleBreakpoint.py (1086 of 1938) PASS: lldb-api :: commands/expression/xvalue/TestXValuePrinting.py (1087 of 1938) PASS: lldb-unit :: Utility/./UtilityTests/StringExtractorTest.DecodeHexU8_Underflow (1088 of 1938) PASS: lldb-shell :: Reproducer/Functionalities/TestStepping.test (1089 of 1938) UNSUPPORTED: lldb-api :: functionalities/exec/TestExec.py (1090 of 1938) PASS: lldb-unit :: Utility/./UtilityTests/StreamTest.PutSLEB128 (1091 of 1938) PASS: lldb-api :: functionalities/show_location/TestShowLocationDwarf5.py (1092 of 1938) PASS: lldb-unit :: Utility/./UtilityTests/ScalarTest.RightShiftOperator (1093 of 1938) PASS: lldb-unit :: Utility/./UtilityTests/BinaryStreamTest.PutSLEB128NineBytes (1094 of 1938) XFAIL: lldb-shell :: Register/x86-64-write.test (1095 of 1938) PASS: lldb-api :: lang/objc/radar-9691614/TestObjCMethodReturningBOOL.py (1096 of 1938) PASS: lldb-api :: commands/expression/argument_passing_restrictions/TestArgumentPassingRestrictions.py (1097 of 1938) PASS: lldb-unit :: Utility/./UtilityTests/StringListTest.JoinEmpty (1098 of 1938) PASS: lldb-unit :: Host/./HostTests/MainLoopTest.DetectsEOF (1099 of 1938) PASS: lldb-shell :: SymbolFile/DWARF/dwarf5-debug_line.s (1100 of 1938) PASS: lldb-shell :: ObjectFile/ELF/PT_TLS-overlap-PT_LOAD.yaml (1101 of 1938) PASS: lldb-api :: types/TestIntegerTypeExpr.py (1102 of 1938) PASS: lldb-unit :: Utility/./UtilityTests/StringLexerTest.NextIfList (1103 of 1938) PASS: lldb-shell :: Quit/TestQuitExitCodeHex0.test (1104 of 1938) PASS: lldb-unit :: UnwindAssembly/x86/./UnwindAssemblyx86Tests/Testx86AssemblyInspectionEngine.TestStackRealign8BitDisp_i386 (1105 of 1938) PASS: lldb-unit :: Utility/./UtilityTests/StringListTest.GetMaxStringLengthDecreasingSize (1106 of 1938) PASS: lldb-api :: lang/objc/global_ptrs/TestGlobalObjects.py (1107 of 1938) PASS: lldb-unit :: ObjectFile/Breakpad/./ObjectFileBreakpadTests/ModuleRecord.parse (1108 of 1938) PASS: lldb-api :: commands/frame/diagnose/bad-reference/TestBadReference.py (1109 of 1938) PASS: lldb-unit :: Editline/./EditlineTests/EditlineTestFixture.EditlineReceivesMultiLineText (1110 of 1938) PASS: lldb-api :: tools/lldb-server/TestGdbRemoteRegisterState.py (1111 of 1938) PASS: lldb-unit :: Process/gdb-remote/./ProcessGdbRemoteTests/GDBRemoteCommunicationClientTest.WriteRegisterNoSuffix (1112 of 1938) PASS: lldb-api :: commands/apropos/basic/TestApropos.py (1113 of 1938) PASS: lldb-unit :: SymbolFile/NativePDB/./SymbolFileNativePDBTests/PDBFPOProgramToDWARFExpressionTests.SingleAssignmentRegisterRef (1114 of 1938) UNSUPPORTED: lldb-shell :: Process/Windows/exception_access_violation.cpp (1115 of 1938) PASS: lldb-api :: lang/cpp/bool/TestCPPBool.py (1116 of 1938) PASS: lldb-unit :: Utility/./UtilityTests/BinaryStreamTest.PutULEB128ThreeBytes (1117 of 1938) UNSUPPORTED: lldb-api :: commands/watchpoints/multi_watchpoint_slots/TestWatchpointMultipleSlots.py (1118 of 1938) PASS: lldb-unit :: ScriptInterpreter/Python/./ScriptInterpreterPythonTests/PythonDataObjectsTest.TestPythonCallableCheck (1119 of 1938) PASS: lldb-shell :: ObjectFile/Breakpad/sections.test (1120 of 1938) PASS: lldb-api :: lang/c/offsetof/TestOffsetof.py (1121 of 1938) PASS: lldb-unit :: Utility/./UtilityTests/BinaryStreamTest.PutULEB128One (1122 of 1938) UNSUPPORTED: lldb-shell :: ObjectFile/ELF/minidebuginfo-set-and-hit-breakpoint.test (1123 of 1938) PASS: lldb-api :: functionalities/data-formatter/ostypeformatting/TestFormattersOsType.py (1124 of 1938) PASS: lldb-unit :: Host/./HostTests/FileSystemTest.Resolve (1125 of 1938) PASS: lldb-shell :: Expr/TestTypeOfDeclTypeExpr.test (1126 of 1938) PASS: lldb-api :: commands/expression/weak_symbols/TestWeakSymbols.py (1127 of 1938) PASS: lldb-api :: macosx/find-app-in-bundle/TestFindAppInBundle.py (1128 of 1938) PASS: lldb-shell :: Driver/TestTarget.test (1129 of 1938) PASS: lldb-api :: functionalities/gdb_remote_client/TestWriteMemory.py (1130 of 1938) PASS: lldb-api :: commands/watchpoints/watchpoint_size/TestWatchpointSizes.py (1131 of 1938) PASS: lldb-api :: functionalities/data-formatter/array_typedef/TestArrayTypedef.py (1132 of 1938) PASS: lldb-unit :: Process/minidump/./LLDBMinidumpTests/MinidumpParserTest.GetLinuxProcStatus_no_stream (1133 of 1938) PASS: lldb-unit :: Utility/./UtilityTests/StringListTest.LongestCommonPrefixNoPrefix (1134 of 1938) PASS: lldb-api :: functionalities/tail_call_frames/disambiguate_call_site/TestDisambiguateCallSite.py (1135 of 1938) PASS: lldb-unit :: UnwindAssembly/x86/./UnwindAssemblyx86Tests/Testx86AssemblyInspectionEngine.TestDisassemblyMidFunctionEpilogues (1136 of 1938) UNSUPPORTED: lldb-shell :: ScriptInterpreter/Lua/breakpoint_callback.test (1137 of 1938) XFAIL: lldb-shell :: Register/x86-64-ymm-write.test (1138 of 1938) PASS: lldb-unit :: Utility/./UtilityTests/OptionsWithRawTest.WhitespaceInput (1139 of 1938) PASS: lldb-unit :: Utility/./UtilityTests/FileSpecTest.FormatFileSpec (1140 of 1938) PASS: lldb-api :: functionalities/data-formatter/data-formatter-globals/TestDataFormatterGlobals.py (1141 of 1938) PASS: lldb-shell :: ObjectFile/ELF/section-overlap.yaml (1142 of 1938) PASS: lldb-shell :: ObjectFile/MachO/lc_build_version_notools.yaml (1143 of 1938) PASS: lldb-unit :: Host/./HostTests/SocketAddressTest.Set (1144 of 1938) PASS: lldb-unit :: Utility/./UtilityTests/ProcessInfoTest.Constructor (1145 of 1938) PASS: lldb-api :: commands/expression/cast_int_to_anonymous_enum/TestCastIntToAnonymousEnum.py (1146 of 1938) PASS: lldb-unit :: Utility/./UtilityTests/VASprintfTest.EncodingError (1147 of 1938) PASS: lldb-api :: tools/lldb-server/inferior-crash/TestGdbRemoteSegFault.py (1148 of 1938) PASS: lldb-api :: functionalities/breakpoint/scripted_bkpt/TestScriptedResolver.py (1149 of 1938) PASS: lldb-unit :: SymbolFile/DWARF/./SymbolFileDWARFTests/SymbolFileDWARFTests.TestAbbrevMissingTerminator (1150 of 1938) PASS: lldb-api :: functionalities/gdb_remote_client/TestPlatformClient.py (1151 of 1938) PASS: lldb-unit :: Utility/./UtilityTests/StatusTest.Formatv (1152 of 1938) PASS: lldb-shell :: SymbolFile/DWARF/debug-types-missing-signature.test (1153 of 1938) PASS: lldb-api :: functionalities/gdb_remote_client/TestJLink6Armv7RegisterDefinition.py (1154 of 1938) UNSUPPORTED: lldb-shell :: SymbolFile/NativePDB/typedefs.cpp (1155 of 1938) PASS: lldb-shell :: Reproducer/TestDiscard.test (1156 of 1938) PASS: lldb-unit :: DataFormatter/./LLDBFormatterTests/FormatManagerTests.CompatibleLangs (1157 of 1938) PASS: lldb-api :: functionalities/thread/backtrace_limit/TestBacktraceLimit.py (1158 of 1938) PASS: lldb-shell :: SymbolFile/DWARF/debug-types-basic.test (1159 of 1938) PASS: lldb-unit :: UnwindAssembly/x86/./UnwindAssemblyx86Tests/Testx86AssemblyInspectionEngine.TestPushEDI (1160 of 1938) PASS: lldb-api :: lang/objc/modules-incomplete/TestIncompleteModules.py (1161 of 1938) PASS: lldb-api :: lang/objc/objc-struct-return/TestObjCStructReturn.py (1162 of 1938) PASS: lldb-unit :: UnwindAssembly/x86/./UnwindAssemblyx86Tests/Testx86AssemblyInspectionEngine.TestPopEBP (1163 of 1938) PASS: lldb-api :: functionalities/tail_call_frames/disambiguate_paths_to_common_sink/TestDisambiguatePathsToCommonSink.py (1164 of 1938) PASS: lldb-shell :: ObjectFile/ELF/netbsd-exec-8.99.30-amd64.yaml (1165 of 1938) PASS: lldb-api :: macosx/lc-note/kern-ver-str/TestKernVerStrLCNOTE.py (1166 of 1938) PASS: lldb-api :: functionalities/thread/concurrent_events/TestConcurrentDelaySignalBreak.py (1167 of 1938) PASS: lldb-unit :: SymbolFile/DWARF/./SymbolFileDWARFTests/SymbolFileDWARFTests.TestAbbrevOutOfOrder (1168 of 1938) PASS: lldb-unit :: Utility/./UtilityTests/StringExtractorTest.GetHexBytesAvail (1169 of 1938) PASS: lldb-api :: commands/expression/unicode-in-variable/TestUnicodeInVariable.py (1170 of 1938) PASS: lldb-unit :: Utility/./UtilityTests/ProcessInstanceInfo.Dump (1171 of 1938) PASS: lldb-shell :: Reproducer/TestVersionCheck.test (1172 of 1938) PASS: lldb-api :: lang/cpp/limit-debug-info/TestWithLimitDebugInfo.py (1173 of 1938) UNSUPPORTED: lldb-api :: functionalities/tsan/global_location/TestTsanGlobalLocation.py (1174 of 1938) PASS: lldb-shell :: Driver/TestProcessAttach.test (1175 of 1938) PASS: lldb-api :: tools/lldb-vscode/breakpoint/TestVSCode_setBreakpoints.py (1176 of 1938) PASS: lldb-unit :: ScriptInterpreter/Python/./ScriptInterpreterPythonTests/PythonDataObjectsTest.TestBorrowedReferences (1177 of 1938) PASS: lldb-api :: lang/c/tls_globals/TestTlsGlobals.py (1178 of 1938) PASS: lldb-api :: lang/objc/objc-static-method/TestObjCStaticMethod.py (1179 of 1938) PASS: lldb-shell :: SymbolFile/DWARF/childless-compile-unit.s (1180 of 1938) PASS: lldb-api :: commands/expression/entry-bp/TestExprEntryBP.py (1181 of 1938) PASS: lldb-unit :: Host/./HostTests/NativeProcessProtocolTest.ReadCStringFromMemory (1182 of 1938) PASS: lldb-shell :: ObjectFile/MachO/lc_version_min.yaml (1183 of 1938) PASS: lldb-api :: functionalities/data-formatter/data-formatter-caching/TestDataFormatterCaching.py (1184 of 1938) PASS: lldb-shell :: ObjectFile/ELF/section-addresses.yaml (1185 of 1938) PASS: lldb-shell :: ObjectFile/ELF/PT_LOAD-overlap.yaml (1186 of 1938) XFAIL: lldb-shell :: Register/x86-mm-xmm-write.test (1187 of 1938) PASS: lldb-api :: functionalities/postmortem/elf-core/TestLinuxCore.py (1188 of 1938) PASS: lldb-unit :: Utility/./UtilityTests/StringListTest.InsertStringAtIndexStdString (1189 of 1938) PASS: lldb-unit :: Utility/./UtilityTests/StreamTest.AddressEmptyPrefix (1190 of 1938) PASS: lldb-api :: lang/cpp/static_methods/TestCPPStaticMethods.py (1191 of 1938) PASS: lldb-unit :: Utility/./UtilityTests/BinaryStreamTest.PutSLEB128FiveBytes (1192 of 1938) PASS: lldb-unit :: Process/gdb-remote/./ProcessGdbRemoteTests/GDBRemoteCommunicationTest.ReadPacket_checksum (1193 of 1938) PASS: lldb-api :: lang/cpp/signed_types/TestSignedTypes.py (1194 of 1938) PASS: lldb-api :: terminal/TestSTTYBeforeAndAfter.py (1195 of 1938) PASS: lldb-api :: lang/objc/ivar-IMP/TestObjCiVarIMP.py (1196 of 1938) PASS: lldb-api :: lang/objc/objc_direct-methods/TestObjCDirectMethods.py (1197 of 1938) PASS: lldb-unit :: Utility/./UtilityTests/TimeoutTest.Construction (1198 of 1938) PASS: lldb-unit :: Process/minidump/./LLDBMinidumpTests/MinidumpParserTest.GetMiscInfoWindows (1199 of 1938) PASS: lldb-api :: lang/objc/rdar-11355592/TestRdar11355592.py (1200 of 1938) PASS: lldb-shell :: SymbolFile/NativePDB/disassembly.cpp (1201 of 1938) PASS: lldb-unit :: Symbol/./SymbolTests/TestClangASTImporter.CopyTypeTagDecl (1202 of 1938) PASS: lldb-unit :: Utility/./UtilityTests/StreamTest.PutCharNull (1203 of 1938) PASS: lldb-unit :: Expression/./ExpressionTests/CppModuleConfigurationTest.Xcode (1204 of 1938) UNSUPPORTED: lldb-api :: functionalities/tsan/thread_numbers/TestTsanThreadNumbers.py (1205 of 1938) PASS: lldb-unit :: Utility/./UtilityTests/VMRange.IsValid (1206 of 1938) PASS: lldb-unit :: Language/Highlighting/./HighlighterTests/HighlighterTest.FallbackHighlighter (1207 of 1938) PASS: lldb-api :: functionalities/data-formatter/data-formatter-objc/TestDataFormatterObjCPlain.py (1208 of 1938) UNSUPPORTED: lldb-api :: lang/objc/foundation/TestFoundationDisassembly.py (1209 of 1938) PASS: lldb-api :: lang/cpp/char8_t/TestCxxChar8_t.py (1210 of 1938) PASS: lldb-unit :: SymbolFile/NativePDB/./SymbolFileNativePDBTests/PDBFPOProgramToDWARFExpressionTests.UnsupportedRASearch (1211 of 1938) PASS: lldb-unit :: Utility/./UtilityTests/StringLexerTest.Peek (1212 of 1938) PASS: lldb-unit :: Utility/./UtilityTests/ReproducerTest.SetReplay (1213 of 1938) PASS: lldb-shell :: ScriptInterpreter/Python/scripted_breakpoint.test (1214 of 1938) PASS: lldb-api :: lang/cpp/symbols/TestSymbols.py (1215 of 1938) PASS: lldb-unit :: Utility/./UtilityTests/StringExtractorTest.GetHexBytesAvail_FullString (1216 of 1938) PASS: lldb-unit :: Utility/./UtilityTests/StringListTest.GetMaxStringLengthEqualSize (1217 of 1938) PASS: lldb-unit :: Utility/./UtilityTests/StructuredDataTest.StringDump (1218 of 1938) UNSUPPORTED: lldb-api :: functionalities/breakpoint/breakpoint_callback_command_source/TestBreakpointCallbackCommandSource.py (1219 of 1938) PASS: lldb-api :: functionalities/data-formatter/data-formatter-smart-array/TestDataFormatterSmartArray.py (1220 of 1938) PASS: lldb-unit :: Expression/./ExpressionTests/DiagnosticManagerTest.PutStringSeverities (1221 of 1938) PASS: lldb-api :: functionalities/data-formatter/data-formatter-stl/libcxx/tuple/TestDataFormatterLibcxxTuple.py (1222 of 1938) PASS: lldb-unit :: Process/gdb-remote/./ProcessGdbRemoteTests/GDBRemoteClientBaseTest.SendContinueAndLateInterrupt (1223 of 1938) PASS: lldb-api :: functionalities/abbreviation/TestCommonShortSpellings.py (1224 of 1938) PASS: lldb-api :: macosx/DBGSourcePathRemapping/TestDSYMSourcePathRemapping.py (1225 of 1938) PASS: lldb-unit :: Utility/./UtilityTests/FileSpecTest.EqualDotsWindows (1226 of 1938) PASS: lldb-unit :: UnwindAssembly/x86/./UnwindAssemblyx86Tests/Testx86AssemblyInspectionEngine.TestPushRBP (1227 of 1938) PASS: lldb-unit :: Language/Highlighting/./HighlighterTests/HighlighterTest.DefaultHighlighterWithCursor (1228 of 1938) PASS: lldb-api :: functionalities/data-formatter/data-formatter-stl/libcxx/variant/TestDataFormatterLibcxxVariant.py (1229 of 1938) PASS: lldb-api :: sanity/TestModuleCacheSanity.py (1230 of 1938) PASS: lldb-unit :: Utility/./UtilityTests/BinaryStreamTest.PutSLEB128MaxValue (1231 of 1938) PASS: lldb-unit :: Utility/./UtilityTests/BinaryStreamTest.PutSLEB128SixBytes (1232 of 1938) PASS: lldb-api :: lang/c/conflicting-symbol/TestConflictingSymbol.py (1233 of 1938) PASS: lldb-shell :: Register/x86-64-read.test (1234 of 1938) PASS: lldb-unit :: Process/gdb-remote/./ProcessGdbRemoteTests/GDBRemoteCommunicationClientTest.SendStopTracePacket (1235 of 1938) PASS: lldb-unit :: Utility/./UtilityTests/OptionsWithRawTest.WhitespaceSuffix (1236 of 1938) PASS: lldb-unit :: Interpreter/./InterpreterTests/CompletionTest.DirCompletionUsername (1237 of 1938) PASS: lldb-api :: commands/expression/rdar42038760/TestScalarURem.py (1238 of 1938) PASS: lldb-api :: lang/c/strings/TestCStrings.py (1239 of 1938) PASS: lldb-unit :: Utility/./UtilityTests/CompletionRequest.DuplicateFiltering (1240 of 1938) PASS: lldb-api :: commands/expression/vector_of_enums/TestVectorOfEnums.py (1241 of 1938) PASS: lldb-unit :: UnwindAssembly/x86/./UnwindAssemblyx86Tests/Testx86AssemblyInspectionEngine.TestReturnDetect (1242 of 1938) PASS: lldb-shell :: ObjectFile/ELF/gnu-debuglink.yaml (1243 of 1938) PASS: lldb-shell :: SymbolFile/NativePDB/bitfields.cpp (1244 of 1938) PASS: lldb-unit :: Utility/./UtilityTests/UriParserTest.PortOverflow (1245 of 1938) PASS: lldb-shell :: Breakpoint/case-sensitive.test (1246 of 1938) PASS: lldb-unit :: Utility/./UtilityTests/StreamTest.Indent (1247 of 1938) PASS: lldb-api :: functionalities/completion/TestCompletion.py (1248 of 1938) PASS: lldb-unit :: Utility/./UtilityTests/NameMatchesTest.Ignore (1249 of 1938) PASS: lldb-unit :: Language/CPlusPlus/./LanguageCPlusPlusTests/CPlusPlusLanguage.ExtractContextAndIdentifier (1250 of 1938) PASS: lldb-api :: functionalities/data-formatter/data-formatter-stl/libcxx/map/TestDataFormatterLibccMap.py (1251 of 1938) PASS: lldb-unit :: ScriptInterpreter/Python/./ScriptInterpreterPythonTests/PythonDataObjectsTest.TestPythonByteArray (1252 of 1938) PASS: lldb-unit :: Utility/./UtilityTests/FileSpecTest.FileAndDirectoryComponents (1253 of 1938) PASS: lldb-unit :: Symbol/./SymbolTests/TestTypeSystemClang.TestIsClangType (1254 of 1938) PASS: lldb-api :: lang/cpp/dynamic-value/TestCppValueCast.py (1255 of 1938) FAIL: lldb-shell :: SymbolFile/DWARF/dwp.s (1256 of 1938) ******************** TEST 'lldb-shell :: SymbolFile/DWARF/dwp.s' FAILED ******************** Script: -- : 'RUN: at line 3'; /Users/buildslave/jenkins/workspace/lldb-cmake-sanitized/lldb-build/bin/llvm-mc --filetype=obj --triple x86_64-pc-linux /Users/buildslave/jenkins/workspace/lldb-cmake-sanitized/llvm-project/lldb/test/Shell/SymbolFile/DWARF/dwp.s -o /Users/buildslave/jenkins/workspace/lldb-cmake-sanitized/lldb-build/tools/lldb/test/SymbolFile/DWARF/Output/dwp.s.tmp --defsym MAIN=0 : 'RUN: at line 4'; /Users/buildslave/jenkins/workspace/lldb-cmake-sanitized/lldb-build/bin/llvm-mc --filetype=obj --triple x86_64-pc-linux /Users/buildslave/jenkins/workspace/lldb-cmake-sanitized/llvm-project/lldb/test/Shell/SymbolFile/DWARF/dwp.s -o /Users/buildslave/jenkins/workspace/lldb-cmake-sanitized/lldb-build/tools/lldb/test/SymbolFile/DWARF/Output/dwp.s.tmp.dwp --defsym DWP=0 : 'RUN: at line 5'; /Users/buildslave/jenkins/workspace/lldb-cmake-sanitized/lldb-build/bin/lldb --no-lldbinit -S /Users/buildslave/jenkins/workspace/lldb-cmake-sanitized/lldb-build/tools/lldb/test/Shell/lit-lldb-init /Users/buildslave/jenkins/workspace/lldb-cmake-sanitized/lldb-build/tools/lldb/test/SymbolFile/DWARF/Output/dwp.s.tmp -o "target variable A" -o "image lookup -v -n F1" -b | /Users/buildslave/jenkins/workspace/lldb-cmake-sanitized/lldb-build/bin/FileCheck /Users/buildslave/jenkins/workspace/lldb-cmake-sanitized/llvm-project/lldb/test/Shell/SymbolFile/DWARF/dwp.s : 'RUN: at line 6'; /Users/buildslave/jenkins/workspace/lldb-cmake-sanitized/lldb-build/bin/lldb-test symbols /Users/buildslave/jenkins/workspace/lldb-cmake-sanitized/lldb-build/tools/lldb/test/SymbolFile/DWARF/Output/dwp.s.tmp | /Users/buildslave/jenkins/workspace/lldb-cmake-sanitized/lldb-build/bin/FileCheck /Users/buildslave/jenkins/workspace/lldb-cmake-sanitized/llvm-project/lldb/test/Shell/SymbolFile/DWARF/dwp.s --check-prefix=SYMBOLS -- Exit Code: 1

Hide Details

Command Output (stderr): -- <instantiation>:1:1: error: changed section flags for .debug_str.dwo, expected: 0x80000030 .section .debug_str.dwo,"e",@progbits ^ /Users/buildslave/jenkins/workspace/lldb-cmake-sanitized/llvm-project/lldb/test/Shell/SymbolFile/DWARF/dwp.s:107:1: note: while in macro instantiation .irpc I,0123 ^ <instantiation>:1:1: error: changed section entsize for .debug_str.dwo, expected: 1 .section .debug_str.dwo,"e",@progbits ^ /Users/buildslave/jenkins/workspace/lldb-cmake-sanitized/llvm-project/lldb/test/Shell/SymbolFile/DWARF/dwp.s:107:1: note: while in macro instantiation .irpc I,0123 ^ <instantiation>:126:1: error: changed section flags for .debug_str.dwo, expected: 0x80000030 .section .debug_str.dwo,"e",@progbits ^ /Users/buildslave/jenkins/workspace/lldb-cmake-sanitized/llvm-project/lldb/test/Shell/SymbolFile/DWARF/dwp.s:107:1: note: while in macro instantiation .irpc I,0123 ^ <instantiation>:126:1: error: changed section entsize for .debug_str.dwo, expected: 1 .section .debug_str.dwo,"e",@progbits ^ /Users/buildslave/jenkins/workspace/lldb-cmake-sanitized/llvm-project/lldb/test/Shell/SymbolFile/DWARF/dwp.s:107:1: note: while in macro instantiation .irpc I,0123 ^ <instantiation>:251:1: error: changed section flags for .debug_str.dwo, expected: 0x80000030 .section .debug_str.dwo,"e",@progbits ^ /Users/buildslave/jenkins/workspace/lldb-cmake-sanitized/llvm-project/lldb/test/Shell/SymbolFile/DWARF/dwp.s:107:1: note: while in macro instantiation .irpc I,0123 ^ <instantiation>:251:1: error: changed section entsize for .debug_str.dwo, expected: 1 .section .debug_str.dwo,"e",@progbits ^ /Users/buildslave/jenkins/workspace/lldb-cmake-sanitized/llvm-project/lldb/test/Shell/SymbolFile/DWARF/dwp.s:107:1: note: while in macro instantiation .irpc I,0123 ^ <instantiation>:376:1: error: changed section flags for .debug_str.dwo, expected: 0x80000030 .section .debug_str.dwo,"e",@progbits ^ /Users/buildslave/jenkins/workspace/lldb-cmake-sanitized/llvm-project/lldb/test/Shell/SymbolFile/DWARF/dwp.s:107:1: note: while in macro instantiation .irpc I,0123 ^ <instantiation>:376:1: error: changed section entsize for .debug_str.dwo, expected: 1 .section .debug_str.dwo,"e",@progbits ^ /Users/buildslave/jenkins/workspace/lldb-cmake-sanitized/llvm-project/lldb/test/Shell/SymbolFile/DWARF/dwp.s:107:1: note: while in macro instantiation .irpc I,0123 ^

Hide Details

--

Hide Details

******************** PASS: lldb-unit :: Process/minidump/./LLDBMinidumpTests/MinidumpParserTest.GetThreadsAndGetThreadContext (1257 of 1938) PASS: lldb-api :: functionalities/plugins/python_os_plugin/TestPythonOSPlugin.py (1258 of 1938) PASS: lldb-unit :: Utility/./UtilityTests/UriParserTest.SchemeHostSeparator2 (1259 of 1938) PASS: lldb-unit :: Utility/./UtilityTests/RangeTest.SetRangeBase (1260 of 1938) PASS: lldb-api :: python_api/objc_type/TestObjCType.py (1261 of 1938) PASS: lldb-unit :: Utility/./UtilityTests/RangeTest.SizeTypes (1262 of 1938) PASS: lldb-unit :: Symbol/./SymbolTests/DWARFCallFrameInfoTest.Basic_dwarf4 (1263 of 1938) PASS: lldb-api :: types/TestFloatTypesExpr.py (1264 of 1938) PASS: lldb-shell :: SymbolFile/DWARF/debug-types-address-ranges.s (1265 of 1938) PASS: lldb-api :: functionalities/gdb_remote_client/TestNestedRegDefinitions.py (1266 of 1938) PASS: lldb-unit :: Utility/./UtilityTests/StreamTest.ShiftOperatorStrings (1267 of 1938) PASS: lldb-shell :: ObjectFile/PECOFF/section-types.yaml (1268 of 1938) PASS: lldb-unit :: Utility/./UtilityTests/RegisterValueTest.GetSet8 (1269 of 1938) PASS: lldb-shell :: SymbolFile/DWARF/find-qualified-variable.cpp (1270 of 1938) PASS: lldb-unit :: UnwindAssembly/x86/./UnwindAssemblyx86Tests/Testx86AssemblyInspectionEngine.TestPopR14 (1271 of 1938) PASS: lldb-unit :: Utility/./UtilityTests/StreamTeeTest.AppendStream (1272 of 1938) PASS: lldb-api :: commands/watchpoints/multiple_threads/TestWatchpointMultipleThreads.py (1273 of 1938) PASS: lldb-api :: functionalities/thread/concurrent_events/TestConcurrentManyWatchpoints.py (1274 of 1938) PASS: lldb-unit :: Utility/./UtilityTests/ArgsTest.TestSingleQuotedArgWithSpace (1275 of 1938) PASS: lldb-api :: functionalities/backticks/TestBackticksWithoutATarget.py (1276 of 1938) PASS: lldb-api :: commands/expression/import-std-module/forward_list-dbg-info-content/TestDbgInfoContentForwardListFromStdModule.py (1277 of 1938) PASS: lldb-api :: functionalities/data-formatter/user-format-vs-summary/TestUserFormatVsSummary.py (1278 of 1938) PASS: lldb-shell :: ObjectFile/Breakpad/sections-trailing-func.test (1279 of 1938) PASS: lldb-api :: python_api/watchpoint/TestWatchpointIgnoreCount.py (1280 of 1938) PASS: lldb-api :: tools/lldb-vscode/step/TestVSCode_step.py (1281 of 1938) PASS: lldb-unit :: Utility/./UtilityTests/VMRange.Clear (1282 of 1938) PASS: lldb-api :: functionalities/thread/concurrent_events/TestConcurrentBreakpointDelayBreakpointOneSignal.py (1283 of 1938) PASS: lldb-unit :: ObjectFile/Breakpad/./ObjectFileBreakpadTests/StackCFIRecord.parse (1284 of 1938) UNSUPPORTED: lldb-shell :: SymbolFile/PDB/udt-layout.test (1285 of 1938) PASS: lldb-api :: lang/objc/objc-struct-argument/TestObjCStructArgument.py (1286 of 1938) PASS: lldb-unit :: Utility/./UtilityTests/StringExtractorTest.GetHexBytes (1287 of 1938) PASS: lldb-shell :: Reproducer/Functionalities/TestDataFormatter.test (1288 of 1938) PASS: lldb-unit :: Utility/./UtilityTests/AnsiTerminal.Empty (1289 of 1938) PASS: lldb-unit :: Symbol/./SymbolTests/TestClangASTImporter.MetadataPropagation (1290 of 1938) PASS: lldb-api :: types/TestShortTypeExpr.py (1291 of 1938) PASS: lldb-api :: lang/objc/objc-ivar-protocols/TestIvarProtocols.py (1292 of 1938) XFAIL: lldb-shell :: SymbolFile/DWARF/find-type-in-function.cpp (1293 of 1938) PASS: lldb-api :: functionalities/postmortem/minidump/TestMiniDump.py (1294 of 1938) PASS: lldb-api :: lang/objc/objc-super/TestObjCSuper.py (1295 of 1938) PASS: lldb-api :: commands/expression/persistent_variables/TestPersistentVariables.py (1296 of 1938) PASS: lldb-api :: lang/cpp/global_operators/TestCppGlobalOperators.py (1297 of 1938) PASS: lldb-api :: commands/watchpoints/watchpoint_events/TestWatchpointEvents.py (1298 of 1938) PASS: lldb-unit :: Utility/./UtilityTests/RangeTest.ContainsEndInclusive (1299 of 1938) PASS: lldb-unit :: Process/gdb-remote/./ProcessGdbRemoteTests/GDBRemoteClientBaseTest.SendContinueDelegateStructuredDataReceipt (1300 of 1938) PASS: lldb-unit :: Process/minidump/./LLDBMinidumpTests/MinidumpParserTest.GetFilteredModuleList (1301 of 1938) UNSUPPORTED: lldb-shell :: SymbolFile/PDB/type-quals.test (1302 of 1938) PASS: lldb-unit :: Symbol/./SymbolTests/LineEntryTest.GetSameLineContiguousAddressRangeOneInline (1303 of 1938) UNSUPPORTED: lldb-api :: tools/lldb-server/libraries-svr4/TestGdbRemoteLibrariesSvr4Support.py (1304 of 1938) PASS: lldb-unit :: UnwindAssembly/x86/./UnwindAssemblyx86Tests/Testx86AssemblyInspectionEngine.TestPopR12 (1305 of 1938) PASS: lldb-unit :: ScriptInterpreter/Python/./ScriptInterpreterPythonTests/PythonDataObjectsTest.TestPythonListManipulation (1306 of 1938) PASS: lldb-unit :: UnwindAssembly/x86/./UnwindAssemblyx86Tests/Testx86AssemblyInspectionEngine.TestPushECX (1307 of 1938) PASS: lldb-api :: lang/c/step-target/TestStepTarget.py (1308 of 1938) PASS: lldb-api :: commands/expression/call-function/TestCallStdStringFunction.py (1309 of 1938) PASS: lldb-unit :: Utility/./UtilityTests/FileSpecTest.EqualDotsPosix (1310 of 1938) PASS: lldb-api :: lang/cpp/inlines/TestInlines.py (1311 of 1938) PASS: lldb-api :: commands/watchpoints/watchpoint_commands/TestWatchpointCommands.py (1312 of 1938) PASS: lldb-api :: functionalities/tail_call_frames/thread_step_out_message/TestArtificialFrameStepOutMessage.py (1313 of 1938) PASS: lldb-unit :: Host/./HostTests/SocketTest.DecodeHostAndPort (1314 of 1938) PASS: lldb-shell :: SymbolFile/DWARF/dwp-debug-types.s (1315 of 1938) PASS: lldb-unit :: Core/./LLDBCoreTests/MangledTest.ResultForBlockInvocation (1316 of 1938) PASS: lldb-unit :: Utility/./UtilityTests/AnsiTerminal.Twice (1317 of 1938) PASS: lldb-unit :: ScriptInterpreter/Python/./ScriptInterpreterPythonTests/PythonDataObjectsTest.TestPythonListValueEquality (1318 of 1938) UNSUPPORTED: lldb-shell :: ObjectFile/ELF/minidebuginfo-no-lzma.yaml (1319 of 1938) PASS: lldb-unit :: Utility/./UtilityTests/StringExtractorTest.GetHexU8_InvalidHex_NoEof (1320 of 1938) PASS: lldb-api :: lang/objc/objc-builtin-types/TestObjCBuiltinTypes.py (1321 of 1938) PASS: lldb-api :: macosx/safe-to-func-call/TestSafeFuncCalls.py (1322 of 1938) PASS: lldb-api :: types/TestDoubleTypes.py (1323 of 1938) PASS: lldb-unit :: UnwindAssembly/x86/./UnwindAssemblyx86Tests/Testx86AssemblyInspectionEngine.TestPushExtended (1324 of 1938) PASS: lldb-api :: tools/lldb-vscode/breakpoint/TestVSCode_setExceptionBreakpoints.py (1325 of 1938) PASS: lldb-unit :: Utility/./UtilityTests/RangeTest.Slide (1326 of 1938) PASS: lldb-unit :: Utility/./UtilityTests/StringExtractorTest.GetU32LittleEndian (1327 of 1938) PASS: lldb-api :: lang/cpp/gmodules-templates/TestGModules.py (1328 of 1938) UNSUPPORTED: lldb-api :: linux/mix-dwo-and-regular-objects/TestMixedDwarfBinary.py (1329 of 1938) PASS: lldb-api :: functionalities/mtc/simple/TestMTCSimple.py (1330 of 1938) PASS: lldb-api :: macosx/order/TestOrderFile.py (1331 of 1938) PASS: lldb-api :: commands/version/TestVersion.py (1332 of 1938) PASS: lldb-api :: functionalities/thread/backtrace_all/TestBacktraceAll.py (1333 of 1938) PASS: lldb-unit :: SymbolFile/NativePDB/./SymbolFileNativePDBTests/PDBFPOProgramToDWARFExpressionTests.UnresolvedRegisterReference (1334 of 1938) PASS: lldb-api :: commands/watchpoints/watchpoint_commands/command/TestWatchpointCommandPython.py (1335 of 1938) PASS: lldb-api :: lang/c/unions/TestUnionMembers.py (1336 of 1938) PASS: lldb-api :: functionalities/breakpoint/address_breakpoints/TestBadAddressBreakpoints.py (1337 of 1938) PASS: lldb-shell :: ObjectFile/PECOFF/basic-info.yaml (1338 of 1938) PASS: lldb-unit :: Utility/./UtilityTests/DataExtractorTest.GetBitfield (1339 of 1938) PASS: lldb-unit :: Language/Highlighting/./HighlighterTests/HighlighterTest.ClangStringLiterals (1340 of 1938) PASS: lldb-api :: functionalities/breakpoint/require_hw_breakpoints/TestRequireHWBreakpoints.py (1341 of 1938) PASS: lldb-shell :: SymbolFile/DWARF/debug-names-compressed.cpp (1342 of 1938) PASS: lldb-api :: functionalities/thread/concurrent_events/TestConcurrentTwoWatchpointThreads.py (1343 of 1938) PASS: lldb-api :: tools/lldb-server/register-reading/TestGdbRemoteGPacket.py (1344 of 1938) UNSUPPORTED: lldb-api :: iohandler/completion/TestIOHandlerCompletion.py (1345 of 1938) PASS: lldb-api :: commands/frame/diagnose/local-variable/TestLocalVariable.py (1346 of 1938) PASS: lldb-unit :: Utility/./UtilityTests/StringExtractorTest.GetHexU8_Extra (1347 of 1938) PASS: lldb-unit :: Utility/./UtilityTests/NameMatchesTest.EndsWith (1348 of 1938) PASS: lldb-unit :: Utility/./UtilityTests/BinaryStreamTest.PutULEB128FiveBytes (1349 of 1938) PASS: lldb-unit :: Utility/./UtilityTests/StringExtractorTest.GetHexBytes_OddPair (1350 of 1938) PASS: lldb-unit :: Utility/./UtilityTests/BroadcasterTest.EventTypeHasListeners (1351 of 1938) PASS: lldb-api :: functionalities/thread/concurrent_events/TestConcurrentTwoWatchpointsOneBreakpoint.py (1352 of 1938) PASS: lldb-api :: functionalities/breakpoint/dummy_target_breakpoints/TestBreakpointsWithNoTargets.py (1353 of 1938) PASS: lldb-unit :: Utility/./UtilityTests/StreamTest.PutPtr (1354 of 1938) PASS: lldb-api :: macosx/version_zero/TestGetVersionZeroVersion.py (1355 of 1938) PASS: lldb-unit :: Utility/./UtilityTests/RangeTest.LessThanInvalid (1356 of 1938) PASS: lldb-unit :: ObjectFile/Breakpad/./ObjectFileBreakpadTests/Record.classify (1357 of 1938) UNSUPPORTED: lldb-api :: functionalities/data-formatter/data-formatter-stl/libstdcpp/vector/TestDataFormatterStdVector.py (1358 of 1938) PASS: lldb-unit :: UnwindAssembly/x86/./UnwindAssemblyx86Tests/Testx86AssemblyInspectionEngine.TestPushEBP (1359 of 1938) PASS: lldb-unit :: Utility/./UtilityTests/ArgsTest.TestAppendArg (1360 of 1938) PASS: lldb-shell :: SymbolFile/NativePDB/nested-types.cpp (1361 of 1938) UNSUPPORTED: lldb-shell :: Register/x86-64-ymm16-write.test (1362 of 1938) PASS: lldb-api :: commands/watchpoints/watchpoint_on_vectors/TestValueOfVectorVariable.py (1363 of 1938) PASS: lldb-unit :: Utility/./UtilityTests/SerializationRountripTest.SerializeDeserializeObjectReference (1364 of 1938) PASS: lldb-unit :: Utility/./UtilityTests/BroadcasterTest.BroadcastEvent (1365 of 1938) PASS: lldb-unit :: Host/./HostTests/SocketTest.TCPGetAddress (1366 of 1938) PASS: lldb-api :: lang/objc/foundation/TestRuntimeTypes.py (1367 of 1938) PASS: lldb-api :: functionalities/optimized_code/TestNoASanExceptionAfterEvalOP_piece.py (1368 of 1938) PASS: lldb-api :: lang/cpp/exceptions/TestCPPExceptionBreakpoints.py (1369 of 1938) PASS: lldb-api :: functionalities/data-formatter/data-formatter-stl/libcxx/string/TestDataFormatterLibcxxString.py (1370 of 1938) PASS: lldb-shell :: SymbolFile/DWARF/dir-separator-posix.s (1371 of 1938) PASS: lldb-api :: lang/objc/objc-dyn-sbtype/TestObjCDynamicSBType.py (1372 of 1938) PASS: lldb-shell :: SymbolFile/Breakpad/unwind-via-stack-cfi.test (1373 of 1938) UNSUPPORTED: lldb-api :: functionalities/thread/multi_break/TestMultipleBreakpoints.py (1374 of 1938) PASS: lldb-api :: lang/cpp/template-function/TestTemplateFunctions.py (1375 of 1938) PASS: lldb-unit :: Utility/./UtilityTests/ScalarTest.Division (1376 of 1938) PASS: lldb-unit :: Process/minidump/./LLDBMinidumpTests/MinidumpParserTest.GetPid (1377 of 1938) PASS: lldb-api :: functionalities/data-formatter/data-formatter-synthtype/TestDataFormatterSynthType.py (1378 of 1938) UNSUPPORTED: lldb-api :: commands/gui/basic/TestGuiBasic.py (1379 of 1938) PASS: lldb-unit :: ObjectFile/ELF/./ObjectFileELFTests/ObjectFileELFTest.GetSymtab_NoSymEntryPointArmThumbAddressClass (1380 of 1938) PASS: lldb-unit :: Utility/./UtilityTests/BinaryStreamTest.PutSLEB128OneByte (1381 of 1938) PASS: lldb-api :: commands/expression/call-function/TestCallBuiltinFunction.py (1382 of 1938) PASS: lldb-unit :: Utility/./UtilityTests/ScalarTest.GetBytes (1383 of 1938) PASS: lldb-shell :: Quit/TestQuitExitCodeHexA.test (1384 of 1938) PASS: lldb-api :: functionalities/signal/TestSendSignal.py (1385 of 1938) PASS: lldb-unit :: Host/./HostTests/SocketTest.UDPConnect (1386 of 1938) PASS: lldb-unit :: Core/./LLDBCoreTests/MangledTest.NameIndexes_FindFunctionSymbols (1387 of 1938) PASS: lldb-unit :: SymbolFile/NativePDB/./SymbolFileNativePDBTests/PDBFPOProgramToDWARFExpressionTests.UnresolvedRegisterAssignmentReference (1388 of 1938) PASS: lldb-unit :: Language/Highlighting/./HighlighterTests/HighlighterTest.HighlighterSelectionPath (1389 of 1938) PASS: lldb-unit :: Symbol/./SymbolTests/TestClangASTImporter.CanImportInvalidType (1390 of 1938) PASS: lldb-api :: commands/expression/call-function/TestCallStopAndContinue.py (1391 of 1938) PASS: lldb-shell :: SymbolFile/Breakpad/line-table-discontinuous-file-ids.test (1392 of 1938) PASS: lldb-unit :: Utility/./UtilityTests/DataExtractorTest.GetMaxU64_unchecked (1393 of 1938) PASS: lldb-api :: lang/objc/rdar-10967107/TestRdar10967107.py (1394 of 1938) PASS: lldb-unit :: Utility/./UtilityTests/StreamTest.PutBytesAsRawHex8ToMixedEndian (1395 of 1938) PASS: lldb-unit :: Language/Highlighting/./HighlighterTests/HighlighterTest.ClangComments (1396 of 1938) PASS: lldb-unit :: debugserver/./debugserverTests/RNBSocket.LoopBackListenIPv6 (1397 of 1938) PASS: lldb-shell :: ObjectFile/PECOFF/sections-names.yaml (1398 of 1938) PASS: lldb-unit :: Utility/./UtilityTests/AnsiTerminal.Basic (1399 of 1938) PASS: lldb-unit :: Process/gdb-remote/./ProcessGdbRemoteTests/GDBRemoteCommunicationServerTest.SendErrorResponse_UnimplementedError (1400 of 1938) PASS: lldb-unit :: Utility/./UtilityTests/UUIDTest.Validity (1401 of 1938) PASS: lldb-unit :: Utility/./UtilityTests/OptionsWithRawTest.ArgsButNoLeadingDash (1402 of 1938) PASS: lldb-unit :: ScriptInterpreter/Python/./ScriptInterpreterPythonTests/PythonDataObjectsTest.TestCallable (1403 of 1938) PASS: lldb-unit :: Utility/./UtilityTests/LogChannelTest.List (1404 of 1938) UNSUPPORTED: lldb-api :: iohandler/unicode/TestUnicode.py (1405 of 1938) PASS: lldb-shell :: Driver/LocalLLDBInit.test (1406 of 1938) PASS: lldb-unit :: Core/./LLDBCoreTests/MangledTest.EmptyForInvalidName (1407 of 1938) PASS: lldb-unit :: Language/Highlighting/./HighlighterTests/HighlighterTest.ClangCursorPosEndOfLine (1408 of 1938) PASS: lldb-unit :: Process/minidump/./LLDBMinidumpTests/MinidumpParserTest.GetExceptionStream (1409 of 1938) PASS: lldb-api :: functionalities/thread/concurrent_events/TestConcurrentDelayedCrashWithBreakpointSignal.py (1410 of 1938) UNSUPPORTED: lldb-shell :: ObjectFile/PECOFF/disassemble-thumb.yaml (1411 of 1938) PASS: lldb-unit :: Expression/./ExpressionTests/DiagnosticManagerTest.GetStringPreserveOrder (1412 of 1938) PASS: lldb-shell :: SymbolFile/DWARF/find-basic-type.cpp (1413 of 1938) PASS: lldb-unit :: Utility/./UtilityTests/LogChannelTest.EnableOptions (1414 of 1938) PASS: lldb-unit :: Symbol/./SymbolTests/DWARFCallFrameInfoTest.Basic_dwarf3 (1415 of 1938) PASS: lldb-unit :: Utility/./UtilityTests/StreamTeeTest.GetStreamAtIndexOutOfBounds (1416 of 1938) PASS: lldb-unit :: Utility/./UtilityTests/DataExtractorTest.GetCStr (1417 of 1938) PASS: lldb-unit :: Utility/./UtilityTests/VMRange.Ordering (1418 of 1938) PASS: lldb-api :: functionalities/float-display/TestFloatDisplay.py (1419 of 1938) PASS: lldb-api :: functionalities/thread/concurrent_events/TestConcurrentWatchpointWithDelayWatchpointThreads.py (1420 of 1938) PASS: lldb-shell :: SymbolFile/DWARF/debug_line-relative_path.s (1421 of 1938) PASS: lldb-unit :: Utility/./UtilityTests/OptionsWithRawTest.QuotedSuffix (1422 of 1938) PASS: lldb-unit :: Utility/./UtilityTests/UUIDTest.RelationalOperators (1423 of 1938) PASS: lldb-unit :: Utility/./UtilityTests/ConstStringTest.CompareStringRef (1424 of 1938) PASS: lldb-api :: lang/objcxx/objcxx-ivar-vector/TestIvarVector.py (1425 of 1938) PASS: lldb-api :: functionalities/data-formatter/data-formatter-advanced/TestDataFormatterAdv.py (1426 of 1938) UNSUPPORTED: lldb-api :: functionalities/asan/TestReportData.py (1427 of 1938) UNSUPPORTED: lldb-shell :: SymbolFile/PDB/ast-restore.test (1428 of 1938) PASS: lldb-unit :: Utility/./UtilityTests/StreamTest.ShiftOperatorChars (1429 of 1938) PASS: lldb-api :: commands/expression/pr35310/TestExprsBug35310.py (1430 of 1938) PASS: lldb-unit :: UnwindAssembly/x86/./UnwindAssemblyx86Tests/Testx86AssemblyInspectionEngine.TestSimplex86_64Augmented (1431 of 1938) PASS: lldb-api :: tools/lldb-vscode/launch/TestVSCode_launch.py (1432 of 1938) UNSUPPORTED: lldb-api :: functionalities/darwin_log/basic/TestDarwinLogBasic.py (1433 of 1938) UNSUPPORTED: lldb-api :: functionalities/darwin_log/filter/exact_match/message/TestDarwinLogFilterMatchMessage.py (1434 of 1938) PASS: lldb-unit :: Utility/./UtilityTests/ArgsTest.TestSingleArg (1435 of 1938) PASS: lldb-shell :: Reproducer/TestGDBRemoteRepro.test (1436 of 1938) PASS: lldb-shell :: SymbolFile/NativePDB/globals-bss.cpp (1437 of 1938) PASS: lldb-unit :: Utility/./UtilityTests/RegularExpression.CopyAssignment (1438 of 1938) PASS: lldb-api :: lang/objc/foundation/TestObjCMethods2.py (1439 of 1938) PASS: lldb-unit :: Utility/./UtilityTests/DataExtractorTest.GetCStrAtNullOffset (1440 of 1938) PASS: lldb-unit :: Symbol/./SymbolTests/Type.CompilerContextPattern (1441 of 1938) PASS: lldb-api :: python_api/value/empty_class/TestValueAPIEmptyClass.py (1442 of 1938) PASS: lldb-shell :: SymbolFile/DWARF/inline-function-address.ll (1443 of 1938) PASS: lldb-api :: functionalities/type_completion/TestTypeCompletion.py (1444 of 1938) PASS: lldb-shell :: SymbolFile/DWARF/deterministic-build.cpp (1445 of 1938) PASS: lldb-unit :: Utility/./UtilityTests/VASprintfTest.NoBufferResize (1446 of 1938) PASS: lldb-unit :: Utility/./UtilityTests/Flags.Clear (1447 of 1938) PASS: lldb-api :: functionalities/gdb_remote_client/TestNoGPacketSupported.py (1448 of 1938) PASS: lldb-api :: commands/expression/deleting-implicit-copy-constructor/TestDeletingImplicitCopyConstructor.py (1449 of 1938) PASS: lldb-api :: commands/watchpoints/watchpoint_set_command/TestWatchLocationWithWatchSet.py (1450 of 1938) PASS: lldb-api :: python_api/signals/TestSignalsAPI.py (1451 of 1938) UNSUPPORTED: lldb-api :: benchmarks/frame_variable/TestFrameVariableResponse.py (1452 of 1938) PASS: lldb-unit :: Utility/./UtilityTests/LogTest.Register (1453 of 1938) UNSUPPORTED: lldb-api :: functionalities/param_entry_vals/basic_entry_values_x86_64/TestBasicEntryValuesX86_64.py (1454 of 1938) PASS: lldb-unit :: Utility/./UtilityTests/CompletionRequest.FakeLastArg (1455 of 1938) PASS: lldb-unit :: Utility/./UtilityTests/ProcessInstanceInfo.DumpTable (1456 of 1938) PASS: lldb-unit :: SymbolFile/DWARF/./SymbolFileDWARFTests/SymbolFileDWARFTests.TestAbbrevInvalidNULLTag (1457 of 1938) PASS: lldb-api :: functionalities/recursion/TestValueObjectRecursion.py (1458 of 1938) PASS: lldb-unit :: Platform/./LLDBPlatformTests/PlatformDarwinTest.TestParseVersionBuildDir (1459 of 1938) PASS: lldb-api :: functionalities/thread/thread_specific_break/TestThreadSpecificBreakpoint.py (1460 of 1938) PASS: lldb-api :: functionalities/data-formatter/stringprinter/TestStringPrinter.py (1461 of 1938) PASS: lldb-api :: tools/lldb-vscode/stackTrace/TestVSCode_stackTrace.py (1462 of 1938) PASS: lldb-unit :: Utility/./UtilityTests/StreamTest.PutRawBytesToMixedEndian (1463 of 1938) XFAIL: lldb-shell :: Register/x86-mm-xmm-read.test (1464 of 1938) PASS: lldb-unit :: Utility/./UtilityTests/FileSpecTest.PrependPathComponent (1465 of 1938) PASS: lldb-shell :: Quit/TestQuitExitCode-30.test (1466 of 1938) PASS: lldb-api :: functionalities/dead-strip/TestDeadStrip.py (1467 of 1938) PASS: lldb-unit :: Utility/./UtilityTests/StringExtractorTest.DecodeHexU8_Extra (1468 of 1938) PASS: lldb-unit :: Utility/./UtilityTests/ScalarTest.ExtractBitfield (1469 of 1938) PASS: lldb-shell :: SymbolFile/DWARF/debug-types-dwarf5.s (1470 of 1938) PASS: lldb-unit :: Process/minidump/./LLDBMinidumpTests/MinidumpParserTest.GetMemoryRegionInfoLinuxMaps (1471 of 1938) PASS: lldb-api :: functionalities/jitloader_gdb/TestJITLoaderGDB.py (1472 of 1938) PASS: lldb-unit :: Utility/./UtilityTests/UriParserTest.Minimal (1473 of 1938) UNSUPPORTED: lldb-shell :: ScriptInterpreter/Lua/nested_sessions.test (1474 of 1938) PASS: lldb-unit :: Utility/./UtilityTests/StringExtractorTest.InitMisc (1475 of 1938) PASS: lldb-api :: functionalities/breakpoint/breakpoint_ids/TestBreakpointIDs.py (1476 of 1938) PASS: lldb-api :: functionalities/data-formatter/format-propagation/TestFormatPropagation.py (1477 of 1938) PASS: lldb-unit :: Process/minidump/./LLDBMinidumpTests/MinidumpParserTest.GetThreadContext_x86_32_wow64 (1478 of 1938) PASS: lldb-unit :: ScriptInterpreter/Python/./ScriptInterpreterPythonTests/PythonDataObjectsTest.TestPythonTupleSize (1479 of 1938) UNSUPPORTED: lldb-api :: functionalities/signal/handle-segv/TestHandleSegv.py (1480 of 1938) PASS: lldb-unit :: Utility/./UtilityTests/BinaryStreamTest.PutULEB128OneByte (1481 of 1938) PASS: lldb-unit :: Utility/./UtilityTests/StringLexerTest.GetUnlexed (1482 of 1938) PASS: lldb-api :: functionalities/thread/concurrent_events/TestConcurrentTwoWatchpointsOneSignal.py (1483 of 1938) PASS: lldb-api :: commands/frame/recognizer/TestFrameRecognizer.py (1484 of 1938) PASS: lldb-unit :: Utility/./UtilityTests/DeserializerTest.HasData (1485 of 1938) PASS: lldb-unit :: ScriptInterpreter/Python/./ScriptInterpreterPythonTests/PythonDataObjectsTest.TestPythonBytes (1486 of 1938) PASS: lldb-api :: functionalities/gdb_remote_client/TestNoWatchpointSupportInfo.py (1487 of 1938) PASS: lldb-api :: commands/expression/import-std-module/vector-of-vectors/TestVectorOfVectorsFromStdModule.py (1488 of 1938) PASS: lldb-unit :: Utility/./UtilityTests/StringExtractorTest.GetHexU8_Underflow2 (1489 of 1938) PASS: lldb-api :: commands/expression/import_builtin_fileid/TestImportBuiltinFileID.py (1490 of 1938) PASS: lldb-unit :: UnwindAssembly/x86/./UnwindAssemblyx86Tests/Testx86AssemblyInspectionEngine.TestPush0 (1491 of 1938) PASS: lldb-unit :: Utility/./UtilityTests/ScalarTest.Scalar_512 (1492 of 1938) PASS: lldb-api :: lang/c/vla/TestVLA.py (1493 of 1938) PASS: lldb-shell :: ObjectFile/wasm/basic.yaml (1494 of 1938) UNSUPPORTED: lldb-api :: android/platform/TestDefaultCacheLineSize.py (1495 of 1938) PASS: lldb-unit :: Utility/./UtilityTests/LogTest.Unregister (1496 of 1938) PASS: lldb-api :: python_api/default-constructor/TestDefaultConstructorForAPIObjects.py (1497 of 1938) PASS: lldb-unit :: Process/gdb-remote/./ProcessGdbRemoteTests/GDBRemoteCommunicationClientTest.GetModulesInfoInvalidResponse (1498 of 1938) PASS: lldb-api :: commands/frame/diagnose/dereference-argument/TestDiagnoseDereferenceArgument.py (1499 of 1938) PASS: lldb-api :: lang/objc/ptr_refs/TestPtrRefsObjC.py (1500 of 1938) PASS: lldb-unit :: Utility/./UtilityTests/VMRange.ContainsRange (1501 of 1938) UNSUPPORTED: lldb-api :: functionalities/thread/concurrent_events/TestConcurrentManySignals.py (1502 of 1938) PASS: lldb-unit :: Utility/./UtilityTests/StringListTest.Join (1503 of 1938) PASS: lldb-api :: lang/c/register_variables/TestRegisterVariables.py (1504 of 1938) PASS: lldb-unit :: Language/Highlighting/./HighlighterTests/HighlighterTest.ClangTrailingBackslashBeforeNewline (1505 of 1938) PASS: lldb-api :: functionalities/data-formatter/data-formatter-stl/libcxx/list/TestDataFormatterLibcxxList.py (1506 of 1938) PASS: lldb-api :: functionalities/gdb_remote_client/TestRestartBug.py (1507 of 1938) PASS: lldb-api :: tools/lldb-server/TestGdbRemote_vCont.py (1508 of 1938) PASS: lldb-unit :: Utility/./UtilityTests/StringExtractorTest.GetNameColonValueSuccess (1509 of 1938) PASS: lldb-shell :: Breakpoint/jitbp_elf.test (1510 of 1938) PASS: lldb-unit :: ScriptInterpreter/Python/./ScriptInterpreterPythonTests/PythonDataObjectsTest.TestExceptions (1511 of 1938) PASS: lldb-api :: lang/c/struct_types/TestStructTypes.py (1512 of 1938) PASS: lldb-unit :: Utility/./UtilityTests/VMRange.ContainsAddr (1513 of 1938) PASS: lldb-api :: lang/cpp/operator-overload/TestOperatorOverload.py (1514 of 1938) PASS: lldb-shell :: Minidump/breakpad-symbols.test (1515 of 1938) UNSUPPORTED: lldb-shell :: ScriptInterpreter/Lua/convenience_variables.test (1516 of 1938) PASS: lldb-api :: functionalities/data-formatter/var-in-aggregate-misuse/TestVarInAggregateMisuse.py (1517 of 1938) PASS: lldb-unit :: Symbol/./SymbolTests/TestTypeSystemClang.TestGetEnumIntegerTypeBasicTypes (1518 of 1938) PASS: lldb-unit :: Utility/./UtilityTests/StringListTest.JoinMultiCharSeparator (1519 of 1938) PASS: lldb-api :: functionalities/data-formatter/data-formatter-objc/nsstring/TestDataFormatterNSString.py (1520 of 1938) PASS: lldb-api :: functionalities/breakpoint/hardware_breakpoints/hardware_breakpoint_on_multiple_threads/TestHWBreakMultiThread.py (1521 of 1938) PASS: lldb-shell :: Settings/TestEchoCommands.test (1522 of 1938) PASS: lldb-unit :: UnwindAssembly/x86/./UnwindAssemblyx86Tests/Testx86AssemblyInspectionEngine.TestPopRBPWithREX (1523 of 1938) PASS: lldb-api :: functionalities/data-formatter/boolreference/TestFormattersBoolRefPtr.py (1524 of 1938) PASS: lldb-shell :: SymbolFile/NativePDB/break-by-line.cpp (1525 of 1938) PASS: lldb-api :: python_api/breakpoint/TestBreakpointAPI.py (1526 of 1938) PASS: lldb-unit :: Utility/./UtilityTests/OptionsWithRawTest.EmptyArgsOnlySuffix (1527 of 1938) PASS: lldb-unit :: Utility/./UtilityTests/OptionsWithRawTest.ArgsButNoDelimiter (1528 of 1938) PASS: lldb-unit :: Language/Highlighting/./HighlighterTests/HighlighterTest.ClangSquareBrackets (1529 of 1938) PASS: lldb-unit :: Utility/./UtilityTests/StatusTest.ErrorConversion (1530 of 1938) PASS: lldb-api :: functionalities/unwind/noreturn/TestNoreturnUnwind.py (1531 of 1938) PASS: lldb-unit :: Utility/./UtilityTests/AnsiTerminal.Unknown (1532 of 1938) PASS: lldb-api :: functionalities/thread/concurrent_events/TestConcurrentManyCrash.py (1533 of 1938) PASS: lldb-api :: functionalities/breakpoint/comp_dir_symlink/TestCompDirSymLink.py (1534 of 1938) PASS: lldb-unit :: Language/Highlighting/./HighlighterTests/HighlighterTest.DefaultHighlighter (1535 of 1938) PASS: lldb-shell :: SymbolFile/DWARF/dir-separator-windows.s (1536 of 1938) PASS: lldb-api :: python_api/class_members/TestSBTypeClassMembers.py (1537 of 1938) PASS: lldb-unit :: Symbol/./SymbolTests/TestTypeSystemClang.TestNotDeletingUserCopyCstrDueToMoveCStr (1538 of 1938) PASS: lldb-api :: lang/c/set_values/TestSetValues.py (1539 of 1938) PASS: lldb-unit :: Utility/./UtilityTests/StreamTeeTest.Write (1540 of 1938) PASS: lldb-unit :: Utility/./UtilityTests/StreamTest.PutBytesAsRawHex8ToLittleEndian (1541 of 1938) PASS: lldb-api :: commands/process/attach/attach_denied/TestAttachDenied.py (1542 of 1938) UNSUPPORTED: lldb-api :: lang/c/typedef/Testtypedef.py (1543 of 1938) PASS: lldb-unit :: Utility/./UtilityTests/StringExtractorTest.GetHexU8_Underflow2_NoEof (1544 of 1938) PASS: lldb-api :: functionalities/tail_call_frames/cross_object/TestCrossObjectTailCalls.py (1545 of 1938) PASS: lldb-api :: commands/expression/anonymous-struct/TestCallUserAnonTypedef.py (1546 of 1938) PASS: lldb-unit :: Target/./TargetTests/ExecutionContextTest.GetByteOrder (1547 of 1938) PASS: lldb-unit :: Utility/./UtilityTests/FileSpecTest.CopyByAppendingPathComponent (1548 of 1938) PASS: lldb-unit :: Utility/./UtilityTests/StringListTest.ForRangeEmpty (1549 of 1938) PASS: lldb-unit :: Process/minidump/./LLDBMinidumpTests/MinidumpParserTest.GetArchitectureWindows (1550 of 1938) PASS: lldb-api :: functionalities/signal/handle-abrt/TestHandleAbort.py (1551 of 1938) UNSUPPORTED: lldb-shell :: BuildScript/toolchain-msvc.test (1552 of 1938) PASS: lldb-shell :: SymbolFile/DWARF/find-method-local-struct.cpp (1553 of 1938) PASS: lldb-unit :: Utility/./UtilityTests/RangeTest.ContainsRangeStartingFromZero (1554 of 1938) PASS: lldb-unit :: Utility/./UtilityTests/StreamTest.PutCString (1555 of 1938) PASS: lldb-unit :: Utility/./UtilityTests/StreamTest.PutHex64ByteOrderLittle (1556 of 1938) UNSUPPORTED: lldb-shell :: Watchpoint/netbsd-nouserdbregs.test (1557 of 1938) PASS: lldb-shell :: Breakpoint/single-file-split-dwarf.test (1558 of 1938) PASS: lldb-api :: functionalities/value_md5_crash/TestValueMD5Crash.py (1559 of 1938) PASS: lldb-api :: lang/objc/single-entry-dictionary/TestObjCSingleEntryDictionary.py (1560 of 1938) PASS: lldb-unit :: Symbol/./SymbolTests/TestTypeSystemClang.TestGetTypeClassDeclType (1561 of 1938) UNSUPPORTED: lldb-api :: functionalities/longjmp/TestLongjmp.py (1562 of 1938) PASS: lldb-api :: commands/process/launch/TestProcessLaunch.py (1563 of 1938) PASS: lldb-shell :: SymbolFile/NativePDB/ast-types.cpp (1564 of 1938) PASS: lldb-api :: functionalities/thread/exit_during_break/TestExitDuringBreak.py (1565 of 1938) PASS: lldb-unit :: Process/minidump/./LLDBMinidumpTests/MinidumpParserTest.GetMemoryRegionInfoFromMemory64List (1566 of 1938) PASS: lldb-unit :: Process/gdb-remote/./ProcessGdbRemoteTests/GDBRemoteCommunicationClientTest.SendGetMetaDataPacket (1567 of 1938) PASS: lldb-unit :: Utility/./UtilityTests/FileSpecTest.IsRelative (1568 of 1938) PASS: lldb-shell :: Quit/TestQuitExitCode30.test (1569 of 1938) PASS: lldb-api :: commands/expression/import-std-module/forward_list/TestForwardListFromStdModule.py (1570 of 1938) PASS: lldb-unit :: Process/gdb-remote/./ProcessGdbRemoteTests/GDBRemoteCommunicationClientTest.SendGetTraceConfigPacket (1571 of 1938) UNSUPPORTED: lldb-shell :: Register/x86-ymm-write.test (1572 of 1938) PASS: lldb-unit :: Host/./HostTests/TaskPoolTest.TaskMap (1573 of 1938) PASS: lldb-unit :: ScriptInterpreter/Python/./ScriptInterpreterPythonTests/PythonDataObjectsTest.TestGlobalNameResolutionWithDot (1574 of 1938) PASS: lldb-unit :: Utility/./UtilityTests/StreamTeeTest.Assignment (1575 of 1938) PASS: lldb-api :: python_api/debugger/TestDebuggerAPI.py (1576 of 1938) PASS: lldb-shell :: ObjectFile/ELF/PT_LOAD-empty.yaml (1577 of 1938) PASS: lldb-api :: lang/objc/modules/TestObjCModules.py (1578 of 1938) PASS: lldb-api :: lang/objc/objc-new-syntax/TestObjCNewSyntaxLiteral.py (1579 of 1938) PASS: lldb-unit :: Process/minidump/./LLDBMinidumpTests/MinidumpParserTest.GetLinuxProcStatus (1580 of 1938) PASS: lldb-unit :: Utility/./UtilityTests/Flags.IsClear (1581 of 1938) PASS: lldb-api :: lang/c/anonymous/TestAnonymous.py (1582 of 1938) PASS: lldb-shell :: Minidump/dump-all.test (1583 of 1938) UNSUPPORTED: lldb-shell :: ScriptInterpreter/Lua/persistent_state.test (1584 of 1938) PASS: lldb-api :: functionalities/data-formatter/data-formatter-stl/libcxx/queue/TestDataFormatterLibcxxQueue.py (1585 of 1938) PASS: lldb-shell :: SymbolFile/DWARF/find-basic-namespace.cpp (1586 of 1938) PASS: lldb-unit :: Utility/./UtilityTests/StringListTest.AppendStringStdString (1587 of 1938) PASS: lldb-api :: python_api/hello_world/TestHelloWorld.py (1588 of 1938) PASS: lldb-api :: functionalities/thread/concurrent_events/TestConcurrentCrashWithSignal.py (1589 of 1938) PASS: lldb-shell :: ObjectFile/ELF/aarch64-relocations.yaml (1590 of 1938) PASS: lldb-shell :: SymbolFile/DWARF/compilercontext.ll (1591 of 1938) PASS: lldb-unit :: ObjectFile/Breakpad/./ObjectFileBreakpadTests/InfoRecord.parse (1592 of 1938) PASS: lldb-unit :: Symbol/./SymbolTests/TestClangASTImporter.CompleteFwdDeclWithOtherOrigin (1593 of 1938) UNSUPPORTED: lldb-shell :: Register/arm-fp-read.test (1594 of 1938) PASS: lldb-unit :: Utility/./UtilityTests/StructuredDataTest.ParseJSONFromFile (1595 of 1938) PASS: lldb-api :: lang/c/array_types/TestArrayTypes.py (1596 of 1938) PASS: lldb-api :: functionalities/data-formatter/data-formatter-stl/libcxx/multimap/TestDataFormatterLibccMultiMap.py (1597 of 1938) PASS: lldb-api :: functionalities/tail_call_frames/thread_step_out_or_return/TestSteppingOutWithArtificialFrames.py (1598 of 1938) UNSUPPORTED: lldb-api :: lang/cpp/static_members/TestCPPStaticMembers.py (1599 of 1938) PASS: lldb-api :: commands/expression/expr-in-syscall/TestExpressionInSyscall.py (1600 of 1938) PASS: lldb-api :: functionalities/data-formatter/data-formatter-disabling/TestDataFormatterDisabling.py (1601 of 1938) PASS: lldb-unit :: Host/./HostTests/FileSystemTest.FileAndDirectoryComponents (1602 of 1938) PASS: lldb-shell :: Minidump/Windows/Sigsegv/sigsegv.test (1603 of 1938) PASS: lldb-unit :: Target/./TargetTests/ModuleCacheTest.GetAndPutUuidExists (1604 of 1938) PASS: lldb-unit :: Expression/./ExpressionTests/CppModuleConfigurationTest.IgnoreLibStdCpp (1605 of 1938) PASS: lldb-shell :: ObjectFile/MachO/symtab.yaml (1606 of 1938) PASS: lldb-api :: functionalities/thread/create_after_attach/TestCreateAfterAttach.py (1607 of 1938) PASS: lldb-api :: functionalities/data-formatter/poarray/TestPrintObjectArray.py (1608 of 1938) PASS: lldb-api :: functionalities/data-formatter/data-formatter-stl/libcxx/forward_list/TestDataFormatterLibcxxForwardList.py (1609 of 1938) PASS: lldb-api :: commands/expression/import-std-module/basic/TestImportStdModule.py (1610 of 1938) PASS: lldb-unit :: Utility/./UtilityTests/Predicate.WaitForValueEqualTo (1611 of 1938) PASS: lldb-shell :: BuildScript/compiler-full-path.test (1612 of 1938) PASS: lldb-unit :: Utility/./UtilityTests/StringLexerTest.HasAtLeast (1613 of 1938) PASS: lldb-unit :: Utility/./UtilityTests/StringExtractorTest.GetU64BigEndian (1614 of 1938) PASS: lldb-unit :: UnwindAssembly/x86/./UnwindAssemblyx86Tests/Testx86AssemblyInspectionEngine.TestSimplei386ugmented (1615 of 1938) PASS: lldb-unit :: Utility/./UtilityTests/StreamTest.PutHex16ByteOrderLittle (1616 of 1938) PASS: lldb-shell :: ObjectFile/ELF/PT_LOAD-overlap-PT_TLS.yaml (1617 of 1938) PASS: lldb-shell :: ObjectFile/PECOFF/uuid.yaml (1618 of 1938) PASS: lldb-shell :: SymbolFile/NativePDB/break-by-function.cpp (1619 of 1938) PASS: lldb-unit :: Utility/./UtilityTests/RangeTest.LessThan (1620 of 1938) PASS: lldb-api :: functionalities/thread/concurrent_events/TestConcurrentTwoBreakpointsOneSignal.py (1621 of 1938) PASS: lldb-api :: functionalities/data-formatter/data-formatter-objc/nsindexpath/TestDataFormatterNSIndexPath.py (1622 of 1938) PASS: lldb-api :: commands/expression/import-std-module/vector-dbg-info-content/TestDbgInfoContentVectorFromStdModule.py (1623 of 1938) PASS: lldb-api :: sample_test/TestSampleInlineTest.py (1624 of 1938) PASS: lldb-unit :: Utility/./UtilityTests/StringExtractorTest.GetHexBytes_Underflow (1625 of 1938) PASS: lldb-shell :: SymbolFile/Breakpad/symtab-macho.test (1626 of 1938) PASS: lldb-api :: lang/objc/conflicting-definition/TestConflictingDefinition.py (1627 of 1938) PASS: lldb-unit :: ScriptInterpreter/Python/./ScriptInterpreterPythonTests/PythonDataObjectsTest.TestObjectAttributes (1628 of 1938) PASS: lldb-shell :: Commands/command-breakpoint-col.test (1629 of 1938) PASS: lldb-api :: python_api/interpreter/TestRunCommandInterpreterAPI.py (1630 of 1938) PASS: lldb-api :: functionalities/gdb_remote_client/TestGDBRemoteClient.py (1631 of 1938) PASS: lldb-api :: lang/cpp/const_this/TestConstThis.py (1632 of 1938) PASS: lldb-api :: types/TestCharType.py (1633 of 1938) PASS: lldb-unit :: Utility/./UtilityTests/StreamTeeTest.Constructor2Streams (1634 of 1938) PASS: lldb-unit :: Utility/./UtilityTests/RegularExpression.Invalid (1635 of 1938) PASS: lldb-unit :: Utility/./UtilityTests/StreamTest.PutHex8 (1636 of 1938) PASS: lldb-unit :: Utility/./UtilityTests/LogChannelEnabledTest.log_options (1637 of 1938) PASS: lldb-api :: api/multiple-targets/TestMultipleTargets.py (1638 of 1938) UNSUPPORTED: lldb-shell :: Register/aarch64-gp-read.test (1639 of 1938) UNSUPPORTED: lldb-api :: benchmarks/startup/TestStartupDelays.py (1640 of 1938) PASS: lldb-unit :: Process/gdb-remote/./ProcessGdbRemoteTests/GDBRemoteClientBaseTest.SendContinueDelegateInterface (1641 of 1938) PASS: lldb-api :: functionalities/avoids-fd-leak/TestFdLeak.py (1642 of 1938) PASS: lldb-unit :: Utility/./UtilityTests/BinaryStreamTest.PutSLEB128ThreeBytes (1643 of 1938) PASS: lldb-api :: functionalities/thread/crash_during_step/TestCrashDuringStep.py (1644 of 1938) PASS: lldb-api :: commands/expression/persistent_types/TestPersistentTypes.py (1645 of 1938) PASS: lldb-unit :: Utility/./UtilityTests/GeneratorTest.Get (1646 of 1938) PASS: lldb-api :: functionalities/data-formatter/nsarraysynth/TestNSArraySynthetic.py (1647 of 1938) PASS: lldb-api :: lang/cpp/offsetof/TestOffsetofCpp.py (1648 of 1938) PASS: lldb-unit :: Utility/./UtilityTests/StringExtractorTest.InitEmpty (1649 of 1938) PASS: lldb-unit :: Utility/./UtilityTests/StringExtractorTest.GetHexBytesAvail_OddPair (1650 of 1938) PASS: lldb-unit :: Utility/./UtilityTests/OptionsWithRawTest.SingleWordSuffix (1651 of 1938) PASS: lldb-unit :: UnwindAssembly/x86/./UnwindAssemblyx86Tests/Testx86AssemblyInspectionEngine.TestSimple64bitFrameFunction (1652 of 1938) PASS: lldb-unit :: Language/Highlighting/./HighlighterTests/HighlighterTest.ClangTrailingBackslashWithWhitespace (1653 of 1938) PASS: lldb-unit :: Expression/./ExpressionTests/DiagnosticManagerTest.AppendMessageSubsequentDiags (1654 of 1938) PASS: lldb-api :: lang/cpp/unicode-literals/TestUnicodeLiterals.py (1655 of 1938) PASS: lldb-unit :: Utility/./UtilityTests/ScalarTest.GetValue (1656 of 1938) PASS: lldb-unit :: ScriptInterpreter/Python/./ScriptInterpreterPythonTests/PythonDataObjectsTest.TestGlobalNameResolutionNoDot (1657 of 1938) PASS: lldb-unit :: Utility/./UtilityTests/StringLexerTest.NextIf (1658 of 1938) PASS: lldb-shell :: ScriptInterpreter/None/none.test (1659 of 1938) PASS: lldb-unit :: Utility/./UtilityTests/StringListTest.InsertStringAtIndexEnd (1660 of 1938) PASS: lldb-unit :: Expression/./ExpressionTests/CppModuleConfigurationTest.AmbiguousLibCpp (1661 of 1938) PASS: lldb-api :: functionalities/load_using_paths/TestLoadUsingPaths.py (1662 of 1938) PASS: lldb-unit :: Utility/./UtilityTests/StringListTest.JoinNonSpace (1663 of 1938) PASS: lldb-api :: commands/settings/quoting/TestQuoting.py (1664 of 1938) PASS: lldb-unit :: Utility/./UtilityTests/StreamTest.AddressRange (1665 of 1938) PASS: lldb-unit :: Host/./HostTests/FileActionTest.Open (1666 of 1938) PASS: lldb-api :: functionalities/data-formatter/data-formatter-stl/libcxx/vbool/TestDataFormatterLibcxxVBool.py (1667 of 1938) PASS: lldb-unit :: Expression/./ExpressionTests/DiagnosticManagerTest.AppendMessageNoDiag (1668 of 1938) PASS: lldb-api :: functionalities/memory-region/TestMemoryRegion.py (1669 of 1938) PASS: lldb-api :: sample_test/TestSampleTest.py (1670 of 1938) PASS: lldb-api :: functionalities/target_var/TestTargetVar.py (1671 of 1938) PASS: lldb-unit :: Process/gdb-remote/./ProcessGdbRemoteTests/GDBRemoteCommunicationClientTest.GetMemoryRegionInfoInvalidResponse (1672 of 1938) PASS: lldb-unit :: Symbol/./SymbolTests/Type.GetTypeScopeAndBasename (1673 of 1938) PASS: lldb-unit :: Utility/./UtilityTests/ArgsTest.TestUnknownEscape (1674 of 1938) PASS: lldb-api :: functionalities/data-formatter/data-formatter-objc/TestDataFormatterObjCNSDate.py (1675 of 1938) PASS: lldb-api :: python_api/watchpoint/TestWatchpointIter.py (1676 of 1938) PASS: lldb-api :: functionalities/data-formatter/data-formatter-script/TestDataFormatterScript.py (1677 of 1938) PASS: lldb-unit :: Utility/./UtilityTests/AnsiTerminal.AtEnd (1678 of 1938) PASS: lldb-unit :: Utility/./UtilityTests/LogChannelEnabledTest.LLDB_LOG_ERROR (1679 of 1938) PASS: lldb-shell :: Minidump/fb-dump.test (1680 of 1938) UNSUPPORTED: lldb-api :: functionalities/process_save_core/TestProcessSaveCore.py (1681 of 1938) UNSUPPORTED: lldb-api :: python_api/event/TestEvents.py (1682 of 1938) PASS: lldb-api :: macosx/duplicate-archive-members/TestDuplicateMembers.py (1683 of 1938) PASS: lldb-shell :: SymbolFile/Breakpad/unwind-via-raSearch.test (1684 of 1938) PASS: lldb-unit :: Process/gdb-remote/./ProcessGdbRemoteTests/GDBRemoteClientBaseTest.SendContinueAndAsyncSignal (1685 of 1938) PASS: lldb-api :: commands/expression/completion-in-lambda-and-unnamed-class/TestCompletionInLambdaAndUnnamedClass.py (1686 of 1938) PASS: lldb-api :: functionalities/inline-stepping/TestInlineStepping.py (1687 of 1938) PASS: lldb-api :: functionalities/breakpoint/breakpoint_ignore_count/TestBreakpointIgnoreCount.py (1688 of 1938) PASS: lldb-unit :: Utility/./UtilityTests/RangeTest.NotEqual (1689 of 1938) PASS: lldb-api :: commands/expression/class_template_specialization_empty_pack/TestClassTemplateSpecializationParametersHandling.py (1690 of 1938) PASS: lldb-shell :: Heap/heap-cstr.test (1691 of 1938) PASS: lldb-unit :: ScriptInterpreter/Python/./ScriptInterpreterPythonTests/PythonDataObjectsTest.TestResetting (1692 of 1938) PASS: lldb-unit :: Utility/./UtilityTests/BinaryStreamTest.PutULEB128TwoBytes (1693 of 1938) PASS: lldb-api :: lang/cpp/frame-var-anon-unions/TestFrameVariableAnonymousUnions.py (1694 of 1938) PASS: lldb-api :: lang/objc/variadic_methods/TestVariadicMethods.py (1695 of 1938) PASS: lldb-unit :: Utility/./UtilityTests/ScalarTest.Comparison (1696 of 1938) PASS: lldb-shell :: SymbolFile/Breakpad/line-table.test (1697 of 1938) PASS: lldb-api :: lang/cpp/stl/TestStdCXXDisassembly.py (1698 of 1938) PASS: lldb-shell :: SymbolFile/DWARF/apple-index-is-used.cpp (1699 of 1938) PASS: lldb-shell :: SymbolFile/DWARF/DW_AT_loclists_base.s (1700 of 1938) PASS: lldb-unit :: Language/Highlighting/./HighlighterTests/HighlighterTest.ClangEmptyInput (1701 of 1938) PASS: lldb-unit :: Utility/./UtilityTests/RangeTest.DoesAdjoinOrIntersect (1702 of 1938) PASS: lldb-api :: commands/expression/import-std-module/sysroot/TestStdModuleSysroot.py (1703 of 1938) PASS: lldb-api :: lang/cpp/function-qualifiers/TestCppFunctionQualifiers.py (1704 of 1938) PASS: lldb-api :: commands/frame/var/TestFrameVar.py (1705 of 1938) PASS: lldb-shell :: SymbolFile/DWARF/gnu-style-compression.cpp (1706 of 1938) PASS: lldb-unit :: Utility/./UtilityTests/StreamTest.ChangingByteOrder (1707 of 1938) PASS: lldb-api :: tools/lldb-vscode/variables/TestVSCode_variables.py (1708 of 1938) PASS: lldb-api :: functionalities/data-formatter/data-formatter-objc/TestDataFormatterObjCNSContainer.py (1709 of 1938) PASS: lldb-unit :: Utility/./UtilityTests/OptionsWithRawTest.TerminatedQuote (1710 of 1938) UNSUPPORTED: lldb-api :: functionalities/tsan/cpp_global_location/TestTsanCPPGlobalLocation.py (1711 of 1938) PASS: lldb-api :: functionalities/step_scripted/TestStepScripted.py (1712 of 1938) PASS: lldb-unit :: Utility/./UtilityTests/AnsiTerminal.WhiteSpace (1713 of 1938) PASS: lldb-unit :: ScriptInterpreter/Python/./ScriptInterpreterPythonTests/PythonDataObjectsTest.TestPythonStringToStructuredString (1714 of 1938) PASS: lldb-shell :: ObjectFile/ELF/PT_LOAD-overlap-section.yaml (1715 of 1938) PASS: lldb-api :: commands/platform/basic/TestPlatformCommand.py (1716 of 1938) PASS: lldb-unit :: Expression/./ExpressionTests/CppModuleConfigurationTest.Linux (1717 of 1938) PASS: lldb-unit :: Utility/./UtilityTests/NameMatchesTest.RegularExpression (1718 of 1938) PASS: lldb-unit :: Process/minidump/./LLDBMinidumpTests/MinidumpParserTest.FindMemoryRangeWithFullMemoryMinidump (1719 of 1938) PASS: lldb-shell :: SymbolFile/DWARF/debug-line-basic.s (1720 of 1938) PASS: lldb-unit :: ScriptInterpreter/Python/./ScriptInterpreterPythonTests/PythonDataObjectsTest.TestPythonIntegerToStr (1721 of 1938) PASS: lldb-api :: lang/objc/real-definition/TestRealDefinition.py (1722 of 1938) PASS: lldb-api :: functionalities/testid/TestTestId.py (1723 of 1938) PASS: lldb-api :: functionalities/data-formatter/type_summary_list_arg/TestTypeSummaryListArg.py (1724 of 1938) PASS: lldb-unit :: Utility/./UtilityTests/DataExtractorTest.PeekData (1725 of 1938) PASS: lldb-shell :: Settings/TestSettingsSet.test (1726 of 1938) PASS: lldb-api :: functionalities/data-formatter/data-formatter-objc/TestDataFormatterObjCExpr.py (1727 of 1938) PASS: lldb-unit :: SymbolFile/DWARF/./SymbolFileDWARFTests/SymbolFileDWARFTests.TestAbilitiesForDWARF (1728 of 1938) PASS: lldb-api :: tools/lldb-server/TestGdbRemoteProcessInfo.py (1729 of 1938) PASS: lldb-unit :: ObjectFile/ELF/./ObjectFileELFTests/ObjectFileELFTest.GetModuleSpecifications_EarlySectionHeaders (1730 of 1938) PASS: lldb-api :: python_api/get-value-32bit-int/TestGetValue32BitInt.py (1731 of 1938) PASS: lldb-api :: lang/cpp/extern_c/TestExternCSymbols.py (1732 of 1938) PASS: lldb-shell :: Commands/command-regex-delete.test (1733 of 1938) PASS: lldb-api :: lang/cpp/nsimport/TestCppNsImport.py (1734 of 1938) PASS: lldb-unit :: Editline/./EditlineTests/EditlineTestFixture.EditlineReceivesSingleLineText (1735 of 1938) PASS: lldb-unit :: Language/Highlighting/./HighlighterTests/HighlighterTest.Colons (1736 of 1938) PASS: lldb-api :: lang/cpp/diamond/TestDiamond.py (1737 of 1938) PASS: lldb-api :: functionalities/unwind/sigtramp/TestSigtrampUnwind.py (1738 of 1938) UNSUPPORTED: lldb-shell :: SymbolFile/PDB/compilands.test (1739 of 1938) PASS: lldb-unit :: Utility/./UtilityTests/StreamTest.AddressSize (1740 of 1938) PASS: lldb-api :: lang/objc/modules-cache/TestClangModulesCache.py (1741 of 1938) PASS: lldb-api :: python_api/module_section/TestModuleAndSection.py (1742 of 1938) PASS: lldb-api :: macosx/indirect_symbol/TestIndirectSymbols.py (1743 of 1938) PASS: lldb-api :: functionalities/data-formatter/typedef_array/TestTypedefArray.py (1744 of 1938) PASS: lldb-unit :: Utility/./UtilityTests/StringListTest.CopyListEmpty (1745 of 1938) PASS: lldb-unit :: Language/Highlighting/./HighlighterTests/HighlighterTest.ClangPPDirectives (1746 of 1938) PASS: lldb-api :: lang/cpp/std-function-step-into-callable/TestStdFunctionStepIntoCallable.py (1747 of 1938) PASS: lldb-api :: functionalities/data-formatter/frameformat_smallstruct/TestFrameFormatSmallStruct.py (1748 of 1938) PASS: lldb-unit :: Utility/./UtilityTests/OptionsWithRawTest.EmptySuffix (1749 of 1938) UNSUPPORTED: lldb-shell :: SymbolFile/PDB/function-level-linking.test (1750 of 1938) PASS: lldb-unit :: Interpreter/./InterpreterTests/OptionArgParserTest.toScriptLanguage (1751 of 1938) PASS: lldb-api :: functionalities/gdb_remote_client/TestRegDefinitionInParts.py (1752 of 1938) PASS: lldb-shell :: SymbolFile/NativePDB/function-types-classes.cpp (1753 of 1938) UNSUPPORTED: lldb-api :: functionalities/darwin_log/filter/exact_match/category/TestDarwinLogFilterMatchCategory.py (1754 of 1938) PASS: lldb-unit :: ObjectFile/Breakpad/./ObjectFileBreakpadTests/FuncRecord.parse (1755 of 1938) PASS: lldb-api :: functionalities/thread/concurrent_events/TestConcurrentBreakpointOneDelayBreakpointThreads.py (1756 of 1938) PASS: lldb-unit :: Process/minidump/./LLDBMinidumpTests/MinidumpParserTest.GetThreadContext_x86_32 (1757 of 1938) PASS: lldb-api :: functionalities/data-formatter/data-formatter-stl/libcxx/vector/TestDataFormatterLibcxxVector.py (1758 of 1938) PASS: lldb-api :: functionalities/data-formatter/type_summary_list_script/TestTypeSummaryListScript.py (1759 of 1938) UNSUPPORTED: lldb-api :: functionalities/darwin_log/filter/regex/subsystem/TestDarwinLogFilterRegexSubsystem.py (1760 of 1938) PASS: lldb-api :: functionalities/gdb_remote_client/TestThreadSelectionBug.py (1761 of 1938) PASS: lldb-api :: commands/watchpoints/step_over_watchpoint/TestStepOverWatchpoint.py (1762 of 1938) PASS: lldb-api :: lang/cpp/namespace_definitions/TestNamespaceDefinitions.py (1763 of 1938) PASS: lldb-api :: functionalities/tail_call_frames/unambiguous_sequence/TestUnambiguousTailCalls.py (1764 of 1938) PASS: lldb-unit :: Utility/./UtilityTests/BinaryStreamTest.PutULEB128FourBytes (1765 of 1938) PASS: lldb-api :: tools/lldb-server/TestGdbRemoteHostInfo.py (1766 of 1938) PASS: lldb-api :: commands/expression/no-deadlock/TestExprDoesntBlock.py (1767 of 1938) PASS: lldb-unit :: Utility/./UtilityTests/SerializationRountripTest.SerializeDeserializePodPointers (1768 of 1938) PASS: lldb-api :: lang/cpp/stl/TestSTL.py (1769 of 1938) PASS: lldb-unit :: Utility/./UtilityTests/FileSpecTest.AppendPathComponent (1770 of 1938) UNSUPPORTED: lldb-api :: functionalities/darwin_log/filter/regex/category/TestDarwinLogFilterRegexCategory.py (1771 of 1938) PASS: lldb-api :: functionalities/breakpoint/cpp_exception/TestCPPExceptionBreakpoint.py (1772 of 1938) PASS: lldb-unit :: SymbolFile/DWARF/./SymbolFileDWARFTests/SymbolFileDWARFTests.TestAbbrevOrder1Start5 (1773 of 1938) PASS: lldb-api :: commands/quit/TestQuit.py (1774 of 1938) PASS: lldb-unit :: ScriptInterpreter/Python/./ScriptInterpreterPythonTests/PythonDataObjectsTest.TestPythonTupleInitializerList2 (1775 of 1938) PASS: lldb-unit :: Utility/./UtilityTests/BinaryStreamTest.PutULEB128Zero (1776 of 1938) PASS: lldb-unit :: Target/./TargetTests/PathMappingListTest.RemapRoot (1777 of 1938) UNSUPPORTED: lldb-api :: functionalities/thread/thread_specific_break_plus_condition/TestThreadSpecificBpPlusCondition.py (1778 of 1938) PASS: lldb-api :: functionalities/data-formatter/data-formatter-stl/libcxx/list/loop/TestDataFormatterLibcxxListLoop.py (1779 of 1938) PASS: lldb-unit :: Target/./TargetTests/ModuleCacheTest.GetAndPut (1780 of 1938) PASS: lldb-api :: commands/platform/process/list/TestProcessList.py (1781 of 1938) PASS: lldb-unit :: ObjectFile/Breakpad/./ObjectFileBreakpadTests/StackWinRecord.parse (1782 of 1938) PASS: lldb-api :: functionalities/multiword-commands/TestMultiWordCommands.py (1783 of 1938) PASS: lldb-api :: python_api/watchpoint/condition/TestWatchpointConditionAPI.py (1784 of 1938) PASS: lldb-shell :: Driver/TestCommands.test (1785 of 1938) PASS: lldb-unit :: Utility/./UtilityTests/SubsystemRAIITest.NormalSubsystem (1786 of 1938) PASS: lldb-shell :: Minidump/no-process-id.yaml (1787 of 1938) PASS: lldb-api :: functionalities/breakpoint/inlined_breakpoints/TestInlinedBreakpoints.py (1788 of 1938) UNSUPPORTED: lldb-api :: lang/cpp/function-template-parameter-pack/TestFunctionTemplateParameterPack.py (1789 of 1938) PASS: lldb-api :: commands/add-dsym/uuid/TestAddDsymCommand.py (1790 of 1938) PASS: lldb-unit :: Utility/./UtilityTests/ArgsTest.ReplaceArgumentAtIndexOutOfRange (1791 of 1938) PASS: lldb-unit :: Expression/./ExpressionTests/DWARFExpression.DW_OP_convert (1792 of 1938) PASS: lldb-api :: functionalities/gdb_remote_client/TestStopPCs.py (1793 of 1938) PASS: lldb-api :: lang/c/local_types/TestUseClosestType.py (1794 of 1938) PASS: lldb-unit :: Utility/./UtilityTests/StringLexerTest.PutBack (1795 of 1938) PASS: lldb-api :: commands/command/delete/TestCommandDelete.py (1796 of 1938) PASS: lldb-api :: lang/cpp/breakpoint-commands/TestCPPBreakpointCommands.py (1797 of 1938) UNSUPPORTED: lldb-api :: functionalities/darwin_log/source/info/TestDarwinLogSourceInfo.py (1798 of 1938) PASS: lldb-unit :: Utility/./UtilityTests/UriParserTest.MinimalPortPath (1799 of 1938) PASS: lldb-unit :: Symbol/./SymbolTests/TestTypeSystemClang.TestFunctionTemplateConstruction (1800 of 1938) PASS: lldb-api :: api/multithreaded/TestMultithreaded.py (1801 of 1938) PASS: lldb-unit :: Interpreter/./InterpreterTests/CompletionTest.FileCompletionAbsolute (1802 of 1938) PASS: lldb-api :: commands/frame/diagnose/complicated-expression/TestComplicatedExpression.py (1803 of 1938) PASS: lldb-api :: functionalities/type_lookup/TestTypeLookup.py (1804 of 1938) PASS: lldb-unit :: ScriptInterpreter/Python/./ScriptInterpreterPythonTests/PythonDataObjectsTest.TestScript (1805 of 1938) PASS: lldb-unit :: Utility/./UtilityTests/ConstStringTest.MangledCounterpart (1806 of 1938) PASS: lldb-shell :: SymbolFile/Breakpad/symtab.test (1807 of 1938) PASS: lldb-unit :: Expression/./ExpressionTests/ClangExpressionDeclMapTest.TestPersistentDeclLookup (1808 of 1938) PASS: lldb-api :: commands/statistics/basic/TestStats.py (1809 of 1938) PASS: lldb-unit :: Expression/./ExpressionTests/CppModuleConfigurationTest.UnrelatedLibrary (1810 of 1938) PASS: lldb-unit :: Utility/./UtilityTests/StringExtractorTest.GetHexU8_Underflow_NoEof (1811 of 1938) PASS: lldb-api :: lang/cpp/class_types/TestClassTypes.py (1812 of 1938) PASS: lldb-shell :: ObjectFile/MachO/subsections.yaml (1813 of 1938) UNSUPPORTED: lldb-api :: functionalities/data-formatter/data-formatter-stl/libstdcpp/unique_ptr/TestDataFormatterStdUniquePtr.py (1814 of 1938) PASS: lldb-unit :: UnwindAssembly/x86/./UnwindAssemblyx86Tests/Testx86AssemblyInspectionEngine.TestAddESP (1815 of 1938) PASS: lldb-unit :: Utility/./UtilityTests/BinaryStreamTest.PutULEB128NineBytes (1816 of 1938) PASS: lldb-unit :: Symbol/./SymbolTests/PostfixExpression.ParseFPOProgram (1817 of 1938) PASS: lldb-api :: lang/cpp/global_variables/TestCPPGlobalVariables.py (1818 of 1938) PASS: lldb-api :: functionalities/return-value/TestReturnValue.py (1819 of 1938) PASS: lldb-api :: commands/target/create-deps/TestTargetCreateDeps.py (1820 of 1938) PASS: lldb-unit :: Utility/./UtilityTests/ConstStringTest.FromMidOfBufferStringRef (1821 of 1938) PASS: lldb-api :: lang/objc/foundation/TestConstStrings.py (1822 of 1938) PASS: lldb-api :: functionalities/data-formatter/data-formatter-objc/TestDataFormatterObjCNSError.py (1823 of 1938) PASS: lldb-unit :: ScriptInterpreter/Python/./ScriptInterpreterPythonTests/PythonDataObjectsTest.TestPythonDictionaryManipulation (1824 of 1938) UNSUPPORTED: lldb-shell :: Register/x86-64-gp-write.test (1825 of 1938) UNSUPPORTED: lldb-api :: commands/watchpoints/hello_watchlocation/TestWatchLocation.py (1826 of 1938) PASS: lldb-api :: functionalities/inferior-crashing/TestInferiorCrashingStep.py (1827 of 1938) PASS: lldb-shell :: Register/x86-64-ymm-read.test (1828 of 1938) PASS: lldb-api :: functionalities/thread/thread_exit/TestThreadExit.py (1829 of 1938) PASS: lldb-api :: commands/frame/diagnose/dereference-function-return/TestDiagnoseDereferenceFunctionReturn.py (1830 of 1938) PASS: lldb-shell :: SymbolFile/DWARF/array-sizes.s (1831 of 1938) PASS: lldb-api :: commands/process/attach-resume/TestAttachResume.py (1832 of 1938) PASS: lldb-unit :: UnwindAssembly/x86/./UnwindAssemblyx86Tests/Testx86AssemblyInspectionEngine.TestAddRSP (1833 of 1938) PASS: lldb-unit :: Utility/./UtilityTests/ArgsTest.ReplaceArgumentAtIndexShort (1834 of 1938) PASS: lldb-api :: functionalities/thread/concurrent_events/TestConcurrentSignalDelayWatch.py (1835 of 1938) PASS: lldb-shell :: ObjectFile/ELF/netbsd-core-amd64.test (1836 of 1938) PASS: lldb-api :: lang/cpp/rvalue-references/TestRvalueReferences.py (1837 of 1938) PASS: lldb-unit :: Process/minidump/./LLDBMinidumpTests/RegisterContextMinidump.CheckRegisterContextMinidump_ARM (1838 of 1938) PASS: lldb-unit :: SymbolFile/DWARF/./SymbolFileDWARFTests/DWARFASTParserClangTests.EnsureAllDIEsInDeclContextHaveBeenParsedParsesOnlyMatchingEntries (1839 of 1938) PASS: lldb-api :: functionalities/data-formatter/data-formatter-stl/libstdcpp/unique_ptr/invalid/TestDataFormatterInvalidStdUniquePtr.py (1840 of 1938) PASS: lldb-api :: tools/lldb-server/TestLldbGdbServer.py (1841 of 1938) UNSUPPORTED: lldb-shell :: SymbolFile/PDB/expressions.test (1842 of 1938) PASS: lldb-unit :: UnwindAssembly/x86/./UnwindAssemblyx86Tests/Testx86AssemblyInspectionEngine.TestPushImm (1843 of 1938) UNSUPPORTED: lldb-shell :: SymbolFile/PDB/func-symbols.test (1844 of 1938) PASS: lldb-shell :: Minidump/Windows/broken-unwind.test (1845 of 1938) PASS: lldb-api :: commands/frame/var-scope/TestFrameVariableScope.py (1846 of 1938) PASS: lldb-unit :: UnwindAssembly/x86/./UnwindAssemblyx86Tests/Testx86AssemblyInspectionEngine.TestSubESP (1847 of 1938) PASS: lldb-shell :: Process/TestEnvironment.test (1848 of 1938) UNSUPPORTED: lldb-api :: commands/expression/multiline-completion/TestMultilineCompletion.py (1849 of 1938) UNSUPPORTED: lldb-shell :: SymbolFile/PDB/vbases.test (1850 of 1938) PASS: lldb-unit :: Utility/./UtilityTests/ListenerTest.GetEventWait (1851 of 1938) PASS: lldb-unit :: Language/Highlighting/./HighlighterTests/HighlighterTest.ClangCursorOutOfBounds (1852 of 1938) PASS: lldb-api :: functionalities/data-formatter/data-formatter-ptr-to-array/TestPtrToArrayFormatting.py (1853 of 1938) PASS: lldb-unit :: Interpreter/./InterpreterTests/OptionArgParserTest.toChar (1854 of 1938) PASS: lldb-shell :: SymbolFile/DWARF/dwarf5-index-is-used.cpp (1855 of 1938) PASS: lldb-api :: functionalities/data-formatter/ptr_ref_typedef/TestPtrRef2Typedef.py (1856 of 1938) PASS: lldb-api :: commands/expression/radar_8638051/Test8638051.py (1857 of 1938) PASS: lldb-unit :: Process/minidump/./LLDBMinidumpTests/MinidumpParserTest.GetPidWindows (1858 of 1938) PASS: lldb-unit :: Utility/./UtilityTests/ArchSpecTest.MergeFrom (1859 of 1938) PASS: lldb-api :: functionalities/data-formatter/data-formatter-categories/TestDataFormatterCategories.py (1860 of 1938) PASS: lldb-api :: types/TestRecursiveTypes.py (1861 of 1938) UNSUPPORTED: lldb-api :: tools/lldb-server/TestGdbRemoteAuxvSupport.py (1862 of 1938) PASS: lldb-unit :: Symbol/./SymbolTests/TestClangASTImporter.RecordLayout (1863 of 1938) UNSUPPORTED: lldb-api :: functionalities/thread/break_after_join/TestBreakAfterJoin.py (1864 of 1938) PASS: lldb-api :: commands/expression/import-std-module/list/TestListFromStdModule.py (1865 of 1938) PASS: lldb-unit :: UnwindAssembly/x86/./UnwindAssemblyx86Tests/Testx86AssemblyInspectionEngine.TestPopRBP (1866 of 1938) PASS: lldb-unit :: Utility/./UtilityTests/StreamTeeTest.Flush (1867 of 1938) PASS: lldb-unit :: Utility/./UtilityTests/StatusTest.ErrorConstructor (1868 of 1938) PASS: lldb-unit :: Utility/./UtilityTests/RecordReplayTest.InstrumentedBarPtr (1869 of 1938) PASS: lldb-api :: functionalities/thread/concurrent_events/TestConcurrentTwoBreakpointsOneDelaySignal.py (1870 of 1938) PASS: lldb-shell :: Commands/command-backtrace.test (1871 of 1938) PASS: lldb-api :: functionalities/inferior-crashing/recursive-inferior/TestRecursiveInferior.py (1872 of 1938) PASS: lldb-shell :: ObjectFile/ELF/avr-basic-info.yaml (1873 of 1938) PASS: lldb-shell :: ObjectFile/MachO/lc_build_version.yaml (1874 of 1938) PASS: lldb-api :: types/TestDoubleTypesExpr.py (1875 of 1938) PASS: lldb-api :: commands/expression/import-std-module/stack/TestStackFromStdModule.py (1876 of 1938) PASS: lldb-shell :: SymbolFile/DWARF/debug-types-dwo-cross-reference.cpp (1877 of 1938) PASS: lldb-unit :: Utility/./UtilityTests/StreamTest.PutMaxHex64ByteOrderBig (1878 of 1938) PASS: lldb-unit :: Utility/./UtilityTests/EnvironmentTest.EnvpConstruction (1879 of 1938) PASS: lldb-unit :: ScriptInterpreter/Python/./ScriptInterpreterPythonTests/PythonDataObjectsTest.TestPythonDictionaryToStructuredDictionary (1880 of 1938) PASS: lldb-api :: functionalities/data-formatter/nssetsynth/TestNSSetSynthetic.py (1881 of 1938) PASS: lldb-shell :: SymbolFile/DWARF/win-i386-line-table.s (1882 of 1938) PASS: lldb-shell :: SymbolFile/DWARF/find-inline-method.s (1883 of 1938) PASS: lldb-api :: lang/cpp/overloaded-functions/TestOverloadedFunctions.py (1884 of 1938) PASS: lldb-unit :: Utility/./UtilityTests/NameMatchesTest.Equals (1885 of 1938) PASS: lldb-unit :: SymbolFile/NativePDB/./SymbolFileNativePDBTests/PDBFPOProgramToDWARFExpressionTests.MultipleDependentAssignments (1886 of 1938) PASS: lldb-shell :: SymbolFile/DWARF/anon_class_w_and_wo_export_symbols.ll (1887 of 1938) PASS: lldb-unit :: Utility/./UtilityTests/StreamTest.PutStringAsRawHex8 (1888 of 1938) PASS: lldb-unit :: Utility/./UtilityTests/StreamTest.PutChar (1889 of 1938) PASS: lldb-shell :: SymbolFile/DWARF/find-method.cpp (1890 of 1938) PASS: lldb-unit :: Utility/./UtilityTests/RangeTest.Copy (1891 of 1938) PASS: lldb-shell :: Reproducer/TestFileRepro.test (1892 of 1938) PASS: lldb-api :: functionalities/thread/concurrent_events/TestConcurrentWatchpointDelayWatchpointOneBreakpoint.py (1893 of 1938) PASS: lldb-unit :: Utility/./UtilityTests/CompletionRequest.TryCompleteCurrentArgMode (1894 of 1938) PASS: lldb-api :: types/TestLongTypesExpr.py (1895 of 1938) PASS: lldb-unit :: Utility/./UtilityTests/StreamTest.AddressPrefix (1896 of 1938) PASS: lldb-api :: lang/cpp/virtual-overload/TestVirtualOverload.py (1897 of 1938) PASS: lldb-api :: lang/objc/hidden-ivars/TestHiddenIvars.py (1898 of 1938) PASS: lldb-unit :: Utility/./UtilityTests/LogChannelEnabledTest.LogThread (1899 of 1938) PASS: lldb-unit :: UnwindAssembly/x86/./UnwindAssemblyx86Tests/Testx86AssemblyInspectionEngine.Test32bitFramelessSmallStackFrame (1900 of 1938) PASS: lldb-api :: commands/expression/call-throws/TestCallThatThrows.py (1901 of 1938) PASS: lldb-unit :: ObjectFile/Breakpad/./ObjectFileBreakpadTests/LineRecord.parse (1902 of 1938) PASS: lldb-shell :: Driver/TestSingleQuote.test (1903 of 1938) PASS: lldb-shell :: Breakpoint/debug_addrx.test (1904 of 1938) PASS: lldb-api :: functionalities/ptr_refs/TestPtrRefs.py (1905 of 1938) PASS: lldb-api :: functionalities/data-formatter/data-formatter-named-summaries/TestDataFormatterNamedSummaries.py (1906 of 1938) PASS: lldb-api :: lang/objc/objc-checker/TestObjCCheckers.py (1907 of 1938) PASS: lldb-shell :: Settings/TestFrameFormatNoColor.test (1908 of 1938) PASS: lldb-unit :: ScriptInterpreter/Python/./ScriptInterpreterPythonTests/PythonDataObjectsTest.TestPythonListToStructuredList (1909 of 1938) PASS: lldb-shell :: Reproducer/TestWorkingDir.test (1910 of 1938) PASS: lldb-api :: commands/expression/import-std-module/queue/TestQueueFromStdModule.py (1911 of 1938) PASS: lldb-shell :: Reproducer/TestMultipleTargets.test (1912 of 1938) PASS: lldb-unit :: ScriptInterpreter/Python/./ScriptInterpreterPythonTests/PythonDataObjectsTest.TestPythonCallableInvoke (1913 of 1938) PASS: lldb-unit :: Utility/./UtilityTests/StringExtractorTest.GetU64LittleEndian (1914 of 1938) PASS: lldb-api :: macosx/load-kext/TestLoadKext.py (1915 of 1938) PASS: lldb-unit :: Utility/./UtilityTests/LogChannelEnabledTest.LogVerboseThread (1916 of 1938) PASS: lldb-unit :: Utility/./UtilityTests/StreamTest.SetIndentLevel (1917 of 1938) PASS: lldb-api :: functionalities/postmortem/netbsd-core/TestNetBSDCore.py (1918 of 1938) PASS: lldb-shell :: ObjectFile/PECOFF/symbol.yaml (1919 of 1938) PASS: lldb-api :: commands/gui/invalid-args/TestInvalidArgsGui.py (1920 of 1938) PASS: lldb-unit :: Utility/./UtilityTests/CompletionRequest.Constructor (1921 of 1938) PASS: lldb-unit :: UnwindAssembly/x86/./UnwindAssemblyx86Tests/Testx86AssemblyInspectionEngine.TestPushEDX (1922 of 1938) PASS: lldb-unit :: Utility/./UtilityTests/UriParserTest.LongPath (1923 of 1938) PASS: lldb-unit :: Process/gdb-remote/./ProcessGdbRemoteTests/GDBRemoteCommunicationClientTest.SendSignalsToIgnore (1924 of 1938) PASS: lldb-api :: functionalities/data-formatter/data-formatter-stl/libcxx/iterator/TestDataFormatterLibccIterator.py (1925 of 1938) PASS: lldb-unit :: Symbol/./SymbolTests/TestTypeSystemClang.TestGetEnumIntegerTypeInvalid (1926 of 1938) PASS: lldb-shell :: Expr/TestMultilineExpr.test (1927 of 1938) PASS: lldb-api :: functionalities/unwind/noreturn/module-end/TestNoReturnModuleEnd.py (1928 of 1938) PASS: lldb-unit :: Utility/./UtilityTests/StringListTest.ShiftStdString (1929 of 1938) PASS: lldb-unit :: Utility/./UtilityTests/CompletionRequest.TestCompletionOwnership (1930 of 1938) PASS: lldb-api :: lang/c/inlines/TestRedefinitionsInInlines.py (1931 of 1938) PASS: lldb-unit :: SymbolFile/NativePDB/./SymbolFileNativePDBTests/PDBFPOProgramToDWARFExpressionTests.MissingTargetRegister (1932 of 1938) PASS: lldb-unit :: Symbol/./SymbolTests/TestTypeSystemClang.TestConvertAccessTypeToAccessSpecifier (1933 of 1938) PASS: lldb-unit :: Utility/./UtilityTests/UUIDTest.StringConverion (1934 of 1938) PASS: lldb-shell :: Unwind/trap_frame_sym_ctx.test (1935 of 1938) PASS: lldb-api :: commands/expression/import-std-module/vector-bool/TestVectorBoolFromStdModule.py (1936 of 1938) UNSUPPORTED: lldb-api :: functionalities/thread/create_during_step/TestCreateDuringStep.py (1937 of 1938) PASS: lldb-api :: functionalities/data-formatter/compactvectors/TestCompactVectors.py (1938 of 1938)

Hide Details

Testing Time: 4251.77s ******************** Failing Tests (2): lldb-api :: functionalities/process_crash_info/TestProcessCrashInfo.py lldb-shell :: SymbolFile/DWARF/dwp.s

Hide Details

******************** Unresolved Tests (1): lldb-api :: functionalities/gdb_remote_client/TestWasm.py

Hide Details

Hide Details

Slowest Tests: -------------------------------------------------------------------------- 97.47s: lldb-api :: types/TestLongTypes.py 101.20s: lldb-api :: lang/objc/forward-decl/TestForwardDecl.py 104.73s: lldb-api :: lang/objcxx/class-name-clash/TestNameClash.py 106.71s: lldb-api :: python_api/lldbutil/iter/TestLLDBIterator.py 113.21s: lldb-api :: lang/objc/foundation/TestObjCMethodsNSError.py 113.56s: lldb-api :: lang/objc/objc-new-syntax/TestObjCNewSyntaxArray.py 113.61s: lldb-api :: lang/objc/foundation/TestObjCMethodsString.py 113.65s: lldb-api :: lang/objc/objc-new-syntax/TestObjCNewSyntaxDictionary.py 118.84s: lldb-api :: tools/lldb-server/TestGdbRemote_qThreadStopInfo.py 128.81s: lldb-api :: types/TestLongTypesExpr.py 137.46s: lldb-api :: lang/objc/exceptions/TestObjCExceptions.py 139.76s: lldb-api :: lang/objc/real-definition/TestRealDefinition.py 153.24s: lldb-api :: lang/objc/objc-new-syntax/TestObjCNewSyntaxLiteral.py 163.19s: lldb-api :: lang/cpp/namespace/TestNamespaceLookup.py 213.53s: lldb-api :: lang/objc/foundation/TestObjCMethods.py 219.20s: lldb-api :: lang/objc/hidden-ivars/TestHiddenIvars.py 247.32s: lldb-api :: tools/lldb-server/TestGdbRemoteThreadsInStopReply.py 247.48s: lldb-api :: api/multithreaded/TestMultithreaded.py 257.13s: lldb-api :: lang/cpp/enum_types/TestCPP11EnumTypes.py 366.33s: lldb-api :: tools/lldb-server/TestLldbGdbServer.py

Hide Details

Tests Times: -------------------------------------------------------------------------- [ Range ] :: [ Percentage ] :: [ Count ] -------------------------------------------------------------------------- [ 0s, 20s) :: [********************************** ] :: [1691/1938] [ 20s, 40s) :: [** ] :: [ 122/1938] [ 40s, 60s) :: [* ] :: [ 76/1938] [ 60s, 80s) :: [ ] :: [ 25/1938] [ 80s,100s) :: [ ] :: [ 4/1938] [100s,120s) :: [ ] :: [ 8/1938] [120s,140s) :: [ ] :: [ 2/1938] [140s,160s) :: [ ] :: [ 3/1938] [160s,180s) :: [ ] :: [ 1/1938] [180s,200s) :: [ ] :: [ 0/1938] [200s,220s) :: [ ] :: [ 0/1938] [220s,240s) :: [ ] :: [ 2/1938] [240s,260s) :: [ ] :: [ 2/1938] [260s,280s) :: [ ] :: [ 1/1938] [280s,300s) :: [ ] :: [ 0/1938] [300s,320s) :: [ ] :: [ 0/1938] [320s,340s) :: [ ] :: [ 0/1938] [340s,360s) :: [ ] :: [ 0/1938] [360s,380s) :: [ ] :: [ 1/1938] Expected Passes : 1765 Expected Failures : 6 Unsupported Tests : 164 Unresolved Tests : 1 Unexpected Failures: 2 FAILED: tools/lldb/test/CMakeFiles/check-lldb-lit cd /Users/buildslave/jenkins/workspace/lldb-cmake-sanitized/lldb-build/tools/lldb/test && /usr/local/bin/python /Users/buildslave/jenkins/workspace/lldb-cmake-sanitized/lldb-build/./bin/llvm-lit -v --time-tests --shuffle --xunit-xml-output=/Users/buildslave/jenkins/workspace/lldb-cmake-sanitized/test/results.xml -v -j 4 --timeout 1200 /Users/buildslave/jenkins/workspace/lldb-cmake-sanitized/lldb-build/tools/lldb/test ninja: build stopped: subcommand failed. Command failed: Command '['/usr/bin/env', 'TERM=vt100', '/usr/local/bin/ninja', '-v', 'check-lldb']' returned non-zero exit status 1. Command: ['/usr/bin/env', 'TERM=vt100', '/usr/local/bin/ninja', '-v', 'check-lldb'] [Pipeline] } [Pipeline] // timeout [Pipeline] } [Pipeline] // stage [Pipeline] stage [Pipeline] { (Declarative: Post Actions) [Pipeline] scanForIssues No credentials specified [Clang (LLVM based)] Sleeping for 5 seconds due to JENKINS-32191... [Clang (LLVM based)] Parsing console log (workspace: '/Users/buildslave/jenkins/workspace/lldb-cmake-sanitized') [Clang (LLVM based)] [-ERROR-] Can't resolve absolute paths for some files: [Clang (LLVM based)] [-ERROR-] - /Users/buildslave/jenkins/workspace/lldb-cmake-sanitized/lldb-build/<instantiation> [Clang (LLVM based)] [-ERROR-] Can't create fingerprints for some files: [Clang (LLVM based)] [-ERROR-] - '/Users/buildslave/jenkins/workspace/lldb-cmake-sanitized/lldb-build/<instantiation>', IO exception has been thrown: java.nio.file.NoSuchFileException: /Users/buildslave/jenkins/workspace/lldb-cmake-sanitized/lldb-build/<instantiation> [Clang (LLVM based)] [-ERROR-] - '/Users/buildslave/jenkins/workspace/lldb-cmake-sanitized/lldb-build/<instantiation>', IO exception has been thrown: java.nio.file.NoSuchFileException: /Users/buildslave/jenkins/workspace/lldb-cmake-sanitized/lldb-build/<instantiation> [Clang (LLVM based)] [-ERROR-] - '/Users/buildslave/jenkins/workspace/lldb-cmake-sanitized/lldb-build/<instantiation>', IO exception has been thrown: java.nio.file.NoSuchFileException: /Users/buildslave/jenkins/workspace/lldb-cmake-sanitized/lldb-build/<instantiation> [Clang (LLVM based)] [-ERROR-] - '/Users/buildslave/jenkins/workspace/lldb-cmake-sanitized/lldb-build/<instantiation>', IO exception has been thrown: java.nio.file.NoSuchFileException: /Users/buildslave/jenkins/workspace/lldb-cmake-sanitized/lldb-build/<instantiation> [Clang (LLVM based)] [-ERROR-] - '/Users/buildslave/jenkins/workspace/lldb-cmake-sanitized/lldb-build/<instantiation>', IO exception has been thrown: java.nio.file.NoSuchFileException: /Users/buildslave/jenkins/workspace/lldb-cmake-sanitized/lldb-build/<instantiation> [Clang (LLVM based)] [-ERROR-] - '/Users/buildslave/jenkins/workspace/lldb-cmake-sanitized/lldb-build/<instantiation>', IO exception has been thrown: java.nio.file.NoSuchFileException: /Users/buildslave/jenkins/workspace/lldb-cmake-sanitized/lldb-build/<instantiation> [Clang (LLVM based)] [-ERROR-] - '/Users/buildslave/jenkins/workspace/lldb-cmake-sanitized/lldb-build/<instantiation>', IO exception has been thrown: java.nio.file.NoSuchFileException: /Users/buildslave/jenkins/workspace/lldb-cmake-sanitized/lldb-build/<instantiation> [Clang (LLVM based)] [-ERROR-] - '/Users/buildslave/jenkins/workspace/lldb-cmake-sanitized/lldb-build/<instantiation>', IO exception has been thrown: java.nio.file.NoSuchFileException: /Users/buildslave/jenkins/workspace/lldb-cmake-sanitized/lldb-build/<instantiation> [Clang (LLVM based)] [-ERROR-] Git blame errors: [Clang (LLVM based)] [-ERROR-] - no blame results for request <llvm-project/lldb/source/Plugins/Language/ObjC/NSDictionary.cpp - [726]>.

Hide Details

[Clang (LLVM based)] [-ERROR-] Git blame errors: [Clang (LLVM based)] [-ERROR-] - no blame results for request <lldb-build/<instantiation> - [1, 376, 251, 126]>.

Hide Details

[Clang (LLVM based)] [-ERROR-] Git blame errors: [Clang (LLVM based)] [-ERROR-] - no blame results for request <llvm-project/lldb/source/Plugins/Language/ObjC/NSSet.cpp - [516]>.

Hide Details

[Clang (LLVM based)] [-ERROR-] Git blame errors: [Clang (LLVM based)] [-ERROR-] - no blame results for request <llvm-project/lldb/source/Plugins/Language/ObjC/NSArray.cpp - [530, 597]>.

Hide Details

[Clang (LLVM based)] Post processing issues on 'green-dragon-23' with source code encoding 'UTF-8' [Clang (LLVM based)] Resolving absolute file names for all issues in workspace '/Users/buildslave/jenkins/workspace/lldb-cmake-sanitized' [Clang (LLVM based)] -> 0 resolved, 1 unresolved, 3 already resolved [Clang (LLVM based)] Copying affected files to Jenkins' build folder '/Users/Shared/Jenkins/Home/jobs/lldb-cmake-sanitized/builds/975/files-with-issues' [Clang (LLVM based)] -> 3 copied, 0 not in workspace, 1 not-found, 0 with I/O error [Clang (LLVM based)] Resolving module names from module definitions (build.xml, pom.xml, or Manifest.mf files) [Clang (LLVM based)] -> resolved module names for 12 issues [Clang (LLVM based)] Resolving package names (or namespaces) by parsing the affected files [Clang (LLVM based)] -> resolved package names of 4 affected files [Clang (LLVM based)] No filter has been set, publishing all 12 issues [Clang (LLVM based)] Creating fingerprints for all affected code blocks to track issues over different builds [Clang (LLVM based)] -> created fingerprints for 4 issues [Clang (LLVM based)] Invoking Git blamer to create author and commit information for all affected files [Clang (LLVM based)] GIT_COMMIT env = 'HEAD' [Clang (LLVM based)] Git working tree = '/Users/buildslave/jenkins/workspace/lldb-cmake-sanitized' [Clang (LLVM based)] Git commit ID = '3a4296e9c1cdb53e0bf939b244790d257a6d5f26' [Clang (LLVM based)] Job workspace = '/Users/buildslave/jenkins/workspace/lldb-cmake-sanitized' [Clang (LLVM based)] Created blame requests for 4 files - invoking Git blame on agent for each of the requests [Clang (LLVM based)] -> blamed authors of issues in 4 files
[Pipeline] junit Recording test results [Pipeline] } [Pipeline] // stage [Pipeline] } [Pipeline] // withEnv [Pipeline] } > git rev-parse HEAD^{commit} # timeout=10 [Pipeline] // node [Pipeline] End of Pipeline ERROR: script returned exit code 1 Finished: FAILURE