FailedConsole Output

Skipping 18,445 KB.. Full Log
/test-mr-clang-stage1-RA/clang-build/tools/clang/runtime/compiler-rt-bins/test/fuzzer/X86_64DefaultDarwinConfig/Output/merge.test.tmp/T0/1
: 'RUN: at line 8';   echo .U.... > /Users/buildslave/jenkins/workspace/test-mr-clang-stage1-RA/clang-build/tools/clang/runtime/compiler-rt-bins/test/fuzzer/X86_64DefaultDarwinConfig/Output/merge.test.tmp/T0/2
: 'RUN: at line 9';   echo ..Z... > /Users/buildslave/jenkins/workspace/test-mr-clang-stage1-RA/clang-build/tools/clang/runtime/compiler-rt-bins/test/fuzzer/X86_64DefaultDarwinConfig/Output/merge.test.tmp/T0/3
: 'RUN: at line 12';   cp /Users/buildslave/jenkins/workspace/test-mr-clang-stage1-RA/clang-build/tools/clang/runtime/compiler-rt-bins/test/fuzzer/X86_64DefaultDarwinConfig/Output/merge.test.tmp/T0/* /Users/buildslave/jenkins/workspace/test-mr-clang-stage1-RA/clang-build/tools/clang/runtime/compiler-rt-bins/test/fuzzer/X86_64DefaultDarwinConfig/Output/merge.test.tmp/T1/
: 'RUN: at line 13';    /Users/buildslave/jenkins/workspace/test-mr-clang-stage1-RA/clang-build/tools/clang/runtime/compiler-rt-bins/test/fuzzer/X86_64DefaultDarwinConfig/Output/merge.test.tmp-FullCoverageSetTest         -merge=1 /Users/buildslave/jenkins/workspace/test-mr-clang-stage1-RA/clang-build/tools/clang/runtime/compiler-rt-bins/test/fuzzer/X86_64DefaultDarwinConfig/Output/merge.test.tmp/T1 /Users/buildslave/jenkins/workspace/test-mr-clang-stage1-RA/clang-build/tools/clang/runtime/compiler-rt-bins/test/fuzzer/X86_64DefaultDarwinConfig/Output/merge.test.tmp/T2 2>&1 | FileCheck /Users/buildslave/jenkins/workspace/test-mr-clang-stage1-RA/llvm/projects/compiler-rt/test/fuzzer/merge.test --check-prefix=CHECK1
: 'RUN: at line 17';   echo ...Z.. > /Users/buildslave/jenkins/workspace/test-mr-clang-stage1-RA/clang-build/tools/clang/runtime/compiler-rt-bins/test/fuzzer/X86_64DefaultDarwinConfig/Output/merge.test.tmp/T2/1
: 'RUN: at line 18';   echo ....E. > /Users/buildslave/jenkins/workspace/test-mr-clang-stage1-RA/clang-build/tools/clang/runtime/compiler-rt-bins/test/fuzzer/X86_64DefaultDarwinConfig/Output/merge.test.tmp/T2/2
: 'RUN: at line 19';   echo .....R > /Users/buildslave/jenkins/workspace/test-mr-clang-stage1-RA/clang-build/tools/clang/runtime/compiler-rt-bins/test/fuzzer/X86_64DefaultDarwinConfig/Output/merge.test.tmp/T2/3
: 'RUN: at line 20';   echo F..... > /Users/buildslave/jenkins/workspace/test-mr-clang-stage1-RA/clang-build/tools/clang/runtime/compiler-rt-bins/test/fuzzer/X86_64DefaultDarwinConfig/Output/merge.test.tmp/T2/a
: 'RUN: at line 21';   echo .U.... > /Users/buildslave/jenkins/workspace/test-mr-clang-stage1-RA/clang-build/tools/clang/runtime/compiler-rt-bins/test/fuzzer/X86_64DefaultDarwinConfig/Output/merge.test.tmp/T2/b
: 'RUN: at line 22';   echo ..Z... > /Users/buildslave/jenkins/workspace/test-mr-clang-stage1-RA/clang-build/tools/clang/runtime/compiler-rt-bins/test/fuzzer/X86_64DefaultDarwinConfig/Output/merge.test.tmp/T2/c
: 'RUN: at line 25';    /Users/buildslave/jenkins/workspace/test-mr-clang-stage1-RA/clang-build/tools/clang/runtime/compiler-rt-bins/test/fuzzer/X86_64DefaultDarwinConfig/Output/merge.test.tmp-FullCoverageSetTest         -merge=1 /Users/buildslave/jenkins/workspace/test-mr-clang-stage1-RA/clang-build/tools/clang/runtime/compiler-rt-bins/test/fuzzer/X86_64DefaultDarwinConfig/Output/merge.test.tmp/T1 /Users/buildslave/jenkins/workspace/test-mr-clang-stage1-RA/clang-build/tools/clang/runtime/compiler-rt-bins/test/fuzzer/X86_64DefaultDarwinConfig/Output/merge.test.tmp/T2 2>&1 | FileCheck /Users/buildslave/jenkins/workspace/test-mr-clang-stage1-RA/llvm/projects/compiler-rt/test/fuzzer/merge.test --check-prefix=CHECK2
: 'RUN: at line 30';    /Users/buildslave/jenkins/workspace/test-mr-clang-stage1-RA/clang-build/tools/clang/runtime/compiler-rt-bins/test/fuzzer/X86_64DefaultDarwinConfig/Output/merge.test.tmp-FullCoverageSetTest         -merge=1 /Users/buildslave/jenkins/workspace/test-mr-clang-stage1-RA/clang-build/tools/clang/runtime/compiler-rt-bins/test/fuzzer/X86_64DefaultDarwinConfig/Output/merge.test.tmp/T1 /Users/buildslave/jenkins/workspace/test-mr-clang-stage1-RA/clang-build/tools/clang/runtime/compiler-rt-bins/test/fuzzer/X86_64DefaultDarwinConfig/Output/merge.test.tmp/T2 2>&1 | FileCheck /Users/buildslave/jenkins/workspace/test-mr-clang-stage1-RA/llvm/projects/compiler-rt/test/fuzzer/merge.test --check-prefix=CHECK3
: 'RUN: at line 35';   rm /Users/buildslave/jenkins/workspace/test-mr-clang-stage1-RA/clang-build/tools/clang/runtime/compiler-rt-bins/test/fuzzer/X86_64DefaultDarwinConfig/Output/merge.test.tmp/T1/*
: 'RUN: at line 36';   cp /Users/buildslave/jenkins/workspace/test-mr-clang-stage1-RA/clang-build/tools/clang/runtime/compiler-rt-bins/test/fuzzer/X86_64DefaultDarwinConfig/Output/merge.test.tmp/T0/* /Users/buildslave/jenkins/workspace/test-mr-clang-stage1-RA/clang-build/tools/clang/runtime/compiler-rt-bins/test/fuzzer/X86_64DefaultDarwinConfig/Output/merge.test.tmp/T1/
: 'RUN: at line 37';   echo looooooooong > /Users/buildslave/jenkins/workspace/test-mr-clang-stage1-RA/clang-build/tools/clang/runtime/compiler-rt-bins/test/fuzzer/X86_64DefaultDarwinConfig/Output/merge.test.tmp/T2/looooooooong
: 'RUN: at line 38';    /Users/buildslave/jenkins/workspace/test-mr-clang-stage1-RA/clang-build/tools/clang/runtime/compiler-rt-bins/test/fuzzer/X86_64DefaultDarwinConfig/Output/merge.test.tmp-FullCoverageSetTest         -merge=1 /Users/buildslave/jenkins/workspace/test-mr-clang-stage1-RA/clang-build/tools/clang/runtime/compiler-rt-bins/test/fuzzer/X86_64DefaultDarwinConfig/Output/merge.test.tmp/T1 /Users/buildslave/jenkins/workspace/test-mr-clang-stage1-RA/clang-build/tools/clang/runtime/compiler-rt-bins/test/fuzzer/X86_64DefaultDarwinConfig/Output/merge.test.tmp/T2 -max_len=6 2>&1 | FileCheck /Users/buildslave/jenkins/workspace/test-mr-clang-stage1-RA/llvm/projects/compiler-rt/test/fuzzer/merge.test --check-prefix=MAX_LEN
: 'RUN: at line 42';   rm /Users/buildslave/jenkins/workspace/test-mr-clang-stage1-RA/clang-build/tools/clang/runtime/compiler-rt-bins/test/fuzzer/X86_64DefaultDarwinConfig/Output/merge.test.tmp/T1/*
: 'RUN: at line 43';   cp /Users/buildslave/jenkins/workspace/test-mr-clang-stage1-RA/clang-build/tools/clang/runtime/compiler-rt-bins/test/fuzzer/X86_64DefaultDarwinConfig/Output/merge.test.tmp/T0/* /Users/buildslave/jenkins/workspace/test-mr-clang-stage1-RA/clang-build/tools/clang/runtime/compiler-rt-bins/test/fuzzer/X86_64DefaultDarwinConfig/Output/merge.test.tmp/T1/
: 'RUN: at line 44';   rm -f /Users/buildslave/jenkins/workspace/test-mr-clang-stage1-RA/clang-build/tools/clang/runtime/compiler-rt-bins/test/fuzzer/X86_64DefaultDarwinConfig/Output/merge.test.tmp/MCF
: 'RUN: at line 45';    /Users/buildslave/jenkins/workspace/test-mr-clang-stage1-RA/clang-build/tools/clang/runtime/compiler-rt-bins/test/fuzzer/X86_64DefaultDarwinConfig/Output/merge.test.tmp-FullCoverageSetTest -merge=1 -merge_control_file=/Users/buildslave/jenkins/workspace/test-mr-clang-stage1-RA/clang-build/tools/clang/runtime/compiler-rt-bins/test/fuzzer/X86_64DefaultDarwinConfig/Output/merge.test.tmp/MCF /Users/buildslave/jenkins/workspace/test-mr-clang-stage1-RA/clang-build/tools/clang/runtime/compiler-rt-bins/test/fuzzer/X86_64DefaultDarwinConfig/Output/merge.test.tmp/T1 /Users/buildslave/jenkins/workspace/test-mr-clang-stage1-RA/clang-build/tools/clang/runtime/compiler-rt-bins/test/fuzzer/X86_64DefaultDarwinConfig/Output/merge.test.tmp/T2 2>&1 | FileCheck /Users/buildslave/jenkins/workspace/test-mr-clang-stage1-RA/llvm/projects/compiler-rt/test/fuzzer/merge.test --check-prefix=MCF
: 'RUN: at line 46';   grep STARTED /Users/buildslave/jenkins/workspace/test-mr-clang-stage1-RA/clang-build/tools/clang/runtime/compiler-rt-bins/test/fuzzer/X86_64DefaultDarwinConfig/Output/merge.test.tmp/MCF
: 'RUN: at line 47';   grep FT /Users/buildslave/jenkins/workspace/test-mr-clang-stage1-RA/clang-build/tools/clang/runtime/compiler-rt-bins/test/fuzzer/X86_64DefaultDarwinConfig/Output/merge.test.tmp/MCF
: 'RUN: at line 53';   rm /Users/buildslave/jenkins/workspace/test-mr-clang-stage1-RA/clang-build/tools/clang/runtime/compiler-rt-bins/test/fuzzer/X86_64DefaultDarwinConfig/Output/merge.test.tmp/T1/*
: 'RUN: at line 54';   cp /Users/buildslave/jenkins/workspace/test-mr-clang-stage1-RA/clang-build/tools/clang/runtime/compiler-rt-bins/test/fuzzer/X86_64DefaultDarwinConfig/Output/merge.test.tmp/T0/* /Users/buildslave/jenkins/workspace/test-mr-clang-stage1-RA/clang-build/tools/clang/runtime/compiler-rt-bins/test/fuzzer/X86_64DefaultDarwinConfig/Output/merge.test.tmp/T1/
: 'RUN: at line 55';   echo 'FUZZER' > /Users/buildslave/jenkins/workspace/test-mr-clang-stage1-RA/clang-build/tools/clang/runtime/compiler-rt-bins/test/fuzzer/X86_64DefaultDarwinConfig/Output/merge.test.tmp/T2/FUZZER
: 'RUN: at line 56';    /Users/buildslave/jenkins/workspace/test-mr-clang-stage1-RA/clang-build/tools/clang/runtime/compiler-rt-bins/test/fuzzer/X86_64DefaultDarwinConfig/Output/merge.test.tmp-FullCoverageSetTest -merge=1 /Users/buildslave/jenkins/workspace/test-mr-clang-stage1-RA/clang-build/tools/clang/runtime/compiler-rt-bins/test/fuzzer/X86_64DefaultDarwinConfig/Output/merge.test.tmp/T1 /Users/buildslave/jenkins/workspace/test-mr-clang-stage1-RA/clang-build/tools/clang/runtime/compiler-rt-bins/test/fuzzer/X86_64DefaultDarwinConfig/Output/merge.test.tmp/T2 2>&1 | FileCheck /Users/buildslave/jenkins/workspace/test-mr-clang-stage1-RA/llvm/projects/compiler-rt/test/fuzzer/merge.test --check-prefix=MERGE_WITH_CRASH
: 'RUN: at line 61';   rm /Users/buildslave/jenkins/workspace/test-mr-clang-stage1-RA/clang-build/tools/clang/runtime/compiler-rt-bins/test/fuzzer/X86_64DefaultDarwinConfig/Output/merge.test.tmp/T1/* /Users/buildslave/jenkins/workspace/test-mr-clang-stage1-RA/clang-build/tools/clang/runtime/compiler-rt-bins/test/fuzzer/X86_64DefaultDarwinConfig/Output/merge.test.tmp/T2/*
: 'RUN: at line 62';   echo 'FUZZER' > /Users/buildslave/jenkins/workspace/test-mr-clang-stage1-RA/clang-build/tools/clang/runtime/compiler-rt-bins/test/fuzzer/X86_64DefaultDarwinConfig/Output/merge.test.tmp/T2/FUZZER
: 'RUN: at line 63';    /Users/buildslave/jenkins/workspace/test-mr-clang-stage1-RA/clang-build/tools/clang/runtime/compiler-rt-bins/test/fuzzer/X86_64DefaultDarwinConfig/Output/merge.test.tmp-FullCoverageSetTest -merge=1 /Users/buildslave/jenkins/workspace/test-mr-clang-stage1-RA/clang-build/tools/clang/runtime/compiler-rt-bins/test/fuzzer/X86_64DefaultDarwinConfig/Output/merge.test.tmp/T1 /Users/buildslave/jenkins/workspace/test-mr-clang-stage1-RA/clang-build/tools/clang/runtime/compiler-rt-bins/test/fuzzer/X86_64DefaultDarwinConfig/Output/merge.test.tmp/T2  -max_len=5 2>&1 | FileCheck /Users/buildslave/jenkins/workspace/test-mr-clang-stage1-RA/llvm/projects/compiler-rt/test/fuzzer/merge.test --check-prefix=MERGE_LEN5
: 'RUN: at line 64';   not grep FUZZER /Users/buildslave/jenkins/workspace/test-mr-clang-stage1-RA/clang-build/tools/clang/runtime/compiler-rt-bins/test/fuzzer/X86_64DefaultDarwinConfig/Output/merge.test.tmp/T1/*
: 'RUN: at line 65';   grep FUZZE /Users/buildslave/jenkins/workspace/test-mr-clang-stage1-RA/clang-build/tools/clang/runtime/compiler-rt-bins/test/fuzzer/X86_64DefaultDarwinConfig/Output/merge.test.tmp/T1/*
--
Exit Code: 137

Hide Details

Command Output (stderr): -- /Users/buildslave/jenkins/workspace/test-mr-clang-stage1-RA/clang-build/tools/clang/runtime/compiler-rt-bins/test/fuzzer/X86_64DefaultDarwinConfig/Output/merge.test.script: line 35: 22115 Done /Users/buildslave/jenkins/workspace/test-mr-clang-stage1-RA/clang-build/tools/clang/runtime/compiler-rt-bins/test/fuzzer/X86_64DefaultDarwinConfig/Output/merge.test.tmp-FullCoverageSetTest -merge=1 /Users/buildslave/jenkins/workspace/test-mr-clang-stage1-RA/clang-build/tools/clang/runtime/compiler-rt-bins/test/fuzzer/X86_64DefaultDarwinConfig/Output/merge.test.tmp/T1 /Users/buildslave/jenkins/workspace/test-mr-clang-stage1-RA/clang-build/tools/clang/runtime/compiler-rt-bins/test/fuzzer/X86_64DefaultDarwinConfig/Output/merge.test.tmp/T2 2>&1 22116 Killed: 9 | FileCheck /Users/buildslave/jenkins/workspace/test-mr-clang-stage1-RA/llvm/projects/compiler-rt/test/fuzzer/merge.test --check-prefix=CHECK1

Hide Details

--

Hide Details

******************** UNSUPPORTED: libFuzzer :: msan-param-unpoison.test (2621 of 2668) UNSUPPORTED: libFuzzer :: msan.test (2622 of 2668) FAIL: libFuzzer :: minimize_crash.test (2623 of 2668) ******************** TEST 'libFuzzer :: minimize_crash.test' FAILED ******************** Script: -- : 'RUN: at line 1'; /Users/buildslave/jenkins/workspace/test-mr-clang-stage1-RA/clang-build/./bin/clang --driver-mode=g++ -O2 -gline-tables-only -fsanitize=address,fuzzer -I/Users/buildslave/jenkins/workspace/test-mr-clang-stage1-RA/llvm/projects/compiler-rt/lib/fuzzer -arch x86_64 -stdlib=libc++ -mmacosx-version-min=10.9 -isysroot /Applications/Xcode.app/Contents/Developer/Platforms/MacOSX.platform/Developer/SDKs/MacOSX10.14.sdk /Users/buildslave/jenkins/workspace/test-mr-clang-stage1-RA/llvm/projects/compiler-rt/test/fuzzer/NullDerefTest.cpp -o /Users/buildslave/jenkins/workspace/test-mr-clang-stage1-RA/clang-build/tools/clang/runtime/compiler-rt-bins/test/fuzzer/X86_64DefaultDarwinConfig/Output/minimize_crash.test.tmp-NullDerefTest : 'RUN: at line 2'; /Users/buildslave/jenkins/workspace/test-mr-clang-stage1-RA/clang-build/./bin/clang --driver-mode=g++ -O2 -gline-tables-only -fsanitize=address,fuzzer -I/Users/buildslave/jenkins/workspace/test-mr-clang-stage1-RA/llvm/projects/compiler-rt/lib/fuzzer -arch x86_64 -stdlib=libc++ -mmacosx-version-min=10.9 -isysroot /Applications/Xcode.app/Contents/Developer/Platforms/MacOSX.platform/Developer/SDKs/MacOSX10.14.sdk /Users/buildslave/jenkins/workspace/test-mr-clang-stage1-RA/llvm/projects/compiler-rt/test/fuzzer/SingleByteInputTest.cpp -o /Users/buildslave/jenkins/workspace/test-mr-clang-stage1-RA/clang-build/tools/clang/runtime/compiler-rt-bins/test/fuzzer/X86_64DefaultDarwinConfig/Output/minimize_crash.test.tmp-SingleByteInputTest : 'RUN: at line 3'; mkdir -p /Users/buildslave/jenkins/workspace/test-mr-clang-stage1-RA/clang-build/tools/clang/runtime/compiler-rt-bins/test/fuzzer/X86_64DefaultDarwinConfig/Output/minimize_crash.test.tmp.dir : 'RUN: at line 5'; echo 'Hi!rv349f34t3gg' > /Users/buildslave/jenkins/workspace/test-mr-clang-stage1-RA/clang-build/tools/clang/runtime/compiler-rt-bins/test/fuzzer/X86_64DefaultDarwinConfig/Output/minimize_crash.test.tmp.dir/not_minimal_crash : 'RUN: at line 6'; /Users/buildslave/jenkins/workspace/test-mr-clang-stage1-RA/clang-build/tools/clang/runtime/compiler-rt-bins/test/fuzzer/X86_64DefaultDarwinConfig/Output/minimize_crash.test.tmp-NullDerefTest -minimize_crash=1 /Users/buildslave/jenkins/workspace/test-mr-clang-stage1-RA/clang-build/tools/clang/runtime/compiler-rt-bins/test/fuzzer/X86_64DefaultDarwinConfig/Output/minimize_crash.test.tmp.dir/not_minimal_crash -max_total_time=2 2>&1 | FileCheck /Users/buildslave/jenkins/workspace/test-mr-clang-stage1-RA/llvm/projects/compiler-rt/test/fuzzer/minimize_crash.test : 'RUN: at line 8'; /Users/buildslave/jenkins/workspace/test-mr-clang-stage1-RA/clang-build/tools/clang/runtime/compiler-rt-bins/test/fuzzer/X86_64DefaultDarwinConfig/Output/minimize_crash.test.tmp-NullDerefTest -minimize_crash=1 /Users/buildslave/jenkins/workspace/test-mr-clang-stage1-RA/clang-build/tools/clang/runtime/compiler-rt-bins/test/fuzzer/X86_64DefaultDarwinConfig/Output/minimize_crash.test.tmp.dir/not_minimal_crash -max_total_time=2 -exact_artifact_path=/Users/buildslave/jenkins/workspace/test-mr-clang-stage1-RA/clang-build/tools/clang/runtime/compiler-rt-bins/test/fuzzer/X86_64DefaultDarwinConfig/Output/minimize_crash.test.tmp.exact_minimized_path 2>&1 | FileCheck /Users/buildslave/jenkins/workspace/test-mr-clang-stage1-RA/llvm/projects/compiler-rt/test/fuzzer/minimize_crash.test --check-prefix=CHECK_EXACT : 'RUN: at line 10'; rm /Users/buildslave/jenkins/workspace/test-mr-clang-stage1-RA/clang-build/tools/clang/runtime/compiler-rt-bins/test/fuzzer/X86_64DefaultDarwinConfig/Output/minimize_crash.test.tmp.dir/not_minimal_crash /Users/buildslave/jenkins/workspace/test-mr-clang-stage1-RA/clang-build/tools/clang/runtime/compiler-rt-bins/test/fuzzer/X86_64DefaultDarwinConfig/Output/minimize_crash.test.tmp.exact_minimized_path : 'RUN: at line 12'; echo -n 'abcd*xyz' > /Users/buildslave/jenkins/workspace/test-mr-clang-stage1-RA/clang-build/tools/clang/runtime/compiler-rt-bins/test/fuzzer/X86_64DefaultDarwinConfig/Output/minimize_crash.test.tmp.dir/not_minimal_crash : 'RUN: at line 13'; /Users/buildslave/jenkins/workspace/test-mr-clang-stage1-RA/clang-build/tools/clang/runtime/compiler-rt-bins/test/fuzzer/X86_64DefaultDarwinConfig/Output/minimize_crash.test.tmp-SingleByteInputTest -minimize_crash=1 /Users/buildslave/jenkins/workspace/test-mr-clang-stage1-RA/clang-build/tools/clang/runtime/compiler-rt-bins/test/fuzzer/X86_64DefaultDarwinConfig/Output/minimize_crash.test.tmp.dir/not_minimal_crash -exact_artifact_path=/Users/buildslave/jenkins/workspace/test-mr-clang-stage1-RA/clang-build/tools/clang/runtime/compiler-rt-bins/test/fuzzer/X86_64DefaultDarwinConfig/Output/minimize_crash.test.tmp.exact_minimized_path 2>&1 | FileCheck /Users/buildslave/jenkins/workspace/test-mr-clang-stage1-RA/llvm/projects/compiler-rt/test/fuzzer/minimize_crash.test --check-prefix=MIN1 -- Exit Code: 254

Hide Details

Command Output (stderr): -- clang-10: error: unable to execute command: Killed: 9 clang-10: error: dsymutil command failed due to signal (use -v to see invocation)

Hide Details

--

Hide Details

******************** FAIL: libFuzzer :: not-instrumented.test (2624 of 2668) ******************** TEST 'libFuzzer :: not-instrumented.test' FAILED ******************** Script: -- : 'RUN: at line 1'; /Users/buildslave/jenkins/workspace/test-mr-clang-stage1-RA/clang-build/./bin/clang --driver-mode=g++ -O2 -gline-tables-only -fsanitize=address,fuzzer -I/Users/buildslave/jenkins/workspace/test-mr-clang-stage1-RA/llvm/projects/compiler-rt/lib/fuzzer -arch x86_64 -stdlib=libc++ -mmacosx-version-min=10.9 -isysroot /Applications/Xcode.app/Contents/Developer/Platforms/MacOSX.platform/Developer/SDKs/MacOSX10.14.sdk /Users/buildslave/jenkins/workspace/test-mr-clang-stage1-RA/llvm/projects/compiler-rt/test/fuzzer/NotinstrumentedTest.cpp -fsanitize-coverage=0 -o /Users/buildslave/jenkins/workspace/test-mr-clang-stage1-RA/clang-build/tools/clang/runtime/compiler-rt-bins/test/fuzzer/X86_64DefaultDarwinConfig/Output/not-instrumented.test.tmp-NotinstrumentedTest-NoCoverage : 'RUN: at line 2'; not /Users/buildslave/jenkins/workspace/test-mr-clang-stage1-RA/clang-build/tools/clang/runtime/compiler-rt-bins/test/fuzzer/X86_64DefaultDarwinConfig/Output/not-instrumented.test.tmp-NotinstrumentedTest-NoCoverage 2>&1 | FileCheck /Users/buildslave/jenkins/workspace/test-mr-clang-stage1-RA/llvm/projects/compiler-rt/test/fuzzer/not-instrumented.test --check-prefix=NO_COVERAGE -- Exit Code: 137

Hide Details

Command Output (stderr): -- /Users/buildslave/jenkins/workspace/test-mr-clang-stage1-RA/clang-build/tools/clang/runtime/compiler-rt-bins/test/fuzzer/X86_64DefaultDarwinConfig/Output/not-instrumented.test.script: line 2: 22134 Done not /Users/buildslave/jenkins/workspace/test-mr-clang-stage1-RA/clang-build/tools/clang/runtime/compiler-rt-bins/test/fuzzer/X86_64DefaultDarwinConfig/Output/not-instrumented.test.tmp-NotinstrumentedTest-NoCoverage 2>&1 22135 Killed: 9 | FileCheck /Users/buildslave/jenkins/workspace/test-mr-clang-stage1-RA/llvm/projects/compiler-rt/test/fuzzer/not-instrumented.test --check-prefix=NO_COVERAGE

Hide Details

--

Hide Details

******************** FAIL: libFuzzer :: null-deref.test (2625 of 2668) ******************** TEST 'libFuzzer :: null-deref.test' FAILED ******************** Script: -- : 'RUN: at line 1'; /Users/buildslave/jenkins/workspace/test-mr-clang-stage1-RA/clang-build/./bin/clang --driver-mode=g++ -O2 -gline-tables-only -fsanitize=address,fuzzer -I/Users/buildslave/jenkins/workspace/test-mr-clang-stage1-RA/llvm/projects/compiler-rt/lib/fuzzer -arch x86_64 -stdlib=libc++ -mmacosx-version-min=10.9 -isysroot /Applications/Xcode.app/Contents/Developer/Platforms/MacOSX.platform/Developer/SDKs/MacOSX10.14.sdk /Users/buildslave/jenkins/workspace/test-mr-clang-stage1-RA/llvm/projects/compiler-rt/test/fuzzer/NullDerefTest.cpp -o /Users/buildslave/jenkins/workspace/test-mr-clang-stage1-RA/clang-build/tools/clang/runtime/compiler-rt-bins/test/fuzzer/X86_64DefaultDarwinConfig/Output/null-deref.test.tmp-NullDerefTest : 'RUN: at line 3'; not /Users/buildslave/jenkins/workspace/test-mr-clang-stage1-RA/clang-build/tools/clang/runtime/compiler-rt-bins/test/fuzzer/X86_64DefaultDarwinConfig/Output/null-deref.test.tmp-NullDerefTest 2>&1 | FileCheck /Users/buildslave/jenkins/workspace/test-mr-clang-stage1-RA/llvm/projects/compiler-rt/test/fuzzer/null-deref.test --check-prefix=NullDerefTest : 'RUN: at line 4'; not /Users/buildslave/jenkins/workspace/test-mr-clang-stage1-RA/clang-build/tools/clang/runtime/compiler-rt-bins/test/fuzzer/X86_64DefaultDarwinConfig/Output/null-deref.test.tmp-NullDerefTest -close_fd_mask=3 2>&1 | FileCheck /Users/buildslave/jenkins/workspace/test-mr-clang-stage1-RA/llvm/projects/compiler-rt/test/fuzzer/null-deref.test --check-prefix=NullDerefTest : 'RUN: at line 7'; not /Users/buildslave/jenkins/workspace/test-mr-clang-stage1-RA/clang-build/tools/clang/runtime/compiler-rt-bins/test/fuzzer/X86_64DefaultDarwinConfig/Output/null-deref.test.tmp-NullDerefTest -artifact_prefix=ZZZ 2>&1 | FileCheck /Users/buildslave/jenkins/workspace/test-mr-clang-stage1-RA/llvm/projects/compiler-rt/test/fuzzer/null-deref.test --check-prefix=NullDerefTestPrefix : 'RUN: at line 9'; not /Users/buildslave/jenkins/workspace/test-mr-clang-stage1-RA/clang-build/tools/clang/runtime/compiler-rt-bins/test/fuzzer/X86_64DefaultDarwinConfig/Output/null-deref.test.tmp-NullDerefTest -artifact_prefix=ZZZ -exact_artifact_path=FOOBAR 2>&1 | FileCheck /Users/buildslave/jenkins/workspace/test-mr-clang-stage1-RA/llvm/projects/compiler-rt/test/fuzzer/null-deref.test --check-prefix=NullDerefTestExactPath -- Exit Code: 137

Hide Details

Command Output (stderr): -- /Users/buildslave/jenkins/workspace/test-mr-clang-stage1-RA/clang-build/tools/clang/runtime/compiler-rt-bins/test/fuzzer/X86_64DefaultDarwinConfig/Output/null-deref.test.script: line 5: 22142 Done not /Users/buildslave/jenkins/workspace/test-mr-clang-stage1-RA/clang-build/tools/clang/runtime/compiler-rt-bins/test/fuzzer/X86_64DefaultDarwinConfig/Output/null-deref.test.tmp-NullDerefTest 2>&1 22143 Killed: 9 | FileCheck /Users/buildslave/jenkins/workspace/test-mr-clang-stage1-RA/llvm/projects/compiler-rt/test/fuzzer/null-deref.test --check-prefix=NullDerefTest

Hide Details

--

Hide Details

******************** UNSUPPORTED: libFuzzer :: only-some-bytes-fork.test (2626 of 2668) UNSUPPORTED: libFuzzer :: only-some-bytes.test (2627 of 2668) FAIL: libFuzzer :: minimize_two_crashes.test (2628 of 2668) ******************** TEST 'libFuzzer :: minimize_two_crashes.test' FAILED ******************** Script: -- : 'RUN: at line 5'; /Users/buildslave/jenkins/workspace/test-mr-clang-stage1-RA/clang-build/./bin/clang --driver-mode=g++ -O2 -gline-tables-only -fsanitize=address,fuzzer -I/Users/buildslave/jenkins/workspace/test-mr-clang-stage1-RA/llvm/projects/compiler-rt/lib/fuzzer -arch x86_64 -stdlib=libc++ -mmacosx-version-min=10.9 -isysroot /Applications/Xcode.app/Contents/Developer/Platforms/MacOSX.platform/Developer/SDKs/MacOSX10.14.sdk -O0 /Users/buildslave/jenkins/workspace/test-mr-clang-stage1-RA/llvm/projects/compiler-rt/test/fuzzer/TwoDifferentBugsTest.cpp -o /Users/buildslave/jenkins/workspace/test-mr-clang-stage1-RA/clang-build/tools/clang/runtime/compiler-rt-bins/test/fuzzer/X86_64DefaultDarwinConfig/Output/minimize_two_crashes.test.tmp-TwoDifferentBugsTest : 'RUN: at line 7'; rm -rf /Users/buildslave/jenkins/workspace/test-mr-clang-stage1-RA/clang-build/tools/clang/runtime/compiler-rt-bins/test/fuzzer/X86_64DefaultDarwinConfig/Output/minimize_two_crashes.test.tmp && mkdir /Users/buildslave/jenkins/workspace/test-mr-clang-stage1-RA/clang-build/tools/clang/runtime/compiler-rt-bins/test/fuzzer/X86_64DefaultDarwinConfig/Output/minimize_two_crashes.test.tmp : 'RUN: at line 8'; echo H12345678901234667888090 > /Users/buildslave/jenkins/workspace/test-mr-clang-stage1-RA/clang-build/tools/clang/runtime/compiler-rt-bins/test/fuzzer/X86_64DefaultDarwinConfig/Output/minimize_two_crashes.test.tmp/long_crash : 'RUN: at line 9'; env ASAN_OPTIONS=abort_on_error=0:log_to_syslog=0:dedup_token_length=3 /Users/buildslave/jenkins/workspace/test-mr-clang-stage1-RA/clang-build/tools/clang/runtime/compiler-rt-bins/test/fuzzer/X86_64DefaultDarwinConfig/Output/minimize_two_crashes.test.tmp-TwoDifferentBugsTest -seed=1 -minimize_crash=1 /Users/buildslave/jenkins/workspace/test-mr-clang-stage1-RA/clang-build/tools/clang/runtime/compiler-rt-bins/test/fuzzer/X86_64DefaultDarwinConfig/Output/minimize_two_crashes.test.tmp/long_crash -exact_artifact_path=/Users/buildslave/jenkins/workspace/test-mr-clang-stage1-RA/clang-build/tools/clang/runtime/compiler-rt-bins/test/fuzzer/X86_64DefaultDarwinConfig/Output/minimize_two_crashes.test.tmp/result 2>&1 | FileCheck /Users/buildslave/jenkins/workspace/test-mr-clang-stage1-RA/llvm/projects/compiler-rt/test/fuzzer/minimize_two_crashes.test : 'RUN: at line 17'; not /Users/buildslave/jenkins/workspace/test-mr-clang-stage1-RA/clang-build/tools/clang/runtime/compiler-rt-bins/test/fuzzer/X86_64DefaultDarwinConfig/Output/minimize_two_crashes.test.tmp-TwoDifferentBugsTest /Users/buildslave/jenkins/workspace/test-mr-clang-stage1-RA/clang-build/tools/clang/runtime/compiler-rt-bins/test/fuzzer/X86_64DefaultDarwinConfig/Output/minimize_two_crashes.test.tmp/result 2>&1 | FileCheck /Users/buildslave/jenkins/workspace/test-mr-clang-stage1-RA/llvm/projects/compiler-rt/test/fuzzer/minimize_two_crashes.test --check-prefix=VERIFY -- Exit Code: 2

Hide Details

Command Output (stderr): -- FileCheck error: '-' is empty. FileCheck command line: FileCheck /Users/buildslave/jenkins/workspace/test-mr-clang-stage1-RA/llvm/projects/compiler-rt/test/fuzzer/minimize_two_crashes.test

Hide Details

--

Hide Details

******************** UNSUPPORTED: libFuzzer :: print-func.test (2629 of 2668) FAIL: libFuzzer :: null-deref-on-empty.test (2630 of 2668) ******************** TEST 'libFuzzer :: null-deref-on-empty.test' FAILED ******************** Script: -- : 'RUN: at line 1'; /Users/buildslave/jenkins/workspace/test-mr-clang-stage1-RA/clang-build/./bin/clang --driver-mode=g++ -O2 -gline-tables-only -fsanitize=address,fuzzer -I/Users/buildslave/jenkins/workspace/test-mr-clang-stage1-RA/llvm/projects/compiler-rt/lib/fuzzer -arch x86_64 -stdlib=libc++ -mmacosx-version-min=10.9 -isysroot /Applications/Xcode.app/Contents/Developer/Platforms/MacOSX.platform/Developer/SDKs/MacOSX10.14.sdk /Users/buildslave/jenkins/workspace/test-mr-clang-stage1-RA/llvm/projects/compiler-rt/test/fuzzer/NullDerefOnEmptyTest.cpp -o /Users/buildslave/jenkins/workspace/test-mr-clang-stage1-RA/clang-build/tools/clang/runtime/compiler-rt-bins/test/fuzzer/X86_64DefaultDarwinConfig/Output/null-deref-on-empty.test.tmp-NullDerefOnEmptyTest : 'RUN: at line 3'; not /Users/buildslave/jenkins/workspace/test-mr-clang-stage1-RA/clang-build/tools/clang/runtime/compiler-rt-bins/test/fuzzer/X86_64DefaultDarwinConfig/Output/null-deref-on-empty.test.tmp-NullDerefOnEmptyTest -print_final_stats=1 2>&1 | FileCheck /Users/buildslave/jenkins/workspace/test-mr-clang-stage1-RA/llvm/projects/compiler-rt/test/fuzzer/null-deref-on-empty.test --check-prefix=NULL_DEREF_ON_EMPTY -- Exit Code: 137

Hide Details

Command Output (stderr): -- /Users/buildslave/jenkins/workspace/test-mr-clang-stage1-RA/clang-build/tools/clang/runtime/compiler-rt-bins/test/fuzzer/X86_64DefaultDarwinConfig/Output/null-deref-on-empty.test.script: line 2: 22164 Done not /Users/buildslave/jenkins/workspace/test-mr-clang-stage1-RA/clang-build/tools/clang/runtime/compiler-rt-bins/test/fuzzer/X86_64DefaultDarwinConfig/Output/null-deref-on-empty.test.tmp-NullDerefOnEmptyTest -print_final_stats=1 2>&1 22165 Killed: 9 | FileCheck /Users/buildslave/jenkins/workspace/test-mr-clang-stage1-RA/llvm/projects/compiler-rt/test/fuzzer/null-deref-on-empty.test --check-prefix=NULL_DEREF_ON_EMPTY

Hide Details

--

Hide Details

******************** FAIL: libFuzzer :: overwrite-input.test (2631 of 2668) ******************** TEST 'libFuzzer :: overwrite-input.test' FAILED ******************** Script: -- : 'RUN: at line 1'; /Users/buildslave/jenkins/workspace/test-mr-clang-stage1-RA/clang-build/./bin/clang --driver-mode=g++ -O2 -gline-tables-only -fsanitize=address,fuzzer -I/Users/buildslave/jenkins/workspace/test-mr-clang-stage1-RA/llvm/projects/compiler-rt/lib/fuzzer -arch x86_64 -stdlib=libc++ -mmacosx-version-min=10.9 -isysroot /Applications/Xcode.app/Contents/Developer/Platforms/MacOSX.platform/Developer/SDKs/MacOSX10.14.sdk /Users/buildslave/jenkins/workspace/test-mr-clang-stage1-RA/llvm/projects/compiler-rt/test/fuzzer/OverwriteInputTest.cpp -o /Users/buildslave/jenkins/workspace/test-mr-clang-stage1-RA/clang-build/tools/clang/runtime/compiler-rt-bins/test/fuzzer/X86_64DefaultDarwinConfig/Output/overwrite-input.test.tmp-OverwriteInputTest : 'RUN: at line 2'; not /Users/buildslave/jenkins/workspace/test-mr-clang-stage1-RA/clang-build/tools/clang/runtime/compiler-rt-bins/test/fuzzer/X86_64DefaultDarwinConfig/Output/overwrite-input.test.tmp-OverwriteInputTest 2>&1 | FileCheck /Users/buildslave/jenkins/workspace/test-mr-clang-stage1-RA/llvm/projects/compiler-rt/test/fuzzer/overwrite-input.test -- Exit Code: 137

Hide Details

Command Output (stderr): -- /Users/buildslave/jenkins/workspace/test-mr-clang-stage1-RA/clang-build/tools/clang/runtime/compiler-rt-bins/test/fuzzer/X86_64DefaultDarwinConfig/Output/overwrite-input.test.script: line 2: 22181 Done not /Users/buildslave/jenkins/workspace/test-mr-clang-stage1-RA/clang-build/tools/clang/runtime/compiler-rt-bins/test/fuzzer/X86_64DefaultDarwinConfig/Output/overwrite-input.test.tmp-OverwriteInputTest 2>&1 22182 Killed: 9 | FileCheck /Users/buildslave/jenkins/workspace/test-mr-clang-stage1-RA/llvm/projects/compiler-rt/test/fuzzer/overwrite-input.test

Hide Details

--

Hide Details

******************** FAIL: libFuzzer :: recommended-dictionary.test (2632 of 2668) ******************** TEST 'libFuzzer :: recommended-dictionary.test' FAILED ******************** Script: -- : 'RUN: at line 2'; /Users/buildslave/jenkins/workspace/test-mr-clang-stage1-RA/clang-build/./bin/clang --driver-mode=g++ -O2 -gline-tables-only -fsanitize=address,fuzzer -I/Users/buildslave/jenkins/workspace/test-mr-clang-stage1-RA/llvm/projects/compiler-rt/lib/fuzzer -arch x86_64 -stdlib=libc++ -mmacosx-version-min=10.9 -isysroot /Applications/Xcode.app/Contents/Developer/Platforms/MacOSX.platform/Developer/SDKs/MacOSX10.14.sdk /Users/buildslave/jenkins/workspace/test-mr-clang-stage1-RA/llvm/projects/compiler-rt/test/fuzzer/RepeatedMemcmp.cpp -o /Users/buildslave/jenkins/workspace/test-mr-clang-stage1-RA/clang-build/tools/clang/runtime/compiler-rt-bins/test/fuzzer/X86_64DefaultDarwinConfig/Output/recommended-dictionary.test.tmp-RepeatedMemcmp : 'RUN: at line 3'; /Users/buildslave/jenkins/workspace/test-mr-clang-stage1-RA/clang-build/tools/clang/runtime/compiler-rt-bins/test/fuzzer/X86_64DefaultDarwinConfig/Output/recommended-dictionary.test.tmp-RepeatedMemcmp -seed=11 -runs=100000 -max_len=20 2>&1 | FileCheck /Users/buildslave/jenkins/workspace/test-mr-clang-stage1-RA/llvm/projects/compiler-rt/test/fuzzer/recommended-dictionary.test --check-prefix=RECOMMENDED_DICT -- Exit Code: 137

Hide Details

Command Output (stderr): -- /Users/buildslave/jenkins/workspace/test-mr-clang-stage1-RA/clang-build/tools/clang/runtime/compiler-rt-bins/test/fuzzer/X86_64DefaultDarwinConfig/Output/recommended-dictionary.test.script: line 2: 22177 Done /Users/buildslave/jenkins/workspace/test-mr-clang-stage1-RA/clang-build/tools/clang/runtime/compiler-rt-bins/test/fuzzer/X86_64DefaultDarwinConfig/Output/recommended-dictionary.test.tmp-RepeatedMemcmp -seed=11 -runs=100000 -max_len=20 2>&1 22179 Killed: 9 | FileCheck /Users/buildslave/jenkins/workspace/test-mr-clang-stage1-RA/llvm/projects/compiler-rt/test/fuzzer/recommended-dictionary.test --check-prefix=RECOMMENDED_DICT

Hide Details

--

Hide Details

******************** FAIL: libFuzzer :: read-binary.test (2633 of 2668) ******************** TEST 'libFuzzer :: read-binary.test' FAILED ******************** Script: -- : 'RUN: at line 4'; echo -e "Hello\r\nWorld\r" > /Users/buildslave/jenkins/workspace/test-mr-clang-stage1-RA/clang-build/tools/clang/runtime/compiler-rt-bins/test/fuzzer/X86_64DefaultDarwinConfig/Output/read-binary.test.tmp-testcase : 'RUN: at line 5'; /Users/buildslave/jenkins/workspace/test-mr-clang-stage1-RA/clang-build/./bin/clang --driver-mode=g++ -O2 -gline-tables-only -fsanitize=address,fuzzer -I/Users/buildslave/jenkins/workspace/test-mr-clang-stage1-RA/llvm/projects/compiler-rt/lib/fuzzer -arch x86_64 -stdlib=libc++ -mmacosx-version-min=10.9 -isysroot /Applications/Xcode.app/Contents/Developer/Platforms/MacOSX.platform/Developer/SDKs/MacOSX10.14.sdk /Users/buildslave/jenkins/workspace/test-mr-clang-stage1-RA/llvm/projects/compiler-rt/test/fuzzer/ReadBinaryTest.cpp -o /Users/buildslave/jenkins/workspace/test-mr-clang-stage1-RA/clang-build/tools/clang/runtime/compiler-rt-bins/test/fuzzer/X86_64DefaultDarwinConfig/Output/read-binary.test.tmp-fuzzer : 'RUN: at line 6'; /Users/buildslave/jenkins/workspace/test-mr-clang-stage1-RA/clang-build/tools/clang/runtime/compiler-rt-bins/test/fuzzer/X86_64DefaultDarwinConfig/Output/read-binary.test.tmp-fuzzer /Users/buildslave/jenkins/workspace/test-mr-clang-stage1-RA/clang-build/tools/clang/runtime/compiler-rt-bins/test/fuzzer/X86_64DefaultDarwinConfig/Output/read-binary.test.tmp-testcase | FileCheck /Users/buildslave/jenkins/workspace/test-mr-clang-stage1-RA/llvm/projects/compiler-rt/test/fuzzer/read-binary.test -- Exit Code: 137

Hide Details

Command Output (stderr): -- INFO: Seed: 1137943070 INFO: Loaded 1 modules (70 inline 8-bit counters): 70 [0x10f8bdbb0, 0x10f8bdbf6), INFO: Loaded 1 PC tables (70 PCs): 70 [0x10f8bdbf8,0x10f8be058), /Users/buildslave/jenkins/workspace/test-mr-clang-stage1-RA/clang-build/tools/clang/runtime/compiler-rt-bins/test/fuzzer/X86_64DefaultDarwinConfig/Output/read-binary.test.tmp-fuzzer: Running 1 inputs 1 time(s) each. Running: /Users/buildslave/jenkins/workspace/test-mr-clang-stage1-RA/clang-build/tools/clang/runtime/compiler-rt-bins/test/fuzzer/X86_64DefaultDarwinConfig/Output/read-binary.test.tmp-testcase Executed /Users/buildslave/jenkins/workspace/test-mr-clang-stage1-RA/clang-build/tools/clang/runtime/compiler-rt-bins/test/fuzzer/X86_64DefaultDarwinConfig/Output/read-binary.test.tmp-testcase in 0 ms *** *** NOTE: fuzzing was not performed, you have only *** executed the target code on a fixed set of inputs. *** /Users/buildslave/jenkins/workspace/test-mr-clang-stage1-RA/clang-build/tools/clang/runtime/compiler-rt-bins/test/fuzzer/X86_64DefaultDarwinConfig/Output/read-binary.test.script: line 3: 22198 Done /Users/buildslave/jenkins/workspace/test-mr-clang-stage1-RA/clang-build/tools/clang/runtime/compiler-rt-bins/test/fuzzer/X86_64DefaultDarwinConfig/Output/read-binary.test.tmp-fuzzer /Users/buildslave/jenkins/workspace/test-mr-clang-stage1-RA/clang-build/tools/clang/runtime/compiler-rt-bins/test/fuzzer/X86_64DefaultDarwinConfig/Output/read-binary.test.tmp-testcase 22199 Killed: 9 | FileCheck /Users/buildslave/jenkins/workspace/test-mr-clang-stage1-RA/llvm/projects/compiler-rt/test/fuzzer/read-binary.test

Hide Details

--

Hide Details

******************** FAIL: libFuzzer :: reduce_inputs.test (2634 of 2668) ******************** TEST 'libFuzzer :: reduce_inputs.test' FAILED ******************** Script: -- : 'RUN: at line 3'; rm -rf /Users/buildslave/jenkins/workspace/test-mr-clang-stage1-RA/clang-build/tools/clang/runtime/compiler-rt-bins/test/fuzzer/X86_64DefaultDarwinConfig/Output/reduce_inputs.test.tmp/C : 'RUN: at line 4'; mkdir -p /Users/buildslave/jenkins/workspace/test-mr-clang-stage1-RA/clang-build/tools/clang/runtime/compiler-rt-bins/test/fuzzer/X86_64DefaultDarwinConfig/Output/reduce_inputs.test.tmp/C : 'RUN: at line 5'; /Users/buildslave/jenkins/workspace/test-mr-clang-stage1-RA/clang-build/./bin/clang --driver-mode=g++ -O2 -gline-tables-only -fsanitize=address,fuzzer -I/Users/buildslave/jenkins/workspace/test-mr-clang-stage1-RA/llvm/projects/compiler-rt/lib/fuzzer -arch x86_64 -stdlib=libc++ -mmacosx-version-min=10.9 -isysroot /Applications/Xcode.app/Contents/Developer/Platforms/MacOSX.platform/Developer/SDKs/MacOSX10.14.sdk /Users/buildslave/jenkins/workspace/test-mr-clang-stage1-RA/llvm/projects/compiler-rt/test/fuzzer/ShrinkControlFlowSimpleTest.cpp -o /Users/buildslave/jenkins/workspace/test-mr-clang-stage1-RA/clang-build/tools/clang/runtime/compiler-rt-bins/test/fuzzer/X86_64DefaultDarwinConfig/Output/reduce_inputs.test.tmp-ShrinkControlFlowSimpleTest : 'RUN: at line 6'; /Users/buildslave/jenkins/workspace/test-mr-clang-stage1-RA/clang-build/./bin/clang --driver-mode=g++ -O2 -gline-tables-only -fsanitize=address,fuzzer -I/Users/buildslave/jenkins/workspace/test-mr-clang-stage1-RA/llvm/projects/compiler-rt/lib/fuzzer -arch x86_64 -stdlib=libc++ -mmacosx-version-min=10.9 -isysroot /Applications/Xcode.app/Contents/Developer/Platforms/MacOSX.platform/Developer/SDKs/MacOSX10.14.sdk /Users/buildslave/jenkins/workspace/test-mr-clang-stage1-RA/llvm/projects/compiler-rt/test/fuzzer/ShrinkControlFlowTest.cpp -o /Users/buildslave/jenkins/workspace/test-mr-clang-stage1-RA/clang-build/tools/clang/runtime/compiler-rt-bins/test/fuzzer/X86_64DefaultDarwinConfig/Output/reduce_inputs.test.tmp-ShrinkControlFlowTest : 'RUN: at line 7'; /Users/buildslave/jenkins/workspace/test-mr-clang-stage1-RA/clang-build/tools/clang/runtime/compiler-rt-bins/test/fuzzer/X86_64DefaultDarwinConfig/Output/reduce_inputs.test.tmp-ShrinkControlFlowSimpleTest -exit_on_item=0eb8e4ed029b774d80f2b66408203801cb982a60 -runs=1000000 /Users/buildslave/jenkins/workspace/test-mr-clang-stage1-RA/clang-build/tools/clang/runtime/compiler-rt-bins/test/fuzzer/X86_64DefaultDarwinConfig/Output/reduce_inputs.test.tmp/C 2>&1 | FileCheck /Users/buildslave/jenkins/workspace/test-mr-clang-stage1-RA/llvm/projects/compiler-rt/test/fuzzer/reduce_inputs.test : 'RUN: at line 11'; /Users/buildslave/jenkins/workspace/test-mr-clang-stage1-RA/clang-build/tools/clang/runtime/compiler-rt-bins/test/fuzzer/X86_64DefaultDarwinConfig/Output/reduce_inputs.test.tmp-ShrinkControlFlowSimpleTest -runs=0 /Users/buildslave/jenkins/workspace/test-mr-clang-stage1-RA/clang-build/tools/clang/runtime/compiler-rt-bins/test/fuzzer/X86_64DefaultDarwinConfig/Output/reduce_inputs.test.tmp/C 2>&1 | FileCheck /Users/buildslave/jenkins/workspace/test-mr-clang-stage1-RA/llvm/projects/compiler-rt/test/fuzzer/reduce_inputs.test --check-prefix=COUNT : 'RUN: at line 15'; /Users/buildslave/jenkins/workspace/test-mr-clang-stage1-RA/clang-build/tools/clang/runtime/compiler-rt-bins/test/fuzzer/X86_64DefaultDarwinConfig/Output/reduce_inputs.test.tmp-ShrinkControlFlowTest -exit_on_item=0eb8e4ed029b774d80f2b66408203801cb982a60 -seed=42 -runs=1000000 2>&1 | FileCheck /Users/buildslave/jenkins/workspace/test-mr-clang-stage1-RA/llvm/projects/compiler-rt/test/fuzzer/reduce_inputs.test -- Exit Code: 137

Hide Details

Command Output (stderr): -- /Users/buildslave/jenkins/workspace/test-mr-clang-stage1-RA/clang-build/tools/clang/runtime/compiler-rt-bins/test/fuzzer/X86_64DefaultDarwinConfig/Output/reduce_inputs.test.script: line 7: 22205 Done /Users/buildslave/jenkins/workspace/test-mr-clang-stage1-RA/clang-build/tools/clang/runtime/compiler-rt-bins/test/fuzzer/X86_64DefaultDarwinConfig/Output/reduce_inputs.test.tmp-ShrinkControlFlowSimpleTest -exit_on_item=0eb8e4ed029b774d80f2b66408203801cb982a60 -runs=1000000 /Users/buildslave/jenkins/workspace/test-mr-clang-stage1-RA/clang-build/tools/clang/runtime/compiler-rt-bins/test/fuzzer/X86_64DefaultDarwinConfig/Output/reduce_inputs.test.tmp/C 2>&1 22206 Killed: 9 | FileCheck /Users/buildslave/jenkins/workspace/test-mr-clang-stage1-RA/llvm/projects/compiler-rt/test/fuzzer/reduce_inputs.test

Hide Details

--

Hide Details

******************** FAIL: libFuzzer :: reload.test (2635 of 2668) ******************** TEST 'libFuzzer :: reload.test' FAILED ******************** Script: -- : 'RUN: at line 1'; /Users/buildslave/jenkins/workspace/test-mr-clang-stage1-RA/clang-build/./bin/clang --driver-mode=g++ -O2 -gline-tables-only -fsanitize=address,fuzzer -I/Users/buildslave/jenkins/workspace/test-mr-clang-stage1-RA/llvm/projects/compiler-rt/lib/fuzzer -arch x86_64 -stdlib=libc++ -mmacosx-version-min=10.9 -isysroot /Applications/Xcode.app/Contents/Developer/Platforms/MacOSX.platform/Developer/SDKs/MacOSX10.14.sdk /Users/buildslave/jenkins/workspace/test-mr-clang-stage1-RA/llvm/projects/compiler-rt/test/fuzzer/ReloadTest.cpp -o /Users/buildslave/jenkins/workspace/test-mr-clang-stage1-RA/clang-build/tools/clang/runtime/compiler-rt-bins/test/fuzzer/X86_64DefaultDarwinConfig/Output/reload.test.tmp-ReloadTest : 'RUN: at line 2'; not /Users/buildslave/jenkins/workspace/test-mr-clang-stage1-RA/clang-build/tools/clang/runtime/compiler-rt-bins/test/fuzzer/X86_64DefaultDarwinConfig/Output/reload.test.tmp-ReloadTest -max_len=10000 -seed=1 -timeout=15 -len_control=0 -exact_artifact_path=/Users/buildslave/jenkins/workspace/test-mr-clang-stage1-RA/clang-build/tools/clang/runtime/compiler-rt-bins/test/fuzzer/X86_64DefaultDarwinConfig/Output/reload.test.tmp.crash 2>&1 | FileCheck /Users/buildslave/jenkins/workspace/test-mr-clang-stage1-RA/llvm/projects/compiler-rt/test/fuzzer/reload.test : 'RUN: at line 6'; not /Users/buildslave/jenkins/workspace/test-mr-clang-stage1-RA/clang-build/tools/clang/runtime/compiler-rt-bins/test/fuzzer/X86_64DefaultDarwinConfig/Output/reload.test.tmp-ReloadTest /Users/buildslave/jenkins/workspace/test-mr-clang-stage1-RA/clang-build/tools/clang/runtime/compiler-rt-bins/test/fuzzer/X86_64DefaultDarwinConfig/Output/reload.test.tmp.crash 2>&1 | FileCheck /Users/buildslave/jenkins/workspace/test-mr-clang-stage1-RA/llvm/projects/compiler-rt/test/fuzzer/reload.test --check-prefix=ARTIFACT : 'RUN: at line 12'; echo z >> /Users/buildslave/jenkins/workspace/test-mr-clang-stage1-RA/clang-build/tools/clang/runtime/compiler-rt-bins/test/fuzzer/X86_64DefaultDarwinConfig/Output/reload.test.tmp.crash : 'RUN: at line 13'; /Users/buildslave/jenkins/workspace/test-mr-clang-stage1-RA/clang-build/tools/clang/runtime/compiler-rt-bins/test/fuzzer/X86_64DefaultDarwinConfig/Output/reload.test.tmp-ReloadTest /Users/buildslave/jenkins/workspace/test-mr-clang-stage1-RA/clang-build/tools/clang/runtime/compiler-rt-bins/test/fuzzer/X86_64DefaultDarwinConfig/Output/reload.test.tmp.crash -- Exit Code: 137

Hide Details

Command Output (stderr): -- /Users/buildslave/jenkins/workspace/test-mr-clang-stage1-RA/clang-build/tools/clang/runtime/compiler-rt-bins/test/fuzzer/X86_64DefaultDarwinConfig/Output/reload.test.script: line 5: 22212 Done not /Users/buildslave/jenkins/workspace/test-mr-clang-stage1-RA/clang-build/tools/clang/runtime/compiler-rt-bins/test/fuzzer/X86_64DefaultDarwinConfig/Output/reload.test.tmp-ReloadTest -max_len=10000 -seed=1 -timeout=15 -len_control=0 -exact_artifact_path=/Users/buildslave/jenkins/workspace/test-mr-clang-stage1-RA/clang-build/tools/clang/runtime/compiler-rt-bins/test/fuzzer/X86_64DefaultDarwinConfig/Output/reload.test.tmp.crash 2>&1 22213 Killed: 9 | FileCheck /Users/buildslave/jenkins/workspace/test-mr-clang-stage1-RA/llvm/projects/compiler-rt/test/fuzzer/reload.test

Hide Details

--

Hide Details

******************** FAIL: libFuzzer :: repeated-bytes.test (2636 of 2668) ******************** TEST 'libFuzzer :: repeated-bytes.test' FAILED ******************** Script: -- : 'RUN: at line 1'; /Users/buildslave/jenkins/workspace/test-mr-clang-stage1-RA/clang-build/./bin/clang --driver-mode=g++ -O2 -gline-tables-only -fsanitize=address,fuzzer -I/Users/buildslave/jenkins/workspace/test-mr-clang-stage1-RA/llvm/projects/compiler-rt/lib/fuzzer -arch x86_64 -stdlib=libc++ -mmacosx-version-min=10.9 -isysroot /Applications/Xcode.app/Contents/Developer/Platforms/MacOSX.platform/Developer/SDKs/MacOSX10.14.sdk /Users/buildslave/jenkins/workspace/test-mr-clang-stage1-RA/llvm/projects/compiler-rt/test/fuzzer/RepeatedBytesTest.cpp -o /Users/buildslave/jenkins/workspace/test-mr-clang-stage1-RA/clang-build/tools/clang/runtime/compiler-rt-bins/test/fuzzer/X86_64DefaultDarwinConfig/Output/repeated-bytes.test.tmp-RepeatedBytesTest : 'RUN: at line 3'; not /Users/buildslave/jenkins/workspace/test-mr-clang-stage1-RA/clang-build/tools/clang/runtime/compiler-rt-bins/test/fuzzer/X86_64DefaultDarwinConfig/Output/repeated-bytes.test.tmp-RepeatedBytesTest -seed=1 -runs=1000000 2>&1 | FileCheck /Users/buildslave/jenkins/workspace/test-mr-clang-stage1-RA/llvm/projects/compiler-rt/test/fuzzer/repeated-bytes.test -- Exit Code: 137

Hide Details

Command Output (stderr): -- /Users/buildslave/jenkins/workspace/test-mr-clang-stage1-RA/clang-build/tools/clang/runtime/compiler-rt-bins/test/fuzzer/X86_64DefaultDarwinConfig/Output/repeated-bytes.test.script: line 2: 22227 Done not /Users/buildslave/jenkins/workspace/test-mr-clang-stage1-RA/clang-build/tools/clang/runtime/compiler-rt-bins/test/fuzzer/X86_64DefaultDarwinConfig/Output/repeated-bytes.test.tmp-RepeatedBytesTest -seed=1 -runs=1000000 2>&1 22228 Killed: 9 | FileCheck /Users/buildslave/jenkins/workspace/test-mr-clang-stage1-RA/llvm/projects/compiler-rt/test/fuzzer/repeated-bytes.test

Hide Details

--

Hide Details

******************** UNSUPPORTED: libFuzzer :: sigint.test (2637 of 2668) UNSUPPORTED: libFuzzer :: sigusr.test (2638 of 2668) UNSUPPORTED: libFuzzer :: simple-cmp.test (2639 of 2668) FAIL: libFuzzer :: seed_inputs.test (2640 of 2668) ******************** TEST 'libFuzzer :: seed_inputs.test' FAILED ******************** Script: -- : 'RUN: at line 4'; /Users/buildslave/jenkins/workspace/test-mr-clang-stage1-RA/clang-build/./bin/clang --driver-mode=g++ -O2 -gline-tables-only -fsanitize=address,fuzzer -I/Users/buildslave/jenkins/workspace/test-mr-clang-stage1-RA/llvm/projects/compiler-rt/lib/fuzzer -arch x86_64 -stdlib=libc++ -mmacosx-version-min=10.9 -isysroot /Applications/Xcode.app/Contents/Developer/Platforms/MacOSX.platform/Developer/SDKs/MacOSX10.14.sdk /Users/buildslave/jenkins/workspace/test-mr-clang-stage1-RA/llvm/projects/compiler-rt/test/fuzzer/SimpleTest.cpp -o /Users/buildslave/jenkins/workspace/test-mr-clang-stage1-RA/clang-build/tools/clang/runtime/compiler-rt-bins/test/fuzzer/X86_64DefaultDarwinConfig/Output/seed_inputs.test.tmp-SimpleTest : 'RUN: at line 7'; echo -n "/Users/buildslave/jenkins/workspace/test-mr-clang-stage1-RA/clang-build/tools/clang/runtime/compiler-rt-bins/test/fuzzer/X86_64DefaultDarwinConfig/Output/seed_inputs.test.tmp-SimpleTest" > /Users/buildslave/jenkins/workspace/test-mr-clang-stage1-RA/clang-build/tools/clang/runtime/compiler-rt-bins/test/fuzzer/X86_64DefaultDarwinConfig/Output/seed_inputs.test.tmp.seed-inputs : 'RUN: at line 9'; /Users/buildslave/jenkins/workspace/test-mr-clang-stage1-RA/clang-build/tools/clang/runtime/compiler-rt-bins/test/fuzzer/X86_64DefaultDarwinConfig/Output/seed_inputs.test.tmp-SimpleTest -runs=1 -seed_inputs=@/Users/buildslave/jenkins/workspace/test-mr-clang-stage1-RA/clang-build/tools/clang/runtime/compiler-rt-bins/test/fuzzer/X86_64DefaultDarwinConfig/Output/seed_inputs.test.tmp.seed-inputs 2>&1 | FileCheck /Users/buildslave/jenkins/workspace/test-mr-clang-stage1-RA/llvm/projects/compiler-rt/test/fuzzer/seed_inputs.test --check-prefix=USE-1 : 'RUN: at line 10'; /Users/buildslave/jenkins/workspace/test-mr-clang-stage1-RA/clang-build/tools/clang/runtime/compiler-rt-bins/test/fuzzer/X86_64DefaultDarwinConfig/Output/seed_inputs.test.tmp-SimpleTest -runs=1 -seed_inputs=/Users/buildslave/jenkins/workspace/test-mr-clang-stage1-RA/clang-build/tools/clang/runtime/compiler-rt-bins/test/fuzzer/X86_64DefaultDarwinConfig/Output/seed_inputs.test.tmp-SimpleTest 2>&1 | FileCheck /Users/buildslave/jenkins/workspace/test-mr-clang-stage1-RA/llvm/projects/compiler-rt/test/fuzzer/seed_inputs.test --check-prefix=USE-1 : 'RUN: at line 13'; echo -n "/Users/buildslave/jenkins/workspace/test-mr-clang-stage1-RA/clang-build/tools/clang/runtime/compiler-rt-bins/test/fuzzer/X86_64DefaultDarwinConfig/Output/seed_inputs.test.tmp-SimpleTest,/Users/buildslave/jenkins/workspace/test-mr-clang-stage1-RA/clang-build/tools/clang/runtime/compiler-rt-bins/test/fuzzer/X86_64DefaultDarwinConfig/Output/seed_inputs.test.tmp-SimpleTest" > /Users/buildslave/jenkins/workspace/test-mr-clang-stage1-RA/clang-build/tools/clang/runtime/compiler-rt-bins/test/fuzzer/X86_64DefaultDarwinConfig/Output/seed_inputs.test.tmp.seed-inputs : 'RUN: at line 14'; /Users/buildslave/jenkins/workspace/test-mr-clang-stage1-RA/clang-build/tools/clang/runtime/compiler-rt-bins/test/fuzzer/X86_64DefaultDarwinConfig/Output/seed_inputs.test.tmp-SimpleTest -runs=1 -seed_inputs=@/Users/buildslave/jenkins/workspace/test-mr-clang-stage1-RA/clang-build/tools/clang/runtime/compiler-rt-bins/test/fuzzer/X86_64DefaultDarwinConfig/Output/seed_inputs.test.tmp.seed-inputs 2>&1 | FileCheck /Users/buildslave/jenkins/workspace/test-mr-clang-stage1-RA/llvm/projects/compiler-rt/test/fuzzer/seed_inputs.test --check-prefix=USE-2 : 'RUN: at line 15'; /Users/buildslave/jenkins/workspace/test-mr-clang-stage1-RA/clang-build/tools/clang/runtime/compiler-rt-bins/test/fuzzer/X86_64DefaultDarwinConfig/Output/seed_inputs.test.tmp-SimpleTest -runs=1 -seed_inputs=/Users/buildslave/jenkins/workspace/test-mr-clang-stage1-RA/clang-build/tools/clang/runtime/compiler-rt-bins/test/fuzzer/X86_64DefaultDarwinConfig/Output/seed_inputs.test.tmp-SimpleTest,/Users/buildslave/jenkins/workspace/test-mr-clang-stage1-RA/clang-build/tools/clang/runtime/compiler-rt-bins/test/fuzzer/X86_64DefaultDarwinConfig/Output/seed_inputs.test.tmp-SimpleTest 2>&1 | FileCheck /Users/buildslave/jenkins/workspace/test-mr-clang-stage1-RA/llvm/projects/compiler-rt/test/fuzzer/seed_inputs.test --check-prefix=USE-2 : 'RUN: at line 18'; echo -n "/Users/buildslave/jenkins/workspace/test-mr-clang-stage1-RA/clang-build/tools/clang/runtime/compiler-rt-bins/test/fuzzer/X86_64DefaultDarwinConfig/Output/seed_inputs.test.tmp-SimpleTest,/Users/buildslave/jenkins/workspace/test-mr-clang-stage1-RA/clang-build/tools/clang/runtime/compiler-rt-bins/test/fuzzer/X86_64DefaultDarwinConfig/Output/seed_inputs.test.tmp-SimpleTest,nonexistent-file," > /Users/buildslave/jenkins/workspace/test-mr-clang-stage1-RA/clang-build/tools/clang/runtime/compiler-rt-bins/test/fuzzer/X86_64DefaultDarwinConfig/Output/seed_inputs.test.tmp.seed-inputs : 'RUN: at line 19'; /Users/buildslave/jenkins/workspace/test-mr-clang-stage1-RA/clang-build/tools/clang/runtime/compiler-rt-bins/test/fuzzer/X86_64DefaultDarwinConfig/Output/seed_inputs.test.tmp-SimpleTest -runs=1 -seed_inputs=@/Users/buildslave/jenkins/workspace/test-mr-clang-stage1-RA/clang-build/tools/clang/runtime/compiler-rt-bins/test/fuzzer/X86_64DefaultDarwinConfig/Output/seed_inputs.test.tmp.seed-inputs 2>&1 | FileCheck /Users/buildslave/jenkins/workspace/test-mr-clang-stage1-RA/llvm/projects/compiler-rt/test/fuzzer/seed_inputs.test --check-prefix=USE-2 : 'RUN: at line 20'; /Users/buildslave/jenkins/workspace/test-mr-clang-stage1-RA/clang-build/tools/clang/runtime/compiler-rt-bins/test/fuzzer/X86_64DefaultDarwinConfig/Output/seed_inputs.test.tmp-SimpleTest -runs=1 -seed_inputs=/Users/buildslave/jenkins/workspace/test-mr-clang-stage1-RA/clang-build/tools/clang/runtime/compiler-rt-bins/test/fuzzer/X86_64DefaultDarwinConfig/Output/seed_inputs.test.tmp-SimpleTest,/Users/buildslave/jenkins/workspace/test-mr-clang-stage1-RA/clang-build/tools/clang/runtime/compiler-rt-bins/test/fuzzer/X86_64DefaultDarwinConfig/Output/seed_inputs.test.tmp-SimpleTest,nonexistent-file, 2>&1 | FileCheck /Users/buildslave/jenkins/workspace/test-mr-clang-stage1-RA/llvm/projects/compiler-rt/test/fuzzer/seed_inputs.test --check-prefix=USE-2 : 'RUN: at line 24'; not /Users/buildslave/jenkins/workspace/test-mr-clang-stage1-RA/clang-build/tools/clang/runtime/compiler-rt-bins/test/fuzzer/X86_64DefaultDarwinConfig/Output/seed_inputs.test.tmp-SimpleTest -runs=1 -seed_inputs=@nonexistent-file 2>&1 | FileCheck /Users/buildslave/jenkins/workspace/test-mr-clang-stage1-RA/llvm/projects/compiler-rt/test/fuzzer/seed_inputs.test --check-prefix=EMPTY : 'RUN: at line 25'; echo -n "" > /Users/buildslave/jenkins/workspace/test-mr-clang-stage1-RA/clang-build/tools/clang/runtime/compiler-rt-bins/test/fuzzer/X86_64DefaultDarwinConfig/Output/seed_inputs.test.tmp.seed-inputs : 'RUN: at line 26'; not /Users/buildslave/jenkins/workspace/test-mr-clang-stage1-RA/clang-build/tools/clang/runtime/compiler-rt-bins/test/fuzzer/X86_64DefaultDarwinConfig/Output/seed_inputs.test.tmp-SimpleTest -runs=1 -seed_inputs=@/Users/buildslave/jenkins/workspace/test-mr-clang-stage1-RA/clang-build/tools/clang/runtime/compiler-rt-bins/test/fuzzer/X86_64DefaultDarwinConfig/Output/seed_inputs.test.tmp.seed-inputs 2>&1 | FileCheck /Users/buildslave/jenkins/workspace/test-mr-clang-stage1-RA/llvm/projects/compiler-rt/test/fuzzer/seed_inputs.test --check-prefix=EMPTY : 'RUN: at line 27'; not /Users/buildslave/jenkins/workspace/test-mr-clang-stage1-RA/clang-build/tools/clang/runtime/compiler-rt-bins/test/fuzzer/X86_64DefaultDarwinConfig/Output/seed_inputs.test.tmp-SimpleTest -runs=1 -seed_inputs= 2>&1 | FileCheck /Users/buildslave/jenkins/workspace/test-mr-clang-stage1-RA/llvm/projects/compiler-rt/test/fuzzer/seed_inputs.test --check-prefix=EMPTY -- Exit Code: 137

Hide Details

Command Output (stderr): -- /Users/buildslave/jenkins/workspace/test-mr-clang-stage1-RA/clang-build/tools/clang/runtime/compiler-rt-bins/test/fuzzer/X86_64DefaultDarwinConfig/Output/seed_inputs.test.script: line 14: 22244 Done /Users/buildslave/jenkins/workspace/test-mr-clang-stage1-RA/clang-build/tools/clang/runtime/compiler-rt-bins/test/fuzzer/X86_64DefaultDarwinConfig/Output/seed_inputs.test.tmp-SimpleTest -runs=1 -seed_inputs=@/Users/buildslave/jenkins/workspace/test-mr-clang-stage1-RA/clang-build/tools/clang/runtime/compiler-rt-bins/test/fuzzer/X86_64DefaultDarwinConfig/Output/seed_inputs.test.tmp.seed-inputs 2>&1 22245 Killed: 9 | FileCheck /Users/buildslave/jenkins/workspace/test-mr-clang-stage1-RA/llvm/projects/compiler-rt/test/fuzzer/seed_inputs.test --check-prefix=USE-1

Hide Details

--

Hide Details

******************** FAIL: libFuzzer :: shrink.test (2641 of 2668) ******************** TEST 'libFuzzer :: shrink.test' FAILED ******************** Script: -- : 'RUN: at line 1'; /Users/buildslave/jenkins/workspace/test-mr-clang-stage1-RA/clang-build/./bin/clang --driver-mode=g++ -O2 -gline-tables-only -fsanitize=address,fuzzer -I/Users/buildslave/jenkins/workspace/test-mr-clang-stage1-RA/llvm/projects/compiler-rt/lib/fuzzer -arch x86_64 -stdlib=libc++ -mmacosx-version-min=10.9 -isysroot /Applications/Xcode.app/Contents/Developer/Platforms/MacOSX.platform/Developer/SDKs/MacOSX10.14.sdk /Users/buildslave/jenkins/workspace/test-mr-clang-stage1-RA/llvm/projects/compiler-rt/test/fuzzer/ShrinkControlFlowTest.cpp -o /Users/buildslave/jenkins/workspace/test-mr-clang-stage1-RA/clang-build/tools/clang/runtime/compiler-rt-bins/test/fuzzer/X86_64DefaultDarwinConfig/Output/shrink.test.tmp-ShrinkControlFlowTest : 'RUN: at line 2'; /Users/buildslave/jenkins/workspace/test-mr-clang-stage1-RA/clang-build/./bin/clang --driver-mode=g++ -O2 -gline-tables-only -fsanitize=address,fuzzer -I/Users/buildslave/jenkins/workspace/test-mr-clang-stage1-RA/llvm/projects/compiler-rt/lib/fuzzer -arch x86_64 -stdlib=libc++ -mmacosx-version-min=10.9 -isysroot /Applications/Xcode.app/Contents/Developer/Platforms/MacOSX.platform/Developer/SDKs/MacOSX10.14.sdk /Users/buildslave/jenkins/workspace/test-mr-clang-stage1-RA/llvm/projects/compiler-rt/test/fuzzer/ShrinkValueProfileTest.cpp -o /Users/buildslave/jenkins/workspace/test-mr-clang-stage1-RA/clang-build/tools/clang/runtime/compiler-rt-bins/test/fuzzer/X86_64DefaultDarwinConfig/Output/shrink.test.tmp-ShrinkValueProfileTest : 'RUN: at line 3'; /Users/buildslave/jenkins/workspace/test-mr-clang-stage1-RA/clang-build/tools/clang/runtime/compiler-rt-bins/test/fuzzer/X86_64DefaultDarwinConfig/Output/shrink.test.tmp-ShrinkControlFlowTest -seed=1 -exit_on_item=0eb8e4ed029b774d80f2b66408203801cb982a60 -runs=2000000 -shrink=1 -reduce_inputs=0 2>&1 | FileCheck /Users/buildslave/jenkins/workspace/test-mr-clang-stage1-RA/llvm/projects/compiler-rt/test/fuzzer/shrink.test --check-prefix=SHRINK1 : 'RUN: at line 5'; /Users/buildslave/jenkins/workspace/test-mr-clang-stage1-RA/clang-build/tools/clang/runtime/compiler-rt-bins/test/fuzzer/X86_64DefaultDarwinConfig/Output/shrink.test.tmp-ShrinkControlFlowTest -seed=1 -exit_on_item=0eb8e4ed029b774d80f2b66408203801cb982a60 -runs=1000000 -shrink=0 -reduce_inputs=0 -max_len=64 2>&1 | FileCheck /Users/buildslave/jenkins/workspace/test-mr-clang-stage1-RA/llvm/projects/compiler-rt/test/fuzzer/shrink.test --check-prefix=SHRINK0 : 'RUN: at line 6'; /Users/buildslave/jenkins/workspace/test-mr-clang-stage1-RA/clang-build/tools/clang/runtime/compiler-rt-bins/test/fuzzer/X86_64DefaultDarwinConfig/Output/shrink.test.tmp-ShrinkValueProfileTest -seed=1 -exit_on_item=aea2e3923af219a8956f626558ef32f30a914ebc -runs=100000 -shrink=1 -reduce_inputs=0 -use_value_profile=1 2>&1 | FileCheck /Users/buildslave/jenkins/workspace/test-mr-clang-stage1-RA/llvm/projects/compiler-rt/test/fuzzer/shrink.test --check-prefix=SHRINK1_VP -- Exit Code: 137

Hide Details

Command Output (stderr): -- /Users/buildslave/jenkins/workspace/test-mr-clang-stage1-RA/clang-build/tools/clang/runtime/compiler-rt-bins/test/fuzzer/X86_64DefaultDarwinConfig/Output/shrink.test.script: line 5: 22246 Done /Users/buildslave/jenkins/workspace/test-mr-clang-stage1-RA/clang-build/tools/clang/runtime/compiler-rt-bins/test/fuzzer/X86_64DefaultDarwinConfig/Output/shrink.test.tmp-ShrinkControlFlowTest -seed=1 -exit_on_item=0eb8e4ed029b774d80f2b66408203801cb982a60 -runs=2000000 -shrink=1 -reduce_inputs=0 2>&1 22247 Killed: 9 | FileCheck /Users/buildslave/jenkins/workspace/test-mr-clang-stage1-RA/llvm/projects/compiler-rt/test/fuzzer/shrink.test --check-prefix=SHRINK1

Hide Details

--

Hide Details

******************** FAIL: libFuzzer :: standalone.test (2642 of 2668) ******************** TEST 'libFuzzer :: standalone.test' FAILED ******************** Script: -- : 'RUN: at line 1'; /Users/buildslave/jenkins/workspace/test-mr-clang-stage1-RA/clang-build/./bin/clang -O2 -gline-tables-only -fsanitize=address -I/Users/buildslave/jenkins/workspace/test-mr-clang-stage1-RA/llvm/projects/compiler-rt/lib/fuzzer -arch x86_64 -stdlib=libc++ -mmacosx-version-min=10.9 -isysroot /Applications/Xcode.app/Contents/Developer/Platforms/MacOSX.platform/Developer/SDKs/MacOSX10.14.sdk /Users/buildslave/jenkins/workspace/test-mr-clang-stage1-RA/llvm/projects/compiler-rt/lib/fuzzer/standalone/StandaloneFuzzTargetMain.c -c -o /Users/buildslave/jenkins/workspace/test-mr-clang-stage1-RA/clang-build/tools/clang/runtime/compiler-rt-bins/test/fuzzer/X86_64DefaultDarwinConfig/Output/standalone.test.tmp_1.o : 'RUN: at line 2'; /Users/buildslave/jenkins/workspace/test-mr-clang-stage1-RA/clang-build/./bin/clang --driver-mode=g++ -O2 -gline-tables-only -fsanitize=address -I/Users/buildslave/jenkins/workspace/test-mr-clang-stage1-RA/llvm/projects/compiler-rt/lib/fuzzer -arch x86_64 -stdlib=libc++ -mmacosx-version-min=10.9 -isysroot /Applications/Xcode.app/Contents/Developer/Platforms/MacOSX.platform/Developer/SDKs/MacOSX10.14.sdk /Users/buildslave/jenkins/workspace/test-mr-clang-stage1-RA/llvm/projects/compiler-rt/test/fuzzer/InitializeTest.cpp -c -o /Users/buildslave/jenkins/workspace/test-mr-clang-stage1-RA/clang-build/tools/clang/runtime/compiler-rt-bins/test/fuzzer/X86_64DefaultDarwinConfig/Output/standalone.test.tmp_2.o : 'RUN: at line 4'; /Users/buildslave/jenkins/workspace/test-mr-clang-stage1-RA/clang-build/./bin/clang --driver-mode=g++ -O2 -gline-tables-only -fsanitize=address -I/Users/buildslave/jenkins/workspace/test-mr-clang-stage1-RA/llvm/projects/compiler-rt/lib/fuzzer -arch x86_64 -stdlib=libc++ -mmacosx-version-min=10.9 -isysroot /Applications/Xcode.app/Contents/Developer/Platforms/MacOSX.platform/Developer/SDKs/MacOSX10.14.sdk /Users/buildslave/jenkins/workspace/test-mr-clang-stage1-RA/clang-build/tools/clang/runtime/compiler-rt-bins/test/fuzzer/X86_64DefaultDarwinConfig/Output/standalone.test.tmp_1.o /Users/buildslave/jenkins/workspace/test-mr-clang-stage1-RA/clang-build/tools/clang/runtime/compiler-rt-bins/test/fuzzer/X86_64DefaultDarwinConfig/Output/standalone.test.tmp_2.o -o /Users/buildslave/jenkins/workspace/test-mr-clang-stage1-RA/clang-build/tools/clang/runtime/compiler-rt-bins/test/fuzzer/X86_64DefaultDarwinConfig/Output/standalone.test.tmp-StandaloneInitializeTest : 'RUN: at line 5'; /Users/buildslave/jenkins/workspace/test-mr-clang-stage1-RA/clang-build/tools/clang/runtime/compiler-rt-bins/test/fuzzer/X86_64DefaultDarwinConfig/Output/standalone.test.tmp-StandaloneInitializeTest /Users/buildslave/jenkins/workspace/test-mr-clang-stage1-RA/llvm/projects/compiler-rt/test/fuzzer/hi.txt /Users/buildslave/jenkins/workspace/test-mr-clang-stage1-RA/llvm/projects/compiler-rt/test/fuzzer/dict1.txt 2>&1 | FileCheck /Users/buildslave/jenkins/workspace/test-mr-clang-stage1-RA/llvm/projects/compiler-rt/test/fuzzer/standalone.test -- Exit Code: 137

Hide Details

Command Output (stderr): -- /Users/buildslave/jenkins/workspace/test-mr-clang-stage1-RA/clang-build/tools/clang/runtime/compiler-rt-bins/test/fuzzer/X86_64DefaultDarwinConfig/Output/standalone.test.script: line 4: 22258 Done /Users/buildslave/jenkins/workspace/test-mr-clang-stage1-RA/clang-build/tools/clang/runtime/compiler-rt-bins/test/fuzzer/X86_64DefaultDarwinConfig/Output/standalone.test.tmp-StandaloneInitializeTest /Users/buildslave/jenkins/workspace/test-mr-clang-stage1-RA/llvm/projects/compiler-rt/test/fuzzer/hi.txt /Users/buildslave/jenkins/workspace/test-mr-clang-stage1-RA/llvm/projects/compiler-rt/test/fuzzer/dict1.txt 2>&1 22259 Killed: 9 | FileCheck /Users/buildslave/jenkins/workspace/test-mr-clang-stage1-RA/llvm/projects/compiler-rt/test/fuzzer/standalone.test

Hide Details

--

Hide Details

******************** FAIL: libFuzzer :: strcmp.test (2643 of 2668) ******************** TEST 'libFuzzer :: strcmp.test' FAILED ******************** Script: -- : 'RUN: at line 2'; /Users/buildslave/jenkins/workspace/test-mr-clang-stage1-RA/clang-build/./bin/clang --driver-mode=g++ -O2 -gline-tables-only -fsanitize=address,fuzzer -I/Users/buildslave/jenkins/workspace/test-mr-clang-stage1-RA/llvm/projects/compiler-rt/lib/fuzzer -arch x86_64 -stdlib=libc++ -mmacosx-version-min=10.9 -isysroot /Applications/Xcode.app/Contents/Developer/Platforms/MacOSX.platform/Developer/SDKs/MacOSX10.14.sdk /Users/buildslave/jenkins/workspace/test-mr-clang-stage1-RA/llvm/projects/compiler-rt/test/fuzzer/StrcmpTest.cpp -o /Users/buildslave/jenkins/workspace/test-mr-clang-stage1-RA/clang-build/tools/clang/runtime/compiler-rt-bins/test/fuzzer/X86_64DefaultDarwinConfig/Output/strcmp.test.tmp-StrcmpTest : 'RUN: at line 3'; not /Users/buildslave/jenkins/workspace/test-mr-clang-stage1-RA/clang-build/tools/clang/runtime/compiler-rt-bins/test/fuzzer/X86_64DefaultDarwinConfig/Output/strcmp.test.tmp-StrcmpTest -seed=1 -runs=2000000 2>&1 | FileCheck /Users/buildslave/jenkins/workspace/test-mr-clang-stage1-RA/llvm/projects/compiler-rt/test/fuzzer/strcmp.test -- Exit Code: 137

Hide Details

Command Output (stderr): -- /Users/buildslave/jenkins/workspace/test-mr-clang-stage1-RA/clang-build/tools/clang/runtime/compiler-rt-bins/test/fuzzer/X86_64DefaultDarwinConfig/Output/strcmp.test.script: line 2: 22265 Done not /Users/buildslave/jenkins/workspace/test-mr-clang-stage1-RA/clang-build/tools/clang/runtime/compiler-rt-bins/test/fuzzer/X86_64DefaultDarwinConfig/Output/strcmp.test.tmp-StrcmpTest -seed=1 -runs=2000000 2>&1 22266 Killed: 9 | FileCheck /Users/buildslave/jenkins/workspace/test-mr-clang-stage1-RA/llvm/projects/compiler-rt/test/fuzzer/strcmp.test

Hide Details

--

Hide Details

******************** FAIL: libFuzzer :: simple.test (2644 of 2668) ******************** TEST 'libFuzzer :: simple.test' FAILED ******************** Script: -- : 'RUN: at line 2'; /Users/buildslave/jenkins/workspace/test-mr-clang-stage1-RA/clang-build/./bin/clang --driver-mode=g++ -O2 -gline-tables-only -fsanitize=address,fuzzer -I/Users/buildslave/jenkins/workspace/test-mr-clang-stage1-RA/llvm/projects/compiler-rt/lib/fuzzer -arch x86_64 -stdlib=libc++ -mmacosx-version-min=10.9 -isysroot /Applications/Xcode.app/Contents/Developer/Platforms/MacOSX.platform/Developer/SDKs/MacOSX10.14.sdk /Users/buildslave/jenkins/workspace/test-mr-clang-stage1-RA/llvm/projects/compiler-rt/test/fuzzer/SimpleTest.cpp -o /Users/buildslave/jenkins/workspace/test-mr-clang-stage1-RA/clang-build/tools/clang/runtime/compiler-rt-bins/test/fuzzer/X86_64DefaultDarwinConfig/Output/simple.test.tmp-SimpleTest : 'RUN: at line 4'; not /Users/buildslave/jenkins/workspace/test-mr-clang-stage1-RA/clang-build/tools/clang/runtime/compiler-rt-bins/test/fuzzer/X86_64DefaultDarwinConfig/Output/simple.test.tmp-SimpleTest 2>&1 | FileCheck /Users/buildslave/jenkins/workspace/test-mr-clang-stage1-RA/llvm/projects/compiler-rt/test/fuzzer/simple.test : 'RUN: at line 7'; not /Users/buildslave/jenkins/workspace/test-mr-clang-stage1-RA/clang-build/tools/clang/runtime/compiler-rt-bins/test/fuzzer/X86_64DefaultDarwinConfig/Output/simple.test.tmp-SimpleTest -only_ascii=1 2>&1 -- Exit Code: 137

Hide Details

Command Output (stderr): -- /Users/buildslave/jenkins/workspace/test-mr-clang-stage1-RA/clang-build/tools/clang/runtime/compiler-rt-bins/test/fuzzer/X86_64DefaultDarwinConfig/Output/simple.test.script: line 3: 22278 Done not /Users/buildslave/jenkins/workspace/test-mr-clang-stage1-RA/clang-build/tools/clang/runtime/compiler-rt-bins/test/fuzzer/X86_64DefaultDarwinConfig/Output/simple.test.tmp-SimpleTest 2>&1 22279 Killed: 9 | FileCheck /Users/buildslave/jenkins/workspace/test-mr-clang-stage1-RA/llvm/projects/compiler-rt/test/fuzzer/simple.test

Hide Details

--

Hide Details

******************** PASS: libFuzzer :: strncmp-oob.test (2645 of 2668) FAIL: libFuzzer :: swap-cmp.test (2646 of 2668) ******************** TEST 'libFuzzer :: swap-cmp.test' FAILED ******************** Script: -- : 'RUN: at line 1'; /Users/buildslave/jenkins/workspace/test-mr-clang-stage1-RA/clang-build/./bin/clang --driver-mode=g++ -O2 -gline-tables-only -fsanitize=address,fuzzer -I/Users/buildslave/jenkins/workspace/test-mr-clang-stage1-RA/llvm/projects/compiler-rt/lib/fuzzer -arch x86_64 -stdlib=libc++ -mmacosx-version-min=10.9 -isysroot /Applications/Xcode.app/Contents/Developer/Platforms/MacOSX.platform/Developer/SDKs/MacOSX10.14.sdk /Users/buildslave/jenkins/workspace/test-mr-clang-stage1-RA/llvm/projects/compiler-rt/test/fuzzer/SwapCmpTest.cpp -o /Users/buildslave/jenkins/workspace/test-mr-clang-stage1-RA/clang-build/tools/clang/runtime/compiler-rt-bins/test/fuzzer/X86_64DefaultDarwinConfig/Output/swap-cmp.test.tmp-SwapCmpTest : 'RUN: at line 3'; not /Users/buildslave/jenkins/workspace/test-mr-clang-stage1-RA/clang-build/tools/clang/runtime/compiler-rt-bins/test/fuzzer/X86_64DefaultDarwinConfig/Output/swap-cmp.test.tmp-SwapCmpTest -seed=1 -runs=10000000 2>&1 | FileCheck /Users/buildslave/jenkins/workspace/test-mr-clang-stage1-RA/llvm/projects/compiler-rt/test/fuzzer/swap-cmp.test -- Exit Code: 254

Hide Details

Command Output (stderr): -- clang-10: error: unable to execute command: Killed: 9 clang-10: error: dsymutil command failed due to signal (use -v to see invocation)

Hide Details

--

Hide Details

******************** FAIL: libFuzzer :: strstr.test (2647 of 2668) ******************** TEST 'libFuzzer :: strstr.test' FAILED ******************** Script: -- : 'RUN: at line 2'; /Users/buildslave/jenkins/workspace/test-mr-clang-stage1-RA/clang-build/./bin/clang --driver-mode=g++ -O2 -gline-tables-only -fsanitize=address,fuzzer -I/Users/buildslave/jenkins/workspace/test-mr-clang-stage1-RA/llvm/projects/compiler-rt/lib/fuzzer -arch x86_64 -stdlib=libc++ -mmacosx-version-min=10.9 -isysroot /Applications/Xcode.app/Contents/Developer/Platforms/MacOSX.platform/Developer/SDKs/MacOSX10.14.sdk /Users/buildslave/jenkins/workspace/test-mr-clang-stage1-RA/llvm/projects/compiler-rt/test/fuzzer/StrstrTest.cpp -o /Users/buildslave/jenkins/workspace/test-mr-clang-stage1-RA/clang-build/tools/clang/runtime/compiler-rt-bins/test/fuzzer/X86_64DefaultDarwinConfig/Output/strstr.test.tmp-StrstrTest : 'RUN: at line 3'; not /Users/buildslave/jenkins/workspace/test-mr-clang-stage1-RA/clang-build/tools/clang/runtime/compiler-rt-bins/test/fuzzer/X86_64DefaultDarwinConfig/Output/strstr.test.tmp-StrstrTest -seed=1 -runs=2000000 2>&1 | FileCheck /Users/buildslave/jenkins/workspace/test-mr-clang-stage1-RA/llvm/projects/compiler-rt/test/fuzzer/strstr.test -- Exit Code: 137

Hide Details

Command Output (stderr): -- /Users/buildslave/jenkins/workspace/test-mr-clang-stage1-RA/clang-build/tools/clang/runtime/compiler-rt-bins/test/fuzzer/X86_64DefaultDarwinConfig/Output/strstr.test.script: line 2: 22310 Done not /Users/buildslave/jenkins/workspace/test-mr-clang-stage1-RA/clang-build/tools/clang/runtime/compiler-rt-bins/test/fuzzer/X86_64DefaultDarwinConfig/Output/strstr.test.tmp-StrstrTest -seed=1 -runs=2000000 2>&1 22311 Killed: 9 | FileCheck /Users/buildslave/jenkins/workspace/test-mr-clang-stage1-RA/llvm/projects/compiler-rt/test/fuzzer/strstr.test

Hide Details

--

Hide Details

******************** UNSUPPORTED: libFuzzer :: target-function.test (2648 of 2668) FAIL: libFuzzer :: three-bytes.test (2649 of 2668) ******************** TEST 'libFuzzer :: three-bytes.test' FAILED ******************** Script: -- : 'RUN: at line 2'; /Users/buildslave/jenkins/workspace/test-mr-clang-stage1-RA/clang-build/./bin/clang --driver-mode=g++ -O2 -gline-tables-only -fsanitize=address,fuzzer -I/Users/buildslave/jenkins/workspace/test-mr-clang-stage1-RA/llvm/projects/compiler-rt/lib/fuzzer -arch x86_64 -stdlib=libc++ -mmacosx-version-min=10.9 -isysroot /Applications/Xcode.app/Contents/Developer/Platforms/MacOSX.platform/Developer/SDKs/MacOSX10.14.sdk /Users/buildslave/jenkins/workspace/test-mr-clang-stage1-RA/llvm/projects/compiler-rt/test/fuzzer/ThreeBytes.cpp -o /Users/buildslave/jenkins/workspace/test-mr-clang-stage1-RA/clang-build/tools/clang/runtime/compiler-rt-bins/test/fuzzer/X86_64DefaultDarwinConfig/Output/three-bytes.test.tmp : 'RUN: at line 4'; /Users/buildslave/jenkins/workspace/test-mr-clang-stage1-RA/clang-build/tools/clang/runtime/compiler-rt-bins/test/fuzzer/X86_64DefaultDarwinConfig/Output/three-bytes.test.tmp -seed=1 -runs=30000 : 'RUN: at line 5'; not /Users/buildslave/jenkins/workspace/test-mr-clang-stage1-RA/clang-build/tools/clang/runtime/compiler-rt-bins/test/fuzzer/X86_64DefaultDarwinConfig/Output/three-bytes.test.tmp -seed=1 -runs=1000000 -use_value_profile=2 2>&1 | FileCheck /Users/buildslave/jenkins/workspace/test-mr-clang-stage1-RA/llvm/projects/compiler-rt/test/fuzzer/three-bytes.test -- Exit Code: 137

Hide Details

Command Output (stderr): -- INFO: Seed: 1 INFO: Loaded 1 modules (4 inline 8-bit counters): 4 [0x10c495b00, 0x10c495b04), INFO: Loaded 1 PC tables (4 PCs): 4 [0x10c495b08,0x10c495b48), INFO: -max_len is not provided; libFuzzer will not generate inputs larger than 4096 bytes INFO: A corpus is not provided, starting from an empty corpus #2 INITED cov: 2 ft: 2 corp: 1/1b exec/s: 0 rss: 26Mb #6 NEW cov: 3 ft: 3 corp: 2/5b lim: 4 exec/s: 0 rss: 26Mb L: 4/4 MS: 4 ShuffleBytes-ChangeBit-CrossOver-CrossOver- #9 REDUCE cov: 3 ft: 3 corp: 2/4b lim: 4 exec/s: 0 rss: 27Mb L: 3/3 MS: 3 ChangeByte-EraseBytes-InsertByte- #30000 DONE cov: 3 ft: 3 corp: 2/4b lim: 301 exec/s: 0 rss: 30Mb Done 30000 runs in 0 second(s) /Users/buildslave/jenkins/workspace/test-mr-clang-stage1-RA/clang-build/tools/clang/runtime/compiler-rt-bins/test/fuzzer/X86_64DefaultDarwinConfig/Output/three-bytes.test.script: line 3: 22332 Done not /Users/buildslave/jenkins/workspace/test-mr-clang-stage1-RA/clang-build/tools/clang/runtime/compiler-rt-bins/test/fuzzer/X86_64DefaultDarwinConfig/Output/three-bytes.test.tmp -seed=1 -runs=1000000 -use_value_profile=2 2>&1 22333 Killed: 9 | FileCheck /Users/buildslave/jenkins/workspace/test-mr-clang-stage1-RA/llvm/projects/compiler-rt/test/fuzzer/three-bytes.test

Hide Details

--

Hide Details

******************** UNSUPPORTED: libFuzzer :: trace-malloc-2.test (2650 of 2668) UNSUPPORTED: libFuzzer :: trace-malloc-threaded.test (2651 of 2668) UNSUPPORTED: libFuzzer :: trace-malloc-unbalanced.test (2652 of 2668) PASS: libFuzzer :: symbolize-deadlock.test (2653 of 2668) FAIL: libFuzzer :: trace-malloc.test (2654 of 2668) ******************** TEST 'libFuzzer :: trace-malloc.test' FAILED ******************** Script: -- : 'RUN: at line 1'; /Users/buildslave/jenkins/workspace/test-mr-clang-stage1-RA/clang-build/./bin/clang --driver-mode=g++ -O2 -gline-tables-only -fsanitize=address,fuzzer -I/Users/buildslave/jenkins/workspace/test-mr-clang-stage1-RA/llvm/projects/compiler-rt/lib/fuzzer -arch x86_64 -stdlib=libc++ -mmacosx-version-min=10.9 -isysroot /Applications/Xcode.app/Contents/Developer/Platforms/MacOSX.platform/Developer/SDKs/MacOSX10.14.sdk /Users/buildslave/jenkins/workspace/test-mr-clang-stage1-RA/llvm/projects/compiler-rt/test/fuzzer/TraceMallocTest.cpp -o /Users/buildslave/jenkins/workspace/test-mr-clang-stage1-RA/clang-build/tools/clang/runtime/compiler-rt-bins/test/fuzzer/X86_64DefaultDarwinConfig/Output/trace-malloc.test.tmp-TraceMallocTest : 'RUN: at line 3'; /Users/buildslave/jenkins/workspace/test-mr-clang-stage1-RA/clang-build/tools/clang/runtime/compiler-rt-bins/test/fuzzer/X86_64DefaultDarwinConfig/Output/trace-malloc.test.tmp-TraceMallocTest -seed=1 -trace_malloc=1 -runs=10000 2>&1 | FileCheck /Users/buildslave/jenkins/workspace/test-mr-clang-stage1-RA/llvm/projects/compiler-rt/test/fuzzer/trace-malloc.test -- Exit Code: 137

Hide Details

Command Output (stderr): -- /Users/buildslave/jenkins/workspace/test-mr-clang-stage1-RA/clang-build/tools/clang/runtime/compiler-rt-bins/test/fuzzer/X86_64DefaultDarwinConfig/Output/trace-malloc.test.script: line 2: 22354 Done /Users/buildslave/jenkins/workspace/test-mr-clang-stage1-RA/clang-build/tools/clang/runtime/compiler-rt-bins/test/fuzzer/X86_64DefaultDarwinConfig/Output/trace-malloc.test.tmp-TraceMallocTest -seed=1 -trace_malloc=1 -runs=10000 2>&1 22355 Killed: 9 | FileCheck /Users/buildslave/jenkins/workspace/test-mr-clang-stage1-RA/llvm/projects/compiler-rt/test/fuzzer/trace-malloc.test

Hide Details

--

Hide Details

******************** PASS: libFuzzer :: ulimit.test (2655 of 2668) FAIL: libFuzzer :: value-profile-cmp2.test (2656 of 2668) ******************** TEST 'libFuzzer :: value-profile-cmp2.test' FAILED ******************** Script: -- : 'RUN: at line 5'; /Users/buildslave/jenkins/workspace/test-mr-clang-stage1-RA/clang-build/./bin/clang --driver-mode=g++ -O2 -gline-tables-only -fsanitize=address,fuzzer -I/Users/buildslave/jenkins/workspace/test-mr-clang-stage1-RA/llvm/projects/compiler-rt/lib/fuzzer -arch x86_64 -stdlib=libc++ -mmacosx-version-min=10.9 -isysroot /Applications/Xcode.app/Contents/Developer/Platforms/MacOSX.platform/Developer/SDKs/MacOSX10.14.sdk -fno-sanitize=address /Users/buildslave/jenkins/workspace/test-mr-clang-stage1-RA/llvm/projects/compiler-rt/test/fuzzer/SimpleHashTest.cpp -o /Users/buildslave/jenkins/workspace/test-mr-clang-stage1-RA/clang-build/tools/clang/runtime/compiler-rt-bins/test/fuzzer/X86_64DefaultDarwinConfig/Output/value-profile-cmp2.test.tmp-SimpleHashTest : 'RUN: at line 6'; not /Users/buildslave/jenkins/workspace/test-mr-clang-stage1-RA/clang-build/tools/clang/runtime/compiler-rt-bins/test/fuzzer/X86_64DefaultDarwinConfig/Output/value-profile-cmp2.test.tmp-SimpleHashTest -seed=1 -use_cmp=0 -use_value_profile=1 -runs=100000000 -max_len=64 2>&1 | FileCheck /Users/buildslave/jenkins/workspace/test-mr-clang-stage1-RA/llvm/projects/compiler-rt/test/fuzzer/value-profile-cmp2.test -- Exit Code: 137

Hide Details

Command Output (stderr): -- /Users/buildslave/jenkins/workspace/test-mr-clang-stage1-RA/clang-build/tools/clang/runtime/compiler-rt-bins/test/fuzzer/X86_64DefaultDarwinConfig/Output/value-profile-cmp2.test.script: line 2: 22378 Done not /Users/buildslave/jenkins/workspace/test-mr-clang-stage1-RA/clang-build/tools/clang/runtime/compiler-rt-bins/test/fuzzer/X86_64DefaultDarwinConfig/Output/value-profile-cmp2.test.tmp-SimpleHashTest -seed=1 -use_cmp=0 -use_value_profile=1 -runs=100000000 -max_len=64 2>&1 22379 Killed: 9 | FileCheck /Users/buildslave/jenkins/workspace/test-mr-clang-stage1-RA/llvm/projects/compiler-rt/test/fuzzer/value-profile-cmp2.test

Hide Details

--

Hide Details

******************** FAIL: libFuzzer :: value-profile-cmp3.test (2657 of 2668) ******************** TEST 'libFuzzer :: value-profile-cmp3.test' FAILED ******************** Script: -- : 'RUN: at line 3'; /Users/buildslave/jenkins/workspace/test-mr-clang-stage1-RA/clang-build/./bin/clang --driver-mode=g++ -O2 -gline-tables-only -fsanitize=address,fuzzer -I/Users/buildslave/jenkins/workspace/test-mr-clang-stage1-RA/llvm/projects/compiler-rt/lib/fuzzer -arch x86_64 -stdlib=libc++ -mmacosx-version-min=10.9 -isysroot /Applications/Xcode.app/Contents/Developer/Platforms/MacOSX.platform/Developer/SDKs/MacOSX10.14.sdk /Users/buildslave/jenkins/workspace/test-mr-clang-stage1-RA/llvm/projects/compiler-rt/test/fuzzer/AbsNegAndConstantTest.cpp -o /Users/buildslave/jenkins/workspace/test-mr-clang-stage1-RA/clang-build/tools/clang/runtime/compiler-rt-bins/test/fuzzer/X86_64DefaultDarwinConfig/Output/value-profile-cmp3.test.tmp-AbsNegAndConstantTest : 'RUN: at line 4'; not /Users/buildslave/jenkins/workspace/test-mr-clang-stage1-RA/clang-build/tools/clang/runtime/compiler-rt-bins/test/fuzzer/X86_64DefaultDarwinConfig/Output/value-profile-cmp3.test.tmp-AbsNegAndConstantTest -seed=1 -use_cmp=0 -use_value_profile=1 -runs=100000000 2>&1 | FileCheck /Users/buildslave/jenkins/workspace/test-mr-clang-stage1-RA/llvm/projects/compiler-rt/test/fuzzer/value-profile-cmp3.test -- Exit Code: 137

Hide Details

Command Output (stderr): -- /Users/buildslave/jenkins/workspace/test-mr-clang-stage1-RA/clang-build/tools/clang/runtime/compiler-rt-bins/test/fuzzer/X86_64DefaultDarwinConfig/Output/value-profile-cmp3.test.script: line 2: 22391 Done not /Users/buildslave/jenkins/workspace/test-mr-clang-stage1-RA/clang-build/tools/clang/runtime/compiler-rt-bins/test/fuzzer/X86_64DefaultDarwinConfig/Output/value-profile-cmp3.test.tmp-AbsNegAndConstantTest -seed=1 -use_cmp=0 -use_value_profile=1 -runs=100000000 2>&1 22392 Killed: 9 | FileCheck /Users/buildslave/jenkins/workspace/test-mr-clang-stage1-RA/llvm/projects/compiler-rt/test/fuzzer/value-profile-cmp3.test

Hide Details

--

Hide Details

******************** FAIL: libFuzzer :: strncmp.test (2658 of 2668) ******************** TEST 'libFuzzer :: strncmp.test' FAILED ******************** Script: -- : 'RUN: at line 2'; /Users/buildslave/jenkins/workspace/test-mr-clang-stage1-RA/clang-build/./bin/clang --driver-mode=g++ -O2 -gline-tables-only -fsanitize=address,fuzzer -I/Users/buildslave/jenkins/workspace/test-mr-clang-stage1-RA/llvm/projects/compiler-rt/lib/fuzzer -arch x86_64 -stdlib=libc++ -mmacosx-version-min=10.9 -isysroot /Applications/Xcode.app/Contents/Developer/Platforms/MacOSX.platform/Developer/SDKs/MacOSX10.14.sdk /Users/buildslave/jenkins/workspace/test-mr-clang-stage1-RA/llvm/projects/compiler-rt/test/fuzzer/StrncmpTest.cpp -o /Users/buildslave/jenkins/workspace/test-mr-clang-stage1-RA/clang-build/tools/clang/runtime/compiler-rt-bins/test/fuzzer/X86_64DefaultDarwinConfig/Output/strncmp.test.tmp-StrncmpTest : 'RUN: at line 3'; not /Users/buildslave/jenkins/workspace/test-mr-clang-stage1-RA/clang-build/tools/clang/runtime/compiler-rt-bins/test/fuzzer/X86_64DefaultDarwinConfig/Output/strncmp.test.tmp-StrncmpTest -seed=2 -runs=10000000 2>&1 | FileCheck /Users/buildslave/jenkins/workspace/test-mr-clang-stage1-RA/llvm/projects/compiler-rt/test/fuzzer/strncmp.test -- Exit Code: 137

Hide Details

Command Output (stderr): -- /Users/buildslave/jenkins/workspace/test-mr-clang-stage1-RA/clang-build/tools/clang/runtime/compiler-rt-bins/test/fuzzer/X86_64DefaultDarwinConfig/Output/strncmp.test.script: line 2: 22291 Done not /Users/buildslave/jenkins/workspace/test-mr-clang-stage1-RA/clang-build/tools/clang/runtime/compiler-rt-bins/test/fuzzer/X86_64DefaultDarwinConfig/Output/strncmp.test.tmp-StrncmpTest -seed=2 -runs=10000000 2>&1 22292 Killed: 9 | FileCheck /Users/buildslave/jenkins/workspace/test-mr-clang-stage1-RA/llvm/projects/compiler-rt/test/fuzzer/strncmp.test

Hide Details

--

Hide Details

******************** FAIL: libFuzzer :: value-profile-div.test (2659 of 2668) ******************** TEST 'libFuzzer :: value-profile-div.test' FAILED ******************** Script: -- : 'RUN: at line 4'; /Users/buildslave/jenkins/workspace/test-mr-clang-stage1-RA/clang-build/./bin/clang --driver-mode=g++ -O2 -gline-tables-only -fsanitize=address,fuzzer -I/Users/buildslave/jenkins/workspace/test-mr-clang-stage1-RA/llvm/projects/compiler-rt/lib/fuzzer -arch x86_64 -stdlib=libc++ -mmacosx-version-min=10.9 -isysroot /Applications/Xcode.app/Contents/Developer/Platforms/MacOSX.platform/Developer/SDKs/MacOSX10.14.sdk /Users/buildslave/jenkins/workspace/test-mr-clang-stage1-RA/llvm/projects/compiler-rt/test/fuzzer/DivTest.cpp -fsanitize-coverage=trace-div -o /Users/buildslave/jenkins/workspace/test-mr-clang-stage1-RA/clang-build/tools/clang/runtime/compiler-rt-bins/test/fuzzer/X86_64DefaultDarwinConfig/Output/value-profile-div.test.tmp-DivTest : 'RUN: at line 5'; not /Users/buildslave/jenkins/workspace/test-mr-clang-stage1-RA/clang-build/tools/clang/runtime/compiler-rt-bins/test/fuzzer/X86_64DefaultDarwinConfig/Output/value-profile-div.test.tmp-DivTest -seed=1 -use_value_profile=1 -runs=10000000 2>&1 | FileCheck /Users/buildslave/jenkins/workspace/test-mr-clang-stage1-RA/llvm/projects/compiler-rt/test/fuzzer/value-profile-div.test -- Exit Code: 137

Hide Details

Command Output (stderr): -- /Users/buildslave/jenkins/workspace/test-mr-clang-stage1-RA/clang-build/tools/clang/runtime/compiler-rt-bins/test/fuzzer/X86_64DefaultDarwinConfig/Output/value-profile-div.test.script: line 2: 22417 Done not /Users/buildslave/jenkins/workspace/test-mr-clang-stage1-RA/clang-build/tools/clang/runtime/compiler-rt-bins/test/fuzzer/X86_64DefaultDarwinConfig/Output/value-profile-div.test.tmp-DivTest -seed=1 -use_value_profile=1 -runs=10000000 2>&1 22418 Killed: 9 | FileCheck /Users/buildslave/jenkins/workspace/test-mr-clang-stage1-RA/llvm/projects/compiler-rt/test/fuzzer/value-profile-div.test

Hide Details

--

Hide Details

******************** FAIL: libFuzzer :: value-profile-cmp4.test (2660 of 2668) ******************** TEST 'libFuzzer :: value-profile-cmp4.test' FAILED ******************** Script: -- : 'RUN: at line 2'; /Users/buildslave/jenkins/workspace/test-mr-clang-stage1-RA/clang-build/./bin/clang --driver-mode=g++ -O2 -gline-tables-only -fsanitize=address,fuzzer -I/Users/buildslave/jenkins/workspace/test-mr-clang-stage1-RA/llvm/projects/compiler-rt/lib/fuzzer -arch x86_64 -stdlib=libc++ -mmacosx-version-min=10.9 -isysroot /Applications/Xcode.app/Contents/Developer/Platforms/MacOSX.platform/Developer/SDKs/MacOSX10.14.sdk /Users/buildslave/jenkins/workspace/test-mr-clang-stage1-RA/llvm/projects/compiler-rt/test/fuzzer/AbsNegAndConstant64Test.cpp -o /Users/buildslave/jenkins/workspace/test-mr-clang-stage1-RA/clang-build/tools/clang/runtime/compiler-rt-bins/test/fuzzer/X86_64DefaultDarwinConfig/Output/value-profile-cmp4.test.tmp-AbsNegAndConstant64Test : 'RUN: at line 3'; not /Users/buildslave/jenkins/workspace/test-mr-clang-stage1-RA/clang-build/tools/clang/runtime/compiler-rt-bins/test/fuzzer/X86_64DefaultDarwinConfig/Output/value-profile-cmp4.test.tmp-AbsNegAndConstant64Test -seed=1 -use_cmp=0 -use_value_profile=1 -runs=100000000 2>&1 | FileCheck /Users/buildslave/jenkins/workspace/test-mr-clang-stage1-RA/llvm/projects/compiler-rt/test/fuzzer/value-profile-cmp4.test -- Exit Code: 137

Hide Details

Command Output (stderr): -- /Users/buildslave/jenkins/workspace/test-mr-clang-stage1-RA/llvm/projects/compiler-rt/test/fuzzer/AbsNegAndConstant64Test.cpp:20:69: warning: format specifies type 'unsigned long' but the argument has type 'int64_t' (aka 'long long') [-Wformat] printf("BINGO; Found the target, exiting; x = 0x%lx y 0x%lx\n", x, y); ~~~ ^ %llx /Users/buildslave/jenkins/workspace/test-mr-clang-stage1-RA/llvm/projects/compiler-rt/test/fuzzer/AbsNegAndConstant64Test.cpp:20:72: warning: format specifies type 'unsigned long' but the argument has type 'uint64_t' (aka 'unsigned long long') [-Wformat] printf("BINGO; Found the target, exiting; x = 0x%lx y 0x%lx\n", x, y); ~~~ ^ %llx 2 warnings generated. /Users/buildslave/jenkins/workspace/test-mr-clang-stage1-RA/clang-build/tools/clang/runtime/compiler-rt-bins/test/fuzzer/X86_64DefaultDarwinConfig/Output/value-profile-cmp4.test.script: line 2: 22404 Done not /Users/buildslave/jenkins/workspace/test-mr-clang-stage1-RA/clang-build/tools/clang/runtime/compiler-rt-bins/test/fuzzer/X86_64DefaultDarwinConfig/Output/value-profile-cmp4.test.tmp-AbsNegAndConstant64Test -seed=1 -use_cmp=0 -use_value_profile=1 -runs=100000000 2>&1 22405 Killed: 9 | FileCheck /Users/buildslave/jenkins/workspace/test-mr-clang-stage1-RA/llvm/projects/compiler-rt/test/fuzzer/value-profile-cmp4.test

Hide Details

--

Hide Details

******************** FAIL: libFuzzer :: value-profile-cmp.test (2661 of 2668) ******************** TEST 'libFuzzer :: value-profile-cmp.test' FAILED ******************** Script: -- : 'RUN: at line 3'; /Users/buildslave/jenkins/workspace/test-mr-clang-stage1-RA/clang-build/./bin/clang --driver-mode=g++ -O2 -gline-tables-only -fsanitize=address,fuzzer -I/Users/buildslave/jenkins/workspace/test-mr-clang-stage1-RA/llvm/projects/compiler-rt/lib/fuzzer -arch x86_64 -stdlib=libc++ -mmacosx-version-min=10.9 -isysroot /Applications/Xcode.app/Contents/Developer/Platforms/MacOSX.platform/Developer/SDKs/MacOSX10.14.sdk /Users/buildslave/jenkins/workspace/test-mr-clang-stage1-RA/llvm/projects/compiler-rt/test/fuzzer/SimpleCmpTest.cpp -o /Users/buildslave/jenkins/workspace/test-mr-clang-stage1-RA/clang-build/tools/clang/runtime/compiler-rt-bins/test/fuzzer/X86_64DefaultDarwinConfig/Output/value-profile-cmp.test.tmp-SimpleCmpTest : 'RUN: at line 4'; not /Users/buildslave/jenkins/workspace/test-mr-clang-stage1-RA/clang-build/tools/clang/runtime/compiler-rt-bins/test/fuzzer/X86_64DefaultDarwinConfig/Output/value-profile-cmp.test.tmp-SimpleCmpTest -seed=1 -use_cmp=0 -use_value_profile=1 -runs=100000000 2>&1 | FileCheck /Users/buildslave/jenkins/workspace/test-mr-clang-stage1-RA/llvm/projects/compiler-rt/test/fuzzer/value-profile-cmp.test -- Exit Code: 137

Hide Details

Command Output (stderr): -- /Users/buildslave/jenkins/workspace/test-mr-clang-stage1-RA/llvm/projects/compiler-rt/test/fuzzer/SimpleCmpTest.cpp:42:19: warning: format specifies type 'ssize_t' (aka 'long') but the argument has type 'uint64_t' (aka 'unsigned long long') [-Wformat] Size, x, y, z, a); ^ /Users/buildslave/jenkins/workspace/test-mr-clang-stage1-RA/llvm/projects/compiler-rt/test/fuzzer/SimpleCmpTest.cpp:42:22: warning: format specifies type 'ssize_t' (aka 'long') but the argument has type 'int64_t' (aka 'long long') [-Wformat] Size, x, y, z, a); ^ 2 warnings generated. /Users/buildslave/jenkins/workspace/test-mr-clang-stage1-RA/clang-build/tools/clang/runtime/compiler-rt-bins/test/fuzzer/X86_64DefaultDarwinConfig/Output/value-profile-cmp.test.script: line 2: 22361 Done not /Users/buildslave/jenkins/workspace/test-mr-clang-stage1-RA/clang-build/tools/clang/runtime/compiler-rt-bins/test/fuzzer/X86_64DefaultDarwinConfig/Output/value-profile-cmp.test.tmp-SimpleCmpTest -seed=1 -use_cmp=0 -use_value_profile=1 -runs=100000000 2>&1 22362 Killed: 9 | FileCheck /Users/buildslave/jenkins/workspace/test-mr-clang-stage1-RA/llvm/projects/compiler-rt/test/fuzzer/value-profile-cmp.test

Hide Details

--

Hide Details

******************** FAIL: libFuzzer :: value-profile-mem.test (2662 of 2668) ******************** TEST 'libFuzzer :: value-profile-mem.test' FAILED ******************** Script: -- : 'RUN: at line 5'; /Users/buildslave/jenkins/workspace/test-mr-clang-stage1-RA/clang-build/./bin/clang --driver-mode=g++ -O2 -gline-tables-only -fsanitize=address,fuzzer -I/Users/buildslave/jenkins/workspace/test-mr-clang-stage1-RA/llvm/projects/compiler-rt/lib/fuzzer -arch x86_64 -stdlib=libc++ -mmacosx-version-min=10.9 -isysroot /Applications/Xcode.app/Contents/Developer/Platforms/MacOSX.platform/Developer/SDKs/MacOSX10.14.sdk /Users/buildslave/jenkins/workspace/test-mr-clang-stage1-RA/llvm/projects/compiler-rt/test/fuzzer/SingleMemcmpTest.cpp -o /Users/buildslave/jenkins/workspace/test-mr-clang-stage1-RA/clang-build/tools/clang/runtime/compiler-rt-bins/test/fuzzer/X86_64DefaultDarwinConfig/Output/value-profile-mem.test.tmp-SingleMemcmpTest -fno-sanitize-coverage=trace-cmp : 'RUN: at line 6'; not /Users/buildslave/jenkins/workspace/test-mr-clang-stage1-RA/clang-build/tools/clang/runtime/compiler-rt-bins/test/fuzzer/X86_64DefaultDarwinConfig/Output/value-profile-mem.test.tmp-SingleMemcmpTest -seed=1 -use_cmp=0 -use_value_profile=1 -runs=10000000 2>&1 | FileCheck /Users/buildslave/jenkins/workspace/test-mr-clang-stage1-RA/llvm/projects/compiler-rt/test/fuzzer/value-profile-mem.test -- Exit Code: 137

Hide Details

Command Output (stderr): -- /Users/buildslave/jenkins/workspace/test-mr-clang-stage1-RA/clang-build/tools/clang/runtime/compiler-rt-bins/test/fuzzer/X86_64DefaultDarwinConfig/Output/value-profile-mem.test.script: line 2: 22443 Done not /Users/buildslave/jenkins/workspace/test-mr-clang-stage1-RA/clang-build/tools/clang/runtime/compiler-rt-bins/test/fuzzer/X86_64DefaultDarwinConfig/Output/value-profile-mem.test.tmp-SingleMemcmpTest -seed=1 -use_cmp=0 -use_value_profile=1 -runs=10000000 2>&1 22444 Killed: 9 | FileCheck /Users/buildslave/jenkins/workspace/test-mr-clang-stage1-RA/llvm/projects/compiler-rt/test/fuzzer/value-profile-mem.test

Hide Details

--

Hide Details

******************** FAIL: libFuzzer :: value-profile-strcmp.test (2663 of 2668) ******************** TEST 'libFuzzer :: value-profile-strcmp.test' FAILED ******************** Script: -- : 'RUN: at line 4'; /Users/buildslave/jenkins/workspace/test-mr-clang-stage1-RA/clang-build/./bin/clang --driver-mode=g++ -O2 -gline-tables-only -fsanitize=address,fuzzer -I/Users/buildslave/jenkins/workspace/test-mr-clang-stage1-RA/llvm/projects/compiler-rt/lib/fuzzer -arch x86_64 -stdlib=libc++ -mmacosx-version-min=10.9 -isysroot /Applications/Xcode.app/Contents/Developer/Platforms/MacOSX.platform/Developer/SDKs/MacOSX10.14.sdk /Users/buildslave/jenkins/workspace/test-mr-clang-stage1-RA/llvm/projects/compiler-rt/test/fuzzer/SingleStrcmpTest.cpp -o /Users/buildslave/jenkins/workspace/test-mr-clang-stage1-RA/clang-build/tools/clang/runtime/compiler-rt-bins/test/fuzzer/X86_64DefaultDarwinConfig/Output/value-profile-strcmp.test.tmp-SingleStrcmpTest : 'RUN: at line 5'; not /Users/buildslave/jenkins/workspace/test-mr-clang-stage1-RA/clang-build/tools/clang/runtime/compiler-rt-bins/test/fuzzer/X86_64DefaultDarwinConfig/Output/value-profile-strcmp.test.tmp-SingleStrcmpTest -seed=1 -use_cmp=0 -use_value_profile=1 -runs=10000000 2>&1 | FileCheck /Users/buildslave/jenkins/workspace/test-mr-clang-stage1-RA/llvm/projects/compiler-rt/test/fuzzer/value-profile-strcmp.test -- Exit Code: 137

Hide Details

Command Output (stderr): -- /Users/buildslave/jenkins/workspace/test-mr-clang-stage1-RA/clang-build/tools/clang/runtime/compiler-rt-bins/test/fuzzer/X86_64DefaultDarwinConfig/Output/value-profile-strcmp.test.script: line 2: 22469 Done not /Users/buildslave/jenkins/workspace/test-mr-clang-stage1-RA/clang-build/tools/clang/runtime/compiler-rt-bins/test/fuzzer/X86_64DefaultDarwinConfig/Output/value-profile-strcmp.test.tmp-SingleStrcmpTest -seed=1 -use_cmp=0 -use_value_profile=1 -runs=10000000 2>&1 22470 Killed: 9 | FileCheck /Users/buildslave/jenkins/workspace/test-mr-clang-stage1-RA/llvm/projects/compiler-rt/test/fuzzer/value-profile-strcmp.test

Hide Details

--

Hide Details

******************** FAIL: libFuzzer :: value-profile-strncmp.test (2664 of 2668) ******************** TEST 'libFuzzer :: value-profile-strncmp.test' FAILED ******************** Script: -- : 'RUN: at line 3'; /Users/buildslave/jenkins/workspace/test-mr-clang-stage1-RA/clang-build/./bin/clang --driver-mode=g++ -O2 -gline-tables-only -fsanitize=address,fuzzer -I/Users/buildslave/jenkins/workspace/test-mr-clang-stage1-RA/llvm/projects/compiler-rt/lib/fuzzer -arch x86_64 -stdlib=libc++ -mmacosx-version-min=10.9 -isysroot /Applications/Xcode.app/Contents/Developer/Platforms/MacOSX.platform/Developer/SDKs/MacOSX10.14.sdk /Users/buildslave/jenkins/workspace/test-mr-clang-stage1-RA/llvm/projects/compiler-rt/test/fuzzer/SingleStrncmpTest.cpp -o /Users/buildslave/jenkins/workspace/test-mr-clang-stage1-RA/clang-build/tools/clang/runtime/compiler-rt-bins/test/fuzzer/X86_64DefaultDarwinConfig/Output/value-profile-strncmp.test.tmp-SingleStrncmpTest : 'RUN: at line 4'; not /Users/buildslave/jenkins/workspace/test-mr-clang-stage1-RA/clang-build/tools/clang/runtime/compiler-rt-bins/test/fuzzer/X86_64DefaultDarwinConfig/Output/value-profile-strncmp.test.tmp-SingleStrncmpTest -seed=1 -use_cmp=0 -use_value_profile=1 -runs=100000000 2>&1 | FileCheck /Users/buildslave/jenkins/workspace/test-mr-clang-stage1-RA/llvm/projects/compiler-rt/test/fuzzer/value-profile-strncmp.test -- Exit Code: 137

Hide Details

Command Output (stderr): -- /Users/buildslave/jenkins/workspace/test-mr-clang-stage1-RA/clang-build/tools/clang/runtime/compiler-rt-bins/test/fuzzer/X86_64DefaultDarwinConfig/Output/value-profile-strncmp.test.script: line 2: 22483 Done not /Users/buildslave/jenkins/workspace/test-mr-clang-stage1-RA/clang-build/tools/clang/runtime/compiler-rt-bins/test/fuzzer/X86_64DefaultDarwinConfig/Output/value-profile-strncmp.test.tmp-SingleStrncmpTest -seed=1 -use_cmp=0 -use_value_profile=1 -runs=100000000 2>&1 22484 Killed: 9 | FileCheck /Users/buildslave/jenkins/workspace/test-mr-clang-stage1-RA/llvm/projects/compiler-rt/test/fuzzer/value-profile-strncmp.test

Hide Details

--

Hide Details

******************** FAIL: libFuzzer :: value-profile-set.test (2665 of 2668) ******************** TEST 'libFuzzer :: value-profile-set.test' FAILED ******************** Script: -- : 'RUN: at line 3'; /Users/buildslave/jenkins/workspace/test-mr-clang-stage1-RA/clang-build/./bin/clang --driver-mode=g++ -O2 -gline-tables-only -fsanitize=address,fuzzer -I/Users/buildslave/jenkins/workspace/test-mr-clang-stage1-RA/llvm/projects/compiler-rt/lib/fuzzer -arch x86_64 -stdlib=libc++ -mmacosx-version-min=10.9 -isysroot /Applications/Xcode.app/Contents/Developer/Platforms/MacOSX.platform/Developer/SDKs/MacOSX10.14.sdk /Users/buildslave/jenkins/workspace/test-mr-clang-stage1-RA/llvm/projects/compiler-rt/test/fuzzer/FourIndependentBranchesTest.cpp -o /Users/buildslave/jenkins/workspace/test-mr-clang-stage1-RA/clang-build/tools/clang/runtime/compiler-rt-bins/test/fuzzer/X86_64DefaultDarwinConfig/Output/value-profile-set.test.tmp-FourIndependentBranchesTest : 'RUN: at line 4'; not /Users/buildslave/jenkins/workspace/test-mr-clang-stage1-RA/clang-build/tools/clang/runtime/compiler-rt-bins/test/fuzzer/X86_64DefaultDarwinConfig/Output/value-profile-set.test.tmp-FourIndependentBranchesTest -seed=1 -use_cmp=0 -use_value_profile=1 -runs=100000000 2>&1 | FileCheck /Users/buildslave/jenkins/workspace/test-mr-clang-stage1-RA/llvm/projects/compiler-rt/test/fuzzer/value-profile-set.test -- Exit Code: 137

Hide Details

Command Output (stderr): -- /Users/buildslave/jenkins/workspace/test-mr-clang-stage1-RA/clang-build/tools/clang/runtime/compiler-rt-bins/test/fuzzer/X86_64DefaultDarwinConfig/Output/value-profile-set.test.script: line 2: 22456 Done not /Users/buildslave/jenkins/workspace/test-mr-clang-stage1-RA/clang-build/tools/clang/runtime/compiler-rt-bins/test/fuzzer/X86_64DefaultDarwinConfig/Output/value-profile-set.test.tmp-FourIndependentBranchesTest -seed=1 -use_cmp=0 -use_value_profile=1 -runs=100000000 2>&1 22457 Killed: 9 | FileCheck /Users/buildslave/jenkins/workspace/test-mr-clang-stage1-RA/llvm/projects/compiler-rt/test/fuzzer/value-profile-set.test

Hide Details

--

Hide Details

******************** UNSUPPORTED: libFuzzer :: windows-opt-ref.test (2666 of 2668) FAIL: libFuzzer :: value-profile-load.test (2667 of 2668) ******************** TEST 'libFuzzer :: value-profile-load.test' FAILED ******************** Script: -- : 'RUN: at line 2'; /Users/buildslave/jenkins/workspace/test-mr-clang-stage1-RA/clang-build/./bin/clang --driver-mode=g++ -O2 -gline-tables-only -fsanitize=address,fuzzer -I/Users/buildslave/jenkins/workspace/test-mr-clang-stage1-RA/llvm/projects/compiler-rt/lib/fuzzer -arch x86_64 -stdlib=libc++ -mmacosx-version-min=10.9 -isysroot /Applications/Xcode.app/Contents/Developer/Platforms/MacOSX.platform/Developer/SDKs/MacOSX10.14.sdk /Users/buildslave/jenkins/workspace/test-mr-clang-stage1-RA/llvm/projects/compiler-rt/test/fuzzer/LoadTest.cpp -fsanitize-coverage=trace-gep -o /Users/buildslave/jenkins/workspace/test-mr-clang-stage1-RA/clang-build/tools/clang/runtime/compiler-rt-bins/test/fuzzer/X86_64DefaultDarwinConfig/Output/value-profile-load.test.tmp-LoadTest : 'RUN: at line 3'; not /Users/buildslave/jenkins/workspace/test-mr-clang-stage1-RA/clang-build/tools/clang/runtime/compiler-rt-bins/test/fuzzer/X86_64DefaultDarwinConfig/Output/value-profile-load.test.tmp-LoadTest -seed=2 -use_cmp=0 -use_value_profile=1 -runs=20000000 2>&1 | FileCheck /Users/buildslave/jenkins/workspace/test-mr-clang-stage1-RA/llvm/projects/compiler-rt/test/fuzzer/value-profile-load.test -- Exit Code: 137

Hide Details

Command Output (stderr): -- /Users/buildslave/jenkins/workspace/test-mr-clang-stage1-RA/clang-build/tools/clang/runtime/compiler-rt-bins/test/fuzzer/X86_64DefaultDarwinConfig/Output/value-profile-load.test.script: line 2: 22430 Done not /Users/buildslave/jenkins/workspace/test-mr-clang-stage1-RA/clang-build/tools/clang/runtime/compiler-rt-bins/test/fuzzer/X86_64DefaultDarwinConfig/Output/value-profile-load.test.tmp-LoadTest -seed=2 -use_cmp=0 -use_value_profile=1 -runs=20000000 2>&1 22431 Killed: 9 | FileCheck /Users/buildslave/jenkins/workspace/test-mr-clang-stage1-RA/llvm/projects/compiler-rt/test/fuzzer/value-profile-load.test

Hide Details

--

Hide Details

******************** FAIL: libFuzzer :: value-profile-switch.test (2668 of 2668) ******************** TEST 'libFuzzer :: value-profile-switch.test' FAILED ******************** Script: -- : 'RUN: at line 3'; /Users/buildslave/jenkins/workspace/test-mr-clang-stage1-RA/clang-build/./bin/clang --driver-mode=g++ -O2 -gline-tables-only -fsanitize=address,fuzzer -I/Users/buildslave/jenkins/workspace/test-mr-clang-stage1-RA/llvm/projects/compiler-rt/lib/fuzzer -arch x86_64 -stdlib=libc++ -mmacosx-version-min=10.9 -isysroot /Applications/Xcode.app/Contents/Developer/Platforms/MacOSX.platform/Developer/SDKs/MacOSX10.14.sdk /Users/buildslave/jenkins/workspace/test-mr-clang-stage1-RA/llvm/projects/compiler-rt/test/fuzzer/SwitchTest.cpp -o /Users/buildslave/jenkins/workspace/test-mr-clang-stage1-RA/clang-build/tools/clang/runtime/compiler-rt-bins/test/fuzzer/X86_64DefaultDarwinConfig/Output/value-profile-switch.test.tmp-SwitchTest : 'RUN: at line 4'; /Users/buildslave/jenkins/workspace/test-mr-clang-stage1-RA/clang-build/./bin/clang --driver-mode=g++ -O2 -gline-tables-only -fsanitize=address,fuzzer -I/Users/buildslave/jenkins/workspace/test-mr-clang-stage1-RA/llvm/projects/compiler-rt/lib/fuzzer -arch x86_64 -stdlib=libc++ -mmacosx-version-min=10.9 -isysroot /Applications/Xcode.app/Contents/Developer/Platforms/MacOSX.platform/Developer/SDKs/MacOSX10.14.sdk /Users/buildslave/jenkins/workspace/test-mr-clang-stage1-RA/llvm/projects/compiler-rt/test/fuzzer/Switch2Test.cpp -o /Users/buildslave/jenkins/workspace/test-mr-clang-stage1-RA/clang-build/tools/clang/runtime/compiler-rt-bins/test/fuzzer/X86_64DefaultDarwinConfig/Output/value-profile-switch.test.tmp-Switch2Test : 'RUN: at line 5'; /Users/buildslave/jenkins/workspace/test-mr-clang-stage1-RA/clang-build/./bin/clang --driver-mode=g++ -O2 -gline-tables-only -fsanitize=address,fuzzer -I/Users/buildslave/jenkins/workspace/test-mr-clang-stage1-RA/llvm/projects/compiler-rt/lib/fuzzer -arch x86_64 -stdlib=libc++ -mmacosx-version-min=10.9 -isysroot /Applications/Xcode.app/Contents/Developer/Platforms/MacOSX.platform/Developer/SDKs/MacOSX10.14.sdk /Users/buildslave/jenkins/workspace/test-mr-clang-stage1-RA/llvm/projects/compiler-rt/test/fuzzer/Switch3Test.cpp -o /Users/buildslave/jenkins/workspace/test-mr-clang-stage1-RA/clang-build/tools/clang/runtime/compiler-rt-bins/test/fuzzer/X86_64DefaultDarwinConfig/Output/value-profile-switch.test.tmp-Switch3Test : 'RUN: at line 6'; not /Users/buildslave/jenkins/workspace/test-mr-clang-stage1-RA/clang-build/tools/clang/runtime/compiler-rt-bins/test/fuzzer/X86_64DefaultDarwinConfig/Output/value-profile-switch.test.tmp-SwitchTest -use_cmp=0 -use_value_profile=1 -runs=100000000 -seed=1 2>&1 | FileCheck /Users/buildslave/jenkins/workspace/test-mr-clang-stage1-RA/llvm/projects/compiler-rt/test/fuzzer/value-profile-switch.test : 'RUN: at line 7'; not /Users/buildslave/jenkins/workspace/test-mr-clang-stage1-RA/clang-build/tools/clang/runtime/compiler-rt-bins/test/fuzzer/X86_64DefaultDarwinConfig/Output/value-profile-switch.test.tmp-Switch2Test -use_cmp=0 -use_value_profile=1 -runs=100000000 -seed=1 2>&1 | FileCheck /Users/buildslave/jenkins/workspace/test-mr-clang-stage1-RA/llvm/projects/compiler-rt/test/fuzzer/value-profile-switch.test : 'RUN: at line 8'; not /Users/buildslave/jenkins/workspace/test-mr-clang-stage1-RA/clang-build/tools/clang/runtime/compiler-rt-bins/test/fuzzer/X86_64DefaultDarwinConfig/Output/value-profile-switch.test.tmp-Switch3Test -use_cmp=0 -use_value_profile=1 -runs=100000000 -seed=1 2>&1 -- Exit Code: 137

Hide Details

Command Output (stderr): -- /Users/buildslave/jenkins/workspace/test-mr-clang-stage1-RA/clang-build/tools/clang/runtime/compiler-rt-bins/test/fuzzer/X86_64DefaultDarwinConfig/Output/value-profile-switch.test.script: line 6: 22509 Done not /Users/buildslave/jenkins/workspace/test-mr-clang-stage1-RA/clang-build/tools/clang/runtime/compiler-rt-bins/test/fuzzer/X86_64DefaultDarwinConfig/Output/value-profile-switch.test.tmp-SwitchTest -use_cmp=0 -use_value_profile=1 -runs=100000000 -seed=1 2>&1 22510 Killed: 9 | FileCheck /Users/buildslave/jenkins/workspace/test-mr-clang-stage1-RA/llvm/projects/compiler-rt/test/fuzzer/value-profile-switch.test

Hide Details

--

Hide Details

********************

Hide Details

21 warning(s) in tests. Testing Time: 716.67s ******************** Failing Tests (629): SanitizerCommon-asan-x86_64-Darwin :: symbolize_stack.cpp SanitizerCommon-lsan-x86_64-Darwin :: Darwin/print-stack-trace.cpp SanitizerCommon-lsan-x86_64-Darwin :: Posix/arc4random.cpp SanitizerCommon-lsan-x86_64-Darwin :: Posix/dedup_token_length_test.cpp SanitizerCommon-lsan-x86_64-Darwin :: Posix/devname.cpp SanitizerCommon-lsan-x86_64-Darwin :: Posix/devname_r.cpp SanitizerCommon-lsan-x86_64-Darwin :: Posix/dump_instruction_bytes.cpp SanitizerCommon-lsan-x86_64-Darwin :: Posix/fgets.cpp SanitizerCommon-lsan-x86_64-Darwin :: Posix/fpe.cpp SanitizerCommon-lsan-x86_64-Darwin :: Posix/fputc_putc_putchar.cpp SanitizerCommon-lsan-x86_64-Darwin :: Posix/fputs_puts.cpp SanitizerCommon-lsan-x86_64-Darwin :: Posix/getmntinfo.cpp SanitizerCommon-lsan-x86_64-Darwin :: Posix/getpass.cpp SanitizerCommon-lsan-x86_64-Darwin :: Posix/getpw_getgr.cpp SanitizerCommon-lsan-x86_64-Darwin :: Posix/getusershell.cpp SanitizerCommon-lsan-x86_64-Darwin :: Posix/illegal_read_test.cpp SanitizerCommon-lsan-x86_64-Darwin :: Posix/illegal_write_test.cpp SanitizerCommon-lsan-x86_64-Darwin :: Posix/popen.cpp SanitizerCommon-lsan-x86_64-Darwin :: Posix/posix_memalign-alignment.cpp SanitizerCommon-lsan-x86_64-Darwin :: Posix/putc_putchar_unlocked.cpp SanitizerCommon-lsan-x86_64-Darwin :: Posix/readlinkat.c SanitizerCommon-lsan-x86_64-Darwin :: Posix/sanitizer_set_report_fd_test.cpp SanitizerCommon-lsan-x86_64-Darwin :: Posix/setvbuf.cpp SanitizerCommon-lsan-x86_64-Darwin :: Posix/strlcat.cpp SanitizerCommon-lsan-x86_64-Darwin :: Posix/strlcpy.cpp SanitizerCommon-lsan-x86_64-Darwin :: Posix/sysctl.cpp SanitizerCommon-lsan-x86_64-Darwin :: allocator_returns_null.cpp SanitizerCommon-lsan-x86_64-Darwin :: ctype.c SanitizerCommon-lsan-x86_64-Darwin :: get_module_and_offset_for_pc.cpp SanitizerCommon-lsan-x86_64-Darwin :: malloc_hook.cpp SanitizerCommon-lsan-x86_64-Darwin :: options-include.cpp SanitizerCommon-lsan-x86_64-Darwin :: options-invalid.cpp SanitizerCommon-lsan-x86_64-Darwin :: sanitizer_coverage_inline8bit_counter.cpp SanitizerCommon-lsan-x86_64-Darwin :: sanitizer_coverage_no_prune.cpp SanitizerCommon-lsan-x86_64-Darwin :: sanitizer_coverage_stack_depth.cpp SanitizerCommon-lsan-x86_64-Darwin :: sanitizer_coverage_trace_pc_guard.cpp SanitizerCommon-lsan-x86_64-Darwin :: symbolize_pc.cpp SanitizerCommon-tsan-x86_64-Darwin :: Darwin/fputs_puts_null.cpp SanitizerCommon-tsan-x86_64-Darwin :: Darwin/malloc_zone.cpp SanitizerCommon-tsan-x86_64-Darwin :: Darwin/print-stack-trace.cpp SanitizerCommon-tsan-x86_64-Darwin :: Posix/arc4random.cpp SanitizerCommon-tsan-x86_64-Darwin :: Posix/devname.cpp SanitizerCommon-tsan-x86_64-Darwin :: Posix/devname_r.cpp SanitizerCommon-tsan-x86_64-Darwin :: Posix/dump_instruction_bytes.cpp SanitizerCommon-tsan-x86_64-Darwin :: Posix/fpe.cpp SanitizerCommon-tsan-x86_64-Darwin :: Posix/fputc_putc_putchar.cpp SanitizerCommon-tsan-x86_64-Darwin :: Posix/fputs_puts.cpp SanitizerCommon-tsan-x86_64-Darwin :: Posix/getmntinfo.cpp SanitizerCommon-tsan-x86_64-Darwin :: Posix/getpass.cpp SanitizerCommon-tsan-x86_64-Darwin :: Posix/getusershell.cpp SanitizerCommon-tsan-x86_64-Darwin :: Posix/illegal_read_test.cpp SanitizerCommon-tsan-x86_64-Darwin :: Posix/illegal_write_test.cpp SanitizerCommon-tsan-x86_64-Darwin :: Posix/popen.cpp SanitizerCommon-tsan-x86_64-Darwin :: Posix/posix_memalign-alignment.cpp SanitizerCommon-tsan-x86_64-Darwin :: Posix/putc_putchar_unlocked.cpp SanitizerCommon-tsan-x86_64-Darwin :: Posix/sanitizer_set_death_callback_test.cpp SanitizerCommon-tsan-x86_64-Darwin :: Posix/sanitizer_set_report_fd_test.cpp SanitizerCommon-tsan-x86_64-Darwin :: Posix/setvbuf.cpp SanitizerCommon-tsan-x86_64-Darwin :: Posix/strlcpy.cpp SanitizerCommon-tsan-x86_64-Darwin :: Posix/sysctl.cpp SanitizerCommon-tsan-x86_64-Darwin :: allocator_returns_null.cpp SanitizerCommon-tsan-x86_64-Darwin :: ctype.c SanitizerCommon-tsan-x86_64-Darwin :: get_module_and_offset_for_pc.cpp SanitizerCommon-tsan-x86_64-Darwin :: malloc_hook.cpp SanitizerCommon-tsan-x86_64-Darwin :: symbolize_pc.cpp SanitizerCommon-tsan-x86_64-Darwin :: symbolize_stack.cpp SanitizerCommon-ubsan-x86_64-Darwin :: Darwin/abort_on_error.cpp SanitizerCommon-ubsan-x86_64-Darwin :: Darwin/fputs_puts_null.cpp SanitizerCommon-ubsan-x86_64-Darwin :: Darwin/print-stack-trace.cpp SanitizerCommon-ubsan-x86_64-Darwin :: Posix/arc4random.cpp SanitizerCommon-ubsan-x86_64-Darwin :: Posix/dedup_token_length_test.cpp SanitizerCommon-ubsan-x86_64-Darwin :: Posix/devname.cpp SanitizerCommon-ubsan-x86_64-Darwin :: Posix/devname_r.cpp SanitizerCommon-ubsan-x86_64-Darwin :: Posix/dump_instruction_bytes.cpp SanitizerCommon-ubsan-x86_64-Darwin :: Posix/fgetc_ungetc_getc.cpp SanitizerCommon-ubsan-x86_64-Darwin :: Posix/fpe.cpp SanitizerCommon-ubsan-x86_64-Darwin :: Posix/fputc_putc_putchar.cpp SanitizerCommon-ubsan-x86_64-Darwin :: Posix/fputs_puts.cpp SanitizerCommon-ubsan-x86_64-Darwin :: Posix/getmntinfo.cpp SanitizerCommon-ubsan-x86_64-Darwin :: Posix/getpass.cpp SanitizerCommon-ubsan-x86_64-Darwin :: Posix/getusershell.cpp SanitizerCommon-ubsan-x86_64-Darwin :: Posix/illegal_read_test.cpp SanitizerCommon-ubsan-x86_64-Darwin :: Posix/illegal_write_test.cpp SanitizerCommon-ubsan-x86_64-Darwin :: Posix/popen.cpp SanitizerCommon-ubsan-x86_64-Darwin :: Posix/putc_putchar_unlocked.cpp SanitizerCommon-ubsan-x86_64-Darwin :: Posix/sanitizer_set_report_fd_test.cpp SanitizerCommon-ubsan-x86_64-Darwin :: Posix/setvbuf.cpp SanitizerCommon-ubsan-x86_64-Darwin :: Posix/strlcat.cpp SanitizerCommon-ubsan-x86_64-Darwin :: Posix/strlcpy.cpp SanitizerCommon-ubsan-x86_64-Darwin :: Posix/sysctl.cpp SanitizerCommon-ubsan-x86_64-Darwin :: ctype.c SanitizerCommon-ubsan-x86_64-Darwin :: get_module_and_offset_for_pc.cpp SanitizerCommon-ubsan-x86_64-Darwin :: options-include.cpp SanitizerCommon-ubsan-x86_64-Darwin :: sanitizer_coverage_inline8bit_counter.cpp SanitizerCommon-ubsan-x86_64-Darwin :: sanitizer_coverage_stack_depth.cpp SanitizerCommon-ubsan-x86_64-Darwin :: symbolize_pc.cpp SanitizerCommon-ubsan-x86_64-Darwin :: symbolize_stack.cpp SanitizerCommon-ubsan-x86_64-Darwin :: wcrtomb.c ThreadSanitizer-x86_64 :: Darwin/deadlock.mm ThreadSanitizer-x86_64 :: Darwin/dlopen.cpp ThreadSanitizer-x86_64 :: Darwin/external-ignore-noninstrumented.cpp ThreadSanitizer-x86_64 :: Darwin/external.cpp ThreadSanitizer-x86_64 :: Darwin/gcd-sync-block-copy.mm ThreadSanitizer-x86_64 :: Darwin/libcxx-call-once.mm ThreadSanitizer-x86_64 :: Darwin/libcxx-future.mm ThreadSanitizer-x86_64 :: Darwin/libcxx-shared-ptr-recursive.mm ThreadSanitizer-x86_64 :: Darwin/libcxx-shared-ptr-stress.mm ThreadSanitizer-x86_64 :: Darwin/libcxx-shared-ptr.mm ThreadSanitizer-x86_64 :: Darwin/mach_vm_allocate.c ThreadSanitizer-x86_64 :: Darwin/malloc-stack-logging.cpp ThreadSanitizer-x86_64 :: Darwin/malloc_size.mm ThreadSanitizer-x86_64 :: Darwin/norace-objcxx-run-time.mm ThreadSanitizer-x86_64 :: Darwin/objc-double-property.mm ThreadSanitizer-x86_64 :: Darwin/objc-simple.mm ThreadSanitizer-x86_64 :: Darwin/objc-synchronize-cycle-tagged.mm ThreadSanitizer-x86_64 :: Darwin/objc-synchronize-cycle.mm ThreadSanitizer-x86_64 :: Darwin/objc-synchronize-nested-recursive.mm ThreadSanitizer-x86_64 :: Darwin/objc-synchronize-tagged.mm ThreadSanitizer-x86_64 :: Darwin/objc-synchronize.mm ThreadSanitizer-x86_64 :: Darwin/os_unfair_lock.c ThreadSanitizer-x86_64 :: Darwin/osatomics-add.mm ThreadSanitizer-x86_64 :: Darwin/osatomics-bitops.mm ThreadSanitizer-x86_64 :: Darwin/osatomics-list.mm ThreadSanitizer-x86_64 :: Darwin/osspinlock-norace.cpp ThreadSanitizer-x86_64 :: Darwin/realloc-zero.cpp ThreadSanitizer-x86_64 :: Darwin/signals-blocked.cpp ThreadSanitizer-x86_64 :: Darwin/xpc-cancel.mm ThreadSanitizer-x86_64 :: Darwin/xpc-race.mm ThreadSanitizer-x86_64 :: Darwin/xpc.mm ThreadSanitizer-x86_64 :: annotate_happens_before.cpp ThreadSanitizer-x86_64 :: atexit.cpp ThreadSanitizer-x86_64 :: atexit2.cpp ThreadSanitizer-x86_64 :: atexit3.cpp ThreadSanitizer-x86_64 :: atomic_free.cpp ThreadSanitizer-x86_64 :: atomic_hle.cpp ThreadSanitizer-x86_64 :: atomic_norace.cpp ThreadSanitizer-x86_64 :: bench_shadow_flush.cpp ThreadSanitizer-x86_64 :: benign_race.cpp ThreadSanitizer-x86_64 :: blacklist.cpp ThreadSanitizer-x86_64 :: blacklist2.cpp ThreadSanitizer-x86_64 :: cond.c ThreadSanitizer-x86_64 :: cond_cancel.c ThreadSanitizer-x86_64 :: cond_destruction.cpp ThreadSanitizer-x86_64 :: custom_mutex0.cpp ThreadSanitizer-x86_64 :: custom_mutex1.cpp ThreadSanitizer-x86_64 :: custom_mutex4.cpp ThreadSanitizer-x86_64 :: custom_mutex5.cpp ThreadSanitizer-x86_64 :: cxa_guard_acquire.cpp ThreadSanitizer-x86_64 :: debug_locate.cpp ThreadSanitizer-x86_64 :: default_options.cpp ThreadSanitizer-x86_64 :: dlclose.cpp ThreadSanitizer-x86_64 :: dtls.c ThreadSanitizer-x86_64 :: exceptions.cpp ThreadSanitizer-x86_64 :: fd_close_norace.cpp ThreadSanitizer-x86_64 :: fd_close_norace2.cpp ThreadSanitizer-x86_64 :: fd_dup_norace.cpp ThreadSanitizer-x86_64 :: fd_dup_norace2.cpp ThreadSanitizer-x86_64 :: fd_pipe_norace.cpp ThreadSanitizer-x86_64 :: fd_socket_connect_norace.cpp ThreadSanitizer-x86_64 :: fd_socket_norace.cpp ThreadSanitizer-x86_64 :: fd_socketpair_norace.cpp ThreadSanitizer-x86_64 :: fiber_asm.cpp ThreadSanitizer-x86_64 :: fiber_from_thread.cpp ThreadSanitizer-x86_64 :: fiber_longjmp.cpp ThreadSanitizer-x86_64 :: fiber_simple.cpp ThreadSanitizer-x86_64 :: fiber_two_threads.cpp ThreadSanitizer-x86_64 :: fork_multithreaded.cpp ThreadSanitizer-x86_64 :: fork_multithreaded3.cpp ThreadSanitizer-x86_64 :: global_race.cpp ThreadSanitizer-x86_64 :: global_race2.cpp ThreadSanitizer-x86_64 :: ignore_free.cpp ThreadSanitizer-x86_64 :: ignore_lib1.cpp ThreadSanitizer-x86_64 :: ignore_lib5.cpp ThreadSanitizer-x86_64 :: ignore_malloc.cpp ThreadSanitizer-x86_64 :: ignore_race.cpp ThreadSanitizer-x86_64 :: ignored-interceptors-mmap.cpp ThreadSanitizer-x86_64 :: interface_atomic_test.c ThreadSanitizer-x86_64 :: java_alloc.cpp ThreadSanitizer-x86_64 :: java_finalizer.cpp ThreadSanitizer-x86_64 :: java_find.cpp ThreadSanitizer-x86_64 :: java_heap_init.cpp ThreadSanitizer-x86_64 :: java_lock.cpp ThreadSanitizer-x86_64 :: java_lock_move.cpp ThreadSanitizer-x86_64 :: java_lock_rec.cpp ThreadSanitizer-x86_64 :: java_move_overlap.cpp ThreadSanitizer-x86_64 :: java_race.cpp ThreadSanitizer-x86_64 :: java_rwlock.cpp ThreadSanitizer-x86_64 :: java_volatile.cpp ThreadSanitizer-x86_64 :: large_malloc_meta.cpp ThreadSanitizer-x86_64 :: libcxx/std_shared_ptr.cpp ThreadSanitizer-x86_64 :: libdispatch/after.c ThreadSanitizer-x86_64 :: libdispatch/apply-race.c ThreadSanitizer-x86_64 :: libdispatch/apply.c ThreadSanitizer-x86_64 :: libdispatch/async-norace.c ThreadSanitizer-x86_64 :: libdispatch/barrier-race.c ThreadSanitizer-x86_64 :: libdispatch/barrier.c ThreadSanitizer-x86_64 :: libdispatch/blocks.c ThreadSanitizer-x86_64 :: libdispatch/data.c ThreadSanitizer-x86_64 :: libdispatch/dispatch_main.c ThreadSanitizer-x86_64 :: libdispatch/dispatch_once_deadlock.c ThreadSanitizer-x86_64 :: libdispatch/fd.c ThreadSanitizer-x86_64 :: libdispatch/groups-destructor.cpp ThreadSanitizer-x86_64 :: libdispatch/groups-leave.c ThreadSanitizer-x86_64 :: libdispatch/groups-norace.c ThreadSanitizer-x86_64 :: libdispatch/groups-stress.c ThreadSanitizer-x86_64 :: libdispatch/io-barrier.c ThreadSanitizer-x86_64 :: libdispatch/io-cleanup.c ThreadSanitizer-x86_64 :: libdispatch/io.c ThreadSanitizer-x86_64 :: libdispatch/once.c ThreadSanitizer-x86_64 :: libdispatch/semaphore-norace.c ThreadSanitizer-x86_64 :: libdispatch/serial-queue-norace.c ThreadSanitizer-x86_64 :: libdispatch/source-cancel.c ThreadSanitizer-x86_64 :: libdispatch/source-cancel2.c ThreadSanitizer-x86_64 :: libdispatch/source-event.c ThreadSanitizer-x86_64 :: libdispatch/source-event2.c ThreadSanitizer-x86_64 :: libdispatch/source-registration.c ThreadSanitizer-x86_64 :: libdispatch/source-registration2.c ThreadSanitizer-x86_64 :: libdispatch/source-serial.c ThreadSanitizer-x86_64 :: libdispatch/suspend.c ThreadSanitizer-x86_64 :: libdispatch/sync-block-copy.cpp ThreadSanitizer-x86_64 :: libdispatch/sync-norace.c ThreadSanitizer-x86_64 :: libdispatch/target-queue-norace.c ThreadSanitizer-x86_64 :: longjmp.cpp ThreadSanitizer-x86_64 :: longjmp2.cpp ThreadSanitizer-x86_64 :: longjmp4.cpp ThreadSanitizer-x86_64 :: lots_of_threads.c ThreadSanitizer-x86_64 :: mmap_large.cpp ThreadSanitizer-x86_64 :: mmap_stress.cpp ThreadSanitizer-x86_64 :: mutex_annotations.cpp ThreadSanitizer-x86_64 :: mutex_bad_unlock.cpp ThreadSanitizer-x86_64 :: mutex_cycle2.c ThreadSanitizer-x86_64 :: mutex_cycle_long.c ThreadSanitizer-x86_64 :: mutex_destroy_locked2.cpp ThreadSanitizer-x86_64 :: mutex_lock_destroyed.cpp ThreadSanitizer-x86_64 :: mutexset1.cpp ThreadSanitizer-x86_64 :: mutexset2.cpp ThreadSanitizer-x86_64 :: mutexset3.cpp ThreadSanitizer-x86_64 :: mutexset4.cpp ThreadSanitizer-x86_64 :: mutexset5.cpp ThreadSanitizer-x86_64 :: mutexset6.cpp ThreadSanitizer-x86_64 :: printf-1.c ThreadSanitizer-x86_64 :: pthread_key.cpp ThreadSanitizer-x86_64 :: race_on_mutex.c ThreadSanitizer-x86_64 :: race_on_speculative_load.cpp ThreadSanitizer-x86_64 :: race_stress.cpp ThreadSanitizer-x86_64 :: real_deadlock_detector_stress_test.cpp ThreadSanitizer-x86_64 :: restore_stack.cpp ThreadSanitizer-x86_64 :: setuid.c ThreadSanitizer-x86_64 :: signal_block.cpp ThreadSanitizer-x86_64 :: signal_cond.cpp ThreadSanitizer-x86_64 :: signal_longjmp.cpp ThreadSanitizer-x86_64 :: signal_malloc.cpp ThreadSanitizer-x86_64 :: signal_pause.cpp ThreadSanitizer-x86_64 :: signal_write.cpp ThreadSanitizer-x86_64 :: sigsuspend.cpp ThreadSanitizer-x86_64 :: simple_stack.c ThreadSanitizer-x86_64 :: simple_stack2.cpp ThreadSanitizer-x86_64 :: sleep_sync2.cpp ThreadSanitizer-x86_64 :: stack_race2.cpp ThreadSanitizer-x86_64 :: stack_sync_reuse.cpp ThreadSanitizer-x86_64 :: static_init1.cpp ThreadSanitizer-x86_64 :: static_init2.cpp ThreadSanitizer-x86_64 :: static_init4.cpp ThreadSanitizer-x86_64 :: static_init5.cpp ThreadSanitizer-x86_64 :: static_init6.cpp ThreadSanitizer-x86_64 :: suppressions_race2.cpp ThreadSanitizer-x86_64 :: thread_detach.c ThreadSanitizer-x86_64 :: thread_detach2.c ThreadSanitizer-x86_64 :: thread_end_with_ignore3.cpp ThreadSanitizer-x86_64 :: thread_exit.c ThreadSanitizer-x86_64 :: thread_leak.c ThreadSanitizer-x86_64 :: thread_leak2.c ThreadSanitizer-x86_64 :: thread_leak3.c ThreadSanitizer-x86_64 :: thread_leak4.c ThreadSanitizer-x86_64 :: virtual_inheritance_compile_bug.cpp ThreadSanitizer-x86_64 :: vptr_benign_race.cpp ThreadSanitizer-x86_64 :: write_in_reader_lock.cpp UBSan-AddressSanitizer-x86_64 :: TestCases/Float/cast-overflow.cpp UBSan-AddressSanitizer-x86_64 :: TestCases/ImplicitConversion/integer-arithmetic-value-change.c UBSan-AddressSanitizer-x86_64 :: TestCases/ImplicitConversion/integer-conversion.c UBSan-AddressSanitizer-x86_64 :: TestCases/ImplicitConversion/integer-sign-change-blacklist.c UBSan-AddressSanitizer-x86_64 :: TestCases/ImplicitConversion/integer-sign-change-summary.cpp UBSan-AddressSanitizer-x86_64 :: TestCases/ImplicitConversion/integer-sign-change.c UBSan-AddressSanitizer-x86_64 :: TestCases/ImplicitConversion/integer-truncation.c UBSan-AddressSanitizer-x86_64 :: TestCases/ImplicitConversion/signed-integer-truncation-blacklist.c UBSan-AddressSanitizer-x86_64 :: TestCases/ImplicitConversion/signed-integer-truncation-or-sign-change-blacklist.c UBSan-AddressSanitizer-x86_64 :: TestCases/ImplicitConversion/signed-integer-truncation-or-sign-change-summary.cpp UBSan-AddressSanitizer-x86_64 :: TestCases/ImplicitConversion/signed-integer-truncation-summary.cpp UBSan-AddressSanitizer-x86_64 :: TestCases/ImplicitConversion/signed-integer-truncation.c UBSan-AddressSanitizer-x86_64 :: TestCases/ImplicitConversion/unsigned-integer-truncation-blacklist.c UBSan-AddressSanitizer-x86_64 :: TestCases/ImplicitConversion/unsigned-integer-truncation-summary.cpp UBSan-AddressSanitizer-x86_64 :: TestCases/ImplicitConversion/unsigned-integer-truncation.c UBSan-AddressSanitizer-x86_64 :: TestCases/Integer/add-overflow.cpp UBSan-AddressSanitizer-x86_64 :: TestCases/Integer/div-overflow.cpp UBSan-AddressSanitizer-x86_64 :: TestCases/Integer/div-zero.cpp UBSan-AddressSanitizer-x86_64 :: TestCases/Integer/incdec-overflow.cpp UBSan-AddressSanitizer-x86_64 :: TestCases/Integer/mul-overflow.cpp UBSan-AddressSanitizer-x86_64 :: TestCases/Integer/negate-overflow.cpp UBSan-AddressSanitizer-x86_64 :: TestCases/Integer/no-recover.cpp UBSan-AddressSanitizer-x86_64 :: TestCases/Integer/shift.cpp UBSan-AddressSanitizer-x86_64 :: TestCases/Integer/sub-overflow.cpp UBSan-AddressSanitizer-x86_64 :: TestCases/Integer/summary.cpp UBSan-AddressSanitizer-x86_64 :: TestCases/Integer/uadd-overflow.cpp UBSan-AddressSanitizer-x86_64 :: TestCases/Integer/uincdec-overflow.cpp UBSan-AddressSanitizer-x86_64 :: TestCases/Integer/umul-overflow.cpp UBSan-AddressSanitizer-x86_64 :: TestCases/Integer/usub-overflow.cpp UBSan-AddressSanitizer-x86_64 :: TestCases/Misc/bool.cpp UBSan-AddressSanitizer-x86_64 :: TestCases/Misc/bounds.cpp UBSan-AddressSanitizer-x86_64 :: TestCases/Misc/builtins.cpp UBSan-AddressSanitizer-x86_64 :: TestCases/Misc/coverage-levels.cpp UBSan-AddressSanitizer-x86_64 :: TestCases/Misc/deduplication.cpp UBSan-AddressSanitizer-x86_64 :: TestCases/Misc/enum.cpp UBSan-AddressSanitizer-x86_64 :: TestCases/Misc/missing_return.cpp UBSan-AddressSanitizer-x86_64 :: TestCases/Misc/monitor.cpp UBSan-AddressSanitizer-x86_64 :: TestCases/Misc/nonnull-arg.cpp UBSan-AddressSanitizer-x86_64 :: TestCases/Misc/nonnull.cpp UBSan-AddressSanitizer-x86_64 :: TestCases/Misc/nullability.c UBSan-AddressSanitizer-x86_64 :: TestCases/Misc/print_summary.c UBSan-AddressSanitizer-x86_64 :: TestCases/Misc/unreachable.cpp UBSan-AddressSanitizer-x86_64 :: TestCases/Misc/vla.c UBSan-AddressSanitizer-x86_64 :: TestCases/Pointer/alignment-assumption-attribute-align_value-on-lvalue.cpp UBSan-AddressSanitizer-x86_64 :: TestCases/Pointer/alignment-assumption-attribute-align_value-on-paramvar.cpp UBSan-AddressSanitizer-x86_64 :: TestCases/Pointer/alignment-assumption-attribute-alloc_align-on-function-variable.cpp UBSan-AddressSanitizer-x86_64 :: TestCases/Pointer/alignment-assumption-attribute-alloc_align-on-function.cpp UBSan-AddressSanitizer-x86_64 :: TestCases/Pointer/alignment-assumption-attribute-assume_aligned-on-function-two-params.cpp UBSan-AddressSanitizer-x86_64 :: TestCases/Pointer/alignment-assumption-attribute-assume_aligned-on-function.cpp UBSan-AddressSanitizer-x86_64 :: TestCases/Pointer/alignment-assumption-blacklist.cpp UBSan-AddressSanitizer-x86_64 :: TestCases/Pointer/alignment-assumption-builtin_assume_aligned-three-params-variable.cpp UBSan-AddressSanitizer-x86_64 :: TestCases/Pointer/alignment-assumption-builtin_assume_aligned-three-params.cpp UBSan-AddressSanitizer-x86_64 :: TestCases/Pointer/alignment-assumption-builtin_assume_aligned-two-params.cpp UBSan-AddressSanitizer-x86_64 :: TestCases/Pointer/alignment-assumption-openmp.cpp UBSan-AddressSanitizer-x86_64 :: TestCases/Pointer/alignment-assumption-summary.cpp UBSan-AddressSanitizer-x86_64 :: TestCases/Pointer/index-overflow.cpp UBSan-AddressSanitizer-x86_64 :: TestCases/Pointer/unsigned-index-expression.cpp UBSan-AddressSanitizer-x86_64 :: TestCases/TypeCheck/Function/function.cpp UBSan-AddressSanitizer-x86_64 :: TestCases/TypeCheck/PR33221.cpp UBSan-AddressSanitizer-x86_64 :: TestCases/TypeCheck/misaligned.cpp UBSan-AddressSanitizer-x86_64 :: TestCases/TypeCheck/null.cpp UBSan-AddressSanitizer-x86_64 :: TestCases/TypeCheck/vptr-corrupted-vtable-itanium.cpp UBSan-AddressSanitizer-x86_64 :: TestCases/TypeCheck/vptr-non-unique-typeinfo.cpp UBSan-AddressSanitizer-x86_64 :: TestCases/TypeCheck/vptr-virtual-base-construction.cpp UBSan-AddressSanitizer-x86_64 :: TestCases/TypeCheck/vptr-virtual-base.cpp UBSan-AddressSanitizer-x86_64 :: TestCases/TypeCheck/vptr.cpp UBSan-Minimal-x86_64 :: TestCases/alignment-assumption.c UBSan-Minimal-x86_64 :: TestCases/implicit-integer-sign-change.c UBSan-Minimal-x86_64 :: TestCases/implicit-signed-integer-truncation-or-sign-change.c UBSan-Minimal-x86_64 :: TestCases/implicit-signed-integer-truncation.c UBSan-Minimal-x86_64 :: TestCases/implicit-unsigned-integer-truncation.c UBSan-Minimal-x86_64 :: TestCases/recover-dedup-limit.cpp UBSan-Minimal-x86_64 :: TestCases/recover-dedup.cpp UBSan-Minimal-x86_64 :: TestCases/test-darwin-interface.c UBSan-Minimal-x86_64 :: TestCases/uadd-overflow.cpp UBSan-Standalone-x86_64 :: TestCases/Float/cast-overflow.cpp UBSan-Standalone-x86_64 :: TestCases/ImplicitConversion/integer-arithmetic-value-change.c UBSan-Standalone-x86_64 :: TestCases/ImplicitConversion/integer-conversion.c UBSan-Standalone-x86_64 :: TestCases/ImplicitConversion/integer-sign-change-blacklist.c UBSan-Standalone-x86_64 :: TestCases/ImplicitConversion/integer-sign-change.c UBSan-Standalone-x86_64 :: TestCases/ImplicitConversion/integer-truncation.c UBSan-Standalone-x86_64 :: TestCases/ImplicitConversion/signed-integer-truncation-blacklist.c UBSan-Standalone-x86_64 :: TestCases/ImplicitConversion/signed-integer-truncation-or-sign-change-blacklist.c UBSan-Standalone-x86_64 :: TestCases/ImplicitConversion/signed-integer-truncation.c UBSan-Standalone-x86_64 :: TestCases/ImplicitConversion/unsigned-integer-truncation-blacklist.c UBSan-Standalone-x86_64 :: TestCases/ImplicitConversion/unsigned-integer-truncation.c UBSan-Standalone-x86_64 :: TestCases/Integer/add-overflow.cpp UBSan-Standalone-x86_64 :: TestCases/Integer/div-overflow.cpp UBSan-Standalone-x86_64 :: TestCases/Integer/div-zero.cpp UBSan-Standalone-x86_64 :: TestCases/Integer/incdec-overflow.cpp UBSan-Standalone-x86_64 :: TestCases/Integer/mul-overflow.cpp UBSan-Standalone-x86_64 :: TestCases/Integer/negate-overflow.cpp UBSan-Standalone-x86_64 :: TestCases/Integer/no-recover.cpp UBSan-Standalone-x86_64 :: TestCases/Integer/shift.cpp UBSan-Standalone-x86_64 :: TestCases/Integer/sub-overflow.cpp UBSan-Standalone-x86_64 :: TestCases/Integer/suppressions.cpp UBSan-Standalone-x86_64 :: TestCases/Integer/uadd-overflow.cpp UBSan-Standalone-x86_64 :: TestCases/Integer/uincdec-overflow.cpp UBSan-Standalone-x86_64 :: TestCases/Integer/usub-overflow.cpp UBSan-Standalone-x86_64 :: TestCases/Misc/bool.cpp UBSan-Standalone-x86_64 :: TestCases/Misc/bounds.cpp UBSan-Standalone-x86_64 :: TestCases/Misc/builtins.cpp UBSan-Standalone-x86_64 :: TestCases/Misc/coverage-levels.cpp UBSan-Standalone-x86_64 :: TestCases/Misc/deduplication.cpp UBSan-Standalone-x86_64 :: TestCases/Misc/enum.cpp UBSan-Standalone-x86_64 :: TestCases/Misc/log-path_test.cpp UBSan-Standalone-x86_64 :: TestCases/Misc/missing_return.cpp UBSan-Standalone-x86_64 :: TestCases/Misc/monitor.cpp UBSan-Standalone-x86_64 :: TestCases/Misc/nonnull-arg.cpp UBSan-Standalone-x86_64 :: TestCases/Misc/nonnull.cpp UBSan-Standalone-x86_64 :: TestCases/Misc/nullability.c UBSan-Standalone-x86_64 :: TestCases/Misc/print_summary.c UBSan-Standalone-x86_64 :: TestCases/Misc/unreachable.cpp UBSan-Standalone-x86_64 :: TestCases/Misc/vla.c UBSan-Standalone-x86_64 :: TestCases/Pointer/alignment-assumption-attribute-align_value-on-lvalue.cpp UBSan-Standalone-x86_64 :: TestCases/Pointer/alignment-assumption-attribute-align_value-on-paramvar.cpp UBSan-Standalone-x86_64 :: TestCases/Pointer/alignment-assumption-attribute-alloc_align-on-function-variable.cpp UBSan-Standalone-x86_64 :: TestCases/Pointer/alignment-assumption-attribute-alloc_align-on-function.cpp UBSan-Standalone-x86_64 :: TestCases/Pointer/alignment-assumption-attribute-assume_aligned-on-function-two-params.cpp UBSan-Standalone-x86_64 :: TestCases/Pointer/alignment-assumption-attribute-assume_aligned-on-function.cpp UBSan-Standalone-x86_64 :: TestCases/Pointer/alignment-assumption-blacklist.cpp UBSan-Standalone-x86_64 :: TestCases/Pointer/alignment-assumption-builtin_assume_aligned-three-params-variable.cpp UBSan-Standalone-x86_64 :: TestCases/Pointer/alignment-assumption-builtin_assume_aligned-three-params.cpp UBSan-Standalone-x86_64 :: TestCases/Pointer/alignment-assumption-builtin_assume_aligned-two-params.cpp UBSan-Standalone-x86_64 :: TestCases/Pointer/alignment-assumption-openmp.cpp UBSan-Standalone-x86_64 :: TestCases/Pointer/index-overflow.cpp UBSan-Standalone-x86_64 :: TestCases/Pointer/unsigned-index-expression.cpp UBSan-Standalone-x86_64 :: TestCases/TypeCheck/Function/function.cpp UBSan-Standalone-x86_64 :: TestCases/TypeCheck/PR33221.cpp UBSan-Standalone-x86_64 :: TestCases/TypeCheck/misaligned.cpp UBSan-Standalone-x86_64 :: TestCases/TypeCheck/null.cpp UBSan-Standalone-x86_64 :: TestCases/TypeCheck/vptr-corrupted-vtable-itanium.cpp UBSan-Standalone-x86_64 :: TestCases/TypeCheck/vptr-virtual-base-construction.cpp UBSan-Standalone-x86_64 :: TestCases/TypeCheck/vptr-virtual-base.cpp UBSan-Standalone-x86_64 :: TestCases/TypeCheck/vptr.cpp UBSan-StandaloneStatic-x86_64 :: TestCases/Float/cast-overflow.cpp UBSan-StandaloneStatic-x86_64 :: TestCases/ImplicitConversion/integer-arithmetic-value-change.c UBSan-StandaloneStatic-x86_64 :: TestCases/ImplicitConversion/integer-conversion.c UBSan-StandaloneStatic-x86_64 :: TestCases/ImplicitConversion/integer-sign-change-blacklist.c UBSan-StandaloneStatic-x86_64 :: TestCases/ImplicitConversion/integer-sign-change.c UBSan-StandaloneStatic-x86_64 :: TestCases/ImplicitConversion/integer-truncation.c UBSan-StandaloneStatic-x86_64 :: TestCases/ImplicitConversion/signed-integer-truncation-blacklist.c UBSan-StandaloneStatic-x86_64 :: TestCases/ImplicitConversion/signed-integer-truncation-or-sign-change-blacklist.c UBSan-StandaloneStatic-x86_64 :: TestCases/ImplicitConversion/signed-integer-truncation.c UBSan-StandaloneStatic-x86_64 :: TestCases/ImplicitConversion/unsigned-integer-truncation-blacklist.c UBSan-StandaloneStatic-x86_64 :: TestCases/ImplicitConversion/unsigned-integer-truncation.c UBSan-StandaloneStatic-x86_64 :: TestCases/Integer/add-overflow.cpp UBSan-StandaloneStatic-x86_64 :: TestCases/Integer/div-overflow.cpp UBSan-StandaloneStatic-x86_64 :: TestCases/Integer/div-zero.cpp UBSan-StandaloneStatic-x86_64 :: TestCases/Integer/incdec-overflow.cpp UBSan-StandaloneStatic-x86_64 :: TestCases/Integer/mul-overflow.cpp UBSan-StandaloneStatic-x86_64 :: TestCases/Integer/negate-overflow.cpp UBSan-StandaloneStatic-x86_64 :: TestCases/Integer/no-recover.cpp UBSan-StandaloneStatic-x86_64 :: TestCases/Integer/shift.cpp UBSan-StandaloneStatic-x86_64 :: TestCases/Integer/sub-overflow.cpp UBSan-StandaloneStatic-x86_64 :: TestCases/Integer/suppressions.cpp UBSan-StandaloneStatic-x86_64 :: TestCases/Integer/uadd-overflow.cpp UBSan-StandaloneStatic-x86_64 :: TestCases/Integer/uincdec-overflow.cpp UBSan-StandaloneStatic-x86_64 :: TestCases/Integer/umul-overflow.cpp UBSan-StandaloneStatic-x86_64 :: TestCases/Integer/usub-overflow.cpp UBSan-StandaloneStatic-x86_64 :: TestCases/Misc/bool.cpp UBSan-StandaloneStatic-x86_64 :: TestCases/Misc/bounds.cpp UBSan-StandaloneStatic-x86_64 :: TestCases/Misc/builtins.cpp UBSan-StandaloneStatic-x86_64 :: TestCases/Misc/enum.cpp UBSan-StandaloneStatic-x86_64 :: TestCases/Misc/log-path_test.cpp UBSan-StandaloneStatic-x86_64 :: TestCases/Misc/missing_return.cpp UBSan-StandaloneStatic-x86_64 :: TestCases/Misc/nonnull-arg.cpp UBSan-StandaloneStatic-x86_64 :: TestCases/Misc/nonnull.cpp UBSan-StandaloneStatic-x86_64 :: TestCases/Misc/nullability.c UBSan-StandaloneStatic-x86_64 :: TestCases/Misc/print_summary.c UBSan-StandaloneStatic-x86_64 :: TestCases/Misc/unreachable.cpp UBSan-StandaloneStatic-x86_64 :: TestCases/Misc/vla.c UBSan-StandaloneStatic-x86_64 :: TestCases/Pointer/alignment-assumption-attribute-align_value-on-lvalue.cpp UBSan-StandaloneStatic-x86_64 :: TestCases/Pointer/alignment-assumption-attribute-align_value-on-paramvar.cpp UBSan-StandaloneStatic-x86_64 :: TestCases/Pointer/alignment-assumption-attribute-alloc_align-on-function-variable.cpp UBSan-StandaloneStatic-x86_64 :: TestCases/Pointer/alignment-assumption-attribute-alloc_align-on-function.cpp UBSan-StandaloneStatic-x86_64 :: TestCases/Pointer/alignment-assumption-attribute-assume_aligned-on-function-two-params.cpp UBSan-StandaloneStatic-x86_64 :: TestCases/Pointer/alignment-assumption-attribute-assume_aligned-on-function.cpp UBSan-StandaloneStatic-x86_64 :: TestCases/Pointer/alignment-assumption-blacklist.cpp UBSan-StandaloneStatic-x86_64 :: TestCases/Pointer/alignment-assumption-builtin_assume_aligned-three-params-variable.cpp UBSan-StandaloneStatic-x86_64 :: TestCases/Pointer/alignment-assumption-builtin_assume_aligned-three-params.cpp UBSan-StandaloneStatic-x86_64 :: TestCases/Pointer/alignment-assumption-builtin_assume_aligned-two-params.cpp UBSan-StandaloneStatic-x86_64 :: TestCases/Pointer/alignment-assumption-openmp.cpp UBSan-StandaloneStatic-x86_64 :: TestCases/Pointer/index-overflow.cpp UBSan-StandaloneStatic-x86_64 :: TestCases/Pointer/unsigned-index-expression.cpp UBSan-StandaloneStatic-x86_64 :: TestCases/TypeCheck/Function/function.cpp UBSan-StandaloneStatic-x86_64 :: TestCases/TypeCheck/misaligned.cpp UBSan-StandaloneStatic-x86_64 :: TestCases/TypeCheck/null.cpp UBSan-StandaloneStatic-x86_64 :: TestCases/TypeCheck/vptr-corrupted-vtable-itanium.cpp UBSan-StandaloneStatic-x86_64 :: TestCases/TypeCheck/vptr-virtual-base-construction.cpp UBSan-StandaloneStatic-x86_64 :: TestCases/TypeCheck/vptr-virtual-base.cpp UBSan-StandaloneStatic-x86_64 :: TestCases/TypeCheck/vptr.cpp UBSan-ThreadSanitizer-x86_64 :: TestCases/Float/cast-overflow.cpp UBSan-ThreadSanitizer-x86_64 :: TestCases/ImplicitConversion/integer-arithmetic-value-change.c UBSan-ThreadSanitizer-x86_64 :: TestCases/ImplicitConversion/integer-conversion.c UBSan-ThreadSanitizer-x86_64 :: TestCases/ImplicitConversion/integer-sign-change-blacklist.c UBSan-ThreadSanitizer-x86_64 :: TestCases/ImplicitConversion/integer-sign-change.c UBSan-ThreadSanitizer-x86_64 :: TestCases/ImplicitConversion/integer-truncation.c UBSan-ThreadSanitizer-x86_64 :: TestCases/ImplicitConversion/signed-integer-truncation-blacklist.c UBSan-ThreadSanitizer-x86_64 :: TestCases/ImplicitConversion/signed-integer-truncation-or-sign-change-blacklist.c UBSan-ThreadSanitizer-x86_64 :: TestCases/ImplicitConversion/signed-integer-truncation-or-sign-change-summary.cpp UBSan-ThreadSanitizer-x86_64 :: TestCases/ImplicitConversion/signed-integer-truncation-summary.cpp UBSan-ThreadSanitizer-x86_64 :: TestCases/ImplicitConversion/signed-integer-truncation.c UBSan-ThreadSanitizer-x86_64 :: TestCases/ImplicitConversion/unsigned-integer-truncation-blacklist.c UBSan-ThreadSanitizer-x86_64 :: TestCases/ImplicitConversion/unsigned-integer-truncation-summary.cpp UBSan-ThreadSanitizer-x86_64 :: TestCases/ImplicitConversion/unsigned-integer-truncation.c UBSan-ThreadSanitizer-x86_64 :: TestCases/Integer/add-overflow.cpp UBSan-ThreadSanitizer-x86_64 :: TestCases/Integer/div-overflow.cpp UBSan-ThreadSanitizer-x86_64 :: TestCases/Integer/div-zero.cpp UBSan-ThreadSanitizer-x86_64 :: TestCases/Integer/incdec-overflow.cpp UBSan-ThreadSanitizer-x86_64 :: TestCases/Integer/mul-overflow.cpp UBSan-ThreadSanitizer-x86_64 :: TestCases/Integer/negate-overflow.cpp UBSan-ThreadSanitizer-x86_64 :: TestCases/Integer/no-recover.cpp UBSan-ThreadSanitizer-x86_64 :: TestCases/Integer/shift.cpp UBSan-ThreadSanitizer-x86_64 :: TestCases/Integer/sub-overflow.cpp UBSan-ThreadSanitizer-x86_64 :: TestCases/Integer/uadd-overflow.cpp UBSan-ThreadSanitizer-x86_64 :: TestCases/Integer/uincdec-overflow.cpp UBSan-ThreadSanitizer-x86_64 :: TestCases/Integer/umul-overflow.cpp UBSan-ThreadSanitizer-x86_64 :: TestCases/Integer/usub-overflow.cpp UBSan-ThreadSanitizer-x86_64 :: TestCases/Misc/bool.cpp UBSan-ThreadSanitizer-x86_64 :: TestCases/Misc/bounds.cpp UBSan-ThreadSanitizer-x86_64 :: TestCases/Misc/builtins.cpp UBSan-ThreadSanitizer-x86_64 :: TestCases/Misc/deduplication.cpp UBSan-ThreadSanitizer-x86_64 :: TestCases/Misc/enum.cpp UBSan-ThreadSanitizer-x86_64 :: TestCases/Misc/missing_return.cpp UBSan-ThreadSanitizer-x86_64 :: TestCases/Misc/monitor.cpp UBSan-ThreadSanitizer-x86_64 :: TestCases/Misc/nonnull-arg.cpp UBSan-ThreadSanitizer-x86_64 :: TestCases/Misc/nonnull.cpp UBSan-ThreadSanitizer-x86_64 :: TestCases/Misc/nullability.c UBSan-ThreadSanitizer-x86_64 :: TestCases/Misc/print_summary.c UBSan-ThreadSanitizer-x86_64 :: TestCases/Misc/unreachable.cpp UBSan-ThreadSanitizer-x86_64 :: TestCases/Misc/vla.c UBSan-ThreadSanitizer-x86_64 :: TestCases/Pointer/alignment-assumption-attribute-align_value-on-lvalue.cpp UBSan-ThreadSanitizer-x86_64 :: TestCases/Pointer/alignment-assumption-attribute-align_value-on-paramvar.cpp UBSan-ThreadSanitizer-x86_64 :: TestCases/Pointer/alignment-assumption-attribute-alloc_align-on-function-variable.cpp UBSan-ThreadSanitizer-x86_64 :: TestCases/Pointer/alignment-assumption-attribute-alloc_align-on-function.cpp UBSan-ThreadSanitizer-x86_64 :: TestCases/Pointer/alignment-assumption-attribute-assume_aligned-on-function-two-params.cpp UBSan-ThreadSanitizer-x86_64 :: TestCases/Pointer/alignment-assumption-attribute-assume_aligned-on-function.cpp UBSan-ThreadSanitizer-x86_64 :: TestCases/Pointer/alignment-assumption-blacklist.cpp UBSan-ThreadSanitizer-x86_64 :: TestCases/Pointer/alignment-assumption-builtin_assume_aligned-three-params-variable.cpp UBSan-ThreadSanitizer-x86_64 :: TestCases/Pointer/alignment-assumption-builtin_assume_aligned-three-params.cpp UBSan-ThreadSanitizer-x86_64 :: TestCases/Pointer/alignment-assumption-builtin_assume_aligned-two-params.cpp UBSan-ThreadSanitizer-x86_64 :: TestCases/Pointer/alignment-assumption-openmp.cpp UBSan-ThreadSanitizer-x86_64 :: TestCases/Pointer/alignment-assumption-summary.cpp UBSan-ThreadSanitizer-x86_64 :: TestCases/Pointer/index-overflow.cpp UBSan-ThreadSanitizer-x86_64 :: TestCases/Pointer/unsigned-index-expression.cpp UBSan-ThreadSanitizer-x86_64 :: TestCases/TypeCheck/Function/function.cpp UBSan-ThreadSanitizer-x86_64 :: TestCases/TypeCheck/PR33221.cpp UBSan-ThreadSanitizer-x86_64 :: TestCases/TypeCheck/misaligned.cpp UBSan-ThreadSanitizer-x86_64 :: TestCases/TypeCheck/null.cpp UBSan-ThreadSanitizer-x86_64 :: TestCases/TypeCheck/vptr-corrupted-vtable-itanium.cpp UBSan-ThreadSanitizer-x86_64 :: TestCases/TypeCheck/vptr-virtual-base.cpp UBSan-ThreadSanitizer-x86_64 :: TestCases/TypeCheck/vptr.cpp cfi-devirt-x86_64 :: anon-namespace.cpp cfi-devirt-x86_64 :: bad-cast.cpp cfi-devirt-x86_64 :: base-derived-destructor.cpp cfi-devirt-x86_64 :: create-derivers.test cfi-devirt-x86_64 :: cross-dso-diagnostic.cpp cfi-devirt-x86_64 :: icall/bad-signature.c cfi-devirt-x86_64 :: mfcall.cpp cfi-devirt-x86_64 :: multiple-inheritance.cpp cfi-devirt-x86_64 :: nvcall.cpp cfi-devirt-x86_64 :: overwrite.cpp cfi-devirt-x86_64 :: simple-fail.cpp cfi-devirt-x86_64 :: target_uninstrumented.cpp cfi-devirt-x86_64 :: vdtor.cpp cfi-standalone-x86_64 :: anon-namespace.cpp cfi-standalone-x86_64 :: bad-cast.cpp cfi-standalone-x86_64 :: base-derived-destructor.cpp cfi-standalone-x86_64 :: create-derivers.test cfi-standalone-x86_64 :: cross-dso-diagnostic.cpp cfi-standalone-x86_64 :: icall/bad-signature.c cfi-standalone-x86_64 :: mfcall.cpp cfi-standalone-x86_64 :: multiple-inheritance.cpp cfi-standalone-x86_64 :: nvcall.cpp cfi-standalone-x86_64 :: overwrite.cpp cfi-standalone-x86_64 :: simple-fail.cpp cfi-standalone-x86_64 :: stats.cpp cfi-standalone-x86_64 :: target_uninstrumented.cpp cfi-standalone-x86_64 :: vdtor.cpp libFuzzer :: acquire-crash-state.test libFuzzer :: bogus-initialize.test libFuzzer :: buffer-overflow-on-input.test libFuzzer :: caller-callee.test libFuzzer :: counters.test libFuzzer :: coverage.test libFuzzer :: cxxstring.test libFuzzer :: dead-stripping.test libFuzzer :: deprecated-instrumentation.test libFuzzer :: dso.test libFuzzer :: exit-report.test libFuzzer :: exit_on_src_pos.test libFuzzer :: fuzzer-alignment-assumption.test libFuzzer :: fuzzer-customcrossover.test libFuzzer :: fuzzer-custommutator.test libFuzzer :: fuzzer-dict.test libFuzzer :: fuzzer-dirs.test libFuzzer :: fuzzer-fdmask.test libFuzzer :: fuzzer-finalstats.test libFuzzer :: fuzzer-flags.test libFuzzer :: fuzzer-implicit-integer-sign-change.test libFuzzer :: fuzzer-implicit-signed-integer-truncation-or-sign-change.test libFuzzer :: fuzzer-implicit-signed-integer-truncation.test libFuzzer :: fuzzer-implicit-unsigned-integer-truncation.test libFuzzer :: fuzzer-oom.test libFuzzer :: fuzzer-printcovpcs.test libFuzzer :: fuzzer-runs.test libFuzzer :: fuzzer-seed.test libFuzzer :: fuzzer-singleinputs.test libFuzzer :: fuzzer-threaded.test libFuzzer :: fuzzer-timeout.test libFuzzer :: fuzzer-ubsan.test libFuzzer :: initialize.test libFuzzer :: len_control.test libFuzzer :: max-number-of-runs.test libFuzzer :: memcmp.test libFuzzer :: memcmp64.test libFuzzer :: merge-control-file.test libFuzzer :: merge-posix.test libFuzzer :: merge.test libFuzzer :: minimize_crash.test libFuzzer :: minimize_two_crashes.test libFuzzer :: not-instrumented.test libFuzzer :: null-deref-on-empty.test libFuzzer :: null-deref.test libFuzzer :: overwrite-input.test libFuzzer :: read-binary.test libFuzzer :: recommended-dictionary.test libFuzzer :: reduce_inputs.test libFuzzer :: reload.test libFuzzer :: repeated-bytes.test libFuzzer :: seed_inputs.test libFuzzer :: shrink.test libFuzzer :: simple.test libFuzzer :: standalone.test libFuzzer :: strcmp.test libFuzzer :: strncmp.test libFuzzer :: strstr.test libFuzzer :: swap-cmp.test libFuzzer :: three-bytes.test libFuzzer :: trace-malloc.test libFuzzer :: value-profile-cmp.test libFuzzer :: value-profile-cmp2.test libFuzzer :: value-profile-cmp3.test libFuzzer :: value-profile-cmp4.test libFuzzer :: value-profile-div.test libFuzzer :: value-profile-load.test libFuzzer :: value-profile-mem.test libFuzzer :: value-profile-set.test libFuzzer :: value-profile-strcmp.test libFuzzer :: value-profile-strncmp.test libFuzzer :: value-profile-switch.test

Hide Details

Expected Passes : 1238 Expected Failures : 32 Unsupported Tests : 769 Unexpected Failures: 629 FAILED: test/CMakeFiles/check-compiler-rt cd /Users/buildslave/jenkins/workspace/test-mr-clang-stage1-RA/clang-build/tools/clang/runtime/compiler-rt-bins/test && /usr/local/bin/python /Users/buildslave/jenkins/workspace/test-mr-clang-stage1-RA/clang-build/bin/llvm-lit --xunit-xml-output=testresults.xunit.xml -v --timeout=600 /Users/buildslave/jenkins/workspace/test-mr-clang-stage1-RA/clang-build/tools/clang/runtime/compiler-rt-bins/test/builtins/TestCases /Users/buildslave/jenkins/workspace/test-mr-clang-stage1-RA/clang-build/tools/clang/runtime/compiler-rt-bins/test/lsan/X86_64LsanConfig /Users/buildslave/jenkins/workspace/test-mr-clang-stage1-RA/clang-build/tools/clang/runtime/compiler-rt-bins/test/lsan/X86_64AsanConfig /Users/buildslave/jenkins/workspace/test-mr-clang-stage1-RA/clang-build/tools/clang/runtime/compiler-rt-bins/test/ubsan/Standalone-x86_64 /Users/buildslave/jenkins/workspace/test-mr-clang-stage1-RA/clang-build/tools/clang/runtime/compiler-rt-bins/test/ubsan/AddressSanitizer-x86_64 /Users/buildslave/jenkins/workspace/test-mr-clang-stage1-RA/clang-build/tools/clang/runtime/compiler-rt-bins/test/ubsan/ThreadSanitizer-x86_64 /Users/buildslave/jenkins/workspace/test-mr-clang-stage1-RA/clang-build/tools/clang/runtime/compiler-rt-bins/test/ubsan/StandaloneStatic-x86_64 /Users/buildslave/jenkins/workspace/test-mr-clang-stage1-RA/clang-build/tools/clang/runtime/compiler-rt-bins/test/cfi/Standalone-x86_64 /Users/buildslave/jenkins/workspace/test-mr-clang-stage1-RA/clang-build/tools/clang/runtime/compiler-rt-bins/test/cfi/Devirt-x86_64 /Users/buildslave/jenkins/workspace/test-mr-clang-stage1-RA/clang-build/tools/clang/runtime/compiler-rt-bins/test/sanitizer_common/asan-x86_64-Darwin /Users/buildslave/jenkins/workspace/test-mr-clang-stage1-RA/clang-build/tools/clang/runtime/compiler-rt-bins/test/sanitizer_common/lsan-x86_64-Darwin /Users/buildslave/jenkins/workspace/test-mr-clang-stage1-RA/clang-build/tools/clang/runtime/compiler-rt-bins/test/sanitizer_common/tsan-x86_64-Darwin /Users/buildslave/jenkins/workspace/test-mr-clang-stage1-RA/clang-build/tools/clang/runtime/compiler-rt-bins/test/sanitizer_common/ubsan-x86_64-Darwin /Users/buildslave/jenkins/workspace/test-mr-clang-stage1-RA/clang-build/tools/clang/runtime/compiler-rt-bins/test/sanitizer_common/Unit /Users/buildslave/jenkins/workspace/test-mr-clang-stage1-RA/clang-build/tools/clang/runtime/compiler-rt-bins/test/fuzzer/unit /Users/buildslave/jenkins/workspace/test-mr-clang-stage1-RA/clang-build/tools/clang/runtime/compiler-rt-bins/test/fuzzer/X86_64DefaultDarwinConfig/ /Users/buildslave/jenkins/workspace/test-mr-clang-stage1-RA/clang-build/tools/clang/runtime/compiler-rt-bins/test/asan/X86_64DarwinConfig /Users/buildslave/jenkins/workspace/test-mr-clang-stage1-RA/clang-build/tools/clang/runtime/compiler-rt-bins/test/asan/Unit /Users/buildslave/jenkins/workspace/test-mr-clang-stage1-RA/clang-build/tools/clang/runtime/compiler-rt-bins/test/tsan/X86_64Config /Users/buildslave/jenkins/workspace/test-mr-clang-stage1-RA/clang-build/tools/clang/runtime/compiler-rt-bins/test/tsan/Unit /Users/buildslave/jenkins/workspace/test-mr-clang-stage1-RA/clang-build/tools/clang/runtime/compiler-rt-bins/test/ubsan_minimal/x86_64 /Users/buildslave/jenkins/workspace/test-mr-clang-stage1-RA/clang-build/tools/clang/runtime/compiler-rt-bins/test/profile/Profile-x86_64 /Users/buildslave/jenkins/workspace/test-mr-clang-stage1-RA/clang-build/tools/clang/runtime/compiler-rt-bins/test/xray/X86_64DarwinConfig /Users/buildslave/jenkins/workspace/test-mr-clang-stage1-RA/clang-build/tools/clang/runtime/compiler-rt-bins/test/xray/X86_64HDarwinConfig /Users/buildslave/jenkins/workspace/test-mr-clang-stage1-RA/clang-build/tools/clang/runtime/compiler-rt-bins/test/shadowcallstack/arm64 ninja: build stopped: subcommand failed. [669/671] : && /Applications/Xcode.app/Contents/Developer/Toolchains/XcodeDefault.xctoolchain/usr/bin/c++ -fPIC -fvisibility-inlines-hidden -Werror=date-time -Werror=unguarded-availability-new -std=c++14 -Wall -Wextra -Wno-unused-parameter -Wwrite-strings -Wcast-qual -Wmissing-field-initializers -pedantic -Wno-long-long -Wimplicit-fallthrough -Wcovered-switch-default -Wno-noexcept-type -Wnon-virtual-dtor -Wdelete-non-virtual-dtor -Wstring-conversion -fdiagnostics-color -O2 -g -isysroot /Applications/Xcode.app/Contents/Developer/Platforms/MacOSX.platform/Developer/SDKs/MacOSX10.14.sdk -mmacosx-version-min=10.9 -Wl,-search_paths_first -Wl,-headerpad_max_install_names -Wl,-dead_strip unittests/tools/llvm-exegesis/X86/CMakeFiles/LLVMExegesisX86Tests.dir/AssemblerTest.cpp.o unittests/tools/llvm-exegesis/X86/CMakeFiles/LLVMExegesisX86Tests.dir/BenchmarkResultTest.cpp.o unittests/tools/llvm-exegesis/X86/CMakeFiles/LLVMExegesisX86Tests.dir/RegisterAliasingTest.cpp.o unittests/tools/llvm-exegesis/X86/CMakeFiles/LLVMExegesisX86Tests.dir/SchedClassResolutionTest.cpp.o unittests/tools/llvm-exegesis/X86/CMakeFiles/LLVMExegesisX86Tests.dir/SnippetGeneratorTest.cpp.o unittests/tools/llvm-exegesis/X86/CMakeFiles/LLVMExegesisX86Tests.dir/TargetTest.cpp.o -o unittests/tools/llvm-exegesis/X86/LLVMExegesisX86Tests lib/libLLVMMC.a lib/libLLVMMCParser.a lib/libLLVMObject.a lib/libLLVMSupport.a lib/libLLVMSymbolize.a lib/libLLVMX86CodeGen.a lib/libLLVMX86AsmParser.a lib/libLLVMX86Desc.a lib/libLLVMX86Disassembler.a lib/libLLVMX86Info.a lib/libLLVMX86Utils.a lib/libLLVMSupport.a lib/libgtest_main.a lib/libgtest.a lib/libLLVMExegesis.a lib/libLLVMExegesisX86.a lib/libLLVMDebugInfoPDB.a -lpthread lib/libLLVMX86CodeGen.a lib/libLLVMAsmPrinter.a lib/libLLVMDebugInfoDWARF.a lib/libLLVMX86AsmParser.a lib/libLLVMX86Desc.a lib/libLLVMX86Disassembler.a lib/libLLVMX86Info.a lib/libLLVMX86Utils.a lib/libLLVMExegesis.a lib/libLLVMGlobalISel.a lib/libLLVMSelectionDAG.a lib/libLLVMCodeGen.a lib/libLLVMBitWriter.a lib/libLLVMScalarOpts.a lib/libLLVMAggressiveInstCombine.a lib/libLLVMInstCombine.a lib/libLLVMTransformUtils.a lib/libLLVMMCDisassembler.a lib/libLLVMMCJIT.a lib/libLLVMExecutionEngine.a lib/libLLVMTarget.a lib/libLLVMAnalysis.a lib/libLLVMProfileData.a lib/libLLVMRuntimeDyld.a lib/libLLVMObjectYAML.a lib/libLLVMObject.a lib/libLLVMMCParser.a lib/libLLVMMC.a lib/libLLVMBitReader.a lib/libLLVMCore.a lib/libLLVMRemarks.a lib/libLLVMBitstreamReader.a lib/libLLVMTextAPI.a lib/libLLVMBinaryFormat.a lib/libLLVMDebugInfoCodeView.a lib/libLLVMDebugInfoMSF.a lib/libLLVMSupport.a -lz -lcurses -lm lib/libLLVMDemangle.a && : FAILED: tools/clang/runtime/CMakeFiles/check-compiler-rt cd /Users/buildslave/jenkins/workspace/test-mr-clang-stage1-RA/clang-build/tools/clang/runtime/compiler-rt-bins && /usr/local/Cellar/cmake/3.11.4/bin/cmake --build . --target check-all --config RelWithDebInfo ninja: build stopped: cannot make progress due to previous errors. Command failed Command: ['/usr/local/bin/ninja', '-v', '-k', '0', 'check-all'] Build step 'Execute shell' marked build as failure New run name is 'rL:371616 - C:371605 - #552' [WARNINGS] Parsing warnings in console log with parser Clang (LLVM based) Skipping warnings blame since Git is the only supported SCM up to now.%n [WARNINGS] Computing warning deltas based on reference build rL:371612 - C:371605 - #551 Recording test results ERROR: Step ‘Publish JUnit test result report’ failed: No test report files were found. Configuration error? IRC notifier plugin: Sending notification to: #llvm-build [BFA] Scanning build for known causes... [BFA] Found failure cause(s): [BFA] Regression test failed from category Test [BFA] Compile Error from category Compile [BFA] Ninja target failed from category Compile [BFA] Missing test results from category Infrastructure [BFA] Done. 4s Email was triggered for: Failure - 1st Trigger Failure - Any was overridden by another trigger and will not send an email. Trigger Failure - Still was overridden by another trigger and will not send an email. Sending email for trigger: Failure - 1st Not sending mail to unregistered user spatel@rotateright.com because your SCM claimed this was associated with a user ID ‘spatel' which your security realm does not recognize; you may need changes in your SCM plugin Not sending mail to unregistered user gchatelet@google.com because your SCM claimed this was associated with a user ID ‘gchatelet' which your security realm does not recognize; you may need changes in your SCM plugin An attempt to send an e-mail to empty list of recipients, ignored. Finished: FAILURE