FailedConsole Output

Skipping 723 KB.. Full Log
Wsuggest-override -Wstring-conversion -fdiagnostics-color -O3  -isysroot /Applications/Xcode.app/Contents/Developer/Platforms/MacOSX.platform/Developer/SDKs/MacOSX10.15.sdk   -UNDEBUG -std=c++14  -fno-exceptions -fno-rtti -MD -MT lib/Support/CMakeFiles/LLVMSupport.dir/circular_raw_ostream.cpp.o -MF lib/Support/CMakeFiles/LLVMSupport.dir/circular_raw_ostream.cpp.o.d -o lib/Support/CMakeFiles/LLVMSupport.dir/circular_raw_ostream.cpp.o -c /Users/buildslave/jenkins/workspace/lldb-cmake-matrix/llvm-project/llvm/lib/Support/circular_raw_ostream.cpp
[551/4328] /Users/buildslave/jenkins/workspace/lldb-cmake-matrix/host-compiler/bin/clang++  -DGTEST_HAS_RTTI=0 -D_DEBUG -D__STDC_CONSTANT_MACROS -D__STDC_FORMAT_MACROS -D__STDC_LIMIT_MACROS -Ilib/Support -I/Users/buildslave/jenkins/workspace/lldb-cmake-matrix/llvm-project/llvm/lib/Support -Iinclude -I/Users/buildslave/jenkins/workspace/lldb-cmake-matrix/llvm-project/llvm/include -fPIC -fvisibility-inlines-hidden -Werror=date-time -Werror=unguarded-availability-new -fmodules -fmodules-cache-path=/Users/buildslave/jenkins/workspace/lldb-cmake-matrix/lldb-build/module.cache -fcxx-modules -Xclang -fmodules-local-submodule-visibility -Wall -Wextra -Wno-unused-parameter -Wwrite-strings -Wcast-qual -Wmissing-field-initializers -pedantic -Wno-long-long -Wimplicit-fallthrough -Wcovered-switch-default -Wno-noexcept-type -Wnon-virtual-dtor -Wdelete-non-virtual-dtor -Wsuggest-override -Wstring-conversion -fdiagnostics-color -O3  -isysroot /Applications/Xcode.app/Contents/Developer/Platforms/MacOSX.platform/Developer/SDKs/MacOSX10.15.sdk   -UNDEBUG -std=c++14  -fno-exceptions -fno-rtti -MD -MT lib/Support/CMakeFiles/LLVMSupport.dir/COM.cpp.o -MF lib/Support/CMakeFiles/LLVMSupport.dir/COM.cpp.o.d -o lib/Support/CMakeFiles/LLVMSupport.dir/COM.cpp.o -c /Users/buildslave/jenkins/workspace/lldb-cmake-matrix/llvm-project/llvm/lib/Support/COM.cpp
[552/4328] /Users/buildslave/jenkins/workspace/lldb-cmake-matrix/host-compiler/bin/clang++  -DGTEST_HAS_RTTI=0 -D_DEBUG -D__STDC_CONSTANT_MACROS -D__STDC_FORMAT_MACROS -D__STDC_LIMIT_MACROS -Ilib/Support -I/Users/buildslave/jenkins/workspace/lldb-cmake-matrix/llvm-project/llvm/lib/Support -Iinclude -I/Users/buildslave/jenkins/workspace/lldb-cmake-matrix/llvm-project/llvm/include -fPIC -fvisibility-inlines-hidden -Werror=date-time -Werror=unguarded-availability-new -fmodules -fmodules-cache-path=/Users/buildslave/jenkins/workspace/lldb-cmake-matrix/lldb-build/module.cache -fcxx-modules -Xclang -fmodules-local-submodule-visibility -Wall -Wextra -Wno-unused-parameter -Wwrite-strings -Wcast-qual -Wmissing-field-initializers -pedantic -Wno-long-long -Wimplicit-fallthrough -Wcovered-switch-default -Wno-noexcept-type -Wnon-virtual-dtor -Wdelete-non-virtual-dtor -Wsuggest-override -Wstring-conversion -fdiagnostics-color -O3  -isysroot /Applications/Xcode.app/Contents/Developer/Platforms/MacOSX.platform/Developer/SDKs/MacOSX10.15.sdk   -UNDEBUG -std=c++14  -fno-exceptions -fno-rtti -MD -MT lib/Support/CMakeFiles/LLVMSupport.dir/BranchProbability.cpp.o -MF lib/Support/CMakeFiles/LLVMSupport.dir/BranchProbability.cpp.o.d -o lib/Support/CMakeFiles/LLVMSupport.dir/BranchProbability.cpp.o -c /Users/buildslave/jenkins/workspace/lldb-cmake-matrix/llvm-project/llvm/lib/Support/BranchProbability.cpp
[553/4328] /Users/buildslave/jenkins/workspace/lldb-cmake-matrix/host-compiler/bin/clang++  -DGTEST_HAS_RTTI=0 -D_DEBUG -D_GNU_SOURCE -D__STDC_CONSTANT_MACROS -D__STDC_FORMAT_MACROS -D__STDC_LIMIT_MACROS -Itools/clang/utils/TableGen -I/Users/buildslave/jenkins/workspace/lldb-cmake-matrix/llvm-project/clang/utils/TableGen -I/Users/buildslave/jenkins/workspace/lldb-cmake-matrix/llvm-project/clang/include -Itools/clang/include -Iinclude -I/Users/buildslave/jenkins/workspace/lldb-cmake-matrix/llvm-project/llvm/include -fPIC -fvisibility-inlines-hidden -Werror=date-time -Werror=unguarded-availability-new -fmodules -fmodules-cache-path=/Users/buildslave/jenkins/workspace/lldb-cmake-matrix/lldb-build/module.cache -fcxx-modules -Xclang -fmodules-local-submodule-visibility -Wall -Wextra -Wno-unused-parameter -Wwrite-strings -Wcast-qual -Wmissing-field-initializers -pedantic -Wno-long-long -Wimplicit-fallthrough -Wcovered-switch-default -Wno-noexcept-type -Wnon-virtual-dtor -Wdelete-non-virtual-dtor -Wsuggest-override -Wstring-conversion -fdiagnostics-color -fno-common -Woverloaded-virtual -Wno-nested-anon-types -O3  -isysroot /Applications/Xcode.app/Contents/Developer/Platforms/MacOSX.platform/Developer/SDKs/MacOSX10.15.sdk    -fno-exceptions -fno-rtti -UNDEBUG -std=c++14 -MD -MT tools/clang/utils/TableGen/CMakeFiles/clang-tblgen.dir/ClangOpenCLBuiltinEmitter.cpp.o -MF tools/clang/utils/TableGen/CMakeFiles/clang-tblgen.dir/ClangOpenCLBuiltinEmitter.cpp.o.d -o tools/clang/utils/TableGen/CMakeFiles/clang-tblgen.dir/ClangOpenCLBuiltinEmitter.cpp.o -c /Users/buildslave/jenkins/workspace/lldb-cmake-matrix/llvm-project/clang/utils/TableGen/ClangOpenCLBuiltinEmitter.cpp
[554/4328] /Users/buildslave/jenkins/workspace/lldb-cmake-matrix/host-compiler/bin/clang++  -DGTEST_HAS_RTTI=0 -D_DEBUG -D__STDC_CONSTANT_MACROS -D__STDC_FORMAT_MACROS -D__STDC_LIMIT_MACROS -Ilib/Support -I/Users/buildslave/jenkins/workspace/lldb-cmake-matrix/llvm-project/llvm/lib/Support -Iinclude -I/Users/buildslave/jenkins/workspace/lldb-cmake-matrix/llvm-project/llvm/include -fPIC -fvisibility-inlines-hidden -Werror=date-time -Werror=unguarded-availability-new -fmodules -fmodules-cache-path=/Users/buildslave/jenkins/workspace/lldb-cmake-matrix/lldb-build/module.cache -fcxx-modules -Xclang -fmodules-local-submodule-visibility -Wall -Wextra -Wno-unused-parameter -Wwrite-strings -Wcast-qual -Wmissing-field-initializers -pedantic -Wno-long-long -Wimplicit-fallthrough -Wcovered-switch-default -Wno-noexcept-type -Wnon-virtual-dtor -Wdelete-non-virtual-dtor -Wsuggest-override -Wstring-conversion -fdiagnostics-color -O3  -isysroot /Applications/Xcode.app/Contents/Developer/Platforms/MacOSX.platform/Developer/SDKs/MacOSX10.15.sdk   -UNDEBUG -std=c++14  -fno-exceptions -fno-rtti -MD -MT lib/Support/CMakeFiles/LLVMSupport.dir/BinaryStreamWriter.cpp.o -MF lib/Support/CMakeFiles/LLVMSupport.dir/BinaryStreamWriter.cpp.o.d -o lib/Support/CMakeFiles/LLVMSupport.dir/BinaryStreamWriter.cpp.o -c /Users/buildslave/jenkins/workspace/lldb-cmake-matrix/llvm-project/llvm/lib/Support/BinaryStreamWriter.cpp
[555/4328] /Users/buildslave/jenkins/workspace/lldb-cmake-matrix/host-compiler/bin/clang++  -DGTEST_HAS_RTTI=0 -D_DEBUG -D__STDC_CONSTANT_MACROS -D__STDC_FORMAT_MACROS -D__STDC_LIMIT_MACROS -Ilib/Support -I/Users/buildslave/jenkins/workspace/lldb-cmake-matrix/llvm-project/llvm/lib/Support -Iinclude -I/Users/buildslave/jenkins/workspace/lldb-cmake-matrix/llvm-project/llvm/include -fPIC -fvisibility-inlines-hidden -Werror=date-time -Werror=unguarded-availability-new -fmodules -fmodules-cache-path=/Users/buildslave/jenkins/workspace/lldb-cmake-matrix/lldb-build/module.cache -fcxx-modules -Xclang -fmodules-local-submodule-visibility -Wall -Wextra -Wno-unused-parameter -Wwrite-strings -Wcast-qual -Wmissing-field-initializers -pedantic -Wno-long-long -Wimplicit-fallthrough -Wcovered-switch-default -Wno-noexcept-type -Wnon-virtual-dtor -Wdelete-non-virtual-dtor -Wsuggest-override -Wstring-conversion -fdiagnostics-color -O3  -isysroot /Applications/Xcode.app/Contents/Developer/Platforms/MacOSX.platform/Developer/SDKs/MacOSX10.15.sdk   -UNDEBUG -std=c++14  -fno-exceptions -fno-rtti -MD -MT lib/Support/CMakeFiles/LLVMSupport.dir/Chrono.cpp.o -MF lib/Support/CMakeFiles/LLVMSupport.dir/Chrono.cpp.o.d -o lib/Support/CMakeFiles/LLVMSupport.dir/Chrono.cpp.o -c /Users/buildslave/jenkins/workspace/lldb-cmake-matrix/llvm-project/llvm/lib/Support/Chrono.cpp
[556/4328] /Users/buildslave/jenkins/workspace/lldb-cmake-matrix/host-compiler/bin/clang++  -DGTEST_HAS_RTTI=0 -D_DEBUG -D__STDC_CONSTANT_MACROS -D__STDC_FORMAT_MACROS -D__STDC_LIMIT_MACROS -Ilib/Support -I/Users/buildslave/jenkins/workspace/lldb-cmake-matrix/llvm-project/llvm/lib/Support -Iinclude -I/Users/buildslave/jenkins/workspace/lldb-cmake-matrix/llvm-project/llvm/include -fPIC -fvisibility-inlines-hidden -Werror=date-time -Werror=unguarded-availability-new -fmodules -fmodules-cache-path=/Users/buildslave/jenkins/workspace/lldb-cmake-matrix/lldb-build/module.cache -fcxx-modules -Xclang -fmodules-local-submodule-visibility -Wall -Wextra -Wno-unused-parameter -Wwrite-strings -Wcast-qual -Wmissing-field-initializers -pedantic -Wno-long-long -Wimplicit-fallthrough -Wcovered-switch-default -Wno-noexcept-type -Wnon-virtual-dtor -Wdelete-non-virtual-dtor -Wsuggest-override -Wstring-conversion -fdiagnostics-color -O3  -isysroot /Applications/Xcode.app/Contents/Developer/Platforms/MacOSX.platform/Developer/SDKs/MacOSX10.15.sdk   -UNDEBUG -std=c++14  -fno-exceptions -fno-rtti -MD -MT lib/Support/CMakeFiles/LLVMSupport.dir/CRC.cpp.o -MF lib/Support/CMakeFiles/LLVMSupport.dir/CRC.cpp.o.d -o lib/Support/CMakeFiles/LLVMSupport.dir/CRC.cpp.o -c /Users/buildslave/jenkins/workspace/lldb-cmake-matrix/llvm-project/llvm/lib/Support/CRC.cpp
[557/4328] /Users/buildslave/jenkins/workspace/lldb-cmake-matrix/host-compiler/bin/clang++  -DGTEST_HAS_RTTI=0 -D_DEBUG -D__STDC_CONSTANT_MACROS -D__STDC_FORMAT_MACROS -D__STDC_LIMIT_MACROS -Ilib/Support -I/Users/buildslave/jenkins/workspace/lldb-cmake-matrix/llvm-project/llvm/lib/Support -Iinclude -I/Users/buildslave/jenkins/workspace/lldb-cmake-matrix/llvm-project/llvm/include -fPIC -fvisibility-inlines-hidden -Werror=date-time -Werror=unguarded-availability-new -fmodules -fmodules-cache-path=/Users/buildslave/jenkins/workspace/lldb-cmake-matrix/lldb-build/module.cache -fcxx-modules -Xclang -fmodules-local-submodule-visibility -Wall -Wextra -Wno-unused-parameter -Wwrite-strings -Wcast-qual -Wmissing-field-initializers -pedantic -Wno-long-long -Wimplicit-fallthrough -Wcovered-switch-default -Wno-noexcept-type -Wnon-virtual-dtor -Wdelete-non-virtual-dtor -Wsuggest-override -Wstring-conversion -fdiagnostics-color -O3  -isysroot /Applications/Xcode.app/Contents/Developer/Platforms/MacOSX.platform/Developer/SDKs/MacOSX10.15.sdk   -UNDEBUG -std=c++14  -fno-exceptions -fno-rtti -MD -MT lib/Support/CMakeFiles/LLVMSupport.dir/ConvertUTF.cpp.o -MF lib/Support/CMakeFiles/LLVMSupport.dir/ConvertUTF.cpp.o.d -o lib/Support/CMakeFiles/LLVMSupport.dir/ConvertUTF.cpp.o -c /Users/buildslave/jenkins/workspace/lldb-cmake-matrix/llvm-project/llvm/lib/Support/ConvertUTF.cpp
[558/4328] /Users/buildslave/jenkins/workspace/lldb-cmake-matrix/host-compiler/bin/clang++  -DGTEST_HAS_RTTI=0 -D_DEBUG -D__STDC_CONSTANT_MACROS -D__STDC_FORMAT_MACROS -D__STDC_LIMIT_MACROS -Ilib/Support -I/Users/buildslave/jenkins/workspace/lldb-cmake-matrix/llvm-project/llvm/lib/Support -Iinclude -I/Users/buildslave/jenkins/workspace/lldb-cmake-matrix/llvm-project/llvm/include -fPIC -fvisibility-inlines-hidden -Werror=date-time -Werror=unguarded-availability-new -fmodules -fmodules-cache-path=/Users/buildslave/jenkins/workspace/lldb-cmake-matrix/lldb-build/module.cache -fcxx-modules -Xclang -fmodules-local-submodule-visibility -Wall -Wextra -Wno-unused-parameter -Wwrite-strings -Wcast-qual -Wmissing-field-initializers -pedantic -Wno-long-long -Wimplicit-fallthrough -Wcovered-switch-default -Wno-noexcept-type -Wnon-virtual-dtor -Wdelete-non-virtual-dtor -Wsuggest-override -Wstring-conversion -fdiagnostics-color -O3  -isysroot /Applications/Xcode.app/Contents/Developer/Platforms/MacOSX.platform/Developer/SDKs/MacOSX10.15.sdk   -UNDEBUG -std=c++14  -fno-exceptions -fno-rtti -MD -MT lib/Support/CMakeFiles/LLVMSupport.dir/Compression.cpp.o -MF lib/Support/CMakeFiles/LLVMSupport.dir/Compression.cpp.o.d -o lib/Support/CMakeFiles/LLVMSupport.dir/Compression.cpp.o -c /Users/buildslave/jenkins/workspace/lldb-cmake-matrix/llvm-project/llvm/lib/Support/Compression.cpp
[559/4328] /Users/buildslave/jenkins/workspace/lldb-cmake-matrix/host-compiler/bin/clang++  -DGTEST_HAS_RTTI=0 -D_DEBUG -D__STDC_CONSTANT_MACROS -D__STDC_FORMAT_MACROS -D__STDC_LIMIT_MACROS -Ilib/Support -I/Users/buildslave/jenkins/workspace/lldb-cmake-matrix/llvm-project/llvm/lib/Support -Iinclude -I/Users/buildslave/jenkins/workspace/lldb-cmake-matrix/llvm-project/llvm/include -fPIC -fvisibility-inlines-hidden -Werror=date-time -Werror=unguarded-availability-new -fmodules -fmodules-cache-path=/Users/buildslave/jenkins/workspace/lldb-cmake-matrix/lldb-build/module.cache -fcxx-modules -Xclang -fmodules-local-submodule-visibility -Wall -Wextra -Wno-unused-parameter -Wwrite-strings -Wcast-qual -Wmissing-field-initializers -pedantic -Wno-long-long -Wimplicit-fallthrough -Wcovered-switch-default -Wno-noexcept-type -Wnon-virtual-dtor -Wdelete-non-virtual-dtor -Wsuggest-override -Wstring-conversion -fdiagnostics-color -O3  -isysroot /Applications/Xcode.app/Contents/Developer/Platforms/MacOSX.platform/Developer/SDKs/MacOSX10.15.sdk   -UNDEBUG -std=c++14  -fno-exceptions -fno-rtti -MD -MT lib/Support/CMakeFiles/LLVMSupport.dir/BinaryStreamRef.cpp.o -MF lib/Support/CMakeFiles/LLVMSupport.dir/BinaryStreamRef.cpp.o.d -o lib/Support/CMakeFiles/LLVMSupport.dir/BinaryStreamRef.cpp.o -c /Users/buildslave/jenkins/workspace/lldb-cmake-matrix/llvm-project/llvm/lib/Support/BinaryStreamRef.cpp
[560/4328] /Users/buildslave/jenkins/workspace/lldb-cmake-matrix/host-compiler/bin/clang++  -DGTEST_HAS_RTTI=0 -D_DEBUG -D__STDC_CONSTANT_MACROS -D__STDC_FORMAT_MACROS -D__STDC_LIMIT_MACROS -Ilib/Support -I/Users/buildslave/jenkins/workspace/lldb-cmake-matrix/llvm-project/llvm/lib/Support -Iinclude -I/Users/buildslave/jenkins/workspace/lldb-cmake-matrix/llvm-project/llvm/include -fPIC -fvisibility-inlines-hidden -Werror=date-time -Werror=unguarded-availability-new -fmodules -fmodules-cache-path=/Users/buildslave/jenkins/workspace/lldb-cmake-matrix/lldb-build/module.cache -fcxx-modules -Xclang -fmodules-local-submodule-visibility -Wall -Wextra -Wno-unused-parameter -Wwrite-strings -Wcast-qual -Wmissing-field-initializers -pedantic -Wno-long-long -Wimplicit-fallthrough -Wcovered-switch-default -Wno-noexcept-type -Wnon-virtual-dtor -Wdelete-non-virtual-dtor -Wsuggest-override -Wstring-conversion -fdiagnostics-color -O3  -isysroot /Applications/Xcode.app/Contents/Developer/Platforms/MacOSX.platform/Developer/SDKs/MacOSX10.15.sdk   -UNDEBUG -std=c++14  -fno-exceptions -fno-rtti -MD -MT lib/Support/CMakeFiles/LLVMSupport.dir/CodeGenCoverage.cpp.o -MF lib/Support/CMakeFiles/LLVMSupport.dir/CodeGenCoverage.cpp.o.d -o lib/Support/CMakeFiles/LLVMSupport.dir/CodeGenCoverage.cpp.o -c /Users/buildslave/jenkins/workspace/lldb-cmake-matrix/llvm-project/llvm/lib/Support/CodeGenCoverage.cpp
[561/4328] /Users/buildslave/jenkins/workspace/lldb-cmake-matrix/host-compiler/bin/clang++  -DGTEST_HAS_RTTI=0 -D_DEBUG -D__STDC_CONSTANT_MACROS -D__STDC_FORMAT_MACROS -D__STDC_LIMIT_MACROS -Ilib/Support -I/Users/buildslave/jenkins/workspace/lldb-cmake-matrix/llvm-project/llvm/lib/Support -Iinclude -I/Users/buildslave/jenkins/workspace/lldb-cmake-matrix/llvm-project/llvm/include -fPIC -fvisibility-inlines-hidden -Werror=date-time -Werror=unguarded-availability-new -fmodules -fmodules-cache-path=/Users/buildslave/jenkins/workspace/lldb-cmake-matrix/lldb-build/module.cache -fcxx-modules -Xclang -fmodules-local-submodule-visibility -Wall -Wextra -Wno-unused-parameter -Wwrite-strings -Wcast-qual -Wmissing-field-initializers -pedantic -Wno-long-long -Wimplicit-fallthrough -Wcovered-switch-default -Wno-noexcept-type -Wnon-virtual-dtor -Wdelete-non-virtual-dtor -Wsuggest-override -Wstring-conversion -fdiagnostics-color -O3  -isysroot /Applications/Xcode.app/Contents/Developer/Platforms/MacOSX.platform/Developer/SDKs/MacOSX10.15.sdk   -UNDEBUG -std=c++14  -fno-exceptions -fno-rtti -MD -MT lib/Support/CMakeFiles/LLVMSupport.dir/BinaryStreamReader.cpp.o -MF lib/Support/CMakeFiles/LLVMSupport.dir/BinaryStreamReader.cpp.o.d -o lib/Support/CMakeFiles/LLVMSupport.dir/BinaryStreamReader.cpp.o -c /Users/buildslave/jenkins/workspace/lldb-cmake-matrix/llvm-project/llvm/lib/Support/BinaryStreamReader.cpp
[562/4328] /Users/buildslave/jenkins/workspace/lldb-cmake-matrix/host-compiler/bin/clang++  -DGTEST_HAS_RTTI=0 -D_DEBUG -D__STDC_CONSTANT_MACROS -D__STDC_FORMAT_MACROS -D__STDC_LIMIT_MACROS -Ilib/Support -I/Users/buildslave/jenkins/workspace/lldb-cmake-matrix/llvm-project/llvm/lib/Support -Iinclude -I/Users/buildslave/jenkins/workspace/lldb-cmake-matrix/llvm-project/llvm/include -fPIC -fvisibility-inlines-hidden -Werror=date-time -Werror=unguarded-availability-new -fmodules -fmodules-cache-path=/Users/buildslave/jenkins/workspace/lldb-cmake-matrix/lldb-build/module.cache -fcxx-modules -Xclang -fmodules-local-submodule-visibility -Wall -Wextra -Wno-unused-parameter -Wwrite-strings -Wcast-qual -Wmissing-field-initializers -pedantic -Wno-long-long -Wimplicit-fallthrough -Wcovered-switch-default -Wno-noexcept-type -Wnon-virtual-dtor -Wdelete-non-virtual-dtor -Wsuggest-override -Wstring-conversion -fdiagnostics-color -O3  -isysroot /Applications/Xcode.app/Contents/Developer/Platforms/MacOSX.platform/Developer/SDKs/MacOSX10.15.sdk   -UNDEBUG -std=c++14  -fno-exceptions -fno-rtti -MD -MT lib/Support/CMakeFiles/LLVMSupport.dir/CrashRecoveryContext.cpp.o -MF lib/Support/CMakeFiles/LLVMSupport.dir/CrashRecoveryContext.cpp.o.d -o lib/Support/CMakeFiles/LLVMSupport.dir/CrashRecoveryContext.cpp.o -c /Users/buildslave/jenkins/workspace/lldb-cmake-matrix/llvm-project/llvm/lib/Support/CrashRecoveryContext.cpp
[563/4328] /Users/buildslave/jenkins/workspace/lldb-cmake-matrix/host-compiler/bin/clang++  -DGTEST_HAS_RTTI=0 -D_DEBUG -D__STDC_CONSTANT_MACROS -D__STDC_FORMAT_MACROS -D__STDC_LIMIT_MACROS -Ilib/Demangle -I/Users/buildslave/jenkins/workspace/lldb-cmake-matrix/llvm-project/llvm/lib/Demangle -Iinclude -I/Users/buildslave/jenkins/workspace/lldb-cmake-matrix/llvm-project/llvm/include -fPIC -fvisibility-inlines-hidden -Werror=date-time -Werror=unguarded-availability-new -fmodules -fmodules-cache-path=/Users/buildslave/jenkins/workspace/lldb-cmake-matrix/lldb-build/module.cache -fcxx-modules -Xclang -fmodules-local-submodule-visibility -Wall -Wextra -Wno-unused-parameter -Wwrite-strings -Wcast-qual -Wmissing-field-initializers -pedantic -Wno-long-long -Wimplicit-fallthrough -Wcovered-switch-default -Wno-noexcept-type -Wnon-virtual-dtor -Wdelete-non-virtual-dtor -Wsuggest-override -Wstring-conversion -fdiagnostics-color -O3  -isysroot /Applications/Xcode.app/Contents/Developer/Platforms/MacOSX.platform/Developer/SDKs/MacOSX10.15.sdk    -fno-exceptions -fno-rtti -UNDEBUG -std=c++14 -MD -MT lib/Demangle/CMakeFiles/LLVMDemangle.dir/MicrosoftDemangle.cpp.o -MF lib/Demangle/CMakeFiles/LLVMDemangle.dir/MicrosoftDemangle.cpp.o.d -o lib/Demangle/CMakeFiles/LLVMDemangle.dir/MicrosoftDemangle.cpp.o -c /Users/buildslave/jenkins/workspace/lldb-cmake-matrix/llvm-project/llvm/lib/Demangle/MicrosoftDemangle.cpp
[564/4328] /Users/buildslave/jenkins/workspace/lldb-cmake-matrix/host-compiler/bin/clang++  -DGTEST_HAS_RTTI=0 -D_DEBUG -D_GNU_SOURCE -D__STDC_CONSTANT_MACROS -D__STDC_FORMAT_MACROS -D__STDC_LIMIT_MACROS -Itools/clang/utils/TableGen -I/Users/buildslave/jenkins/workspace/lldb-cmake-matrix/llvm-project/clang/utils/TableGen -I/Users/buildslave/jenkins/workspace/lldb-cmake-matrix/llvm-project/clang/include -Itools/clang/include -Iinclude -I/Users/buildslave/jenkins/workspace/lldb-cmake-matrix/llvm-project/llvm/include -fPIC -fvisibility-inlines-hidden -Werror=date-time -Werror=unguarded-availability-new -fmodules -fmodules-cache-path=/Users/buildslave/jenkins/workspace/lldb-cmake-matrix/lldb-build/module.cache -fcxx-modules -Xclang -fmodules-local-submodule-visibility -Wall -Wextra -Wno-unused-parameter -Wwrite-strings -Wcast-qual -Wmissing-field-initializers -pedantic -Wno-long-long -Wimplicit-fallthrough -Wcovered-switch-default -Wno-noexcept-type -Wnon-virtual-dtor -Wdelete-non-virtual-dtor -Wsuggest-override -Wstring-conversion -fdiagnostics-color -fno-common -Woverloaded-virtual -Wno-nested-anon-types -O3  -isysroot /Applications/Xcode.app/Contents/Developer/Platforms/MacOSX.platform/Developer/SDKs/MacOSX10.15.sdk    -fno-exceptions -fno-rtti -UNDEBUG -std=c++14 -MD -MT tools/clang/utils/TableGen/CMakeFiles/clang-tblgen.dir/SveEmitter.cpp.o -MF tools/clang/utils/TableGen/CMakeFiles/clang-tblgen.dir/SveEmitter.cpp.o.d -o tools/clang/utils/TableGen/CMakeFiles/clang-tblgen.dir/SveEmitter.cpp.o -c /Users/buildslave/jenkins/workspace/lldb-cmake-matrix/llvm-project/clang/utils/TableGen/SveEmitter.cpp
[565/4328] /Users/buildslave/jenkins/workspace/lldb-cmake-matrix/host-compiler/bin/clang++  -DGTEST_HAS_RTTI=0 -D_DEBUG -D__STDC_CONSTANT_MACROS -D__STDC_FORMAT_MACROS -D__STDC_LIMIT_MACROS -Ilib/Support -I/Users/buildslave/jenkins/workspace/lldb-cmake-matrix/llvm-project/llvm/lib/Support -Iinclude -I/Users/buildslave/jenkins/workspace/lldb-cmake-matrix/llvm-project/llvm/include -fPIC -fvisibility-inlines-hidden -Werror=date-time -Werror=unguarded-availability-new -fmodules -fmodules-cache-path=/Users/buildslave/jenkins/workspace/lldb-cmake-matrix/lldb-build/module.cache -fcxx-modules -Xclang -fmodules-local-submodule-visibility -Wall -Wextra -Wno-unused-parameter -Wwrite-strings -Wcast-qual -Wmissing-field-initializers -pedantic -Wno-long-long -Wimplicit-fallthrough -Wcovered-switch-default -Wno-noexcept-type -Wnon-virtual-dtor -Wdelete-non-virtual-dtor -Wsuggest-override -Wstring-conversion -fdiagnostics-color -O3  -isysroot /Applications/Xcode.app/Contents/Developer/Platforms/MacOSX.platform/Developer/SDKs/MacOSX10.15.sdk   -UNDEBUG -std=c++14  -fno-exceptions -fno-rtti -MD -MT lib/Support/CMakeFiles/LLVMSupport.dir/DJB.cpp.o -MF lib/Support/CMakeFiles/LLVMSupport.dir/DJB.cpp.o.d -o lib/Support/CMakeFiles/LLVMSupport.dir/DJB.cpp.o -c /Users/buildslave/jenkins/workspace/lldb-cmake-matrix/llvm-project/llvm/lib/Support/DJB.cpp
[566/4328] /Users/buildslave/jenkins/workspace/lldb-cmake-matrix/host-compiler/bin/clang++  -DGTEST_HAS_RTTI=0 -D_DEBUG -D__STDC_CONSTANT_MACROS -D__STDC_FORMAT_MACROS -D__STDC_LIMIT_MACROS -Ilib/Support -I/Users/buildslave/jenkins/workspace/lldb-cmake-matrix/llvm-project/llvm/lib/Support -Iinclude -I/Users/buildslave/jenkins/workspace/lldb-cmake-matrix/llvm-project/llvm/include -fPIC -fvisibility-inlines-hidden -Werror=date-time -Werror=unguarded-availability-new -fmodules -fmodules-cache-path=/Users/buildslave/jenkins/workspace/lldb-cmake-matrix/lldb-build/module.cache -fcxx-modules -Xclang -fmodules-local-submodule-visibility -Wall -Wextra -Wno-unused-parameter -Wwrite-strings -Wcast-qual -Wmissing-field-initializers -pedantic -Wno-long-long -Wimplicit-fallthrough -Wcovered-switch-default -Wno-noexcept-type -Wnon-virtual-dtor -Wdelete-non-virtual-dtor -Wsuggest-override -Wstring-conversion -fdiagnostics-color -O3  -isysroot /Applications/Xcode.app/Contents/Developer/Platforms/MacOSX.platform/Developer/SDKs/MacOSX10.15.sdk   -UNDEBUG -std=c++14  -fno-exceptions -fno-rtti -MD -MT lib/Support/CMakeFiles/LLVMSupport.dir/ConvertUTFWrapper.cpp.o -MF lib/Support/CMakeFiles/LLVMSupport.dir/ConvertUTFWrapper.cpp.o.d -o lib/Support/CMakeFiles/LLVMSupport.dir/ConvertUTFWrapper.cpp.o -c /Users/buildslave/jenkins/workspace/lldb-cmake-matrix/llvm-project/llvm/lib/Support/ConvertUTFWrapper.cpp
[567/4328] /Users/buildslave/jenkins/workspace/lldb-cmake-matrix/host-compiler/bin/clang++  -DGTEST_HAS_RTTI=0 -D_DEBUG -D__STDC_CONSTANT_MACROS -D__STDC_FORMAT_MACROS -D__STDC_LIMIT_MACROS -Ilib/Support -I/Users/buildslave/jenkins/workspace/lldb-cmake-matrix/llvm-project/llvm/lib/Support -Iinclude -I/Users/buildslave/jenkins/workspace/lldb-cmake-matrix/llvm-project/llvm/include -fPIC -fvisibility-inlines-hidden -Werror=date-time -Werror=unguarded-availability-new -fmodules -fmodules-cache-path=/Users/buildslave/jenkins/workspace/lldb-cmake-matrix/lldb-build/module.cache -fcxx-modules -Xclang -fmodules-local-submodule-visibility -Wall -Wextra -Wno-unused-parameter -Wwrite-strings -Wcast-qual -Wmissing-field-initializers -pedantic -Wno-long-long -Wimplicit-fallthrough -Wcovered-switch-default -Wno-noexcept-type -Wnon-virtual-dtor -Wdelete-non-virtual-dtor -Wsuggest-override -Wstring-conversion -fdiagnostics-color -O3  -isysroot /Applications/Xcode.app/Contents/Developer/Platforms/MacOSX.platform/Developer/SDKs/MacOSX10.15.sdk   -UNDEBUG -std=c++14  -fno-exceptions -fno-rtti -MD -MT lib/Support/CMakeFiles/LLVMSupport.dir/ELFAttributes.cpp.o -MF lib/Support/CMakeFiles/LLVMSupport.dir/ELFAttributes.cpp.o.d -o lib/Support/CMakeFiles/LLVMSupport.dir/ELFAttributes.cpp.o -c /Users/buildslave/jenkins/workspace/lldb-cmake-matrix/llvm-project/llvm/lib/Support/ELFAttributes.cpp
[568/4328] /Users/buildslave/jenkins/workspace/lldb-cmake-matrix/host-compiler/bin/clang++  -DGTEST_HAS_RTTI=0 -D_DEBUG -D__STDC_CONSTANT_MACROS -D__STDC_FORMAT_MACROS -D__STDC_LIMIT_MACROS -Ilib/Support -I/Users/buildslave/jenkins/workspace/lldb-cmake-matrix/llvm-project/llvm/lib/Support -Iinclude -I/Users/buildslave/jenkins/workspace/lldb-cmake-matrix/llvm-project/llvm/include -fPIC -fvisibility-inlines-hidden -Werror=date-time -Werror=unguarded-availability-new -fmodules -fmodules-cache-path=/Users/buildslave/jenkins/workspace/lldb-cmake-matrix/lldb-build/module.cache -fcxx-modules -Xclang -fmodules-local-submodule-visibility -Wall -Wextra -Wno-unused-parameter -Wwrite-strings -Wcast-qual -Wmissing-field-initializers -pedantic -Wno-long-long -Wimplicit-fallthrough -Wcovered-switch-default -Wno-noexcept-type -Wnon-virtual-dtor -Wdelete-non-virtual-dtor -Wsuggest-override -Wstring-conversion -fdiagnostics-color -O3  -isysroot /Applications/Xcode.app/Contents/Developer/Platforms/MacOSX.platform/Developer/SDKs/MacOSX10.15.sdk   -UNDEBUG -std=c++14  -fno-exceptions -fno-rtti -MD -MT lib/Support/CMakeFiles/LLVMSupport.dir/CachePruning.cpp.o -MF lib/Support/CMakeFiles/LLVMSupport.dir/CachePruning.cpp.o.d -o lib/Support/CMakeFiles/LLVMSupport.dir/CachePruning.cpp.o -c /Users/buildslave/jenkins/workspace/lldb-cmake-matrix/llvm-project/llvm/lib/Support/CachePruning.cpp
[569/4328] /Users/buildslave/jenkins/workspace/lldb-cmake-matrix/host-compiler/bin/clang++  -DGTEST_HAS_RTTI=0 -D_DEBUG -D__STDC_CONSTANT_MACROS -D__STDC_FORMAT_MACROS -D__STDC_LIMIT_MACROS -Ilib/Support -I/Users/buildslave/jenkins/workspace/lldb-cmake-matrix/llvm-project/llvm/lib/Support -Iinclude -I/Users/buildslave/jenkins/workspace/lldb-cmake-matrix/llvm-project/llvm/include -fPIC -fvisibility-inlines-hidden -Werror=date-time -Werror=unguarded-availability-new -fmodules -fmodules-cache-path=/Users/buildslave/jenkins/workspace/lldb-cmake-matrix/lldb-build/module.cache -fcxx-modules -Xclang -fmodules-local-submodule-visibility -Wall -Wextra -Wno-unused-parameter -Wwrite-strings -Wcast-qual -Wmissing-field-initializers -pedantic -Wno-long-long -Wimplicit-fallthrough -Wcovered-switch-default -Wno-noexcept-type -Wnon-virtual-dtor -Wdelete-non-virtual-dtor -Wsuggest-override -Wstring-conversion -fdiagnostics-color -O3  -isysroot /Applications/Xcode.app/Contents/Developer/Platforms/MacOSX.platform/Developer/SDKs/MacOSX10.15.sdk   -UNDEBUG -std=c++14  -fno-exceptions -fno-rtti -MD -MT lib/Support/CMakeFiles/LLVMSupport.dir/DataExtractor.cpp.o -MF lib/Support/CMakeFiles/LLVMSupport.dir/DataExtractor.cpp.o.d -o lib/Support/CMakeFiles/LLVMSupport.dir/DataExtractor.cpp.o -c /Users/buildslave/jenkins/workspace/lldb-cmake-matrix/llvm-project/llvm/lib/Support/DataExtractor.cpp
[570/4328] /Users/buildslave/jenkins/workspace/lldb-cmake-matrix/host-compiler/bin/clang++  -DGTEST_HAS_RTTI=0 -D_DEBUG -D__STDC_CONSTANT_MACROS -D__STDC_FORMAT_MACROS -D__STDC_LIMIT_MACROS -Ilib/Support -I/Users/buildslave/jenkins/workspace/lldb-cmake-matrix/llvm-project/llvm/lib/Support -Iinclude -I/Users/buildslave/jenkins/workspace/lldb-cmake-matrix/llvm-project/llvm/include -fPIC -fvisibility-inlines-hidden -Werror=date-time -Werror=unguarded-availability-new -fmodules -fmodules-cache-path=/Users/buildslave/jenkins/workspace/lldb-cmake-matrix/lldb-build/module.cache -fcxx-modules -Xclang -fmodules-local-submodule-visibility -Wall -Wextra -Wno-unused-parameter -Wwrite-strings -Wcast-qual -Wmissing-field-initializers -pedantic -Wno-long-long -Wimplicit-fallthrough -Wcovered-switch-default -Wno-noexcept-type -Wnon-virtual-dtor -Wdelete-non-virtual-dtor -Wsuggest-override -Wstring-conversion -fdiagnostics-color -O3  -isysroot /Applications/Xcode.app/Contents/Developer/Platforms/MacOSX.platform/Developer/SDKs/MacOSX10.15.sdk   -UNDEBUG -std=c++14  -fno-exceptions -fno-rtti -MD -MT lib/Support/CMakeFiles/LLVMSupport.dir/ErrorHandling.cpp.o -MF lib/Support/CMakeFiles/LLVMSupport.dir/ErrorHandling.cpp.o.d -o lib/Support/CMakeFiles/LLVMSupport.dir/ErrorHandling.cpp.o -c /Users/buildslave/jenkins/workspace/lldb-cmake-matrix/llvm-project/llvm/lib/Support/ErrorHandling.cpp
[571/4328] /Users/buildslave/jenkins/workspace/lldb-cmake-matrix/host-compiler/bin/clang++  -DGTEST_HAS_RTTI=0 -D_DEBUG -D__STDC_CONSTANT_MACROS -D__STDC_FORMAT_MACROS -D__STDC_LIMIT_MACROS -Ilib/Support -I/Users/buildslave/jenkins/workspace/lldb-cmake-matrix/llvm-project/llvm/lib/Support -Iinclude -I/Users/buildslave/jenkins/workspace/lldb-cmake-matrix/llvm-project/llvm/include -fPIC -fvisibility-inlines-hidden -Werror=date-time -Werror=unguarded-availability-new -fmodules -fmodules-cache-path=/Users/buildslave/jenkins/workspace/lldb-cmake-matrix/lldb-build/module.cache -fcxx-modules -Xclang -fmodules-local-submodule-visibility -Wall -Wextra -Wno-unused-parameter -Wwrite-strings -Wcast-qual -Wmissing-field-initializers -pedantic -Wno-long-long -Wimplicit-fallthrough -Wcovered-switch-default -Wno-noexcept-type -Wnon-virtual-dtor -Wdelete-non-virtual-dtor -Wsuggest-override -Wstring-conversion -fdiagnostics-color -O3  -isysroot /Applications/Xcode.app/Contents/Developer/Platforms/MacOSX.platform/Developer/SDKs/MacOSX10.15.sdk   -UNDEBUG -std=c++14  -fno-exceptions -fno-rtti -MD -MT lib/Support/CMakeFiles/LLVMSupport.dir/ExtensibleRTTI.cpp.o -MF lib/Support/CMakeFiles/LLVMSupport.dir/ExtensibleRTTI.cpp.o.d -o lib/Support/CMakeFiles/LLVMSupport.dir/ExtensibleRTTI.cpp.o -c /Users/buildslave/jenkins/workspace/lldb-cmake-matrix/llvm-project/llvm/lib/Support/ExtensibleRTTI.cpp
[572/4328] /Users/buildslave/jenkins/workspace/lldb-cmake-matrix/host-compiler/bin/clang++  -DGTEST_HAS_RTTI=0 -D_DEBUG -D__STDC_CONSTANT_MACROS -D__STDC_FORMAT_MACROS -D__STDC_LIMIT_MACROS -Ilib/Support -I/Users/buildslave/jenkins/workspace/lldb-cmake-matrix/llvm-project/llvm/lib/Support -Iinclude -I/Users/buildslave/jenkins/workspace/lldb-cmake-matrix/llvm-project/llvm/include -fPIC -fvisibility-inlines-hidden -Werror=date-time -Werror=unguarded-availability-new -fmodules -fmodules-cache-path=/Users/buildslave/jenkins/workspace/lldb-cmake-matrix/lldb-build/module.cache -fcxx-modules -Xclang -fmodules-local-submodule-visibility -Wall -Wextra -Wno-unused-parameter -Wwrite-strings -Wcast-qual -Wmissing-field-initializers -pedantic -Wno-long-long -Wimplicit-fallthrough -Wcovered-switch-default -Wno-noexcept-type -Wnon-virtual-dtor -Wdelete-non-virtual-dtor -Wsuggest-override -Wstring-conversion -fdiagnostics-color -O3  -isysroot /Applications/Xcode.app/Contents/Developer/Platforms/MacOSX.platform/Developer/SDKs/MacOSX10.15.sdk   -UNDEBUG -std=c++14  -fno-exceptions -fno-rtti -MD -MT lib/Support/CMakeFiles/LLVMSupport.dir/APFloat.cpp.o -MF lib/Support/CMakeFiles/LLVMSupport.dir/APFloat.cpp.o.d -o lib/Support/CMakeFiles/LLVMSupport.dir/APFloat.cpp.o -c /Users/buildslave/jenkins/workspace/lldb-cmake-matrix/llvm-project/llvm/lib/Support/APFloat.cpp
[573/4328] /Users/buildslave/jenkins/workspace/lldb-cmake-matrix/host-compiler/bin/clang++  -DGTEST_HAS_RTTI=0 -D_DEBUG -D__STDC_CONSTANT_MACROS -D__STDC_FORMAT_MACROS -D__STDC_LIMIT_MACROS -Ilib/Support -I/Users/buildslave/jenkins/workspace/lldb-cmake-matrix/llvm-project/llvm/lib/Support -Iinclude -I/Users/buildslave/jenkins/workspace/lldb-cmake-matrix/llvm-project/llvm/include -fPIC -fvisibility-inlines-hidden -Werror=date-time -Werror=unguarded-availability-new -fmodules -fmodules-cache-path=/Users/buildslave/jenkins/workspace/lldb-cmake-matrix/lldb-build/module.cache -fcxx-modules -Xclang -fmodules-local-submodule-visibility -Wall -Wextra -Wno-unused-parameter -Wwrite-strings -Wcast-qual -Wmissing-field-initializers -pedantic -Wno-long-long -Wimplicit-fallthrough -Wcovered-switch-default -Wno-noexcept-type -Wnon-virtual-dtor -Wdelete-non-virtual-dtor -Wsuggest-override -Wstring-conversion -fdiagnostics-color -O3  -isysroot /Applications/Xcode.app/Contents/Developer/Platforms/MacOSX.platform/Developer/SDKs/MacOSX10.15.sdk   -UNDEBUG -std=c++14  -fno-exceptions -fno-rtti -MD -MT lib/Support/CMakeFiles/LLVMSupport.dir/DeltaAlgorithm.cpp.o -MF lib/Support/CMakeFiles/LLVMSupport.dir/DeltaAlgorithm.cpp.o.d -o lib/Support/CMakeFiles/LLVMSupport.dir/DeltaAlgorithm.cpp.o -c /Users/buildslave/jenkins/workspace/lldb-cmake-matrix/llvm-project/llvm/lib/Support/DeltaAlgorithm.cpp
[574/4328] /Users/buildslave/jenkins/workspace/lldb-cmake-matrix/host-compiler/bin/clang++  -DGTEST_HAS_RTTI=0 -D_DEBUG -D__STDC_CONSTANT_MACROS -D__STDC_FORMAT_MACROS -D__STDC_LIMIT_MACROS -Ilib/Support -I/Users/buildslave/jenkins/workspace/lldb-cmake-matrix/llvm-project/llvm/lib/Support -Iinclude -I/Users/buildslave/jenkins/workspace/lldb-cmake-matrix/llvm-project/llvm/include -fPIC -fvisibility-inlines-hidden -Werror=date-time -Werror=unguarded-availability-new -fmodules -fmodules-cache-path=/Users/buildslave/jenkins/workspace/lldb-cmake-matrix/lldb-build/module.cache -fcxx-modules -Xclang -fmodules-local-submodule-visibility -Wall -Wextra -Wno-unused-parameter -Wwrite-strings -Wcast-qual -Wmissing-field-initializers -pedantic -Wno-long-long -Wimplicit-fallthrough -Wcovered-switch-default -Wno-noexcept-type -Wnon-virtual-dtor -Wdelete-non-virtual-dtor -Wsuggest-override -Wstring-conversion -fdiagnostics-color -O3  -isysroot /Applications/Xcode.app/Contents/Developer/Platforms/MacOSX.platform/Developer/SDKs/MacOSX10.15.sdk   -UNDEBUG -std=c++14  -fno-exceptions -fno-rtti -MD -MT lib/Support/CMakeFiles/LLVMSupport.dir/Debug.cpp.o -MF lib/Support/CMakeFiles/LLVMSupport.dir/Debug.cpp.o.d -o lib/Support/CMakeFiles/LLVMSupport.dir/Debug.cpp.o -c /Users/buildslave/jenkins/workspace/lldb-cmake-matrix/llvm-project/llvm/lib/Support/Debug.cpp
[575/4328] /Users/buildslave/jenkins/workspace/lldb-cmake-matrix/host-compiler/bin/clang++  -DGTEST_HAS_RTTI=0 -D_DEBUG -D__STDC_CONSTANT_MACROS -D__STDC_FORMAT_MACROS -D__STDC_LIMIT_MACROS -Ilib/Support -I/Users/buildslave/jenkins/workspace/lldb-cmake-matrix/llvm-project/llvm/lib/Support -Iinclude -I/Users/buildslave/jenkins/workspace/lldb-cmake-matrix/llvm-project/llvm/include -fPIC -fvisibility-inlines-hidden -Werror=date-time -Werror=unguarded-availability-new -fmodules -fmodules-cache-path=/Users/buildslave/jenkins/workspace/lldb-cmake-matrix/lldb-build/module.cache -fcxx-modules -Xclang -fmodules-local-submodule-visibility -Wall -Wextra -Wno-unused-parameter -Wwrite-strings -Wcast-qual -Wmissing-field-initializers -pedantic -Wno-long-long -Wimplicit-fallthrough -Wcovered-switch-default -Wno-noexcept-type -Wnon-virtual-dtor -Wdelete-non-virtual-dtor -Wsuggest-override -Wstring-conversion -fdiagnostics-color -O3  -isysroot /Applications/Xcode.app/Contents/Developer/Platforms/MacOSX.platform/Developer/SDKs/MacOSX10.15.sdk   -UNDEBUG -std=c++14  -fno-exceptions -fno-rtti -MD -MT lib/Support/CMakeFiles/LLVMSupport.dir/FormattedStream.cpp.o -MF lib/Support/CMakeFiles/LLVMSupport.dir/FormattedStream.cpp.o.d -o lib/Support/CMakeFiles/LLVMSupport.dir/FormattedStream.cpp.o -c /Users/buildslave/jenkins/workspace/lldb-cmake-matrix/llvm-project/llvm/lib/Support/FormattedStream.cpp
[576/4328] /Users/buildslave/jenkins/workspace/lldb-cmake-matrix/host-compiler/bin/clang++  -DGTEST_HAS_RTTI=0 -D_DEBUG -D__STDC_CONSTANT_MACROS -D__STDC_FORMAT_MACROS -D__STDC_LIMIT_MACROS -Ilib/Support -I/Users/buildslave/jenkins/workspace/lldb-cmake-matrix/llvm-project/llvm/lib/Support -Iinclude -I/Users/buildslave/jenkins/workspace/lldb-cmake-matrix/llvm-project/llvm/include -fPIC -fvisibility-inlines-hidden -Werror=date-time -Werror=unguarded-availability-new -fmodules -fmodules-cache-path=/Users/buildslave/jenkins/workspace/lldb-cmake-matrix/lldb-build/module.cache -fcxx-modules -Xclang -fmodules-local-submodule-visibility -Wall -Wextra -Wno-unused-parameter -Wwrite-strings -Wcast-qual -Wmissing-field-initializers -pedantic -Wno-long-long -Wimplicit-fallthrough -Wcovered-switch-default -Wno-noexcept-type -Wnon-virtual-dtor -Wdelete-non-virtual-dtor -Wsuggest-override -Wstring-conversion -fdiagnostics-color -O3  -isysroot /Applications/Xcode.app/Contents/Developer/Platforms/MacOSX.platform/Developer/SDKs/MacOSX10.15.sdk   -UNDEBUG -std=c++14  -fno-exceptions -fno-rtti -MD -MT lib/Support/CMakeFiles/LLVMSupport.dir/Error.cpp.o -MF lib/Support/CMakeFiles/LLVMSupport.dir/Error.cpp.o.d -o lib/Support/CMakeFiles/LLVMSupport.dir/Error.cpp.o -c /Users/buildslave/jenkins/workspace/lldb-cmake-matrix/llvm-project/llvm/lib/Support/Error.cpp
[577/4328] /Users/buildslave/jenkins/workspace/lldb-cmake-matrix/host-compiler/bin/clang++  -DGTEST_HAS_RTTI=0 -D_DEBUG -D__STDC_CONSTANT_MACROS -D__STDC_FORMAT_MACROS -D__STDC_LIMIT_MACROS -Ilib/Support -I/Users/buildslave/jenkins/workspace/lldb-cmake-matrix/llvm-project/llvm/lib/Support -Iinclude -I/Users/buildslave/jenkins/workspace/lldb-cmake-matrix/llvm-project/llvm/include -fPIC -fvisibility-inlines-hidden -Werror=date-time -Werror=unguarded-availability-new -fmodules -fmodules-cache-path=/Users/buildslave/jenkins/workspace/lldb-cmake-matrix/lldb-build/module.cache -fcxx-modules -Xclang -fmodules-local-submodule-visibility -Wall -Wextra -Wno-unused-parameter -Wwrite-strings -Wcast-qual -Wmissing-field-initializers -pedantic -Wno-long-long -Wimplicit-fallthrough -Wcovered-switch-default -Wno-noexcept-type -Wnon-virtual-dtor -Wdelete-non-virtual-dtor -Wsuggest-override -Wstring-conversion -fdiagnostics-color -O3  -isysroot /Applications/Xcode.app/Contents/Developer/Platforms/MacOSX.platform/Developer/SDKs/MacOSX10.15.sdk   -UNDEBUG -std=c++14  -fno-exceptions -fno-rtti -MD -MT lib/Support/CMakeFiles/LLVMSupport.dir/FileCollector.cpp.o -MF lib/Support/CMakeFiles/LLVMSupport.dir/FileCollector.cpp.o.d -o lib/Support/CMakeFiles/LLVMSupport.dir/FileCollector.cpp.o -c /Users/buildslave/jenkins/workspace/lldb-cmake-matrix/llvm-project/llvm/lib/Support/FileCollector.cpp
[578/4328] /Users/buildslave/jenkins/workspace/lldb-cmake-matrix/host-compiler/bin/clang++  -DGTEST_HAS_RTTI=0 -D_DEBUG -D__STDC_CONSTANT_MACROS -D__STDC_FORMAT_MACROS -D__STDC_LIMIT_MACROS -Ilib/Support -I/Users/buildslave/jenkins/workspace/lldb-cmake-matrix/llvm-project/llvm/lib/Support -Iinclude -I/Users/buildslave/jenkins/workspace/lldb-cmake-matrix/llvm-project/llvm/include -fPIC -fvisibility-inlines-hidden -Werror=date-time -Werror=unguarded-availability-new -fmodules -fmodules-cache-path=/Users/buildslave/jenkins/workspace/lldb-cmake-matrix/lldb-build/module.cache -fcxx-modules -Xclang -fmodules-local-submodule-visibility -Wall -Wextra -Wno-unused-parameter -Wwrite-strings -Wcast-qual -Wmissing-field-initializers -pedantic -Wno-long-long -Wimplicit-fallthrough -Wcovered-switch-default -Wno-noexcept-type -Wnon-virtual-dtor -Wdelete-non-virtual-dtor -Wsuggest-override -Wstring-conversion -fdiagnostics-color -O3  -isysroot /Applications/Xcode.app/Contents/Developer/Platforms/MacOSX.platform/Developer/SDKs/MacOSX10.15.sdk   -UNDEBUG -std=c++14  -fno-exceptions -fno-rtti -MD -MT lib/Support/CMakeFiles/LLVMSupport.dir/DebugCounter.cpp.o -MF lib/Support/CMakeFiles/LLVMSupport.dir/DebugCounter.cpp.o.d -o lib/Support/CMakeFiles/LLVMSupport.dir/DebugCounter.cpp.o -c /Users/buildslave/jenkins/workspace/lldb-cmake-matrix/llvm-project/llvm/lib/Support/DebugCounter.cpp
[579/4328] /Users/buildslave/jenkins/workspace/lldb-cmake-matrix/host-compiler/bin/clang++  -DGTEST_HAS_RTTI=0 -D_DEBUG -D__STDC_CONSTANT_MACROS -D__STDC_FORMAT_MACROS -D__STDC_LIMIT_MACROS -Ilib/Support -I/Users/buildslave/jenkins/workspace/lldb-cmake-matrix/llvm-project/llvm/lib/Support -Iinclude -I/Users/buildslave/jenkins/workspace/lldb-cmake-matrix/llvm-project/llvm/include -fPIC -fvisibility-inlines-hidden -Werror=date-time -Werror=unguarded-availability-new -fmodules -fmodules-cache-path=/Users/buildslave/jenkins/workspace/lldb-cmake-matrix/lldb-build/module.cache -fcxx-modules -Xclang -fmodules-local-submodule-visibility -Wall -Wextra -Wno-unused-parameter -Wwrite-strings -Wcast-qual -Wmissing-field-initializers -pedantic -Wno-long-long -Wimplicit-fallthrough -Wcovered-switch-default -Wno-noexcept-type -Wnon-virtual-dtor -Wdelete-non-virtual-dtor -Wsuggest-override -Wstring-conversion -fdiagnostics-color -O3  -isysroot /Applications/Xcode.app/Contents/Developer/Platforms/MacOSX.platform/Developer/SDKs/MacOSX10.15.sdk   -UNDEBUG -std=c++14  -fno-exceptions -fno-rtti -MD -MT lib/Support/CMakeFiles/LLVMSupport.dir/Hashing.cpp.o -MF lib/Support/CMakeFiles/LLVMSupport.dir/Hashing.cpp.o.d -o lib/Support/CMakeFiles/LLVMSupport.dir/Hashing.cpp.o -c /Users/buildslave/jenkins/workspace/lldb-cmake-matrix/llvm-project/llvm/lib/Support/Hashing.cpp
[580/4328] /Users/buildslave/jenkins/workspace/lldb-cmake-matrix/host-compiler/bin/clang++  -DGTEST_HAS_RTTI=0 -D_DEBUG -D__STDC_CONSTANT_MACROS -D__STDC_FORMAT_MACROS -D__STDC_LIMIT_MACROS -Ilib/Support -I/Users/buildslave/jenkins/workspace/lldb-cmake-matrix/llvm-project/llvm/lib/Support -Iinclude -I/Users/buildslave/jenkins/workspace/lldb-cmake-matrix/llvm-project/llvm/include -fPIC -fvisibility-inlines-hidden -Werror=date-time -Werror=unguarded-availability-new -fmodules -fmodules-cache-path=/Users/buildslave/jenkins/workspace/lldb-cmake-matrix/lldb-build/module.cache -fcxx-modules -Xclang -fmodules-local-submodule-visibility -Wall -Wextra -Wno-unused-parameter -Wwrite-strings -Wcast-qual -Wmissing-field-initializers -pedantic -Wno-long-long -Wimplicit-fallthrough -Wcovered-switch-default -Wno-noexcept-type -Wnon-virtual-dtor -Wdelete-non-virtual-dtor -Wsuggest-override -Wstring-conversion -fdiagnostics-color -O3  -isysroot /Applications/Xcode.app/Contents/Developer/Platforms/MacOSX.platform/Developer/SDKs/MacOSX10.15.sdk   -UNDEBUG -std=c++14  -fno-exceptions -fno-rtti -MD -MT lib/Support/CMakeFiles/LLVMSupport.dir/FileUtilities.cpp.o -MF lib/Support/CMakeFiles/LLVMSupport.dir/FileUtilities.cpp.o.d -o lib/Support/CMakeFiles/LLVMSupport.dir/FileUtilities.cpp.o -c /Users/buildslave/jenkins/workspace/lldb-cmake-matrix/llvm-project/llvm/lib/Support/FileUtilities.cpp
[581/4328] /Users/buildslave/jenkins/workspace/lldb-cmake-matrix/host-compiler/bin/clang++  -DGTEST_HAS_RTTI=0 -D_DEBUG -D__STDC_CONSTANT_MACROS -D__STDC_FORMAT_MACROS -D__STDC_LIMIT_MACROS -Ilib/Support -I/Users/buildslave/jenkins/workspace/lldb-cmake-matrix/llvm-project/llvm/lib/Support -Iinclude -I/Users/buildslave/jenkins/workspace/lldb-cmake-matrix/llvm-project/llvm/include -fPIC -fvisibility-inlines-hidden -Werror=date-time -Werror=unguarded-availability-new -fmodules -fmodules-cache-path=/Users/buildslave/jenkins/workspace/lldb-cmake-matrix/lldb-build/module.cache -fcxx-modules -Xclang -fmodules-local-submodule-visibility -Wall -Wextra -Wno-unused-parameter -Wwrite-strings -Wcast-qual -Wmissing-field-initializers -pedantic -Wno-long-long -Wimplicit-fallthrough -Wcovered-switch-default -Wno-noexcept-type -Wnon-virtual-dtor -Wdelete-non-virtual-dtor -Wsuggest-override -Wstring-conversion -fdiagnostics-color -O3  -isysroot /Applications/Xcode.app/Contents/Developer/Platforms/MacOSX.platform/Developer/SDKs/MacOSX10.15.sdk   -UNDEBUG -std=c++14  -fno-exceptions -fno-rtti -MD -MT lib/Support/CMakeFiles/LLVMSupport.dir/FoldingSet.cpp.o -MF lib/Support/CMakeFiles/LLVMSupport.dir/FoldingSet.cpp.o.d -o lib/Support/CMakeFiles/LLVMSupport.dir/FoldingSet.cpp.o -c /Users/buildslave/jenkins/workspace/lldb-cmake-matrix/llvm-project/llvm/lib/Support/FoldingSet.cpp
[582/4328] /Users/buildslave/jenkins/workspace/lldb-cmake-matrix/host-compiler/bin/clang++  -DGTEST_HAS_RTTI=0 -D_DEBUG -D__STDC_CONSTANT_MACROS -D__STDC_FORMAT_MACROS -D__STDC_LIMIT_MACROS -Ilib/Support -I/Users/buildslave/jenkins/workspace/lldb-cmake-matrix/llvm-project/llvm/lib/Support -Iinclude -I/Users/buildslave/jenkins/workspace/lldb-cmake-matrix/llvm-project/llvm/include -fPIC -fvisibility-inlines-hidden -Werror=date-time -Werror=unguarded-availability-new -fmodules -fmodules-cache-path=/Users/buildslave/jenkins/workspace/lldb-cmake-matrix/lldb-build/module.cache -fcxx-modules -Xclang -fmodules-local-submodule-visibility -Wall -Wextra -Wno-unused-parameter -Wwrite-strings -Wcast-qual -Wmissing-field-initializers -pedantic -Wno-long-long -Wimplicit-fallthrough -Wcovered-switch-default -Wno-noexcept-type -Wnon-virtual-dtor -Wdelete-non-virtual-dtor -Wsuggest-override -Wstring-conversion -fdiagnostics-color -O3  -isysroot /Applications/Xcode.app/Contents/Developer/Platforms/MacOSX.platform/Developer/SDKs/MacOSX10.15.sdk   -UNDEBUG -std=c++14  -fno-exceptions -fno-rtti -MD -MT lib/Support/CMakeFiles/LLVMSupport.dir/FileOutputBuffer.cpp.o -MF lib/Support/CMakeFiles/LLVMSupport.dir/FileOutputBuffer.cpp.o.d -o lib/Support/CMakeFiles/LLVMSupport.dir/FileOutputBuffer.cpp.o -c /Users/buildslave/jenkins/workspace/lldb-cmake-matrix/llvm-project/llvm/lib/Support/FileOutputBuffer.cpp
[583/4328] /Users/buildslave/jenkins/workspace/lldb-cmake-matrix/host-compiler/bin/clang++  -DGTEST_HAS_RTTI=0 -D_DEBUG -D__STDC_CONSTANT_MACROS -D__STDC_FORMAT_MACROS -D__STDC_LIMIT_MACROS -Ilib/Support -I/Users/buildslave/jenkins/workspace/lldb-cmake-matrix/llvm-project/llvm/lib/Support -Iinclude -I/Users/buildslave/jenkins/workspace/lldb-cmake-matrix/llvm-project/llvm/include -fPIC -fvisibility-inlines-hidden -Werror=date-time -Werror=unguarded-availability-new -fmodules -fmodules-cache-path=/Users/buildslave/jenkins/workspace/lldb-cmake-matrix/lldb-build/module.cache -fcxx-modules -Xclang -fmodules-local-submodule-visibility -Wall -Wextra -Wno-unused-parameter -Wwrite-strings -Wcast-qual -Wmissing-field-initializers -pedantic -Wno-long-long -Wimplicit-fallthrough -Wcovered-switch-default -Wno-noexcept-type -Wnon-virtual-dtor -Wdelete-non-virtual-dtor -Wsuggest-override -Wstring-conversion -fdiagnostics-color -O3  -isysroot /Applications/Xcode.app/Contents/Developer/Platforms/MacOSX.platform/Developer/SDKs/MacOSX10.15.sdk   -UNDEBUG -std=c++14  -fno-exceptions -fno-rtti -MD -MT lib/Support/CMakeFiles/LLVMSupport.dir/IntEqClasses.cpp.o -MF lib/Support/CMakeFiles/LLVMSupport.dir/IntEqClasses.cpp.o.d -o lib/Support/CMakeFiles/LLVMSupport.dir/IntEqClasses.cpp.o -c /Users/buildslave/jenkins/workspace/lldb-cmake-matrix/llvm-project/llvm/lib/Support/IntEqClasses.cpp
[584/4328] /Users/buildslave/jenkins/workspace/lldb-cmake-matrix/host-compiler/bin/clang++  -DGTEST_HAS_RTTI=0 -D_DEBUG -D__STDC_CONSTANT_MACROS -D__STDC_FORMAT_MACROS -D__STDC_LIMIT_MACROS -Ilib/Support -I/Users/buildslave/jenkins/workspace/lldb-cmake-matrix/llvm-project/llvm/lib/Support -Iinclude -I/Users/buildslave/jenkins/workspace/lldb-cmake-matrix/llvm-project/llvm/include -fPIC -fvisibility-inlines-hidden -Werror=date-time -Werror=unguarded-availability-new -fmodules -fmodules-cache-path=/Users/buildslave/jenkins/workspace/lldb-cmake-matrix/lldb-build/module.cache -fcxx-modules -Xclang -fmodules-local-submodule-visibility -Wall -Wextra -Wno-unused-parameter -Wwrite-strings -Wcast-qual -Wmissing-field-initializers -pedantic -Wno-long-long -Wimplicit-fallthrough -Wcovered-switch-default -Wno-noexcept-type -Wnon-virtual-dtor -Wdelete-non-virtual-dtor -Wsuggest-override -Wstring-conversion -fdiagnostics-color -O3  -isysroot /Applications/Xcode.app/Contents/Developer/Platforms/MacOSX.platform/Developer/SDKs/MacOSX10.15.sdk   -UNDEBUG -std=c++14  -fno-exceptions -fno-rtti -MD -MT lib/Support/CMakeFiles/LLVMSupport.dir/InitLLVM.cpp.o -MF lib/Support/CMakeFiles/LLVMSupport.dir/InitLLVM.cpp.o.d -o lib/Support/CMakeFiles/LLVMSupport.dir/InitLLVM.cpp.o -c /Users/buildslave/jenkins/workspace/lldb-cmake-matrix/llvm-project/llvm/lib/Support/InitLLVM.cpp
[585/4328] /Users/buildslave/jenkins/workspace/lldb-cmake-matrix/host-compiler/bin/clang++  -DGTEST_HAS_RTTI=0 -D_DEBUG -D__STDC_CONSTANT_MACROS -D__STDC_FORMAT_MACROS -D__STDC_LIMIT_MACROS -Ilib/Support -I/Users/buildslave/jenkins/workspace/lldb-cmake-matrix/llvm-project/llvm/lib/Support -Iinclude -I/Users/buildslave/jenkins/workspace/lldb-cmake-matrix/llvm-project/llvm/include -fPIC -fvisibility-inlines-hidden -Werror=date-time -Werror=unguarded-availability-new -fmodules -fmodules-cache-path=/Users/buildslave/jenkins/workspace/lldb-cmake-matrix/lldb-build/module.cache -fcxx-modules -Xclang -fmodules-local-submodule-visibility -Wall -Wextra -Wno-unused-parameter -Wwrite-strings -Wcast-qual -Wmissing-field-initializers -pedantic -Wno-long-long -Wimplicit-fallthrough -Wcovered-switch-default -Wno-noexcept-type -Wnon-virtual-dtor -Wdelete-non-virtual-dtor -Wsuggest-override -Wstring-conversion -fdiagnostics-color -O3  -isysroot /Applications/Xcode.app/Contents/Developer/Platforms/MacOSX.platform/Developer/SDKs/MacOSX10.15.sdk   -UNDEBUG -std=c++14  -fno-exceptions -fno-rtti -MD -MT lib/Support/CMakeFiles/LLVMSupport.dir/LEB128.cpp.o -MF lib/Support/CMakeFiles/LLVMSupport.dir/LEB128.cpp.o.d -o lib/Support/CMakeFiles/LLVMSupport.dir/LEB128.cpp.o -c /Users/buildslave/jenkins/workspace/lldb-cmake-matrix/llvm-project/llvm/lib/Support/LEB128.cpp
[586/4328] /Users/buildslave/jenkins/workspace/lldb-cmake-matrix/host-compiler/bin/clang++  -DGTEST_HAS_RTTI=0 -D_DEBUG -D__STDC_CONSTANT_MACROS -D__STDC_FORMAT_MACROS -D__STDC_LIMIT_MACROS -Ilib/Support -I/Users/buildslave/jenkins/workspace/lldb-cmake-matrix/llvm-project/llvm/lib/Support -Iinclude -I/Users/buildslave/jenkins/workspace/lldb-cmake-matrix/llvm-project/llvm/include -fPIC -fvisibility-inlines-hidden -Werror=date-time -Werror=unguarded-availability-new -fmodules -fmodules-cache-path=/Users/buildslave/jenkins/workspace/lldb-cmake-matrix/lldb-build/module.cache -fcxx-modules -Xclang -fmodules-local-submodule-visibility -Wall -Wextra -Wno-unused-parameter -Wwrite-strings -Wcast-qual -Wmissing-field-initializers -pedantic -Wno-long-long -Wimplicit-fallthrough -Wcovered-switch-default -Wno-noexcept-type -Wnon-virtual-dtor -Wdelete-non-virtual-dtor -Wsuggest-override -Wstring-conversion -fdiagnostics-color -O3  -isysroot /Applications/Xcode.app/Contents/Developer/Platforms/MacOSX.platform/Developer/SDKs/MacOSX10.15.sdk   -UNDEBUG -std=c++14  -fno-exceptions -fno-rtti -MD -MT lib/Support/CMakeFiles/LLVMSupport.dir/ELFAttributeParser.cpp.o -MF lib/Support/CMakeFiles/LLVMSupport.dir/ELFAttributeParser.cpp.o.d -o lib/Support/CMakeFiles/LLVMSupport.dir/ELFAttributeParser.cpp.o -c /Users/buildslave/jenkins/workspace/lldb-cmake-matrix/llvm-project/llvm/lib/Support/ELFAttributeParser.cpp
[587/4328] /Users/buildslave/jenkins/workspace/lldb-cmake-matrix/host-compiler/bin/clang++  -DGTEST_HAS_RTTI=0 -D_DEBUG -D__STDC_CONSTANT_MACROS -D__STDC_FORMAT_MACROS -D__STDC_LIMIT_MACROS -Ilib/Support -I/Users/buildslave/jenkins/workspace/lldb-cmake-matrix/llvm-project/llvm/lib/Support -Iinclude -I/Users/buildslave/jenkins/workspace/lldb-cmake-matrix/llvm-project/llvm/include -fPIC -fvisibility-inlines-hidden -Werror=date-time -Werror=unguarded-availability-new -fmodules -fmodules-cache-path=/Users/buildslave/jenkins/workspace/lldb-cmake-matrix/lldb-build/module.cache -fcxx-modules -Xclang -fmodules-local-submodule-visibility -Wall -Wextra -Wno-unused-parameter -Wwrite-strings -Wcast-qual -Wmissing-field-initializers -pedantic -Wno-long-long -Wimplicit-fallthrough -Wcovered-switch-default -Wno-noexcept-type -Wnon-virtual-dtor -Wdelete-non-virtual-dtor -Wsuggest-override -Wstring-conversion -fdiagnostics-color -O3  -isysroot /Applications/Xcode.app/Contents/Developer/Platforms/MacOSX.platform/Developer/SDKs/MacOSX10.15.sdk   -UNDEBUG -std=c++14  -fno-exceptions -fno-rtti -MD -MT lib/Support/CMakeFiles/LLVMSupport.dir/LineIterator.cpp.o -MF lib/Support/CMakeFiles/LLVMSupport.dir/LineIterator.cpp.o.d -o lib/Support/CMakeFiles/LLVMSupport.dir/LineIterator.cpp.o -c /Users/buildslave/jenkins/workspace/lldb-cmake-matrix/llvm-project/llvm/lib/Support/LineIterator.cpp
[588/4328] /Users/buildslave/jenkins/workspace/lldb-cmake-matrix/host-compiler/bin/clang++  -DGTEST_HAS_RTTI=0 -D_DEBUG -D__STDC_CONSTANT_MACROS -D__STDC_FORMAT_MACROS -D__STDC_LIMIT_MACROS -Ilib/Support -I/Users/buildslave/jenkins/workspace/lldb-cmake-matrix/llvm-project/llvm/lib/Support -Iinclude -I/Users/buildslave/jenkins/workspace/lldb-cmake-matrix/llvm-project/llvm/include -fPIC -fvisibility-inlines-hidden -Werror=date-time -Werror=unguarded-availability-new -fmodules -fmodules-cache-path=/Users/buildslave/jenkins/workspace/lldb-cmake-matrix/lldb-build/module.cache -fcxx-modules -Xclang -fmodules-local-submodule-visibility -Wall -Wextra -Wno-unused-parameter -Wwrite-strings -Wcast-qual -Wmissing-field-initializers -pedantic -Wno-long-long -Wimplicit-fallthrough -Wcovered-switch-default -Wno-noexcept-type -Wnon-virtual-dtor -Wdelete-non-virtual-dtor -Wsuggest-override -Wstring-conversion -fdiagnostics-color -O3  -isysroot /Applications/Xcode.app/Contents/Developer/Platforms/MacOSX.platform/Developer/SDKs/MacOSX10.15.sdk   -UNDEBUG -std=c++14  -fno-exceptions -fno-rtti -MD -MT lib/Support/CMakeFiles/LLVMSupport.dir/FormatVariadic.cpp.o -MF lib/Support/CMakeFiles/LLVMSupport.dir/FormatVariadic.cpp.o.d -o lib/Support/CMakeFiles/LLVMSupport.dir/FormatVariadic.cpp.o -c /Users/buildslave/jenkins/workspace/lldb-cmake-matrix/llvm-project/llvm/lib/Support/FormatVariadic.cpp
[589/4328] /Users/buildslave/jenkins/workspace/lldb-cmake-matrix/host-compiler/bin/clang++  -DGTEST_HAS_RTTI=0 -D_DEBUG -D__STDC_CONSTANT_MACROS -D__STDC_FORMAT_MACROS -D__STDC_LIMIT_MACROS -Ilib/Support -I/Users/buildslave/jenkins/workspace/lldb-cmake-matrix/llvm-project/llvm/lib/Support -Iinclude -I/Users/buildslave/jenkins/workspace/lldb-cmake-matrix/llvm-project/llvm/include -fPIC -fvisibility-inlines-hidden -Werror=date-time -Werror=unguarded-availability-new -fmodules -fmodules-cache-path=/Users/buildslave/jenkins/workspace/lldb-cmake-matrix/lldb-build/module.cache -fcxx-modules -Xclang -fmodules-local-submodule-visibility -Wall -Wextra -Wno-unused-parameter -Wwrite-strings -Wcast-qual -Wmissing-field-initializers -pedantic -Wno-long-long -Wimplicit-fallthrough -Wcovered-switch-default -Wno-noexcept-type -Wnon-virtual-dtor -Wdelete-non-virtual-dtor -Wsuggest-override -Wstring-conversion -fdiagnostics-color -O3  -isysroot /Applications/Xcode.app/Contents/Developer/Platforms/MacOSX.platform/Developer/SDKs/MacOSX10.15.sdk   -UNDEBUG -std=c++14  -fno-exceptions -fno-rtti -MD -MT lib/Support/CMakeFiles/LLVMSupport.dir/Locale.cpp.o -MF lib/Support/CMakeFiles/LLVMSupport.dir/Locale.cpp.o.d -o lib/Support/CMakeFiles/LLVMSupport.dir/Locale.cpp.o -c /Users/buildslave/jenkins/workspace/lldb-cmake-matrix/llvm-project/llvm/lib/Support/Locale.cpp
[590/4328] /Users/buildslave/jenkins/workspace/lldb-cmake-matrix/host-compiler/bin/clang++  -DGTEST_HAS_RTTI=0 -D_DEBUG -D__STDC_CONSTANT_MACROS -D__STDC_FORMAT_MACROS -D__STDC_LIMIT_MACROS -Ilib/Support -I/Users/buildslave/jenkins/workspace/lldb-cmake-matrix/llvm-project/llvm/lib/Support -Iinclude -I/Users/buildslave/jenkins/workspace/lldb-cmake-matrix/llvm-project/llvm/include -fPIC -fvisibility-inlines-hidden -Werror=date-time -Werror=unguarded-availability-new -fmodules -fmodules-cache-path=/Users/buildslave/jenkins/workspace/lldb-cmake-matrix/lldb-build/module.cache -fcxx-modules -Xclang -fmodules-local-submodule-visibility -Wall -Wextra -Wno-unused-parameter -Wwrite-strings -Wcast-qual -Wmissing-field-initializers -pedantic -Wno-long-long -Wimplicit-fallthrough -Wcovered-switch-default -Wno-noexcept-type -Wnon-virtual-dtor -Wdelete-non-virtual-dtor -Wsuggest-override -Wstring-conversion -fdiagnostics-color -O3  -isysroot /Applications/Xcode.app/Contents/Developer/Platforms/MacOSX.platform/Developer/SDKs/MacOSX10.15.sdk   -UNDEBUG -std=c++14  -fno-exceptions -fno-rtti -MD -MT lib/Support/CMakeFiles/LLVMSupport.dir/IntervalMap.cpp.o -MF lib/Support/CMakeFiles/LLVMSupport.dir/IntervalMap.cpp.o.d -o lib/Support/CMakeFiles/LLVMSupport.dir/IntervalMap.cpp.o -c /Users/buildslave/jenkins/workspace/lldb-cmake-matrix/llvm-project/llvm/lib/Support/IntervalMap.cpp
[591/4328] /Users/buildslave/jenkins/workspace/lldb-cmake-matrix/host-compiler/bin/clang++  -DGTEST_HAS_RTTI=0 -D_DEBUG -D__STDC_CONSTANT_MACROS -D__STDC_FORMAT_MACROS -D__STDC_LIMIT_MACROS -Ilib/Support -I/Users/buildslave/jenkins/workspace/lldb-cmake-matrix/llvm-project/llvm/lib/Support -Iinclude -I/Users/buildslave/jenkins/workspace/lldb-cmake-matrix/llvm-project/llvm/include -fPIC -fvisibility-inlines-hidden -Werror=date-time -Werror=unguarded-availability-new -fmodules -fmodules-cache-path=/Users/buildslave/jenkins/workspace/lldb-cmake-matrix/lldb-build/module.cache -fcxx-modules -Xclang -fmodules-local-submodule-visibility -Wall -Wextra -Wno-unused-parameter -Wwrite-strings -Wcast-qual -Wmissing-field-initializers -pedantic -Wno-long-long -Wimplicit-fallthrough -Wcovered-switch-default -Wno-noexcept-type -Wnon-virtual-dtor -Wdelete-non-virtual-dtor -Wsuggest-override -Wstring-conversion -fdiagnostics-color -O3  -isysroot /Applications/Xcode.app/Contents/Developer/Platforms/MacOSX.platform/Developer/SDKs/MacOSX10.15.sdk   -UNDEBUG -std=c++14  -fno-exceptions -fno-rtti -MD -MT lib/Support/CMakeFiles/LLVMSupport.dir/MathExtras.cpp.o -MF lib/Support/CMakeFiles/LLVMSupport.dir/MathExtras.cpp.o.d -o lib/Support/CMakeFiles/LLVMSupport.dir/MathExtras.cpp.o -c /Users/buildslave/jenkins/workspace/lldb-cmake-matrix/llvm-project/llvm/lib/Support/MathExtras.cpp
[592/4328] /Users/buildslave/jenkins/workspace/lldb-cmake-matrix/host-compiler/bin/clang++  -DGTEST_HAS_RTTI=0 -D_DEBUG -D__STDC_CONSTANT_MACROS -D__STDC_FORMAT_MACROS -D__STDC_LIMIT_MACROS -Ilib/Support -I/Users/buildslave/jenkins/workspace/lldb-cmake-matrix/llvm-project/llvm/lib/Support -Iinclude -I/Users/buildslave/jenkins/workspace/lldb-cmake-matrix/llvm-project/llvm/include -fPIC -fvisibility-inlines-hidden -Werror=date-time -Werror=unguarded-availability-new -fmodules -fmodules-cache-path=/Users/buildslave/jenkins/workspace/lldb-cmake-matrix/lldb-build/module.cache -fcxx-modules -Xclang -fmodules-local-submodule-visibility -Wall -Wextra -Wno-unused-parameter -Wwrite-strings -Wcast-qual -Wmissing-field-initializers -pedantic -Wno-long-long -Wimplicit-fallthrough -Wcovered-switch-default -Wno-noexcept-type -Wnon-virtual-dtor -Wdelete-non-virtual-dtor -Wsuggest-override -Wstring-conversion -fdiagnostics-color -O3  -isysroot /Applications/Xcode.app/Contents/Developer/Platforms/MacOSX.platform/Developer/SDKs/MacOSX10.15.sdk   -UNDEBUG -std=c++14  -fno-exceptions -fno-rtti -MD -MT lib/Support/CMakeFiles/LLVMSupport.dir/LowLevelType.cpp.o -MF lib/Support/CMakeFiles/LLVMSupport.dir/LowLevelType.cpp.o.d -o lib/Support/CMakeFiles/LLVMSupport.dir/LowLevelType.cpp.o -c /Users/buildslave/jenkins/workspace/lldb-cmake-matrix/llvm-project/llvm/lib/Support/LowLevelType.cpp
[593/4328] /Users/buildslave/jenkins/workspace/lldb-cmake-matrix/host-compiler/bin/clang++  -DGTEST_HAS_RTTI=0 -D_DEBUG -D__STDC_CONSTANT_MACROS -D__STDC_FORMAT_MACROS -D__STDC_LIMIT_MACROS -Ilib/Support -I/Users/buildslave/jenkins/workspace/lldb-cmake-matrix/llvm-project/llvm/lib/Support -Iinclude -I/Users/buildslave/jenkins/workspace/lldb-cmake-matrix/llvm-project/llvm/include -fPIC -fvisibility-inlines-hidden -Werror=date-time -Werror=unguarded-availability-new -fmodules -fmodules-cache-path=/Users/buildslave/jenkins/workspace/lldb-cmake-matrix/lldb-build/module.cache -fcxx-modules -Xclang -fmodules-local-submodule-visibility -Wall -Wextra -Wno-unused-parameter -Wwrite-strings -Wcast-qual -Wmissing-field-initializers -pedantic -Wno-long-long -Wimplicit-fallthrough -Wcovered-switch-default -Wno-noexcept-type -Wnon-virtual-dtor -Wdelete-non-virtual-dtor -Wsuggest-override -Wstring-conversion -fdiagnostics-color -O3  -isysroot /Applications/Xcode.app/Contents/Developer/Platforms/MacOSX.platform/Developer/SDKs/MacOSX10.15.sdk   -UNDEBUG -std=c++14  -fno-exceptions -fno-rtti -MD -MT lib/Support/CMakeFiles/LLVMSupport.dir/MemAlloc.cpp.o -MF lib/Support/CMakeFiles/LLVMSupport.dir/MemAlloc.cpp.o.d -o lib/Support/CMakeFiles/LLVMSupport.dir/MemAlloc.cpp.o -c /Users/buildslave/jenkins/workspace/lldb-cmake-matrix/llvm-project/llvm/lib/Support/MemAlloc.cpp
[594/4328] /Users/buildslave/jenkins/workspace/lldb-cmake-matrix/host-compiler/bin/clang++  -DGTEST_HAS_RTTI=0 -D_DEBUG -D__STDC_CONSTANT_MACROS -D__STDC_FORMAT_MACROS -D__STDC_LIMIT_MACROS -Ilib/Support -I/Users/buildslave/jenkins/workspace/lldb-cmake-matrix/llvm-project/llvm/lib/Support -Iinclude -I/Users/buildslave/jenkins/workspace/lldb-cmake-matrix/llvm-project/llvm/include -fPIC -fvisibility-inlines-hidden -Werror=date-time -Werror=unguarded-availability-new -fmodules -fmodules-cache-path=/Users/buildslave/jenkins/workspace/lldb-cmake-matrix/lldb-build/module.cache -fcxx-modules -Xclang -fmodules-local-submodule-visibility -Wall -Wextra -Wno-unused-parameter -Wwrite-strings -Wcast-qual -Wmissing-field-initializers -pedantic -Wno-long-long -Wimplicit-fallthrough -Wcovered-switch-default -Wno-noexcept-type -Wnon-virtual-dtor -Wdelete-non-virtual-dtor -Wsuggest-override -Wstring-conversion -fdiagnostics-color -O3  -isysroot /Applications/Xcode.app/Contents/Developer/Platforms/MacOSX.platform/Developer/SDKs/MacOSX10.15.sdk   -UNDEBUG -std=c++14  -fno-exceptions -fno-rtti -MD -MT lib/Support/CMakeFiles/LLVMSupport.dir/ManagedStatic.cpp.o -MF lib/Support/CMakeFiles/LLVMSupport.dir/ManagedStatic.cpp.o.d -o lib/Support/CMakeFiles/LLVMSupport.dir/ManagedStatic.cpp.o -c /Users/buildslave/jenkins/workspace/lldb-cmake-matrix/llvm-project/llvm/lib/Support/ManagedStatic.cpp
[595/4328] /Users/buildslave/jenkins/workspace/lldb-cmake-matrix/host-compiler/bin/clang++  -DGTEST_HAS_RTTI=0 -D_DEBUG -D__STDC_CONSTANT_MACROS -D__STDC_FORMAT_MACROS -D__STDC_LIMIT_MACROS -Ilib/Support -I/Users/buildslave/jenkins/workspace/lldb-cmake-matrix/llvm-project/llvm/lib/Support -Iinclude -I/Users/buildslave/jenkins/workspace/lldb-cmake-matrix/llvm-project/llvm/include -fPIC -fvisibility-inlines-hidden -Werror=date-time -Werror=unguarded-availability-new -fmodules -fmodules-cache-path=/Users/buildslave/jenkins/workspace/lldb-cmake-matrix/lldb-build/module.cache -fcxx-modules -Xclang -fmodules-local-submodule-visibility -Wall -Wextra -Wno-unused-parameter -Wwrite-strings -Wcast-qual -Wmissing-field-initializers -pedantic -Wno-long-long -Wimplicit-fallthrough -Wcovered-switch-default -Wno-noexcept-type -Wnon-virtual-dtor -Wdelete-non-virtual-dtor -Wsuggest-override -Wstring-conversion -fdiagnostics-color -O3  -isysroot /Applications/Xcode.app/Contents/Developer/Platforms/MacOSX.platform/Developer/SDKs/MacOSX10.15.sdk   -UNDEBUG -std=c++14  -fno-exceptions -fno-rtti -MD -MT lib/Support/CMakeFiles/LLVMSupport.dir/KnownBits.cpp.o -MF lib/Support/CMakeFiles/LLVMSupport.dir/KnownBits.cpp.o.d -o lib/Support/CMakeFiles/LLVMSupport.dir/KnownBits.cpp.o -c /Users/buildslave/jenkins/workspace/lldb-cmake-matrix/llvm-project/llvm/lib/Support/KnownBits.cpp
[596/4328] /Users/buildslave/jenkins/workspace/lldb-cmake-matrix/host-compiler/bin/clang++  -DGTEST_HAS_RTTI=0 -D_DEBUG -D__STDC_CONSTANT_MACROS -D__STDC_FORMAT_MACROS -D__STDC_LIMIT_MACROS -Ilib/Support -I/Users/buildslave/jenkins/workspace/lldb-cmake-matrix/llvm-project/llvm/lib/Support -Iinclude -I/Users/buildslave/jenkins/workspace/lldb-cmake-matrix/llvm-project/llvm/include -fPIC -fvisibility-inlines-hidden -Werror=date-time -Werror=unguarded-availability-new -fmodules -fmodules-cache-path=/Users/buildslave/jenkins/workspace/lldb-cmake-matrix/lldb-build/module.cache -fcxx-modules -Xclang -fmodules-local-submodule-visibility -Wall -Wextra -Wno-unused-parameter -Wwrite-strings -Wcast-qual -Wmissing-field-initializers -pedantic -Wno-long-long -Wimplicit-fallthrough -Wcovered-switch-default -Wno-noexcept-type -Wnon-virtual-dtor -Wdelete-non-virtual-dtor -Wsuggest-override -Wstring-conversion -fdiagnostics-color -O3  -isysroot /Applications/Xcode.app/Contents/Developer/Platforms/MacOSX.platform/Developer/SDKs/MacOSX10.15.sdk   -UNDEBUG -std=c++14  -fno-exceptions -fno-rtti -MD -MT lib/Support/CMakeFiles/LLVMSupport.dir/GlobPattern.cpp.o -MF lib/Support/CMakeFiles/LLVMSupport.dir/GlobPattern.cpp.o.d -o lib/Support/CMakeFiles/LLVMSupport.dir/GlobPattern.cpp.o -c /Users/buildslave/jenkins/workspace/lldb-cmake-matrix/llvm-project/llvm/lib/Support/GlobPattern.cpp
[597/4328] /Users/buildslave/jenkins/workspace/lldb-cmake-matrix/host-compiler/bin/clang++  -DGTEST_HAS_RTTI=0 -D_DEBUG -D__STDC_CONSTANT_MACROS -D__STDC_FORMAT_MACROS -D__STDC_LIMIT_MACROS -Ilib/Support -I/Users/buildslave/jenkins/workspace/lldb-cmake-matrix/llvm-project/llvm/lib/Support -Iinclude -I/Users/buildslave/jenkins/workspace/lldb-cmake-matrix/llvm-project/llvm/include -fPIC -fvisibility-inlines-hidden -Werror=date-time -Werror=unguarded-availability-new -fmodules -fmodules-cache-path=/Users/buildslave/jenkins/workspace/lldb-cmake-matrix/lldb-build/module.cache -fcxx-modules -Xclang -fmodules-local-submodule-visibility -Wall -Wextra -Wno-unused-parameter -Wwrite-strings -Wcast-qual -Wmissing-field-initializers -pedantic -Wno-long-long -Wimplicit-fallthrough -Wcovered-switch-default -Wno-noexcept-type -Wnon-virtual-dtor -Wdelete-non-virtual-dtor -Wsuggest-override -Wstring-conversion -fdiagnostics-color -O3  -isysroot /Applications/Xcode.app/Contents/Developer/Platforms/MacOSX.platform/Developer/SDKs/MacOSX10.15.sdk   -UNDEBUG -std=c++14  -fno-exceptions -fno-rtti -MD -MT lib/Support/CMakeFiles/LLVMSupport.dir/APInt.cpp.o -MF lib/Support/CMakeFiles/LLVMSupport.dir/APInt.cpp.o.d -o lib/Support/CMakeFiles/LLVMSupport.dir/APInt.cpp.o -c /Users/buildslave/jenkins/workspace/lldb-cmake-matrix/llvm-project/llvm/lib/Support/APInt.cpp
[598/4328] /Users/buildslave/jenkins/workspace/lldb-cmake-matrix/host-compiler/bin/clang++  -DGTEST_HAS_RTTI=0 -D_DEBUG -D__STDC_CONSTANT_MACROS -D__STDC_FORMAT_MACROS -D__STDC_LIMIT_MACROS -Ilib/Support -I/Users/buildslave/jenkins/workspace/lldb-cmake-matrix/llvm-project/llvm/lib/Support -Iinclude -I/Users/buildslave/jenkins/workspace/lldb-cmake-matrix/llvm-project/llvm/include -fPIC -fvisibility-inlines-hidden -Werror=date-time -Werror=unguarded-availability-new -fmodules -fmodules-cache-path=/Users/buildslave/jenkins/workspace/lldb-cmake-matrix/lldb-build/module.cache -fcxx-modules -Xclang -fmodules-local-submodule-visibility -Wall -Wextra -Wno-unused-parameter -Wwrite-strings -Wcast-qual -Wmissing-field-initializers -pedantic -Wno-long-long -Wimplicit-fallthrough -Wcovered-switch-default -Wno-noexcept-type -Wnon-virtual-dtor -Wdelete-non-virtual-dtor -Wsuggest-override -Wstring-conversion -fdiagnostics-color -O3  -isysroot /Applications/Xcode.app/Contents/Developer/Platforms/MacOSX.platform/Developer/SDKs/MacOSX10.15.sdk   -UNDEBUG -std=c++14  -fno-exceptions -fno-rtti -MD -MT lib/Support/CMakeFiles/LLVMSupport.dir/Optional.cpp.o -MF lib/Support/CMakeFiles/LLVMSupport.dir/Optional.cpp.o.d -o lib/Support/CMakeFiles/LLVMSupport.dir/Optional.cpp.o -c /Users/buildslave/jenkins/workspace/lldb-cmake-matrix/llvm-project/llvm/lib/Support/Optional.cpp
[599/4328] /Users/buildslave/jenkins/workspace/lldb-cmake-matrix/host-compiler/bin/clang++  -DGTEST_HAS_RTTI=0 -D_DEBUG -D__STDC_CONSTANT_MACROS -D__STDC_FORMAT_MACROS -D__STDC_LIMIT_MACROS -Ilib/Support -I/Users/buildslave/jenkins/workspace/lldb-cmake-matrix/llvm-project/llvm/lib/Support -Iinclude -I/Users/buildslave/jenkins/workspace/lldb-cmake-matrix/llvm-project/llvm/include -fPIC -fvisibility-inlines-hidden -Werror=date-time -Werror=unguarded-availability-new -fmodules -fmodules-cache-path=/Users/buildslave/jenkins/workspace/lldb-cmake-matrix/lldb-build/module.cache -fcxx-modules -Xclang -fmodules-local-submodule-visibility -Wall -Wextra -Wno-unused-parameter -Wwrite-strings -Wcast-qual -Wmissing-field-initializers -pedantic -Wno-long-long -Wimplicit-fallthrough -Wcovered-switch-default -Wno-noexcept-type -Wnon-virtual-dtor -Wdelete-non-virtual-dtor -Wsuggest-override -Wstring-conversion -fdiagnostics-color -O3  -isysroot /Applications/Xcode.app/Contents/Developer/Platforms/MacOSX.platform/Developer/SDKs/MacOSX10.15.sdk   -UNDEBUG -std=c++14  -fno-exceptions -fno-rtti -MD -MT lib/Support/CMakeFiles/LLVMSupport.dir/DAGDeltaAlgorithm.cpp.o -MF lib/Support/CMakeFiles/LLVMSupport.dir/DAGDeltaAlgorithm.cpp.o.d -o lib/Support/CMakeFiles/LLVMSupport.dir/DAGDeltaAlgorithm.cpp.o -c /Users/buildslave/jenkins/workspace/lldb-cmake-matrix/llvm-project/llvm/lib/Support/DAGDeltaAlgorithm.cpp
[600/4328] /Users/buildslave/jenkins/workspace/lldb-cmake-matrix/host-compiler/bin/clang++  -DGTEST_HAS_RTTI=0 -D_DEBUG -D__STDC_CONSTANT_MACROS -D__STDC_FORMAT_MACROS -D__STDC_LIMIT_MACROS -Ilib/Support -I/Users/buildslave/jenkins/workspace/lldb-cmake-matrix/llvm-project/llvm/lib/Support -Iinclude -I/Users/buildslave/jenkins/workspace/lldb-cmake-matrix/llvm-project/llvm/include -fPIC -fvisibility-inlines-hidden -Werror=date-time -Werror=unguarded-availability-new -fmodules -fmodules-cache-path=/Users/buildslave/jenkins/workspace/lldb-cmake-matrix/lldb-build/module.cache -fcxx-modules -Xclang -fmodules-local-submodule-visibility -Wall -Wextra -Wno-unused-parameter -Wwrite-strings -Wcast-qual -Wmissing-field-initializers -pedantic -Wno-long-long -Wimplicit-fallthrough -Wcovered-switch-default -Wno-noexcept-type -Wnon-virtual-dtor -Wdelete-non-virtual-dtor -Wsuggest-override -Wstring-conversion -fdiagnostics-color -O3  -isysroot /Applications/Xcode.app/Contents/Developer/Platforms/MacOSX.platform/Developer/SDKs/MacOSX10.15.sdk   -UNDEBUG -std=c++14  -fno-exceptions -fno-rtti -MD -MT lib/Support/CMakeFiles/LLVMSupport.dir/MD5.cpp.o -MF lib/Support/CMakeFiles/LLVMSupport.dir/MD5.cpp.o.d -o lib/Support/CMakeFiles/LLVMSupport.dir/MD5.cpp.o -c /Users/buildslave/jenkins/workspace/lldb-cmake-matrix/llvm-project/llvm/lib/Support/MD5.cpp
[601/4328] /Users/buildslave/jenkins/workspace/lldb-cmake-matrix/host-compiler/bin/clang++  -DGTEST_HAS_RTTI=0 -D_DEBUG -D__STDC_CONSTANT_MACROS -D__STDC_FORMAT_MACROS -D__STDC_LIMIT_MACROS -Ilib/Support -I/Users/buildslave/jenkins/workspace/lldb-cmake-matrix/llvm-project/llvm/lib/Support -Iinclude -I/Users/buildslave/jenkins/workspace/lldb-cmake-matrix/llvm-project/llvm/include -fPIC -fvisibility-inlines-hidden -Werror=date-time -Werror=unguarded-availability-new -fmodules -fmodules-cache-path=/Users/buildslave/jenkins/workspace/lldb-cmake-matrix/lldb-build/module.cache -fcxx-modules -Xclang -fmodules-local-submodule-visibility -Wall -Wextra -Wno-unused-parameter -Wwrite-strings -Wcast-qual -Wmissing-field-initializers -pedantic -Wno-long-long -Wimplicit-fallthrough -Wcovered-switch-default -Wno-noexcept-type -Wnon-virtual-dtor -Wdelete-non-virtual-dtor -Wsuggest-override -Wstring-conversion -fdiagnostics-color -O3  -isysroot /Applications/Xcode.app/Contents/Developer/Platforms/MacOSX.platform/Developer/SDKs/MacOSX10.15.sdk   -UNDEBUG -std=c++14  -fno-exceptions -fno-rtti -MD -MT lib/Support/CMakeFiles/LLVMSupport.dir/NativeFormatting.cpp.o -MF lib/Support/CMakeFiles/LLVMSupport.dir/NativeFormatting.cpp.o.d -o lib/Support/CMakeFiles/LLVMSupport.dir/NativeFormatting.cpp.o -c /Users/buildslave/jenkins/workspace/lldb-cmake-matrix/llvm-project/llvm/lib/Support/NativeFormatting.cpp
[602/4328] /Users/buildslave/jenkins/workspace/lldb-cmake-matrix/host-compiler/bin/clang++  -DGTEST_HAS_RTTI=0 -D_DEBUG -D__STDC_CONSTANT_MACROS -D__STDC_FORMAT_MACROS -D__STDC_LIMIT_MACROS -Ilib/Support -I/Users/buildslave/jenkins/workspace/lldb-cmake-matrix/llvm-project/llvm/lib/Support -Iinclude -I/Users/buildslave/jenkins/workspace/lldb-cmake-matrix/llvm-project/llvm/include -fPIC -fvisibility-inlines-hidden -Werror=date-time -Werror=unguarded-availability-new -fmodules -fmodules-cache-path=/Users/buildslave/jenkins/workspace/lldb-cmake-matrix/lldb-build/module.cache -fcxx-modules -Xclang -fmodules-local-submodule-visibility -Wall -Wextra -Wno-unused-parameter -Wwrite-strings -Wcast-qual -Wmissing-field-initializers -pedantic -Wno-long-long -Wimplicit-fallthrough -Wcovered-switch-default -Wno-noexcept-type -Wnon-virtual-dtor -Wdelete-non-virtual-dtor -Wsuggest-override -Wstring-conversion -fdiagnostics-color -O3  -isysroot /Applications/Xcode.app/Contents/Developer/Platforms/MacOSX.platform/Developer/SDKs/MacOSX10.15.sdk   -UNDEBUG -std=c++14  -fno-exceptions -fno-rtti -MD -MT lib/Support/CMakeFiles/LLVMSupport.dir/PluginLoader.cpp.o -MF lib/Support/CMakeFiles/LLVMSupport.dir/PluginLoader.cpp.o.d -o lib/Support/CMakeFiles/LLVMSupport.dir/PluginLoader.cpp.o -c /Users/buildslave/jenkins/workspace/lldb-cmake-matrix/llvm-project/llvm/lib/Support/PluginLoader.cpp
[603/4328] /Users/buildslave/jenkins/workspace/lldb-cmake-matrix/host-compiler/bin/clang++  -DGTEST_HAS_RTTI=0 -D_DEBUG -D__STDC_CONSTANT_MACROS -D__STDC_FORMAT_MACROS -D__STDC_LIMIT_MACROS -Ilib/Support -I/Users/buildslave/jenkins/workspace/lldb-cmake-matrix/llvm-project/llvm/lib/Support -Iinclude -I/Users/buildslave/jenkins/workspace/lldb-cmake-matrix/llvm-project/llvm/include -fPIC -fvisibility-inlines-hidden -Werror=date-time -Werror=unguarded-availability-new -fmodules -fmodules-cache-path=/Users/buildslave/jenkins/workspace/lldb-cmake-matrix/lldb-build/module.cache -fcxx-modules -Xclang -fmodules-local-submodule-visibility -Wall -Wextra -Wno-unused-parameter -Wwrite-strings -Wcast-qual -Wmissing-field-initializers -pedantic -Wno-long-long -Wimplicit-fallthrough -Wcovered-switch-default -Wno-noexcept-type -Wnon-virtual-dtor -Wdelete-non-virtual-dtor -Wsuggest-override -Wstring-conversion -fdiagnostics-color -O3  -isysroot /Applications/Xcode.app/Contents/Developer/Platforms/MacOSX.platform/Developer/SDKs/MacOSX10.15.sdk   -UNDEBUG -std=c++14  -fno-exceptions -fno-rtti -MD -MT lib/Support/CMakeFiles/LLVMSupport.dir/RISCVAttributes.cpp.o -MF lib/Support/CMakeFiles/LLVMSupport.dir/RISCVAttributes.cpp.o.d -o lib/Support/CMakeFiles/LLVMSupport.dir/RISCVAttributes.cpp.o -c /Users/buildslave/jenkins/workspace/lldb-cmake-matrix/llvm-project/llvm/lib/Support/RISCVAttributes.cpp
[604/4328] /Users/buildslave/jenkins/workspace/lldb-cmake-matrix/host-compiler/bin/clang++  -DGTEST_HAS_RTTI=0 -D_DEBUG -D__STDC_CONSTANT_MACROS -D__STDC_FORMAT_MACROS -D__STDC_LIMIT_MACROS -Ilib/Support -I/Users/buildslave/jenkins/workspace/lldb-cmake-matrix/llvm-project/llvm/lib/Support -Iinclude -I/Users/buildslave/jenkins/workspace/lldb-cmake-matrix/llvm-project/llvm/include -fPIC -fvisibility-inlines-hidden -Werror=date-time -Werror=unguarded-availability-new -fmodules -fmodules-cache-path=/Users/buildslave/jenkins/workspace/lldb-cmake-matrix/lldb-build/module.cache -fcxx-modules -Xclang -fmodules-local-submodule-visibility -Wall -Wextra -Wno-unused-parameter -Wwrite-strings -Wcast-qual -Wmissing-field-initializers -pedantic -Wno-long-long -Wimplicit-fallthrough -Wcovered-switch-default -Wno-noexcept-type -Wnon-virtual-dtor -Wdelete-non-virtual-dtor -Wsuggest-override -Wstring-conversion -fdiagnostics-color -O3  -isysroot /Applications/Xcode.app/Contents/Developer/Platforms/MacOSX.platform/Developer/SDKs/MacOSX10.15.sdk   -UNDEBUG -std=c++14  -fno-exceptions -fno-rtti -MD -MT lib/Support/CMakeFiles/LLVMSupport.dir/GraphWriter.cpp.o -MF lib/Support/CMakeFiles/LLVMSupport.dir/GraphWriter.cpp.o.d -o lib/Support/CMakeFiles/LLVMSupport.dir/GraphWriter.cpp.o -c /Users/buildslave/jenkins/workspace/lldb-cmake-matrix/llvm-project/llvm/lib/Support/GraphWriter.cpp
[605/4328] /Users/buildslave/jenkins/workspace/lldb-cmake-matrix/host-compiler/bin/clang++  -DGTEST_HAS_RTTI=0 -D_DEBUG -D__STDC_CONSTANT_MACROS -D__STDC_FORMAT_MACROS -D__STDC_LIMIT_MACROS -Ilib/Support -I/Users/buildslave/jenkins/workspace/lldb-cmake-matrix/llvm-project/llvm/lib/Support -Iinclude -I/Users/buildslave/jenkins/workspace/lldb-cmake-matrix/llvm-project/llvm/include -fPIC -fvisibility-inlines-hidden -Werror=date-time -Werror=unguarded-availability-new -fmodules -fmodules-cache-path=/Users/buildslave/jenkins/workspace/lldb-cmake-matrix/lldb-build/module.cache -fcxx-modules -Xclang -fmodules-local-submodule-visibility -Wall -Wextra -Wno-unused-parameter -Wwrite-strings -Wcast-qual -Wmissing-field-initializers -pedantic -Wno-long-long -Wimplicit-fallthrough -Wcovered-switch-default -Wno-noexcept-type -Wnon-virtual-dtor -Wdelete-non-virtual-dtor -Wsuggest-override -Wstring-conversion -fdiagnostics-color -O3  -isysroot /Applications/Xcode.app/Contents/Developer/Platforms/MacOSX.platform/Developer/SDKs/MacOSX10.15.sdk   -UNDEBUG -std=c++14  -fno-exceptions -fno-rtti -MD -MT lib/Support/CMakeFiles/LLVMSupport.dir/OptimizedStructLayout.cpp.o -MF lib/Support/CMakeFiles/LLVMSupport.dir/OptimizedStructLayout.cpp.o.d -o lib/Support/CMakeFiles/LLVMSupport.dir/OptimizedStructLayout.cpp.o -c /Users/buildslave/jenkins/workspace/lldb-cmake-matrix/llvm-project/llvm/lib/Support/OptimizedStructLayout.cpp
[606/4328] /Users/buildslave/jenkins/workspace/lldb-cmake-matrix/host-compiler/bin/clang++  -DGTEST_HAS_RTTI=0 -D_DEBUG -D__STDC_CONSTANT_MACROS -D__STDC_FORMAT_MACROS -D__STDC_LIMIT_MACROS -Ilib/Support -I/Users/buildslave/jenkins/workspace/lldb-cmake-matrix/llvm-project/llvm/lib/Support -Iinclude -I/Users/buildslave/jenkins/workspace/lldb-cmake-matrix/llvm-project/llvm/include -fPIC -fvisibility-inlines-hidden -Werror=date-time -Werror=unguarded-availability-new -fmodules -fmodules-cache-path=/Users/buildslave/jenkins/workspace/lldb-cmake-matrix/lldb-build/module.cache -fcxx-modules -Xclang -fmodules-local-submodule-visibility -Wall -Wextra -Wno-unused-parameter -Wwrite-strings -Wcast-qual -Wmissing-field-initializers -pedantic -Wno-long-long -Wimplicit-fallthrough -Wcovered-switch-default -Wno-noexcept-type -Wnon-virtual-dtor -Wdelete-non-virtual-dtor -Wsuggest-override -Wstring-conversion -fdiagnostics-color -O3  -isysroot /Applications/Xcode.app/Contents/Developer/Platforms/MacOSX.platform/Developer/SDKs/MacOSX10.15.sdk   -UNDEBUG -std=c++14  -fno-exceptions -fno-rtti -MD -MT lib/Support/CMakeFiles/LLVMSupport.dir/LockFileManager.cpp.o -MF lib/Support/CMakeFiles/LLVMSupport.dir/LockFileManager.cpp.o.d -o lib/Support/CMakeFiles/LLVMSupport.dir/LockFileManager.cpp.o -c /Users/buildslave/jenkins/workspace/lldb-cmake-matrix/llvm-project/llvm/lib/Support/LockFileManager.cpp
[607/4328] /Users/buildslave/jenkins/workspace/lldb-cmake-matrix/host-compiler/bin/clang++  -DGTEST_HAS_RTTI=0 -D_DEBUG -D__STDC_CONSTANT_MACROS -D__STDC_FORMAT_MACROS -D__STDC_LIMIT_MACROS -Ilib/Support -I/Users/buildslave/jenkins/workspace/lldb-cmake-matrix/llvm-project/llvm/lib/Support -Iinclude -I/Users/buildslave/jenkins/workspace/lldb-cmake-matrix/llvm-project/llvm/include -fPIC -fvisibility-inlines-hidden -Werror=date-time -Werror=unguarded-availability-new -fmodules -fmodules-cache-path=/Users/buildslave/jenkins/workspace/lldb-cmake-matrix/lldb-build/module.cache -fcxx-modules -Xclang -fmodules-local-submodule-visibility -Wall -Wextra -Wno-unused-parameter -Wwrite-strings -Wcast-qual -Wmissing-field-initializers -pedantic -Wno-long-long -Wimplicit-fallthrough -Wcovered-switch-default -Wno-noexcept-type -Wnon-virtual-dtor -Wdelete-non-virtual-dtor -Wsuggest-override -Wstring-conversion -fdiagnostics-color -O3  -isysroot /Applications/Xcode.app/Contents/Developer/Platforms/MacOSX.platform/Developer/SDKs/MacOSX10.15.sdk   -UNDEBUG -std=c++14  -fno-exceptions -fno-rtti -MD -MT lib/Support/CMakeFiles/LLVMSupport.dir/ScopedPrinter.cpp.o -MF lib/Support/CMakeFiles/LLVMSupport.dir/ScopedPrinter.cpp.o.d -o lib/Support/CMakeFiles/LLVMSupport.dir/ScopedPrinter.cpp.o -c /Users/buildslave/jenkins/workspace/lldb-cmake-matrix/llvm-project/llvm/lib/Support/ScopedPrinter.cpp
[608/4328] /Users/buildslave/jenkins/workspace/lldb-cmake-matrix/host-compiler/bin/clang++  -DGTEST_HAS_RTTI=0 -D_DEBUG -D__STDC_CONSTANT_MACROS -D__STDC_FORMAT_MACROS -D__STDC_LIMIT_MACROS -Ilib/Support -I/Users/buildslave/jenkins/workspace/lldb-cmake-matrix/llvm-project/llvm/lib/Support -Iinclude -I/Users/buildslave/jenkins/workspace/lldb-cmake-matrix/llvm-project/llvm/include -fPIC -fvisibility-inlines-hidden -Werror=date-time -Werror=unguarded-availability-new -fmodules -fmodules-cache-path=/Users/buildslave/jenkins/workspace/lldb-cmake-matrix/lldb-build/module.cache -fcxx-modules -Xclang -fmodules-local-submodule-visibility -Wall -Wextra -Wno-unused-parameter -Wwrite-strings -Wcast-qual -Wmissing-field-initializers -pedantic -Wno-long-long -Wimplicit-fallthrough -Wcovered-switch-default -Wno-noexcept-type -Wnon-virtual-dtor -Wdelete-non-virtual-dtor -Wsuggest-override -Wstring-conversion -fdiagnostics-color -O3  -isysroot /Applications/Xcode.app/Contents/Developer/Platforms/MacOSX.platform/Developer/SDKs/MacOSX10.15.sdk   -UNDEBUG -std=c++14  -fno-exceptions -fno-rtti -MD -MT lib/Support/CMakeFiles/LLVMSupport.dir/PrettyStackTrace.cpp.o -MF lib/Support/CMakeFiles/LLVMSupport.dir/PrettyStackTrace.cpp.o.d -o lib/Support/CMakeFiles/LLVMSupport.dir/PrettyStackTrace.cpp.o -c /Users/buildslave/jenkins/workspace/lldb-cmake-matrix/llvm-project/llvm/lib/Support/PrettyStackTrace.cpp
[609/4328] /Users/buildslave/jenkins/workspace/lldb-cmake-matrix/host-compiler/bin/clang++  -DGTEST_HAS_RTTI=0 -D_DEBUG -D__STDC_CONSTANT_MACROS -D__STDC_FORMAT_MACROS -D__STDC_LIMIT_MACROS -Ilib/Support -I/Users/buildslave/jenkins/workspace/lldb-cmake-matrix/llvm-project/llvm/lib/Support -Iinclude -I/Users/buildslave/jenkins/workspace/lldb-cmake-matrix/llvm-project/llvm/include -fPIC -fvisibility-inlines-hidden -Werror=date-time -Werror=unguarded-availability-new -fmodules -fmodules-cache-path=/Users/buildslave/jenkins/workspace/lldb-cmake-matrix/lldb-build/module.cache -fcxx-modules -Xclang -fmodules-local-submodule-visibility -Wall -Wextra -Wno-unused-parameter -Wwrite-strings -Wcast-qual -Wmissing-field-initializers -pedantic -Wno-long-long -Wimplicit-fallthrough -Wcovered-switch-default -Wno-noexcept-type -Wnon-virtual-dtor -Wdelete-non-virtual-dtor -Wsuggest-override -Wstring-conversion -fdiagnostics-color -O3  -isysroot /Applications/Xcode.app/Contents/Developer/Platforms/MacOSX.platform/Developer/SDKs/MacOSX10.15.sdk   -UNDEBUG -std=c++14  -fno-exceptions -fno-rtti -MD -MT lib/Support/CMakeFiles/LLVMSupport.dir/RISCVAttributeParser.cpp.o -MF lib/Support/CMakeFiles/LLVMSupport.dir/RISCVAttributeParser.cpp.o.d -o lib/Support/CMakeFiles/LLVMSupport.dir/RISCVAttributeParser.cpp.o -c /Users/buildslave/jenkins/workspace/lldb-cmake-matrix/llvm-project/llvm/lib/Support/RISCVAttributeParser.cpp
[610/4328] /Users/buildslave/jenkins/workspace/lldb-cmake-matrix/host-compiler/bin/clang++  -DGTEST_HAS_RTTI=0 -D_DEBUG -D__STDC_CONSTANT_MACROS -D__STDC_FORMAT_MACROS -D__STDC_LIMIT_MACROS -Ilib/Support -I/Users/buildslave/jenkins/workspace/lldb-cmake-matrix/llvm-project/llvm/lib/Support -Iinclude -I/Users/buildslave/jenkins/workspace/lldb-cmake-matrix/llvm-project/llvm/include -fPIC -fvisibility-inlines-hidden -Werror=date-time -Werror=unguarded-availability-new -fmodules -fmodules-cache-path=/Users/buildslave/jenkins/workspace/lldb-cmake-matrix/lldb-build/module.cache -fcxx-modules -Xclang -fmodules-local-submodule-visibility -Wall -Wextra -Wno-unused-parameter -Wwrite-strings -Wcast-qual -Wmissing-field-initializers -pedantic -Wno-long-long -Wimplicit-fallthrough -Wcovered-switch-default -Wno-noexcept-type -Wnon-virtual-dtor -Wdelete-non-virtual-dtor -Wsuggest-override -Wstring-conversion -fdiagnostics-color -O3  -isysroot /Applications/Xcode.app/Contents/Developer/Platforms/MacOSX.platform/Developer/SDKs/MacOSX10.15.sdk   -UNDEBUG -std=c++14  -fno-exceptions -fno-rtti -MD -MT lib/Support/CMakeFiles/LLVMSupport.dir/Regex.cpp.o -MF lib/Support/CMakeFiles/LLVMSupport.dir/Regex.cpp.o.d -o lib/Support/CMakeFiles/LLVMSupport.dir/Regex.cpp.o -c /Users/buildslave/jenkins/workspace/lldb-cmake-matrix/llvm-project/llvm/lib/Support/Regex.cpp
[611/4328] /Users/buildslave/jenkins/workspace/lldb-cmake-matrix/host-compiler/bin/clang++  -DGTEST_HAS_RTTI=0 -D_DEBUG -D__STDC_CONSTANT_MACROS -D__STDC_FORMAT_MACROS -D__STDC_LIMIT_MACROS -Ilib/Support -I/Users/buildslave/jenkins/workspace/lldb-cmake-matrix/llvm-project/llvm/lib/Support -Iinclude -I/Users/buildslave/jenkins/workspace/lldb-cmake-matrix/llvm-project/llvm/include -fPIC -fvisibility-inlines-hidden -Werror=date-time -Werror=unguarded-availability-new -fmodules -fmodules-cache-path=/Users/buildslave/jenkins/workspace/lldb-cmake-matrix/lldb-build/module.cache -fcxx-modules -Xclang -fmodules-local-submodule-visibility -Wall -Wextra -Wno-unused-parameter -Wwrite-strings -Wcast-qual -Wmissing-field-initializers -pedantic -Wno-long-long -Wimplicit-fallthrough -Wcovered-switch-default -Wno-noexcept-type -Wnon-virtual-dtor -Wdelete-non-virtual-dtor -Wsuggest-override -Wstring-conversion -fdiagnostics-color -O3  -isysroot /Applications/Xcode.app/Contents/Developer/Platforms/MacOSX.platform/Developer/SDKs/MacOSX10.15.sdk   -UNDEBUG -std=c++14  -fno-exceptions -fno-rtti -MD -MT lib/Support/CMakeFiles/LLVMSupport.dir/SHA1.cpp.o -MF lib/Support/CMakeFiles/LLVMSupport.dir/SHA1.cpp.o.d -o lib/Support/CMakeFiles/LLVMSupport.dir/SHA1.cpp.o -c /Users/buildslave/jenkins/workspace/lldb-cmake-matrix/llvm-project/llvm/lib/Support/SHA1.cpp
[612/4328] /Users/buildslave/jenkins/workspace/lldb-cmake-matrix/host-compiler/bin/clang++  -DGTEST_HAS_RTTI=0 -D_DEBUG -D_GNU_SOURCE -D__STDC_CONSTANT_MACROS -D__STDC_FORMAT_MACROS -D__STDC_LIMIT_MACROS -Itools/clang/utils/TableGen -I/Users/buildslave/jenkins/workspace/lldb-cmake-matrix/llvm-project/clang/utils/TableGen -I/Users/buildslave/jenkins/workspace/lldb-cmake-matrix/llvm-project/clang/include -Itools/clang/include -Iinclude -I/Users/buildslave/jenkins/workspace/lldb-cmake-matrix/llvm-project/llvm/include -fPIC -fvisibility-inlines-hidden -Werror=date-time -Werror=unguarded-availability-new -fmodules -fmodules-cache-path=/Users/buildslave/jenkins/workspace/lldb-cmake-matrix/lldb-build/module.cache -fcxx-modules -Xclang -fmodules-local-submodule-visibility -Wall -Wextra -Wno-unused-parameter -Wwrite-strings -Wcast-qual -Wmissing-field-initializers -pedantic -Wno-long-long -Wimplicit-fallthrough -Wcovered-switch-default -Wno-noexcept-type -Wnon-virtual-dtor -Wdelete-non-virtual-dtor -Wsuggest-override -Wstring-conversion -fdiagnostics-color -fno-common -Woverloaded-virtual -Wno-nested-anon-types -O3  -isysroot /Applications/Xcode.app/Contents/Developer/Platforms/MacOSX.platform/Developer/SDKs/MacOSX10.15.sdk    -fno-exceptions -fno-rtti -UNDEBUG -std=c++14 -MD -MT tools/clang/utils/TableGen/CMakeFiles/clang-tblgen.dir/ClangDiagnosticsEmitter.cpp.o -MF tools/clang/utils/TableGen/CMakeFiles/clang-tblgen.dir/ClangDiagnosticsEmitter.cpp.o.d -o tools/clang/utils/TableGen/CMakeFiles/clang-tblgen.dir/ClangDiagnosticsEmitter.cpp.o -c /Users/buildslave/jenkins/workspace/lldb-cmake-matrix/llvm-project/clang/utils/TableGen/ClangDiagnosticsEmitter.cpp
[613/4328] /Users/buildslave/jenkins/workspace/lldb-cmake-matrix/host-compiler/bin/clang++  -DGTEST_HAS_RTTI=0 -D_DEBUG -D__STDC_CONSTANT_MACROS -D__STDC_FORMAT_MACROS -D__STDC_LIMIT_MACROS -Ilib/Support -I/Users/buildslave/jenkins/workspace/lldb-cmake-matrix/llvm-project/llvm/lib/Support -Iinclude -I/Users/buildslave/jenkins/workspace/lldb-cmake-matrix/llvm-project/llvm/include -fPIC -fvisibility-inlines-hidden -Werror=date-time -Werror=unguarded-availability-new -fmodules -fmodules-cache-path=/Users/buildslave/jenkins/workspace/lldb-cmake-matrix/lldb-build/module.cache -fcxx-modules -Xclang -fmodules-local-submodule-visibility -Wall -Wextra -Wno-unused-parameter -Wwrite-strings -Wcast-qual -Wmissing-field-initializers -pedantic -Wno-long-long -Wimplicit-fallthrough -Wcovered-switch-default -Wno-noexcept-type -Wnon-virtual-dtor -Wdelete-non-virtual-dtor -Wsuggest-override -Wstring-conversion -fdiagnostics-color -O3  -isysroot /Applications/Xcode.app/Contents/Developer/Platforms/MacOSX.platform/Developer/SDKs/MacOSX10.15.sdk   -UNDEBUG -std=c++14  -fno-exceptions -fno-rtti -MD -MT lib/Support/CMakeFiles/LLVMSupport.dir/SmallVector.cpp.o -MF lib/Support/CMakeFiles/LLVMSupport.dir/SmallVector.cpp.o.d -o lib/Support/CMakeFiles/LLVMSupport.dir/SmallVector.cpp.o -c /Users/buildslave/jenkins/workspace/lldb-cmake-matrix/llvm-project/llvm/lib/Support/SmallVector.cpp
[614/4328] /Users/buildslave/jenkins/workspace/lldb-cmake-matrix/host-compiler/bin/clang++  -DGTEST_HAS_RTTI=0 -D_DEBUG -D__STDC_CONSTANT_MACROS -D__STDC_FORMAT_MACROS -D__STDC_LIMIT_MACROS -Ilib/Support -I/Users/buildslave/jenkins/workspace/lldb-cmake-matrix/llvm-project/llvm/lib/Support -Iinclude -I/Users/buildslave/jenkins/workspace/lldb-cmake-matrix/llvm-project/llvm/include -fPIC -fvisibility-inlines-hidden -Werror=date-time -Werror=unguarded-availability-new -fmodules -fmodules-cache-path=/Users/buildslave/jenkins/workspace/lldb-cmake-matrix/lldb-build/module.cache -fcxx-modules -Xclang -fmodules-local-submodule-visibility -Wall -Wextra -Wno-unused-parameter -Wwrite-strings -Wcast-qual -Wmissing-field-initializers -pedantic -Wno-long-long -Wimplicit-fallthrough -Wcovered-switch-default -Wno-noexcept-type -Wnon-virtual-dtor -Wdelete-non-virtual-dtor -Wsuggest-override -Wstring-conversion -fdiagnostics-color -O3  -isysroot /Applications/Xcode.app/Contents/Developer/Platforms/MacOSX.platform/Developer/SDKs/MacOSX10.15.sdk   -UNDEBUG -std=c++14  -fno-exceptions -fno-rtti -MD -MT lib/Support/CMakeFiles/LLVMSupport.dir/MemoryBuffer.cpp.o -MF lib/Support/CMakeFiles/LLVMSupport.dir/MemoryBuffer.cpp.o.d -o lib/Support/CMakeFiles/LLVMSupport.dir/MemoryBuffer.cpp.o -c /Users/buildslave/jenkins/workspace/lldb-cmake-matrix/llvm-project/llvm/lib/Support/MemoryBuffer.cpp
[615/4328] /Users/buildslave/jenkins/workspace/lldb-cmake-matrix/host-compiler/bin/clang++  -DGTEST_HAS_RTTI=0 -D_DEBUG -D__STDC_CONSTANT_MACROS -D__STDC_FORMAT_MACROS -D__STDC_LIMIT_MACROS -Ilib/Support -I/Users/buildslave/jenkins/workspace/lldb-cmake-matrix/llvm-project/llvm/lib/Support -Iinclude -I/Users/buildslave/jenkins/workspace/lldb-cmake-matrix/llvm-project/llvm/include -fPIC -fvisibility-inlines-hidden -Werror=date-time -Werror=unguarded-availability-new -fmodules -fmodules-cache-path=/Users/buildslave/jenkins/workspace/lldb-cmake-matrix/lldb-build/module.cache -fcxx-modules -Xclang -fmodules-local-submodule-visibility -Wall -Wextra -Wno-unused-parameter -Wwrite-strings -Wcast-qual -Wmissing-field-initializers -pedantic -Wno-long-long -Wimplicit-fallthrough -Wcovered-switch-default -Wno-noexcept-type -Wnon-virtual-dtor -Wdelete-non-virtual-dtor -Wsuggest-override -Wstring-conversion -fdiagnostics-color -O3  -isysroot /Applications/Xcode.app/Contents/Developer/Platforms/MacOSX.platform/Developer/SDKs/MacOSX10.15.sdk   -UNDEBUG -std=c++14  -fno-exceptions -fno-rtti -MD -MT lib/Support/CMakeFiles/LLVMSupport.dir/SmallPtrSet.cpp.o -MF lib/Support/CMakeFiles/LLVMSupport.dir/SmallPtrSet.cpp.o.d -o lib/Support/CMakeFiles/LLVMSupport.dir/SmallPtrSet.cpp.o -c /Users/buildslave/jenkins/workspace/lldb-cmake-matrix/llvm-project/llvm/lib/Support/SmallPtrSet.cpp
[616/4328] /Users/buildslave/jenkins/workspace/lldb-cmake-matrix/host-compiler/bin/clang++  -DGTEST_HAS_RTTI=0 -D_DEBUG -D__STDC_CONSTANT_MACROS -D__STDC_FORMAT_MACROS -D__STDC_LIMIT_MACROS -Ilib/Support -I/Users/buildslave/jenkins/workspace/lldb-cmake-matrix/llvm-project/llvm/lib/Support -Iinclude -I/Users/buildslave/jenkins/workspace/lldb-cmake-matrix/llvm-project/llvm/include -fPIC -fvisibility-inlines-hidden -Werror=date-time -Werror=unguarded-availability-new -fmodules -fmodules-cache-path=/Users/buildslave/jenkins/workspace/lldb-cmake-matrix/lldb-build/module.cache -fcxx-modules -Xclang -fmodules-local-submodule-visibility -Wall -Wextra -Wno-unused-parameter -Wwrite-strings -Wcast-qual -Wmissing-field-initializers -pedantic -Wno-long-long -Wimplicit-fallthrough -Wcovered-switch-default -Wno-noexcept-type -Wnon-virtual-dtor -Wdelete-non-virtual-dtor -Wsuggest-override -Wstring-conversion -fdiagnostics-color -O3  -isysroot /Applications/Xcode.app/Contents/Developer/Platforms/MacOSX.platform/Developer/SDKs/MacOSX10.15.sdk   -UNDEBUG -std=c++14  -fno-exceptions -fno-rtti -MD -MT lib/Support/CMakeFiles/LLVMSupport.dir/ScaledNumber.cpp.o -MF lib/Support/CMakeFiles/LLVMSupport.dir/ScaledNumber.cpp.o.d -o lib/Support/CMakeFiles/LLVMSupport.dir/ScaledNumber.cpp.o -c /Users/buildslave/jenkins/workspace/lldb-cmake-matrix/llvm-project/llvm/lib/Support/ScaledNumber.cpp
[617/4328] /Users/buildslave/jenkins/workspace/lldb-cmake-matrix/host-compiler/bin/clang++  -DGTEST_HAS_RTTI=0 -D_DEBUG -D__STDC_CONSTANT_MACROS -D__STDC_FORMAT_MACROS -D__STDC_LIMIT_MACROS -Ilib/Support -I/Users/buildslave/jenkins/workspace/lldb-cmake-matrix/llvm-project/llvm/lib/Support -Iinclude -I/Users/buildslave/jenkins/workspace/lldb-cmake-matrix/llvm-project/llvm/include -fPIC -fvisibility-inlines-hidden -Werror=date-time -Werror=unguarded-availability-new -fmodules -fmodules-cache-path=/Users/buildslave/jenkins/workspace/lldb-cmake-matrix/lldb-build/module.cache -fcxx-modules -Xclang -fmodules-local-submodule-visibility -Wall -Wextra -Wno-unused-parameter -Wwrite-strings -Wcast-qual -Wmissing-field-initializers -pedantic -Wno-long-long -Wimplicit-fallthrough -Wcovered-switch-default -Wno-noexcept-type -Wnon-virtual-dtor -Wdelete-non-virtual-dtor -Wsuggest-override -Wstring-conversion -fdiagnostics-color -O3  -isysroot /Applications/Xcode.app/Contents/Developer/Platforms/MacOSX.platform/Developer/SDKs/MacOSX10.15.sdk   -UNDEBUG -std=c++14  -fno-exceptions -fno-rtti -MD -MT lib/Support/CMakeFiles/LLVMSupport.dir/RandomNumberGenerator.cpp.o -MF lib/Support/CMakeFiles/LLVMSupport.dir/RandomNumberGenerator.cpp.o.d -o lib/Support/CMakeFiles/LLVMSupport.dir/RandomNumberGenerator.cpp.o -c /Users/buildslave/jenkins/workspace/lldb-cmake-matrix/llvm-project/llvm/lib/Support/RandomNumberGenerator.cpp
[618/4328] /Users/buildslave/jenkins/workspace/lldb-cmake-matrix/host-compiler/bin/clang++  -DGTEST_HAS_RTTI=0 -D_DEBUG -D__STDC_CONSTANT_MACROS -D__STDC_FORMAT_MACROS -D__STDC_LIMIT_MACROS -Ilib/Support -I/Users/buildslave/jenkins/workspace/lldb-cmake-matrix/llvm-project/llvm/lib/Support -Iinclude -I/Users/buildslave/jenkins/workspace/lldb-cmake-matrix/llvm-project/llvm/include -fPIC -fvisibility-inlines-hidden -Werror=date-time -Werror=unguarded-availability-new -fmodules -fmodules-cache-path=/Users/buildslave/jenkins/workspace/lldb-cmake-matrix/lldb-build/module.cache -fcxx-modules -Xclang -fmodules-local-submodule-visibility -Wall -Wextra -Wno-unused-parameter -Wwrite-strings -Wcast-qual -Wmissing-field-initializers -pedantic -Wno-long-long -Wimplicit-fallthrough -Wcovered-switch-default -Wno-noexcept-type -Wnon-virtual-dtor -Wdelete-non-virtual-dtor -Wsuggest-override -Wstring-conversion -fdiagnostics-color -O3  -isysroot /Applications/Xcode.app/Contents/Developer/Platforms/MacOSX.platform/Developer/SDKs/MacOSX10.15.sdk   -UNDEBUG -std=c++14  -fno-exceptions -fno-rtti -MD -MT lib/Support/CMakeFiles/LLVMSupport.dir/StringMap.cpp.o -MF lib/Support/CMakeFiles/LLVMSupport.dir/StringMap.cpp.o.d -o lib/Support/CMakeFiles/LLVMSupport.dir/StringMap.cpp.o -c /Users/buildslave/jenkins/workspace/lldb-cmake-matrix/llvm-project/llvm/lib/Support/StringMap.cpp
[619/4328] /Users/buildslave/jenkins/workspace/lldb-cmake-matrix/host-compiler/bin/clang++  -DGTEST_HAS_RTTI=0 -D_DEBUG -D__STDC_CONSTANT_MACROS -D__STDC_FORMAT_MACROS -D__STDC_LIMIT_MACROS -Ilib/Support -I/Users/buildslave/jenkins/workspace/lldb-cmake-matrix/llvm-project/llvm/lib/Support -Iinclude -I/Users/buildslave/jenkins/workspace/lldb-cmake-matrix/llvm-project/llvm/include -fPIC -fvisibility-inlines-hidden -Werror=date-time -Werror=unguarded-availability-new -fmodules -fmodules-cache-path=/Users/buildslave/jenkins/workspace/lldb-cmake-matrix/lldb-build/module.cache -fcxx-modules -Xclang -fmodules-local-submodule-visibility -Wall -Wextra -Wno-unused-parameter -Wwrite-strings -Wcast-qual -Wmissing-field-initializers -pedantic -Wno-long-long -Wimplicit-fallthrough -Wcovered-switch-default -Wno-noexcept-type -Wnon-virtual-dtor -Wdelete-non-virtual-dtor -Wsuggest-override -Wstring-conversion -fdiagnostics-color -O3  -isysroot /Applications/Xcode.app/Contents/Developer/Platforms/MacOSX.platform/Developer/SDKs/MacOSX10.15.sdk   -UNDEBUG -std=c++14  -fno-exceptions -fno-rtti -MD -MT lib/Support/CMakeFiles/LLVMSupport.dir/StringExtras.cpp.o -MF lib/Support/CMakeFiles/LLVMSupport.dir/StringExtras.cpp.o.d -o lib/Support/CMakeFiles/LLVMSupport.dir/StringExtras.cpp.o -c /Users/buildslave/jenkins/workspace/lldb-cmake-matrix/llvm-project/llvm/lib/Support/StringExtras.cpp
[620/4328] /Users/buildslave/jenkins/workspace/lldb-cmake-matrix/host-compiler/bin/clang++  -DNDEBUG -D_LIBCPP_BUILDING_LIBRARY -D_LIBCPP_HAS_NO_PRAGMA_SYSTEM_HEADER -D__STDC_CONSTANT_MACROS -D__STDC_FORMAT_MACROS -D__STDC_LIMIT_MACROS -Iprojects/libcxx/src -I/Users/buildslave/jenkins/workspace/lldb-cmake-matrix/llvm-project/libcxx/src -Iinclude -I/Users/buildslave/jenkins/workspace/lldb-cmake-matrix/llvm-project/llvm/include -Iprojects/libcxx/include/c++build -fPIC -fvisibility-inlines-hidden -Werror=date-time -Werror=unguarded-availability-new -fmodules -fmodules-cache-path=/Users/buildslave/jenkins/workspace/lldb-cmake-matrix/lldb-build/module.cache -fcxx-modules -Xclang -fmodules-local-submodule-visibility -Wall -Wextra -Wno-unused-parameter -Wwrite-strings -Wcast-qual -Wmissing-field-initializers  -Wno-long-long -Wimplicit-fallthrough -Wcovered-switch-default -Wno-noexcept-type -Wnon-virtual-dtor -Wdelete-non-virtual-dtor -Wsuggest-override -Wstring-conversion -fdiagnostics-color -O3  -isysroot /Applications/Xcode.app/Contents/Developer/Platforms/MacOSX.platform/Developer/SDKs/MacOSX10.15.sdk -fPIC   -DLIBCXX_BUILDING_LIBCXXABI -UNDEBUG -faligned-allocation -nostdinc++ -fvisibility-inlines-hidden -fvisibility=hidden -Wall -Wextra -W -Wwrite-strings -Wno-unused-parameter -Wno-long-long -Werror=return-type -Wextra-semi -Wno-user-defined-literals -Wno-covered-switch-default -Wno-suggest-override -Wno-ignored-attributes -Wno-error -Wno-unused-command-line-argument -fno-modules -I /Users/buildslave/jenkins/workspace/lldb-cmake-matrix/lldb-build/include/c++/v1 -include /Users/buildslave/jenkins/workspace/lldb-cmake-matrix/lldb-build/projects/libcxx/__config_site -std=c++17 -MD -MT projects/libcxx/src/CMakeFiles/cxx_shared.dir/locale.cpp.o -MF projects/libcxx/src/CMakeFiles/cxx_shared.dir/locale.cpp.o.d -o projects/libcxx/src/CMakeFiles/cxx_shared.dir/locale.cpp.o -c /Users/buildslave/jenkins/workspace/lldb-cmake-matrix/llvm-project/libcxx/src/locale.cpp
[621/4328] /Users/buildslave/jenkins/workspace/lldb-cmake-matrix/host-compiler/bin/clang++  -DGTEST_HAS_RTTI=0 -D_DEBUG -D__STDC_CONSTANT_MACROS -D__STDC_FORMAT_MACROS -D__STDC_LIMIT_MACROS -Ilib/Support -I/Users/buildslave/jenkins/workspace/lldb-cmake-matrix/llvm-project/llvm/lib/Support -Iinclude -I/Users/buildslave/jenkins/workspace/lldb-cmake-matrix/llvm-project/llvm/include -fPIC -fvisibility-inlines-hidden -Werror=date-time -Werror=unguarded-availability-new -fmodules -fmodules-cache-path=/Users/buildslave/jenkins/workspace/lldb-cmake-matrix/lldb-build/module.cache -fcxx-modules -Xclang -fmodules-local-submodule-visibility -Wall -Wextra -Wno-unused-parameter -Wwrite-strings -Wcast-qual -Wmissing-field-initializers -pedantic -Wno-long-long -Wimplicit-fallthrough -Wcovered-switch-default -Wno-noexcept-type -Wnon-virtual-dtor -Wdelete-non-virtual-dtor -Wsuggest-override -Wstring-conversion -fdiagnostics-color -O3  -isysroot /Applications/Xcode.app/Contents/Developer/Platforms/MacOSX.platform/Developer/SDKs/MacOSX10.15.sdk   -UNDEBUG -std=c++14  -fno-exceptions -fno-rtti -MD -MT lib/Support/CMakeFiles/LLVMSupport.dir/SystemUtils.cpp.o -MF lib/Support/CMakeFiles/LLVMSupport.dir/SystemUtils.cpp.o.d -o lib/Support/CMakeFiles/LLVMSupport.dir/SystemUtils.cpp.o -c /Users/buildslave/jenkins/workspace/lldb-cmake-matrix/llvm-project/llvm/lib/Support/SystemUtils.cpp
[622/4328] /Users/buildslave/jenkins/workspace/lldb-cmake-matrix/host-compiler/bin/clang++  -DGTEST_HAS_RTTI=0 -D_DEBUG -D__STDC_CONSTANT_MACROS -D__STDC_FORMAT_MACROS -D__STDC_LIMIT_MACROS -Ilib/Support -I/Users/buildslave/jenkins/workspace/lldb-cmake-matrix/llvm-project/llvm/lib/Support -Iinclude -I/Users/buildslave/jenkins/workspace/lldb-cmake-matrix/llvm-project/llvm/include -fPIC -fvisibility-inlines-hidden -Werror=date-time -Werror=unguarded-availability-new -fmodules -fmodules-cache-path=/Users/buildslave/jenkins/workspace/lldb-cmake-matrix/lldb-build/module.cache -fcxx-modules -Xclang -fmodules-local-submodule-visibility -Wall -Wextra -Wno-unused-parameter -Wwrite-strings -Wcast-qual -Wmissing-field-initializers -pedantic -Wno-long-long -Wimplicit-fallthrough -Wcovered-switch-default -Wno-noexcept-type -Wnon-virtual-dtor -Wdelete-non-virtual-dtor -Wsuggest-override -Wstring-conversion -fdiagnostics-color -O3  -isysroot /Applications/Xcode.app/Contents/Developer/Platforms/MacOSX.platform/Developer/SDKs/MacOSX10.15.sdk   -UNDEBUG -std=c++14  -fno-exceptions -fno-rtti -MD -MT lib/Support/CMakeFiles/LLVMSupport.dir/Parallel.cpp.o -MF lib/Support/CMakeFiles/LLVMSupport.dir/Parallel.cpp.o.d -o lib/Support/CMakeFiles/LLVMSupport.dir/Parallel.cpp.o -c /Users/buildslave/jenkins/workspace/lldb-cmake-matrix/llvm-project/llvm/lib/Support/Parallel.cpp
[623/4328] /Users/buildslave/jenkins/workspace/lldb-cmake-matrix/host-compiler/bin/clang++  -DGTEST_HAS_RTTI=0 -D_DEBUG -D__STDC_CONSTANT_MACROS -D__STDC_FORMAT_MACROS -D__STDC_LIMIT_MACROS -Ilib/Support -I/Users/buildslave/jenkins/workspace/lldb-cmake-matrix/llvm-project/llvm/lib/Support -Iinclude -I/Users/buildslave/jenkins/workspace/lldb-cmake-matrix/llvm-project/llvm/include -fPIC -fvisibility-inlines-hidden -Werror=date-time -Werror=unguarded-availability-new -fmodules -fmodules-cache-path=/Users/buildslave/jenkins/workspace/lldb-cmake-matrix/lldb-build/module.cache -fcxx-modules -Xclang -fmodules-local-submodule-visibility -Wall -Wextra -Wno-unused-parameter -Wwrite-strings -Wcast-qual -Wmissing-field-initializers -pedantic -Wno-long-long -Wimplicit-fallthrough -Wcovered-switch-default -Wno-noexcept-type -Wnon-virtual-dtor -Wdelete-non-virtual-dtor -Wsuggest-override -Wstring-conversion -fdiagnostics-color -O3  -isysroot /Applications/Xcode.app/Contents/Developer/Platforms/MacOSX.platform/Developer/SDKs/MacOSX10.15.sdk   -UNDEBUG -std=c++14  -fno-exceptions -fno-rtti -MD -MT lib/Support/CMakeFiles/LLVMSupport.dir/StringSaver.cpp.o -MF lib/Support/CMakeFiles/LLVMSupport.dir/StringSaver.cpp.o.d -o lib/Support/CMakeFiles/LLVMSupport.dir/StringSaver.cpp.o -c /Users/buildslave/jenkins/workspace/lldb-cmake-matrix/llvm-project/llvm/lib/Support/StringSaver.cpp
[624/4328] /Users/buildslave/jenkins/workspace/lldb-cmake-matrix/host-compiler/bin/clang++  -DGTEST_HAS_RTTI=0 -D_DEBUG -D__STDC_CONSTANT_MACROS -D__STDC_FORMAT_MACROS -D__STDC_LIMIT_MACROS -Ilib/Support -I/Users/buildslave/jenkins/workspace/lldb-cmake-matrix/llvm-project/llvm/lib/Support -Iinclude -I/Users/buildslave/jenkins/workspace/lldb-cmake-matrix/llvm-project/llvm/include -fPIC -fvisibility-inlines-hidden -Werror=date-time -Werror=unguarded-availability-new -fmodules -fmodules-cache-path=/Users/buildslave/jenkins/workspace/lldb-cmake-matrix/lldb-build/module.cache -fcxx-modules -Xclang -fmodules-local-submodule-visibility -Wall -Wextra -Wno-unused-parameter -Wwrite-strings -Wcast-qual -Wmissing-field-initializers -pedantic -Wno-long-long -Wimplicit-fallthrough -Wcovered-switch-default -Wno-noexcept-type -Wnon-virtual-dtor -Wdelete-non-virtual-dtor -Wsuggest-override -Wstring-conversion -fdiagnostics-color -O3  -isysroot /Applications/Xcode.app/Contents/Developer/Platforms/MacOSX.platform/Developer/SDKs/MacOSX10.15.sdk   -UNDEBUG -std=c++14  -fno-exceptions -fno-rtti -MD -MT lib/Support/CMakeFiles/LLVMSupport.dir/Signposts.cpp.o -MF lib/Support/CMakeFiles/LLVMSupport.dir/Signposts.cpp.o.d -o lib/Support/CMakeFiles/LLVMSupport.dir/Signposts.cpp.o -c /Users/buildslave/jenkins/workspace/lldb-cmake-matrix/llvm-project/llvm/lib/Support/Signposts.cpp
[625/4328] /Users/buildslave/jenkins/workspace/lldb-cmake-matrix/host-compiler/bin/clang++  -DGTEST_HAS_RTTI=0 -D_DEBUG -D__STDC_CONSTANT_MACROS -D__STDC_FORMAT_MACROS -D__STDC_LIMIT_MACROS -Ilib/Support -I/Users/buildslave/jenkins/workspace/lldb-cmake-matrix/llvm-project/llvm/lib/Support -Iinclude -I/Users/buildslave/jenkins/workspace/lldb-cmake-matrix/llvm-project/llvm/include -fPIC -fvisibility-inlines-hidden -Werror=date-time -Werror=unguarded-availability-new -fmodules -fmodules-cache-path=/Users/buildslave/jenkins/workspace/lldb-cmake-matrix/lldb-build/module.cache -fcxx-modules -Xclang -fmodules-local-submodule-visibility -Wall -Wextra -Wno-unused-parameter -Wwrite-strings -Wcast-qual -Wmissing-field-initializers -pedantic -Wno-long-long -Wimplicit-fallthrough -Wcovered-switch-default -Wno-noexcept-type -Wnon-virtual-dtor -Wdelete-non-virtual-dtor -Wsuggest-override -Wstring-conversion -fdiagnostics-color -O3  -isysroot /Applications/Xcode.app/Contents/Developer/Platforms/MacOSX.platform/Developer/SDKs/MacOSX10.15.sdk   -UNDEBUG -std=c++14  -fno-exceptions -fno-rtti -MD -MT lib/Support/CMakeFiles/LLVMSupport.dir/SymbolRemappingReader.cpp.o -MF lib/Support/CMakeFiles/LLVMSupport.dir/SymbolRemappingReader.cpp.o.d -o lib/Support/CMakeFiles/LLVMSupport.dir/SymbolRemappingReader.cpp.o -c /Users/buildslave/jenkins/workspace/lldb-cmake-matrix/llvm-project/llvm/lib/Support/SymbolRemappingReader.cpp
[626/4328] : && /Users/buildslave/jenkins/workspace/lldb-cmake-matrix/host-compiler/bin/clang++ -fPIC -fvisibility-inlines-hidden -Werror=date-time -Werror=unguarded-availability-new -fmodules -fmodules-cache-path=/Users/buildslave/jenkins/workspace/lldb-cmake-matrix/lldb-build/module.cache -fcxx-modules -Xclang -fmodules-local-submodule-visibility -Wall -Wextra -Wno-unused-parameter -Wwrite-strings -Wcast-qual -Wmissing-field-initializers  -Wno-long-long -Wimplicit-fallthrough -Wcovered-switch-default -Wno-noexcept-type -Wnon-virtual-dtor -Wdelete-non-virtual-dtor -Wsuggest-override -Wstring-conversion -fdiagnostics-color -O3 -isysroot /Applications/Xcode.app/Contents/Developer/Platforms/MacOSX.platform/Developer/SDKs/MacOSX10.15.sdk -dynamiclib -Wl,-headerpad_max_install_names -compatibility_version 1.0.0 -current_version 1.0.0 -o lib/libc++.1.0.dylib -install_name @rpath/libc++.1.dylib projects/libcxx/src/CMakeFiles/cxx_shared.dir/algorithm.cpp.o projects/libcxx/src/CMakeFiles/cxx_shared.dir/any.cpp.o projects/libcxx/src/CMakeFiles/cxx_shared.dir/atomic.cpp.o projects/libcxx/src/CMakeFiles/cxx_shared.dir/barrier.cpp.o projects/libcxx/src/CMakeFiles/cxx_shared.dir/bind.cpp.o projects/libcxx/src/CMakeFiles/cxx_shared.dir/charconv.cpp.o projects/libcxx/src/CMakeFiles/cxx_shared.dir/chrono.cpp.o projects/libcxx/src/CMakeFiles/cxx_shared.dir/condition_variable.cpp.o projects/libcxx/src/CMakeFiles/cxx_shared.dir/condition_variable_destructor.cpp.o projects/libcxx/src/CMakeFiles/cxx_shared.dir/debug.cpp.o projects/libcxx/src/CMakeFiles/cxx_shared.dir/exception.cpp.o projects/libcxx/src/CMakeFiles/cxx_shared.dir/functional.cpp.o projects/libcxx/src/CMakeFiles/cxx_shared.dir/future.cpp.o projects/libcxx/src/CMakeFiles/cxx_shared.dir/hash.cpp.o projects/libcxx/src/CMakeFiles/cxx_shared.dir/ios.cpp.o projects/libcxx/src/CMakeFiles/cxx_shared.dir/iostream.cpp.o projects/libcxx/src/CMakeFiles/cxx_shared.dir/locale.cpp.o projects/libcxx/src/CMakeFiles/cxx_shared.dir/memory.cpp.o projects/libcxx/src/CMakeFiles/cxx_shared.dir/mutex.cpp.o projects/libcxx/src/CMakeFiles/cxx_shared.dir/mutex_destructor.cpp.o projects/libcxx/src/CMakeFiles/cxx_shared.dir/new.cpp.o projects/libcxx/src/CMakeFiles/cxx_shared.dir/optional.cpp.o projects/libcxx/src/CMakeFiles/cxx_shared.dir/random.cpp.o projects/libcxx/src/CMakeFiles/cxx_shared.dir/random_shuffle.cpp.o projects/libcxx/src/CMakeFiles/cxx_shared.dir/regex.cpp.o projects/libcxx/src/CMakeFiles/cxx_shared.dir/shared_mutex.cpp.o projects/libcxx/src/CMakeFiles/cxx_shared.dir/stdexcept.cpp.o projects/libcxx/src/CMakeFiles/cxx_shared.dir/string.cpp.o projects/libcxx/src/CMakeFiles/cxx_shared.dir/strstream.cpp.o projects/libcxx/src/CMakeFiles/cxx_shared.dir/system_error.cpp.o projects/libcxx/src/CMakeFiles/cxx_shared.dir/thread.cpp.o projects/libcxx/src/CMakeFiles/cxx_shared.dir/typeinfo.cpp.o projects/libcxx/src/CMakeFiles/cxx_shared.dir/utility.cpp.o projects/libcxx/src/CMakeFiles/cxx_shared.dir/valarray.cpp.o projects/libcxx/src/CMakeFiles/cxx_shared.dir/variant.cpp.o projects/libcxx/src/CMakeFiles/cxx_shared.dir/vector.cpp.o projects/libcxx/src/CMakeFiles/cxx_shared.dir/filesystem/operations.cpp.o projects/libcxx/src/CMakeFiles/cxx_shared.dir/filesystem/directory_iterator.cpp.o projects/libcxx/src/CMakeFiles/cxx_shared.dir/filesystem/int128_builtins.cpp.o  -Wl,-rpath,@loader_path/../lib  -nodefaultlibs  -lSystem  -lc  lib/libc++abi.1.0.dylib  -Wl,-unexported_symbols_list,/Users/buildslave/jenkins/workspace/lldb-cmake-matrix/llvm-project/libcxx/src/../lib/libc++unexp.exp  -Wl,-reexported_symbols_list,/Users/buildslave/jenkins/workspace/lldb-cmake-matrix/llvm-project/libcxx/src/../lib/libc++abi.v2.exp  -Wl,-force_symbols_not_weak_list,/Users/buildslave/jenkins/workspace/lldb-cmake-matrix/llvm-project/libcxx/src/../lib/notweak.exp  -Wl,-force_symbols_weak_list,/Users/buildslave/jenkins/workspace/lldb-cmake-matrix/llvm-project/libcxx/src/../lib/weak.exp  -Wl,-reexported_symbols_list,/Users/buildslave/jenkins/workspace/lldb-cmake-matrix/llvm-project/libcxxabi/src/../lib/new-delete.exp  -Wl,-reexported_symbols_list,/Users/buildslave/jenkins/workspace/lldb-cmake-matrix/llvm-project/libcxxabi/src/../lib/exceptions.exp  -Wl,-reexported_symbols_list,/Users/buildslave/jenkins/workspace/lldb-cmake-matrix/llvm-project/libcxxabi/src/../lib/personality-v0.exp && :
FAILED: lib/libc++.1.0.dylib 
: && /Users/buildslave/jenkins/workspace/lldb-cmake-matrix/host-compiler/bin/clang++ -fPIC -fvisibility-inlines-hidden -Werror=date-time -Werror=unguarded-availability-new -fmodules -fmodules-cache-path=/Users/buildslave/jenkins/workspace/lldb-cmake-matrix/lldb-build/module.cache -fcxx-modules -Xclang -fmodules-local-submodule-visibility -Wall -Wextra -Wno-unused-parameter -Wwrite-strings -Wcast-qual -Wmissing-field-initializers  -Wno-long-long -Wimplicit-fallthrough -Wcovered-switch-default -Wno-noexcept-type -Wnon-virtual-dtor -Wdelete-non-virtual-dtor -Wsuggest-override -Wstring-conversion -fdiagnostics-color -O3 -isysroot /Applications/Xcode.app/Contents/Developer/Platforms/MacOSX.platform/Developer/SDKs/MacOSX10.15.sdk -dynamiclib -Wl,-headerpad_max_install_names -compatibility_version 1.0.0 -current_version 1.0.0 -o lib/libc++.1.0.dylib -install_name @rpath/libc++.1.dylib projects/libcxx/src/CMakeFiles/cxx_shared.dir/algorithm.cpp.o projects/libcxx/src/CMakeFiles/cxx_shared.dir/any.cpp.o projects/libcxx/src/CMakeFiles/cxx_shared.dir/atomic.cpp.o projects/libcxx/src/CMakeFiles/cxx_shared.dir/barrier.cpp.o projects/libcxx/src/CMakeFiles/cxx_shared.dir/bind.cpp.o projects/libcxx/src/CMakeFiles/cxx_shared.dir/charconv.cpp.o projects/libcxx/src/CMakeFiles/cxx_shared.dir/chrono.cpp.o projects/libcxx/src/CMakeFiles/cxx_shared.dir/condition_variable.cpp.o projects/libcxx/src/CMakeFiles/cxx_shared.dir/condition_variable_destructor.cpp.o projects/libcxx/src/CMakeFiles/cxx_shared.dir/debug.cpp.o projects/libcxx/src/CMakeFiles/cxx_shared.dir/exception.cpp.o projects/libcxx/src/CMakeFiles/cxx_shared.dir/functional.cpp.o projects/libcxx/src/CMakeFiles/cxx_shared.dir/future.cpp.o projects/libcxx/src/CMakeFiles/cxx_shared.dir/hash.cpp.o projects/libcxx/src/CMakeFiles/cxx_shared.dir/ios.cpp.o projects/libcxx/src/CMakeFiles/cxx_shared.dir/iostream.cpp.o projects/libcxx/src/CMakeFiles/cxx_shared.dir/locale.cpp.o projects/libcxx/src/CMakeFiles/cxx_shared.dir/memory.cpp.o projects/libcxx/src/CMakeFiles/cxx_shared.dir/mutex.cpp.o projects/libcxx/src/CMakeFiles/cxx_shared.dir/mutex_destructor.cpp.o projects/libcxx/src/CMakeFiles/cxx_shared.dir/new.cpp.o projects/libcxx/src/CMakeFiles/cxx_shared.dir/optional.cpp.o projects/libcxx/src/CMakeFiles/cxx_shared.dir/random.cpp.o projects/libcxx/src/CMakeFiles/cxx_shared.dir/random_shuffle.cpp.o projects/libcxx/src/CMakeFiles/cxx_shared.dir/regex.cpp.o projects/libcxx/src/CMakeFiles/cxx_shared.dir/shared_mutex.cpp.o projects/libcxx/src/CMakeFiles/cxx_shared.dir/stdexcept.cpp.o projects/libcxx/src/CMakeFiles/cxx_shared.dir/string.cpp.o projects/libcxx/src/CMakeFiles/cxx_shared.dir/strstream.cpp.o projects/libcxx/src/CMakeFiles/cxx_shared.dir/system_error.cpp.o projects/libcxx/src/CMakeFiles/cxx_shared.dir/thread.cpp.o projects/libcxx/src/CMakeFiles/cxx_shared.dir/typeinfo.cpp.o projects/libcxx/src/CMakeFiles/cxx_shared.dir/utility.cpp.o projects/libcxx/src/CMakeFiles/cxx_shared.dir/valarray.cpp.o projects/libcxx/src/CMakeFiles/cxx_shared.dir/variant.cpp.o projects/libcxx/src/CMakeFiles/cxx_shared.dir/vector.cpp.o projects/libcxx/src/CMakeFiles/cxx_shared.dir/filesystem/operations.cpp.o projects/libcxx/src/CMakeFiles/cxx_shared.dir/filesystem/directory_iterator.cpp.o projects/libcxx/src/CMakeFiles/cxx_shared.dir/filesystem/int128_builtins.cpp.o  -Wl,-rpath,@loader_path/../lib  -nodefaultlibs  -lSystem  -lc  lib/libc++abi.1.0.dylib  -Wl,-unexported_symbols_list,/Users/buildslave/jenkins/workspace/lldb-cmake-matrix/llvm-project/libcxx/src/../lib/libc++unexp.exp  -Wl,-reexported_symbols_list,/Users/buildslave/jenkins/workspace/lldb-cmake-matrix/llvm-project/libcxx/src/../lib/libc++abi.v2.exp  -Wl,-force_symbols_not_weak_list,/Users/buildslave/jenkins/workspace/lldb-cmake-matrix/llvm-project/libcxx/src/../lib/notweak.exp  -Wl,-force_symbols_weak_list,/Users/buildslave/jenkins/workspace/lldb-cmake-matrix/llvm-project/libcxx/src/../lib/weak.exp  -Wl,-reexported_symbols_list,/Users/buildslave/jenkins/workspace/lldb-cmake-matrix/llvm-project/libcxxabi/src/../lib/new-delete.exp  -Wl,-reexported_symbols_list,/Users/buildslave/jenkins/workspace/lldb-cmake-matrix/llvm-project/libcxxabi/src/../lib/exceptions.exp  -Wl,-reexported_symbols_list,/Users/buildslave/jenkins/workspace/lldb-cmake-matrix/llvm-project/libcxxabi/src/../lib/personality-v0.exp && :
ld: requested re-export symbol operator new(unsigned long) is not from a dylib, but from projects/libcxx/src/CMakeFiles/cxx_shared.dir/new.cpp.o
 file 'projects/libcxx/src/CMakeFiles/cxx_shared.dir/new.cpp.o' for architecture x86_64
clang-12: error: linker command failed with exit code 1 (use -v to see invocation)
[627/4328] /Users/buildslave/jenkins/workspace/lldb-cmake-matrix/host-compiler/bin/clang++  -DGTEST_HAS_RTTI=0 -D_DEBUG -D__STDC_CONSTANT_MACROS -D__STDC_FORMAT_MACROS -D__STDC_LIMIT_MACROS -Ilib/Support -I/Users/buildslave/jenkins/workspace/lldb-cmake-matrix/llvm-project/llvm/lib/Support -Iinclude -I/Users/buildslave/jenkins/workspace/lldb-cmake-matrix/llvm-project/llvm/include -fPIC -fvisibility-inlines-hidden -Werror=date-time -Werror=unguarded-availability-new -fmodules -fmodules-cache-path=/Users/buildslave/jenkins/workspace/lldb-cmake-matrix/lldb-build/module.cache -fcxx-modules -Xclang -fmodules-local-submodule-visibility -Wall -Wextra -Wno-unused-parameter -Wwrite-strings -Wcast-qual -Wmissing-field-initializers -pedantic -Wno-long-long -Wimplicit-fallthrough -Wcovered-switch-default -Wno-noexcept-type -Wnon-virtual-dtor -Wdelete-non-virtual-dtor -Wsuggest-override -Wstring-conversion -fdiagnostics-color -O3  -isysroot /Applications/Xcode.app/Contents/Developer/Platforms/MacOSX.platform/Developer/SDKs/MacOSX10.15.sdk   -UNDEBUG -std=c++14  -fno-exceptions -fno-rtti -MD -MT lib/Support/CMakeFiles/LLVMSupport.dir/TargetParser.cpp.o -MF lib/Support/CMakeFiles/LLVMSupport.dir/TargetParser.cpp.o.d -o lib/Support/CMakeFiles/LLVMSupport.dir/TargetParser.cpp.o -c /Users/buildslave/jenkins/workspace/lldb-cmake-matrix/llvm-project/llvm/lib/Support/TargetParser.cpp
[628/4328] /Users/buildslave/jenkins/workspace/lldb-cmake-matrix/host-compiler/bin/clang++  -DGTEST_HAS_RTTI=0 -D_DEBUG -D__STDC_CONSTANT_MACROS -D__STDC_FORMAT_MACROS -D__STDC_LIMIT_MACROS -Ilib/Support -I/Users/buildslave/jenkins/workspace/lldb-cmake-matrix/llvm-project/llvm/lib/Support -Iinclude -I/Users/buildslave/jenkins/workspace/lldb-cmake-matrix/llvm-project/llvm/include -fPIC -fvisibility-inlines-hidden -Werror=date-time -Werror=unguarded-availability-new -fmodules -fmodules-cache-path=/Users/buildslave/jenkins/workspace/lldb-cmake-matrix/lldb-build/module.cache -fcxx-modules -Xclang -fmodules-local-submodule-visibility -Wall -Wextra -Wno-unused-parameter -Wwrite-strings -Wcast-qual -Wmissing-field-initializers -pedantic -Wno-long-long -Wimplicit-fallthrough -Wcovered-switch-default -Wno-noexcept-type -Wnon-virtual-dtor -Wdelete-non-virtual-dtor -Wsuggest-override -Wstring-conversion -fdiagnostics-color -O3  -isysroot /Applications/Xcode.app/Contents/Developer/Platforms/MacOSX.platform/Developer/SDKs/MacOSX10.15.sdk   -UNDEBUG -std=c++14  -fno-exceptions -fno-rtti -MD -MT lib/Support/CMakeFiles/LLVMSupport.dir/SuffixTree.cpp.o -MF lib/Support/CMakeFiles/LLVMSupport.dir/SuffixTree.cpp.o.d -o lib/Support/CMakeFiles/LLVMSupport.dir/SuffixTree.cpp.o -c /Users/buildslave/jenkins/workspace/lldb-cmake-matrix/llvm-project/llvm/lib/Support/SuffixTree.cpp
[629/4328] /Users/buildslave/jenkins/workspace/lldb-cmake-matrix/host-compiler/bin/clang++  -DGTEST_HAS_RTTI=0 -D_DEBUG -D__STDC_CONSTANT_MACROS -D__STDC_FORMAT_MACROS -D__STDC_LIMIT_MACROS -Ilib/Support -I/Users/buildslave/jenkins/workspace/lldb-cmake-matrix/llvm-project/llvm/lib/Support -Iinclude -I/Users/buildslave/jenkins/workspace/lldb-cmake-matrix/llvm-project/llvm/include -fPIC -fvisibility-inlines-hidden -Werror=date-time -Werror=unguarded-availability-new -fmodules -fmodules-cache-path=/Users/buildslave/jenkins/workspace/lldb-cmake-matrix/lldb-build/module.cache -fcxx-modules -Xclang -fmodules-local-submodule-visibility -Wall -Wextra -Wno-unused-parameter -Wwrite-strings -Wcast-qual -Wmissing-field-initializers -pedantic -Wno-long-long -Wimplicit-fallthrough -Wcovered-switch-default -Wno-noexcept-type -Wnon-virtual-dtor -Wdelete-non-virtual-dtor -Wsuggest-override -Wstring-conversion -fdiagnostics-color -O3  -isysroot /Applications/Xcode.app/Contents/Developer/Platforms/MacOSX.platform/Developer/SDKs/MacOSX10.15.sdk   -UNDEBUG -std=c++14  -fno-exceptions -fno-rtti -MD -MT lib/Support/CMakeFiles/LLVMSupport.dir/TarWriter.cpp.o -MF lib/Support/CMakeFiles/LLVMSupport.dir/TarWriter.cpp.o.d -o lib/Support/CMakeFiles/LLVMSupport.dir/TarWriter.cpp.o -c /Users/buildslave/jenkins/workspace/lldb-cmake-matrix/llvm-project/llvm/lib/Support/TarWriter.cpp
[630/4328] /Users/buildslave/jenkins/workspace/lldb-cmake-matrix/host-compiler/bin/clang++  -DGTEST_HAS_RTTI=0 -D_DEBUG -D__STDC_CONSTANT_MACROS -D__STDC_FORMAT_MACROS -D__STDC_LIMIT_MACROS -Ilib/Support -I/Users/buildslave/jenkins/workspace/lldb-cmake-matrix/llvm-project/llvm/lib/Support -Iinclude -I/Users/buildslave/jenkins/workspace/lldb-cmake-matrix/llvm-project/llvm/include -fPIC -fvisibility-inlines-hidden -Werror=date-time -Werror=unguarded-availability-new -fmodules -fmodules-cache-path=/Users/buildslave/jenkins/workspace/lldb-cmake-matrix/lldb-build/module.cache -fcxx-modules -Xclang -fmodules-local-submodule-visibility -Wall -Wextra -Wno-unused-parameter -Wwrite-strings -Wcast-qual -Wmissing-field-initializers -pedantic -Wno-long-long -Wimplicit-fallthrough -Wcovered-switch-default -Wno-noexcept-type -Wnon-virtual-dtor -Wdelete-non-virtual-dtor -Wsuggest-override -Wstring-conversion -fdiagnostics-color -O3  -isysroot /Applications/Xcode.app/Contents/Developer/Platforms/MacOSX.platform/Developer/SDKs/MacOSX10.15.sdk   -UNDEBUG -std=c++14  -fno-exceptions -fno-rtti -MD -MT lib/Support/CMakeFiles/LLVMSupport.dir/JSON.cpp.o -MF lib/Support/CMakeFiles/LLVMSupport.dir/JSON.cpp.o.d -o lib/Support/CMakeFiles/LLVMSupport.dir/JSON.cpp.o -c /Users/buildslave/jenkins/workspace/lldb-cmake-matrix/llvm-project/llvm/lib/Support/JSON.cpp
[631/4328] /Users/buildslave/jenkins/workspace/lldb-cmake-matrix/host-compiler/bin/clang++  -DGTEST_HAS_RTTI=0 -D_DEBUG -D__STDC_CONSTANT_MACROS -D__STDC_FORMAT_MACROS -D__STDC_LIMIT_MACROS -Ilib/Support -I/Users/buildslave/jenkins/workspace/lldb-cmake-matrix/llvm-project/llvm/lib/Support -Iinclude -I/Users/buildslave/jenkins/workspace/lldb-cmake-matrix/llvm-project/llvm/include -fPIC -fvisibility-inlines-hidden -Werror=date-time -Werror=unguarded-availability-new -fmodules -fmodules-cache-path=/Users/buildslave/jenkins/workspace/lldb-cmake-matrix/lldb-build/module.cache -fcxx-modules -Xclang -fmodules-local-submodule-visibility -Wall -Wextra -Wno-unused-parameter -Wwrite-strings -Wcast-qual -Wmissing-field-initializers -pedantic -Wno-long-long -Wimplicit-fallthrough -Wcovered-switch-default -Wno-noexcept-type -Wnon-virtual-dtor -Wdelete-non-virtual-dtor -Wsuggest-override -Wstring-conversion -fdiagnostics-color -O3  -isysroot /Applications/Xcode.app/Contents/Developer/Platforms/MacOSX.platform/Developer/SDKs/MacOSX10.15.sdk   -UNDEBUG -std=c++14  -fno-exceptions -fno-rtti -MD -MT lib/Support/CMakeFiles/LLVMSupport.dir/SpecialCaseList.cpp.o -MF lib/Support/CMakeFiles/LLVMSupport.dir/SpecialCaseList.cpp.o.d -o lib/Support/CMakeFiles/LLVMSupport.dir/SpecialCaseList.cpp.o -c /Users/buildslave/jenkins/workspace/lldb-cmake-matrix/llvm-project/llvm/lib/Support/SpecialCaseList.cpp
[632/4328] /Users/buildslave/jenkins/workspace/lldb-cmake-matrix/host-compiler/bin/clang++  -DGTEST_HAS_RTTI=0 -D_DEBUG -D__STDC_CONSTANT_MACROS -D__STDC_FORMAT_MACROS -D__STDC_LIMIT_MACROS -Ilib/Support -I/Users/buildslave/jenkins/workspace/lldb-cmake-matrix/llvm-project/llvm/lib/Support -Iinclude -I/Users/buildslave/jenkins/workspace/lldb-cmake-matrix/llvm-project/llvm/include -fPIC -fvisibility-inlines-hidden -Werror=date-time -Werror=unguarded-availability-new -fmodules -fmodules-cache-path=/Users/buildslave/jenkins/workspace/lldb-cmake-matrix/lldb-build/module.cache -fcxx-modules -Xclang -fmodules-local-submodule-visibility -Wall -Wextra -Wno-unused-parameter -Wwrite-strings -Wcast-qual -Wmissing-field-initializers -pedantic -Wno-long-long -Wimplicit-fallthrough -Wcovered-switch-default -Wno-noexcept-type -Wnon-virtual-dtor -Wdelete-non-virtual-dtor -Wsuggest-override -Wstring-conversion -fdiagnostics-color -O3  -isysroot /Applications/Xcode.app/Contents/Developer/Platforms/MacOSX.platform/Developer/SDKs/MacOSX10.15.sdk   -UNDEBUG -std=c++14  -fno-exceptions -fno-rtti -MD -MT lib/Support/CMakeFiles/LLVMSupport.dir/StringRef.cpp.o -MF lib/Support/CMakeFiles/LLVMSupport.dir/StringRef.cpp.o.d -o lib/Support/CMakeFiles/LLVMSupport.dir/StringRef.cpp.o -c /Users/buildslave/jenkins/workspace/lldb-cmake-matrix/llvm-project/llvm/lib/Support/StringRef.cpp
[633/4328] /Users/buildslave/jenkins/workspace/lldb-cmake-matrix/host-compiler/bin/clang++  -DGTEST_HAS_RTTI=0 -D_DEBUG -D_GNU_SOURCE -D__STDC_CONSTANT_MACROS -D__STDC_FORMAT_MACROS -D__STDC_LIMIT_MACROS -Itools/clang/utils/TableGen -I/Users/buildslave/jenkins/workspace/lldb-cmake-matrix/llvm-project/clang/utils/TableGen -I/Users/buildslave/jenkins/workspace/lldb-cmake-matrix/llvm-project/clang/include -Itools/clang/include -Iinclude -I/Users/buildslave/jenkins/workspace/lldb-cmake-matrix/llvm-project/llvm/include -fPIC -fvisibility-inlines-hidden -Werror=date-time -Werror=unguarded-availability-new -fmodules -fmodules-cache-path=/Users/buildslave/jenkins/workspace/lldb-cmake-matrix/lldb-build/module.cache -fcxx-modules -Xclang -fmodules-local-submodule-visibility -Wall -Wextra -Wno-unused-parameter -Wwrite-strings -Wcast-qual -Wmissing-field-initializers -pedantic -Wno-long-long -Wimplicit-fallthrough -Wcovered-switch-default -Wno-noexcept-type -Wnon-virtual-dtor -Wdelete-non-virtual-dtor -Wsuggest-override -Wstring-conversion -fdiagnostics-color -fno-common -Woverloaded-virtual -Wno-nested-anon-types -O3  -isysroot /Applications/Xcode.app/Contents/Developer/Platforms/MacOSX.platform/Developer/SDKs/MacOSX10.15.sdk    -fno-exceptions -fno-rtti -UNDEBUG -std=c++14 -MD -MT tools/clang/utils/TableGen/CMakeFiles/clang-tblgen.dir/NeonEmitter.cpp.o -MF tools/clang/utils/TableGen/CMakeFiles/clang-tblgen.dir/NeonEmitter.cpp.o.d -o tools/clang/utils/TableGen/CMakeFiles/clang-tblgen.dir/NeonEmitter.cpp.o -c /Users/buildslave/jenkins/workspace/lldb-cmake-matrix/llvm-project/clang/utils/TableGen/NeonEmitter.cpp
[634/4328] /Users/buildslave/jenkins/workspace/lldb-cmake-matrix/host-compiler/bin/clang++  -DGTEST_HAS_RTTI=0 -D_DEBUG -D__STDC_CONSTANT_MACROS -D__STDC_FORMAT_MACROS -D__STDC_LIMIT_MACROS -Ilib/Support -I/Users/buildslave/jenkins/workspace/lldb-cmake-matrix/llvm-project/llvm/lib/Support -Iinclude -I/Users/buildslave/jenkins/workspace/lldb-cmake-matrix/llvm-project/llvm/include -fPIC -fvisibility-inlines-hidden -Werror=date-time -Werror=unguarded-availability-new -fmodules -fmodules-cache-path=/Users/buildslave/jenkins/workspace/lldb-cmake-matrix/lldb-build/module.cache -fcxx-modules -Xclang -fmodules-local-submodule-visibility -Wall -Wextra -Wno-unused-parameter -Wwrite-strings -Wcast-qual -Wmissing-field-initializers -pedantic -Wno-long-long -Wimplicit-fallthrough -Wcovered-switch-default -Wno-noexcept-type -Wnon-virtual-dtor -Wdelete-non-virtual-dtor -Wsuggest-override -Wstring-conversion -fdiagnostics-color -O3  -isysroot /Applications/Xcode.app/Contents/Developer/Platforms/MacOSX.platform/Developer/SDKs/MacOSX10.15.sdk   -UNDEBUG -std=c++14  -fno-exceptions -fno-rtti -MD -MT lib/Support/CMakeFiles/LLVMSupport.dir/ThreadPool.cpp.o -MF lib/Support/CMakeFiles/LLVMSupport.dir/ThreadPool.cpp.o.d -o lib/Support/CMakeFiles/LLVMSupport.dir/ThreadPool.cpp.o -c /Users/buildslave/jenkins/workspace/lldb-cmake-matrix/llvm-project/llvm/lib/Support/ThreadPool.cpp
[635/4328] /Users/buildslave/jenkins/workspace/lldb-cmake-matrix/host-compiler/bin/clang++  -DGTEST_HAS_RTTI=0 -D_DEBUG -D__STDC_CONSTANT_MACROS -D__STDC_FORMAT_MACROS -D__STDC_LIMIT_MACROS -Ilib/Support -I/Users/buildslave/jenkins/workspace/lldb-cmake-matrix/llvm-project/llvm/lib/Support -Iinclude -I/Users/buildslave/jenkins/workspace/lldb-cmake-matrix/llvm-project/llvm/include -fPIC -fvisibility-inlines-hidden -Werror=date-time -Werror=unguarded-availability-new -fmodules -fmodules-cache-path=/Users/buildslave/jenkins/workspace/lldb-cmake-matrix/lldb-build/module.cache -fcxx-modules -Xclang -fmodules-local-submodule-visibility -Wall -Wextra -Wno-unused-parameter -Wwrite-strings -Wcast-qual -Wmissing-field-initializers -pedantic -Wno-long-long -Wimplicit-fallthrough -Wcovered-switch-default -Wno-noexcept-type -Wnon-virtual-dtor -Wdelete-non-virtual-dtor -Wsuggest-override -Wstring-conversion -fdiagnostics-color -O3  -isysroot /Applications/Xcode.app/Contents/Developer/Platforms/MacOSX.platform/Developer/SDKs/MacOSX10.15.sdk   -UNDEBUG -std=c++14  -fno-exceptions -fno-rtti -MD -MT lib/Support/CMakeFiles/LLVMSupport.dir/Statistic.cpp.o -MF lib/Support/CMakeFiles/LLVMSupport.dir/Statistic.cpp.o.d -o lib/Support/CMakeFiles/LLVMSupport.dir/Statistic.cpp.o -c /Users/buildslave/jenkins/workspace/lldb-cmake-matrix/llvm-project/llvm/lib/Support/Statistic.cpp
[636/4328] /Users/buildslave/jenkins/workspace/lldb-cmake-matrix/host-compiler/bin/clang++  -DGTEST_HAS_RTTI=0 -D_DEBUG -D__STDC_CONSTANT_MACROS -D__STDC_FORMAT_MACROS -D__STDC_LIMIT_MACROS -Ilib/Demangle -I/Users/buildslave/jenkins/workspace/lldb-cmake-matrix/llvm-project/llvm/lib/Demangle -Iinclude -I/Users/buildslave/jenkins/workspace/lldb-cmake-matrix/llvm-project/llvm/include -fPIC -fvisibility-inlines-hidden -Werror=date-time -Werror=unguarded-availability-new -fmodules -fmodules-cache-path=/Users/buildslave/jenkins/workspace/lldb-cmake-matrix/lldb-build/module.cache -fcxx-modules -Xclang -fmodules-local-submodule-visibility -Wall -Wextra -Wno-unused-parameter -Wwrite-strings -Wcast-qual -Wmissing-field-initializers -pedantic -Wno-long-long -Wimplicit-fallthrough -Wcovered-switch-default -Wno-noexcept-type -Wnon-virtual-dtor -Wdelete-non-virtual-dtor -Wsuggest-override -Wstring-conversion -fdiagnostics-color -O3  -isysroot /Applications/Xcode.app/Contents/Developer/Platforms/MacOSX.platform/Developer/SDKs/MacOSX10.15.sdk    -fno-exceptions -fno-rtti -UNDEBUG -std=c++14 -MD -MT lib/Demangle/CMakeFiles/LLVMDemangle.dir/ItaniumDemangle.cpp.o -MF lib/Demangle/CMakeFiles/LLVMDemangle.dir/ItaniumDemangle.cpp.o.d -o lib/Demangle/CMakeFiles/LLVMDemangle.dir/ItaniumDemangle.cpp.o -c /Users/buildslave/jenkins/workspace/lldb-cmake-matrix/llvm-project/llvm/lib/Demangle/ItaniumDemangle.cpp
[637/4328] /Users/buildslave/jenkins/workspace/lldb-cmake-matrix/host-compiler/bin/clang++  -DGTEST_HAS_RTTI=0 -D_DEBUG -D__STDC_CONSTANT_MACROS -D__STDC_FORMAT_MACROS -D__STDC_LIMIT_MACROS -Ilib/Support -I/Users/buildslave/jenkins/workspace/lldb-cmake-matrix/llvm-project/llvm/lib/Support -Iinclude -I/Users/buildslave/jenkins/workspace/lldb-cmake-matrix/llvm-project/llvm/include -fPIC -fvisibility-inlines-hidden -Werror=date-time -Werror=unguarded-availability-new -fmodules -fmodules-cache-path=/Users/buildslave/jenkins/workspace/lldb-cmake-matrix/lldb-build/module.cache -fcxx-modules -Xclang -fmodules-local-submodule-visibility -Wall -Wextra -Wno-unused-parameter -Wwrite-strings -Wcast-qual -Wmissing-field-initializers -pedantic -Wno-long-long -Wimplicit-fallthrough -Wcovered-switch-default -Wno-noexcept-type -Wnon-virtual-dtor -Wdelete-non-virtual-dtor -Wsuggest-override -Wstring-conversion -fdiagnostics-color -O3  -isysroot /Applications/Xcode.app/Contents/Developer/Platforms/MacOSX.platform/Developer/SDKs/MacOSX10.15.sdk   -UNDEBUG -std=c++14  -fno-exceptions -fno-rtti -MD -MT lib/Support/CMakeFiles/LLVMSupport.dir/SourceMgr.cpp.o -MF lib/Support/CMakeFiles/LLVMSupport.dir/SourceMgr.cpp.o.d -o lib/Support/CMakeFiles/LLVMSupport.dir/SourceMgr.cpp.o -c /Users/buildslave/jenkins/workspace/lldb-cmake-matrix/llvm-project/llvm/lib/Support/SourceMgr.cpp
[638/4328] /Users/buildslave/jenkins/workspace/lldb-cmake-matrix/host-compiler/bin/clang++  -DGTEST_HAS_RTTI=0 -D_DEBUG -D__STDC_CONSTANT_MACROS -D__STDC_FORMAT_MACROS -D__STDC_LIMIT_MACROS -Ilib/Support -I/Users/buildslave/jenkins/workspace/lldb-cmake-matrix/llvm-project/llvm/lib/Support -Iinclude -I/Users/buildslave/jenkins/workspace/lldb-cmake-matrix/llvm-project/llvm/include -fPIC -fvisibility-inlines-hidden -Werror=date-time -Werror=unguarded-availability-new -fmodules -fmodules-cache-path=/Users/buildslave/jenkins/workspace/lldb-cmake-matrix/lldb-build/module.cache -fcxx-modules -Xclang -fmodules-local-submodule-visibility -Wall -Wextra -Wno-unused-parameter -Wwrite-strings -Wcast-qual -Wmissing-field-initializers -pedantic -Wno-long-long -Wimplicit-fallthrough -Wcovered-switch-default -Wno-noexcept-type -Wnon-virtual-dtor -Wdelete-non-virtual-dtor -Wsuggest-override -Wstring-conversion -fdiagnostics-color -O3  -isysroot /Applications/Xcode.app/Contents/Developer/Platforms/MacOSX.platform/Developer/SDKs/MacOSX10.15.sdk   -UNDEBUG -std=c++14  -fno-exceptions -fno-rtti -MD -MT lib/Support/CMakeFiles/LLVMSupport.dir/TimeProfiler.cpp.o -MF lib/Support/CMakeFiles/LLVMSupport.dir/TimeProfiler.cpp.o.d -o lib/Support/CMakeFiles/LLVMSupport.dir/TimeProfiler.cpp.o -c /Users/buildslave/jenkins/workspace/lldb-cmake-matrix/llvm-project/llvm/lib/Support/TimeProfiler.cpp
[639/4328] /Users/buildslave/jenkins/workspace/lldb-cmake-matrix/host-compiler/bin/clang++  -DGTEST_HAS_RTTI=0 -D_DEBUG -D_GNU_SOURCE -D__STDC_CONSTANT_MACROS -D__STDC_FORMAT_MACROS -D__STDC_LIMIT_MACROS -Itools/clang/utils/TableGen -I/Users/buildslave/jenkins/workspace/lldb-cmake-matrix/llvm-project/clang/utils/TableGen -I/Users/buildslave/jenkins/workspace/lldb-cmake-matrix/llvm-project/clang/include -Itools/clang/include -Iinclude -I/Users/buildslave/jenkins/workspace/lldb-cmake-matrix/llvm-project/llvm/include -fPIC -fvisibility-inlines-hidden -Werror=date-time -Werror=unguarded-availability-new -fmodules -fmodules-cache-path=/Users/buildslave/jenkins/workspace/lldb-cmake-matrix/lldb-build/module.cache -fcxx-modules -Xclang -fmodules-local-submodule-visibility -Wall -Wextra -Wno-unused-parameter -Wwrite-strings -Wcast-qual -Wmissing-field-initializers -pedantic -Wno-long-long -Wimplicit-fallthrough -Wcovered-switch-default -Wno-noexcept-type -Wnon-virtual-dtor -Wdelete-non-virtual-dtor -Wsuggest-override -Wstring-conversion -fdiagnostics-color -fno-common -Woverloaded-virtual -Wno-nested-anon-types -O3  -isysroot /Applications/Xcode.app/Contents/Developer/Platforms/MacOSX.platform/Developer/SDKs/MacOSX10.15.sdk    -fno-exceptions -fno-rtti -UNDEBUG -std=c++14 -MD -MT tools/clang/utils/TableGen/CMakeFiles/clang-tblgen.dir/MveEmitter.cpp.o -MF tools/clang/utils/TableGen/CMakeFiles/clang-tblgen.dir/MveEmitter.cpp.o.d -o tools/clang/utils/TableGen/CMakeFiles/clang-tblgen.dir/MveEmitter.cpp.o -c /Users/buildslave/jenkins/workspace/lldb-cmake-matrix/llvm-project/clang/utils/TableGen/MveEmitter.cpp
[640/4328] /Users/buildslave/jenkins/workspace/lldb-cmake-matrix/host-compiler/bin/clang++  -DGTEST_HAS_RTTI=0 -D_DEBUG -D__STDC_CONSTANT_MACROS -D__STDC_FORMAT_MACROS -D__STDC_LIMIT_MACROS -Ilib/Support -I/Users/buildslave/jenkins/workspace/lldb-cmake-matrix/llvm-project/llvm/lib/Support -Iinclude -I/Users/buildslave/jenkins/workspace/lldb-cmake-matrix/llvm-project/llvm/include -fPIC -fvisibility-inlines-hidden -Werror=date-time -Werror=unguarded-availability-new -fmodules -fmodules-cache-path=/Users/buildslave/jenkins/workspace/lldb-cmake-matrix/lldb-build/module.cache -fcxx-modules -Xclang -fmodules-local-submodule-visibility -Wall -Wextra -Wno-unused-parameter -Wwrite-strings -Wcast-qual -Wmissing-field-initializers -pedantic -Wno-long-long -Wimplicit-fallthrough -Wcovered-switch-default -Wno-noexcept-type -Wnon-virtual-dtor -Wdelete-non-virtual-dtor -Wsuggest-override -Wstring-conversion -fdiagnostics-color -O3  -isysroot /Applications/Xcode.app/Contents/Developer/Platforms/MacOSX.platform/Developer/SDKs/MacOSX10.15.sdk   -UNDEBUG -std=c++14  -fno-exceptions -fno-rtti -MD -MT lib/Support/CMakeFiles/LLVMSupport.dir/CommandLine.cpp.o -MF lib/Support/CMakeFiles/LLVMSupport.dir/CommandLine.cpp.o.d -o lib/Support/CMakeFiles/LLVMSupport.dir/CommandLine.cpp.o -c /Users/buildslave/jenkins/workspace/lldb-cmake-matrix/llvm-project/llvm/lib/Support/CommandLine.cpp
[641/4328] /Users/buildslave/jenkins/workspace/lldb-cmake-matrix/host-compiler/bin/clang++  -DGTEST_HAS_RTTI=0 -D_DEBUG -D__STDC_CONSTANT_MACROS -D__STDC_FORMAT_MACROS -D__STDC_LIMIT_MACROS -Ilib/Support -I/Users/buildslave/jenkins/workspace/lldb-cmake-matrix/llvm-project/llvm/lib/Support -Iinclude -I/Users/buildslave/jenkins/workspace/lldb-cmake-matrix/llvm-project/llvm/include -fPIC -fvisibility-inlines-hidden -Werror=date-time -Werror=unguarded-availability-new -fmodules -fmodules-cache-path=/Users/buildslave/jenkins/workspace/lldb-cmake-matrix/lldb-build/module.cache -fcxx-modules -Xclang -fmodules-local-submodule-visibility -Wall -Wextra -Wno-unused-parameter -Wwrite-strings -Wcast-qual -Wmissing-field-initializers -pedantic -Wno-long-long -Wimplicit-fallthrough -Wcovered-switch-default -Wno-noexcept-type -Wnon-virtual-dtor -Wdelete-non-virtual-dtor -Wsuggest-override -Wstring-conversion -fdiagnostics-color -O3  -isysroot /Applications/Xcode.app/Contents/Developer/Platforms/MacOSX.platform/Developer/SDKs/MacOSX10.15.sdk   -UNDEBUG -std=c++14  -fno-exceptions -fno-rtti -MD -MT lib/Support/CMakeFiles/LLVMSupport.dir/Timer.cpp.o -MF lib/Support/CMakeFiles/LLVMSupport.dir/Timer.cpp.o.d -o lib/Support/CMakeFiles/LLVMSupport.dir/Timer.cpp.o -c /Users/buildslave/jenkins/workspace/lldb-cmake-matrix/llvm-project/llvm/lib/Support/Timer.cpp
[642/4328] /Users/buildslave/jenkins/workspace/lldb-cmake-matrix/host-compiler/bin/clang++  -DGTEST_HAS_RTTI=0 -D_DEBUG -D_GNU_SOURCE -D__STDC_CONSTANT_MACROS -D__STDC_FORMAT_MACROS -D__STDC_LIMIT_MACROS -Itools/clang/utils/TableGen -I/Users/buildslave/jenkins/workspace/lldb-cmake-matrix/llvm-project/clang/utils/TableGen -I/Users/buildslave/jenkins/workspace/lldb-cmake-matrix/llvm-project/clang/include -Itools/clang/include -Iinclude -I/Users/buildslave/jenkins/workspace/lldb-cmake-matrix/llvm-project/llvm/include -fPIC -fvisibility-inlines-hidden -Werror=date-time -Werror=unguarded-availability-new -fmodules -fmodules-cache-path=/Users/buildslave/jenkins/workspace/lldb-cmake-matrix/lldb-build/module.cache -fcxx-modules -Xclang -fmodules-local-submodule-visibility -Wall -Wextra -Wno-unused-parameter -Wwrite-strings -Wcast-qual -Wmissing-field-initializers -pedantic -Wno-long-long -Wimplicit-fallthrough -Wcovered-switch-default -Wno-noexcept-type -Wnon-virtual-dtor -Wdelete-non-virtual-dtor -Wsuggest-override -Wstring-conversion -fdiagnostics-color -fno-common -Woverloaded-virtual -Wno-nested-anon-types -O3  -isysroot /Applications/Xcode.app/Contents/Developer/Platforms/MacOSX.platform/Developer/SDKs/MacOSX10.15.sdk    -fno-exceptions -fno-rtti -UNDEBUG -std=c++14 -MD -MT tools/clang/utils/TableGen/CMakeFiles/clang-tblgen.dir/ClangAttrEmitter.cpp.o -MF tools/clang/utils/TableGen/CMakeFiles/clang-tblgen.dir/ClangAttrEmitter.cpp.o.d -o tools/clang/utils/TableGen/CMakeFiles/clang-tblgen.dir/ClangAttrEmitter.cpp.o -c /Users/buildslave/jenkins/workspace/lldb-cmake-matrix/llvm-project/clang/utils/TableGen/ClangAttrEmitter.cpp
[643/4328] /Users/buildslave/jenkins/workspace/lldb-cmake-matrix/host-compiler/bin/clang++  -DGTEST_HAS_RTTI=0 -D_DEBUG -D__STDC_CONSTANT_MACROS -D__STDC_FORMAT_MACROS -D__STDC_LIMIT_MACROS -Ilib/Support -I/Users/buildslave/jenkins/workspace/lldb-cmake-matrix/llvm-project/llvm/lib/Support -Iinclude -I/Users/buildslave/jenkins/workspace/lldb-cmake-matrix/llvm-project/llvm/include -fPIC -fvisibility-inlines-hidden -Werror=date-time -Werror=unguarded-availability-new -fmodules -fmodules-cache-path=/Users/buildslave/jenkins/workspace/lldb-cmake-matrix/lldb-build/module.cache -fcxx-modules -Xclang -fmodules-local-submodule-visibility -Wall -Wextra -Wno-unused-parameter -Wwrite-strings -Wcast-qual -Wmissing-field-initializers -pedantic -Wno-long-long -Wimplicit-fallthrough -Wcovered-switch-default -Wno-noexcept-type -Wnon-virtual-dtor -Wdelete-non-virtual-dtor -Wsuggest-override -Wstring-conversion -fdiagnostics-color -O3  -isysroot /Applications/Xcode.app/Contents/Developer/Platforms/MacOSX.platform/Developer/SDKs/MacOSX10.15.sdk   -UNDEBUG -std=c++14  -fno-exceptions -fno-rtti -MD -MT lib/Support/CMakeFiles/LLVMSupport.dir/ItaniumManglingCanonicalizer.cpp.o -MF lib/Support/CMakeFiles/LLVMSupport.dir/ItaniumManglingCanonicalizer.cpp.o.d -o lib/Support/CMakeFiles/LLVMSupport.dir/ItaniumManglingCanonicalizer.cpp.o -c /Users/buildslave/jenkins/workspace/lldb-cmake-matrix/llvm-project/llvm/lib/Support/ItaniumManglingCanonicalizer.cpp
ninja: build stopped: subcommand failed.
Command failed: Command '['/usr/local/bin/ninja', '-v']' returned non-zero exit status 1.
Command: ['/usr/local/bin/ninja', '-v']
[Pipeline] }
[Pipeline] // timeout
[Pipeline] }
[Pipeline] // stage
[Pipeline] stage
[Pipeline] { (Test DWARF2)
Stage "Test DWARF2" skipped due to earlier failure(s)
[Pipeline] }
[Pipeline] // stage
[Pipeline] stage
[Pipeline] { (Test DWARF4)
Stage "Test DWARF4" skipped due to earlier failure(s)
[Pipeline] }
[Pipeline] // stage
[Pipeline] stage
[Pipeline] { (Test DWARF5)
Stage "Test DWARF5" skipped due to earlier failure(s)
[Pipeline] }
[Pipeline] // stage
[Pipeline] stage
[Pipeline] { (Build Clang 5.0.2)
Stage "Build Clang 5.0.2" skipped due to earlier failure(s)
[Pipeline] }
[Pipeline] // stage
[Pipeline] stage
[Pipeline] { (Test Clang 5.0.2)
Stage "Test Clang 5.0.2" skipped due to earlier failure(s)
[Pipeline] }
[Pipeline] // stage
[Pipeline] stage
[Pipeline] { (Build Clang 7.0.1)
Stage "Build Clang 7.0.1" skipped due to earlier failure(s)
[Pipeline] }
[Pipeline] // stage
[Pipeline] stage
[Pipeline] { (Test Clang 7.0.1)
Stage "Test Clang 7.0.1" skipped due to earlier failure(s)
[Pipeline] }
[Pipeline] // stage
[Pipeline] stage
[Pipeline] { (Build Clang 9.0.0)
Stage "Build Clang 9.0.0" skipped due to earlier failure(s)
[Pipeline] }
[Pipeline] // stage
[Pipeline] stage
[Pipeline] { (Test Clang 9.0.0)
Stage "Test Clang 9.0.0" skipped due to earlier failure(s)
[Pipeline] }
[Pipeline] // stage
[Pipeline] }
[Pipeline] // withEnv
[Pipeline] }
[Pipeline] // node
[Pipeline] End of Pipeline
ERROR: script returned exit code 1
Finished: FAILURE