FailedConsole Output

Skipping 9,574 KB.. Full Log
 lldb-shell :: Breakpoint/debug_rnglist_rlestartend.test (635 of 2119)
PASS: lldb-api :: python_api/watchpoint/watchlocation/TestTargetWatchAddress.py (636 of 2119)
PASS: lldb-unit :: Utility/./UtilityTests/OptionsWithRawTest.ArgsButNoDelimiter (637 of 2119)
PASS: lldb-api :: lang/cpp/scope/TestCppScope.py (638 of 2119)
PASS: lldb-api :: functionalities/breakpoint/scripted_bkpt/TestScriptedResolver.py (639 of 2119)
PASS: lldb-api :: functionalities/data-formatter/data-formatter-objc/TestDataFormatterObjNSException.py (640 of 2119)
PASS: lldb-api :: commands/expression/issue_11588/Test11588.py (641 of 2119)
PASS: lldb-api :: api/multithreaded/TestMultithreaded.py (642 of 2119)
PASS: lldb-unit :: SymbolFile/NativePDB/./SymbolFileNativePDBTests/PDBFPOProgramToDWARFExpressionTests.UnsupportedRASearch (643 of 2119)
PASS: lldb-unit :: Utility/./UtilityTests/LogChannelEnabledTest.LogVerboseThread (644 of 2119)
PASS: lldb-api :: commands/expression/test/TestExprs.py (645 of 2119)
PASS: lldb-unit :: Utility/./UtilityTests/BinaryStreamTest.PutSLEB128FiveBytes (646 of 2119)
PASS: lldb-api :: commands/expression/codegen-crash-typedefdecl-not-in_declcontext/TestCodegenCrashTypedefDeclNotInDeclContext.py (647 of 2119)
PASS: lldb-api :: functionalities/breakpoint/breakpoint_by_file_colon_line/TestBreakpointByFileColonLine.py (648 of 2119)
PASS: lldb-unit :: SymbolFile/DWARF/./SymbolFileDWARFTests/SymbolFileDWARFTests.TestAbbrevInvalidNULLTag (649 of 2119)
PASS: lldb-api :: functionalities/tail_call_frames/ambiguous_tail_call_seq2/TestAmbiguousTailCallSeq2.py (650 of 2119)
PASS: lldb-shell :: Commands/CommandScriptImmediateOutput/CommandScriptImmediateOutputFile.test (651 of 2119)
PASS: lldb-api :: functionalities/thread/exit_during_break/TestExitDuringBreak.py (652 of 2119)
PASS: lldb-api :: functionalities/thread/concurrent_events/TestConcurrentBreakpointsDelayedBreakpointOneWatchpoint.py (653 of 2119)
UNSUPPORTED: lldb-shell :: SymbolFile/DWARF/DW_TAG_GNU_call_site-DW_AT_low_pc.s (654 of 2119)
PASS: lldb-unit :: Utility/./UtilityTests/ConstStringTest.CompareConstString (655 of 2119)
PASS: lldb-unit :: Core/./LLDBCoreTests/ModuleSpecTest.InvalidInMemoryBufferValidFile (656 of 2119)
PASS: lldb-api :: macosx/function-starts/TestFunctionStarts.py (657 of 2119)
PASS: lldb-shell :: Reproducer/TestDSYM.test (658 of 2119)
PASS: lldb-unit :: ScriptInterpreter/Python/./ScriptInterpreterPythonTests/PythonDataObjectsTest.TestPythonStringToStr (659 of 2119)
PASS: lldb-unit :: Expression/./ExpressionTests/CppModuleConfigurationTest.MissingUsrInclude (660 of 2119)
PASS: lldb-api :: lang/cpp/namespace_conflicts/TestNamespaceConflicts.py (661 of 2119)
PASS: lldb-api :: lang/cpp/llvm-style/TestLLVMStyle.py (662 of 2119)
PASS: lldb-unit :: Expression/./ExpressionTests/DWARFExpression.DW_OP_piece (663 of 2119)
PASS: lldb-api :: functionalities/data-formatter/data-formatter-advanced/TestDataFormatterAdv.py (664 of 2119)
PASS: lldb-api :: tools/lldb-vscode/breakpoint/TestVSCode_setExceptionBreakpoints.py (665 of 2119)
PASS: lldb-shell :: ObjectFile/ELF/base-address.yaml (666 of 2119)
PASS: lldb-api :: functionalities/data-formatter/data-formatter-stl/libcxx/bitset/TestDataFormatterLibcxxBitset.py (667 of 2119)
PASS: lldb-unit :: Utility/./UtilityTests/SerializationRountripTest.SerializeDeserializePod (668 of 2119)
PASS: lldb-shell :: ObjectFile/ELF/gnu-debuglink.yaml (669 of 2119)
PASS: lldb-api :: macosx/find-dsym/bundle-with-dot-in-filename/TestBundleWithDotInFilename.py (670 of 2119)
PASS: lldb-unit :: Host/./HostTests/File.GetStreamFromDescriptor (671 of 2119)
PASS: lldb-shell :: ObjectFile/ELF/PT_LOAD-overlap-PT_INTERP.yaml (672 of 2119)
PASS: lldb-unit :: Utility/./UtilityTests/ScalarTest.CastOperations (673 of 2119)
PASS: lldb-unit :: UnwindAssembly/ARM64/./Arm64InstEmulationTests/TestArm64InstEmulation.TestFramelessThreeEpilogueFunction (674 of 2119)
PASS: lldb-unit :: Utility/./UtilityTests/StringExtractorTest.DecodeHexU8_Underflow (675 of 2119)
PASS: lldb-api :: lang/cpp/unique-types/TestUniqueTypes.py (676 of 2119)
PASS: lldb-unit :: UnwindAssembly/x86/./UnwindAssemblyx86Tests/Testx86AssemblyInspectionEngine.TestSimple64bitFrameFunction (677 of 2119)
UNSUPPORTED: lldb-api :: tools/lldb-server/TestGdbRemoteAuxvSupport.py (678 of 2119)
PASS: lldb-unit :: Process/gdb-remote/./ProcessGdbRemoteTests/GDBRemoteCommunicationClientTest.SyncThreadState (679 of 2119)
PASS: lldb-unit :: Platform/./LLDBPlatformTests/PlatformAppleSimulatorTest.TestHostPlatformToSim (680 of 2119)
PASS: lldb-api :: lang/cpp/offsetof/TestOffsetofCpp.py (681 of 2119)
PASS: lldb-shell :: SymbolFile/NativePDB/function-types-calling-conv.cpp (682 of 2119)
PASS: lldb-unit :: Utility/./UtilityTests/NameMatchesTest.Equals (683 of 2119)
PASS: lldb-api :: commands/expression/completion-crash-incomplete-record/TestCompletionCrashIncompleteRecord.py (684 of 2119)
PASS: lldb-unit :: Utility/./UtilityTests/StreamTest.ChangingByteOrder (685 of 2119)
PASS: lldb-api :: commands/expression/static-initializers/TestStaticInitializers.py (686 of 2119)
PASS: lldb-api :: lang/cpp/gmodules-templates/TestGModules.py (687 of 2119)
PASS: lldb-api :: lang/c/complex_int/TestComplexInt.py (688 of 2119)
UNSUPPORTED: lldb-api :: macosx/macCatalystAppMacOSFramework/TestMacCatalystAppWithMacOSFramework.py (689 of 2119)
UNSUPPORTED: lldb-shell :: Register/x86-gp-read.test (690 of 2119)
PASS: lldb-api :: functionalities/data-formatter/data-formatter-objc/TestDataFormatterObjCPlain.py (691 of 2119)
PASS: lldb-unit :: Expression/./ExpressionTests/DiagnosticManagerTest.PutStringMultiple (692 of 2119)
PASS: lldb-unit :: Utility/./UtilityTests/DataExtractorTest.UncommonAddressSize (693 of 2119)
PASS: lldb-api :: functionalities/data-formatter/data-formatter-stl/libcxx/queue/TestDataFormatterLibcxxQueue.py (694 of 2119)
PASS: lldb-api :: lang/objc/foundation/TestObjectDescriptionAPI.py (695 of 2119)
UNSUPPORTED: lldb-shell :: Register/x86-64-gp-write.test (696 of 2119)
PASS: lldb-api :: lang/objc/unicode-string/TestUnicodeString.py (697 of 2119)
PASS: lldb-api :: functionalities/avoids-fd-leak/TestFdLeak.py (698 of 2119)
PASS: lldb-unit :: Utility/./UtilityTests/StringLexerTest.Peek (699 of 2119)
PASS: lldb-api :: functionalities/var_path/TestVarPath.py (700 of 2119)
PASS: lldb-api :: commands/expression/call-function/TestCallStdStringFunction.py (701 of 2119)
PASS: lldb-unit :: ScriptInterpreter/Python/./ScriptInterpreterPythonTests/PythonDataObjectsTest.TestModuleNameResolutionNoDot (702 of 2119)
PASS: lldb-api :: lang/objc/real-definition/TestRealDefinition.py (703 of 2119)
PASS: lldb-unit :: Utility/./UtilityTests/StringListTest.JoinThree (704 of 2119)
PASS: lldb-api :: tools/lldb-server/TestGdbRemote_qThreadStopInfo.py (705 of 2119)
PASS: lldb-unit :: Utility/./UtilityTests/StreamTeeTest.Assignment (706 of 2119)
PASS: lldb-api :: lang/objc/objc-runtime-ivars/TestRuntimeIvars.py (707 of 2119)
PASS: lldb-shell :: BuildScript/modes.test (708 of 2119)
PASS: lldb-unit :: Language/Highlighting/./HighlighterTests/HighlighterTest.ClangCursorPosAfterOtherToken (709 of 2119)
PASS: lldb-unit :: Utility/./UtilityTests/FileSpecTest.PrependPathComponent (710 of 2119)
PASS: lldb-unit :: Core/./LLDBCoreTests/RichManglingContextTest.FromCxxMethodName (711 of 2119)
PASS: lldb-api :: lang/cpp/template-function/TestTemplateFunctions.py (712 of 2119)
PASS: lldb-shell :: Commands/command-breakpoint-col.test (713 of 2119)
PASS: lldb-api :: functionalities/gdb_remote_client/TestWriteMemory.py (714 of 2119)
PASS: lldb-unit :: Utility/./UtilityTests/ListenerTest.GetEventImmediate (715 of 2119)
UNSUPPORTED: lldb-api :: python_api/event/TestEvents.py (716 of 2119)
PASS: lldb-unit :: Expression/./ExpressionTests/DiagnosticManagerTest.AppendMessageSubsequentDiags (717 of 2119)
PASS: lldb-api :: functionalities/data-formatter/data-formatter-objc/nsstring/TestDataFormatterNSString.py (718 of 2119)
PASS: lldb-api :: lang/c/find_struct_type/TestFindStructTypes.py (719 of 2119)
PASS: lldb-unit :: Utility/./UtilityTests/ConstStringTest.NullAndEmptyStates (720 of 2119)
PASS: lldb-shell :: SymbolFile/DWARF/dir-separator-posix.s (721 of 2119)
PASS: lldb-unit :: UnwindAssembly/x86/./UnwindAssemblyx86Tests/Testx86AssemblyInspectionEngine.TestPushExtended (722 of 2119)
PASS: lldb-unit :: Utility/./UtilityTests/VMRange.ContainsRange (723 of 2119)
PASS: lldb-unit :: Utility/./UtilityTests/StringExtractorTest.GetHexBytesAvail_FullString (724 of 2119)
PASS: lldb-unit :: Utility/./UtilityTests/FileSpecTest.Equal (725 of 2119)
PASS: lldb-unit :: Utility/./UtilityTests/ScalarTest.TruncOrExtendTo (726 of 2119)
PASS: lldb-shell :: Reproducer/TestCrash.test (727 of 2119)
PASS: lldb-api :: functionalities/thread/exit_during_step/TestExitDuringStep.py (728 of 2119)
PASS: lldb-api :: python_api/sbenvironment/TestSBEnvironment.py (729 of 2119)
PASS: lldb-unit :: UnwindAssembly/x86/./UnwindAssemblyx86Tests/Testx86AssemblyInspectionEngine.TestPopEDI (730 of 2119)
PASS: lldb-unit :: Utility/./UtilityTests/NameMatchesTest.Contains (731 of 2119)
PASS: lldb-api :: functionalities/data-formatter/data-formatter-stl/libcxx/iterator/TestDataFormatterLibccIterator.py (732 of 2119)
PASS: lldb-api :: functionalities/tsan/cpp_global_location/TestTsanCPPGlobalLocation.py (733 of 2119)
PASS: lldb-api :: functionalities/reproducers/attach/TestReproducerAttach.py (734 of 2119)
UNSUPPORTED: lldb-api :: functionalities/data-formatter/data-formatter-stl/libstdcpp/iterator/TestDataFormatterStdIterator.py (735 of 2119)
PASS: lldb-unit :: Utility/./UtilityTests/StreamTeeTest.Flush (736 of 2119)
PASS: lldb-unit :: Utility/./UtilityTests/StringListTest.AppendList (737 of 2119)
PASS: lldb-unit :: Utility/./UtilityTests/StreamTest.PutHex16ByteOrderBig (738 of 2119)
PASS: lldb-api :: lang/objc/forward-decl/TestForwardDecl.py (739 of 2119)
PASS: lldb-api :: commands/expression/import-std-module/empty-module/TestEmptyStdModule.py (740 of 2119)
PASS: lldb-api :: functionalities/breakpoint/breakpoint_language/TestBreakpointLanguage.py (741 of 2119)
PASS: lldb-unit :: ScriptInterpreter/Python/./ScriptInterpreterPythonTests/PythonDataObjectsTest.TestExceptions (742 of 2119)
PASS: lldb-unit :: Utility/./UtilityTests/UriParserTest.BracketedHostname (743 of 2119)
PASS: lldb-api :: functionalities/type_lookup/TestTypeLookup.py (744 of 2119)
PASS: lldb-unit :: Utility/./UtilityTests/CompletionRequest.FakeLastArg (745 of 2119)
PASS: lldb-unit :: UnwindAssembly/x86/./UnwindAssemblyx86Tests/Testx86AssemblyInspectionEngine.TestPopESI (746 of 2119)
PASS: lldb-api :: commands/add-dsym/uuid/TestAddDsymCommand.py (747 of 2119)
PASS: lldb-api :: lang/objc/objc-static-method-stripped/TestObjCStaticMethodStripped.py (748 of 2119)
PASS: lldb-unit :: Utility/./UtilityTests/StreamTest.PutHex64ByteOrderLittle (749 of 2119)
PASS: lldb-shell :: ObjectFile/ELF/section-types.yaml (750 of 2119)
PASS: lldb-shell :: SymbolFile/Breakpad/line-table-missing-file.test (751 of 2119)
PASS: lldb-unit :: Utility/./UtilityTests/StringExtractorTest.GetHexU8_Exact_NoEof (752 of 2119)
PASS: lldb-unit :: UnwindAssembly/x86/./UnwindAssemblyx86Tests/Testx86AssemblyInspectionEngine.TestPopR12 (753 of 2119)
PASS: lldb-unit :: Utility/./UtilityTests/ArgsTest.BareSingleQuote (754 of 2119)
PASS: lldb-api :: functionalities/archives/TestBSDArchives.py (755 of 2119)
PASS: lldb-shell :: Commands/command-script-import.test (756 of 2119)
PASS: lldb-unit :: UnwindAssembly/x86/./UnwindAssemblyx86Tests/Testx86AssemblyInspectionEngine.Testi386IgnoredRegisters (757 of 2119)
PASS: lldb-api :: python_api/lldbutil/process/TestPrintStackTraces.py (758 of 2119)
PASS: lldb-unit :: ObjectFile/ELF/./ObjectFileELFTests/ObjectFileELFTest.GetModuleSpecifications_EarlySectionHeaders (759 of 2119)
PASS: lldb-api :: commands/target/stop-hook/enable/TestTargetStopHookEnable.py (760 of 2119)
PASS: lldb-unit :: Interpreter/./InterpreterTests/OptionArgParserTest.toChar (761 of 2119)
PASS: lldb-api :: types/TestRecursiveTypes.py (762 of 2119)
PASS: lldb-shell :: Driver/TestFile.test (763 of 2119)
PASS: lldb-unit :: UnwindAssembly/x86/./UnwindAssemblyx86Tests/Testx86AssemblyInspectionEngine.TestPushImm (764 of 2119)
PASS: lldb-unit :: Host/./HostTests/ConnectionFileDescriptorTest.TCPGetURIv4 (765 of 2119)
PASS: lldb-unit :: Utility/./UtilityTests/FileSpecTest.Match (766 of 2119)
PASS: lldb-shell :: SymbolFile/DWARF/limit-debug-info.s (767 of 2119)
PASS: lldb-unit :: Utility/./UtilityTests/RangeTest.LessThanInvalid (768 of 2119)
PASS: lldb-unit :: Symbol/./SymbolTests/TestClangASTImporter.CopyDeclTagDecl (769 of 2119)
PASS: lldb-unit :: Utility/./UtilityTests/Flags.AnyClear (770 of 2119)
PASS: lldb-unit :: Utility/./UtilityTests/StringListTest.InsertStringAtIndexStdString (771 of 2119)
PASS: lldb-shell :: Reproducer/Modules/TestModuleCXX.test (772 of 2119)
PASS: lldb-shell :: ScriptInterpreter/Python/scripted_breakpoint.test (773 of 2119)
PASS: lldb-unit :: Utility/./UtilityTests/EnvironmentTest.EnvpConversion (774 of 2119)
PASS: lldb-unit :: Utility/./UtilityTests/BinaryStreamTest.PutSLEB128FourBytes (775 of 2119)
PASS: lldb-api :: macosx/thread-names/TestInterruptThreadNames.py (776 of 2119)
PASS: lldb-shell :: Reproducer/TestGDBRemoteRepro.test (777 of 2119)
PASS: lldb-api :: functionalities/unwind/sigtramp/TestSigtrampUnwind.py (778 of 2119)
PASS: lldb-unit :: Utility/./UtilityTests/CompletionRequest.Constructor (779 of 2119)
PASS: lldb-unit :: ScriptInterpreter/Python/./ScriptInterpreterPythonTests/PythonDataObjectsTest.TestTypeNameResolutionNoDot (780 of 2119)
PASS: lldb-unit :: Host/./HostTests/NativeProcessProtocolTest.SetBreakpoint (781 of 2119)
PASS: lldb-unit :: Core/./LLDBCoreTests/RichManglingContextTest.SwitchProvider (782 of 2119)
PASS: lldb-unit :: ScriptInterpreter/Python/./ScriptInterpreterPythonTests/PythonDataObjectsTest.TestPythonInteger (783 of 2119)
PASS: lldb-shell :: SymbolFile/DWARF/find-basic-type.cpp (784 of 2119)
PASS: lldb-api :: lang/objc/objc-dyn-sbtype/TestObjCDynamicSBType.py (785 of 2119)
PASS: lldb-api :: functionalities/rerun/TestRerun.py (786 of 2119)
PASS: lldb-unit :: Utility/./UtilityTests/CompletionRequest.ShiftArguments (787 of 2119)
PASS: lldb-api :: python_api/disassemble-raw-data/TestDisassemble_VST1_64.py (788 of 2119)
PASS: lldb-api :: functionalities/data-formatter/data-formatter-objc/nsindexpath/TestDataFormatterNSIndexPath.py (789 of 2119)
PASS: lldb-api :: functionalities/lazy-loading/TestLazyLoading.py (790 of 2119)
PASS: lldb-api :: tools/lldb-server/TestGdbRemoteExpeditedRegisters.py (791 of 2119)
PASS: lldb-api :: types/TestLongTypesExpr.py (792 of 2119)
PASS: lldb-unit :: Process/gdb-remote/./ProcessGdbRemoteTests/GDBRemoteCommunicationClientTest.SendStopTracePacket (793 of 2119)
PASS: lldb-shell :: ObjectFile/wasm/stripped-debug-sections.yaml (794 of 2119)
PASS: lldb-api :: functionalities/thread/thread_exit/TestThreadExit.py (795 of 2119)
PASS: lldb-unit :: Language/Highlighting/./HighlighterTests/HighlighterTest.Keywords (796 of 2119)
UNSUPPORTED: lldb-shell :: SymbolFile/NativePDB/ast-functions-msvc.cpp (797 of 2119)
PASS: lldb-api :: functionalities/data-formatter/data-formatter-stl/libcxx/unique_ptr/TestDataFormatterLibcxxUniquePtr.py (798 of 2119)
PASS: lldb-unit :: Utility/./UtilityTests/Flags.AllClear (799 of 2119)
UNSUPPORTED: lldb-api :: functionalities/longjmp/TestLongjmp.py (800 of 2119)
PASS: lldb-unit :: Language/Highlighting/./HighlighterTests/HighlighterTest.ClangCursorPosEndOfLine (801 of 2119)
PASS: lldb-unit :: ObjectFile/ELF/./ObjectFileELFTests/ObjectFileELFTest.GetSymtab_NoSymEntryPointArmAddressClass (802 of 2119)
PASS: lldb-shell :: SymbolFile/DWARF/debug_rnglists.s (803 of 2119)
PASS: lldb-api :: functionalities/tsan/basic/TestTsanBasic.py (804 of 2119)
PASS: lldb-unit :: Symbol/./SymbolTests/TestTypeSystemClang.TestGetEnumIntegerTypeBasicTypes (805 of 2119)
PASS: lldb-unit :: Utility/./UtilityTests/ScalarTest.Scalar_512 (806 of 2119)
PASS: lldb-api :: commands/apropos/with-process/TestAproposWithProcess.py (807 of 2119)
PASS: lldb-unit :: Utility/./UtilityTests/RangeTest.ContainsAddrInvalid (808 of 2119)
PASS: lldb-unit :: Utility/./UtilityTests/DataExtractorTest.PeekData (809 of 2119)
PASS: lldb-api :: functionalities/mtc/simple/TestMTCSimple.py (810 of 2119)
UNSUPPORTED: lldb-api :: functionalities/tty/TestTerminal.py (811 of 2119)
PASS: lldb-unit :: UnwindAssembly/x86/./UnwindAssemblyx86Tests/Testx86AssemblyInspectionEngine.TestSubRSP (812 of 2119)
PASS: lldb-api :: functionalities/thread/concurrent_events/TestConcurrentWatchpointDelayWatchpointOneBreakpoint.py (813 of 2119)
PASS: lldb-api :: python_api/symbol-context/two-files/TestSymbolContextTwoFiles.py (814 of 2119)
PASS: lldb-unit :: Utility/./UtilityTests/StringExtractorTest.GetU64LittleEndian (815 of 2119)
PASS: lldb-shell :: SymbolFile/Breakpad/line-table-edgecases.test (816 of 2119)
PASS: lldb-unit :: Utility/./UtilityTests/LogChannelEnabledTest.LogThread (817 of 2119)
PASS: lldb-unit :: Host/./HostTests/SocketTest.DecodeHostAndPort (818 of 2119)
UNSUPPORTED: lldb-shell :: SymbolFile/PDB/udt-layout.test (819 of 2119)
PASS: lldb-api :: python_api/watchpoint/TestWatchpointIter.py (820 of 2119)
PASS: lldb-unit :: Symbol/./SymbolTests/TestTypeSystemClang.TestGetBasicTypeFromEnum (821 of 2119)
PASS: lldb-unit :: Utility/./UtilityTests/StreamTest.AddressRangeEmptyRange (822 of 2119)
PASS: lldb-shell :: Driver/TestConvenienceVariables.test (823 of 2119)
PASS: lldb-unit :: Utility/./UtilityTests/ArgsTest.TestArgv (824 of 2119)
UNSUPPORTED: lldb-api :: tools/lldb-server/signal-filtering/TestGdbRemote_QPassSignals.py (825 of 2119)
PASS: lldb-unit :: Language/Highlighting/./HighlighterTests/HighlighterTest.DefaultHighlighterWithCursor (826 of 2119)
PASS: lldb-unit :: Utility/./UtilityTests/ArgsTest.TestQuotedUnknownEscape (827 of 2119)
PASS: lldb-api :: functionalities/postmortem/elf-core/thread_crash/TestLinuxCoreThreads.py (828 of 2119)
PASS: lldb-api :: api/command-return-object/TestSBCommandReturnObject.py (829 of 2119)
PASS: lldb-shell :: Quit/TestQuitExitCodeImplicit0.test (830 of 2119)
UNSUPPORTED: lldb-api :: functionalities/darwin_log/filter/regex/activity-chain/TestDarwinLogFilterRegexActivityChain.py (831 of 2119)
PASS: lldb-unit :: ObjectFile/Breakpad/./ObjectFileBreakpadTests/FuncRecord.parse (832 of 2119)
PASS: lldb-api :: commands/expression/result_numbering/TestResultNumbering.py (833 of 2119)
PASS: lldb-unit :: Core/./LLDBCoreTests/MangledTest.ResultForBlockInvocation (834 of 2119)
PASS: lldb-unit :: Utility/./UtilityTests/StringListTest.JoinSingle (835 of 2119)
PASS: lldb-api :: lang/cpp/global_operators/TestCppGlobalOperators.py (836 of 2119)
PASS: lldb-api :: functionalities/plugins/python_os_plugin/stepping_plugin_threads/TestOSPluginStepping.py (837 of 2119)
PASS: lldb-api :: python_api/value/TestValueAPI.py (838 of 2119)
XFAIL: lldb-shell :: SymbolFile/DWARF/find-type-in-function.cpp (839 of 2119)
PASS: lldb-unit :: Utility/./UtilityTests/StringExtractorTest.GetU32LittleEndian (840 of 2119)
PASS: lldb-shell :: SymbolFile/DWARF/DW_TAG_variable-DW_AT_const_value.s (841 of 2119)
PASS: lldb-api :: commands/expression/ir-interpreter-phi-nodes/TestIRInterpreterPHINodes.py (842 of 2119)
PASS: lldb-unit :: Platform/Android/./AdbClientTests/AdbClientTest.CreateByDeviceId_ByEnvVar (843 of 2119)
PASS: lldb-api :: types/TestShortTypeExpr.py (844 of 2119)
PASS: lldb-shell :: SymbolFile/DWARF/dwarf5-debug_line.s (845 of 2119)
PASS: lldb-api :: commands/expression/vector_of_enums/TestVectorOfEnums.py (846 of 2119)
PASS: lldb-api :: commands/expression/import-std-module/deque-dbg-info-content/TestDbgInfoContentDequeFromStdModule.py (847 of 2119)
PASS: lldb-api :: python_api/get-value-32bit-int/TestGetValue32BitInt.py (848 of 2119)
UNSUPPORTED: lldb-shell :: Watchpoint/netbsd-nouserdbregs.test (849 of 2119)
PASS: lldb-api :: functionalities/data-formatter/data-formatter-objc/cmtime/TestDataFormatterCMTime.py (850 of 2119)
PASS: lldb-api :: types/TestFloatTypesExpr.py (851 of 2119)
PASS: lldb-unit :: Host/./HostTests/SocketTest.TCPListen0ConnectAccept (852 of 2119)
PASS: lldb-shell :: ObjectFile/PECOFF/symbol.yaml (853 of 2119)
PASS: lldb-unit :: Utility/./UtilityTests/StructuredDataTest.ParseJSONFromFile (854 of 2119)
PASS: lldb-api :: functionalities/data-formatter/data-formatter-script/TestDataFormatterScript.py (855 of 2119)
PASS: lldb-api :: commands/expression/rdar42038760/TestScalarURem.py (856 of 2119)
PASS: lldb-unit :: Symbol/./SymbolTests/TestTypeSystemClang.TestIsClangType (857 of 2119)
PASS: lldb-shell :: SymbolFile/DWARF/dwo-type-in-main-file.s (858 of 2119)
PASS: lldb-unit :: ScriptInterpreter/Python/./ScriptInterpreterPythonTests/PythonDataObjectsTest.TestPythonBytes (859 of 2119)
PASS: lldb-api :: python_api/file_handle/TestFileHandle.py (860 of 2119)
PASS: lldb-unit :: Signals/./SignalsTests/UnixSignalsTest.GetInfo (861 of 2119)
PASS: lldb-unit :: Utility/./UtilityTests/SubsystemRAIITest.NormalSubsystem (862 of 2119)
PASS: lldb-shell :: ObjectFile/PECOFF/basic-info-arm.yaml (863 of 2119)
PASS: lldb-unit :: Utility/./UtilityTests/ArgsTest.TestMultipleArgs (864 of 2119)
UNSUPPORTED: lldb-api :: functionalities/thread/thread_specific_break_plus_condition/TestThreadSpecificBpPlusCondition.py (865 of 2119)
PASS: lldb-api :: commands/watchpoints/watchpoint_commands/condition/TestWatchpointConditionCmd.py (866 of 2119)
PASS: lldb-unit :: SymbolFile/DWARF/./SymbolFileDWARFTests/SymbolFileDWARFTests.TestAbbrevOrder1Start5 (867 of 2119)
PASS: lldb-unit :: Utility/./UtilityTests/RangeTest.ContainsEndInclusiveInvalid (868 of 2119)
PASS: lldb-unit :: ScriptInterpreter/Python/./ScriptInterpreterPythonTests/PythonDataObjectsTest.TestExtractingUInt64ThroughStructuredData (869 of 2119)
UNSUPPORTED: lldb-api :: benchmarks/libcxxmap/TestBenchmarkLibcxxMap.py (870 of 2119)
PASS: lldb-unit :: Utility/./UtilityTests/RangeTest.SetRangeBase (871 of 2119)
PASS: lldb-unit :: Host/./HostTests/File.GetWaitableHandleFileno (872 of 2119)
PASS: lldb-api :: functionalities/postmortem/minidump-new/TestMiniDumpUUID.py (873 of 2119)
PASS: lldb-unit :: Utility/./UtilityTests/Predicate.WaitForValueEqualTo (874 of 2119)
PASS: lldb-shell :: ObjectFile/ELF/PT_LOAD-overlap-section.yaml (875 of 2119)
PASS: lldb-shell :: Settings/TestFrameFormatMangling.test (876 of 2119)
PASS: lldb-api :: types/TestIntegerType.py (877 of 2119)
PASS: lldb-unit :: Host/./HostTests/HostInfoTest.GetHostname (878 of 2119)
PASS: lldb-unit :: Utility/./UtilityTests/BinaryStreamTest.PutULEB128TwoBytes (879 of 2119)
PASS: lldb-api :: macosx/indirect_symbol/TestIndirectSymbols.py (880 of 2119)
PASS: lldb-api :: functionalities/plugins/command_plugin/TestPluginCommands.py (881 of 2119)
PASS: lldb-api :: functionalities/thread/num_threads/TestNumThreads.py (882 of 2119)
PASS: lldb-api :: commands/command/script/TestCommandScript.py (883 of 2119)
PASS: lldb-api :: commands/expression/import-std-module/vector/TestVectorFromStdModule.py (884 of 2119)
PASS: lldb-unit :: Symbol/./SymbolTests/Type.GetTypeScopeAndBasename (885 of 2119)
PASS: lldb-api :: commands/frame/select/TestFrameSelect.py (886 of 2119)
PASS: lldb-unit :: Process/gdb-remote/./ProcessGdbRemoteTests/GDBRemoteCommunicationServerTest.SendErrorResponse_ErrorNumber (887 of 2119)
PASS: lldb-unit :: Utility/./UtilityTests/RegularExpression.Match (888 of 2119)
PASS: lldb-unit :: UnwindAssembly/ARM64/./Arm64InstEmulationTests/TestArm64InstEmulation.TestRegisterSavedTwice (889 of 2119)
PASS: lldb-unit :: Utility/./UtilityTests/RangeTest.ClearWithStarAddress (890 of 2119)
PASS: lldb-api :: lang/cpp/type_lookup/TestCppTypeLookup.py (891 of 2119)
PASS: lldb-api :: commands/expression/import-std-module/deque-basic/TestDequeFromStdModule.py (892 of 2119)
PASS: lldb-unit :: UnwindAssembly/ARM64/./Arm64InstEmulationTests/TestArm64InstEmulation.TestMediumDarwinFunction (893 of 2119)
PASS: lldb-unit :: Utility/./UtilityTests/StreamTeeTest.Write (894 of 2119)
PASS: lldb-unit :: Utility/./UtilityTests/SerializationRountripTest.SerializeDeserializePodPointers (895 of 2119)
PASS: lldb-api :: functionalities/data-formatter/nssetsynth/TestNSSetSynthetic.py (896 of 2119)
PASS: lldb-api :: functionalities/thread/concurrent_events/TestConcurrentCrashWithWatchpoint.py (897 of 2119)
PASS: lldb-api :: lang/cpp/char1632_t/TestChar1632T.py (898 of 2119)
PASS: lldb-shell :: Register/x86-64-gp-read.test (899 of 2119)
PASS: lldb-api :: functionalities/data-formatter/pyobjsynthprovider/TestPyObjSynthProvider.py (900 of 2119)
PASS: lldb-unit :: Utility/./UtilityTests/ArchSpecTest.Compatibility (901 of 2119)
PASS: lldb-unit :: Language/Highlighting/./HighlighterTests/HighlighterTest.ClangCursorOutOfBounds (902 of 2119)
PASS: lldb-api :: tools/lldb-vscode/attach/TestVSCode_attach.py (903 of 2119)
PASS: lldb-api :: lang/c/step-target/TestStepTarget.py (904 of 2119)
PASS: lldb-unit :: Utility/./UtilityTests/RangeTest.ContainsEndInclusive (905 of 2119)
PASS: lldb-api :: lang/objc/objc-ivar-stripped/TestObjCIvarStripped.py (906 of 2119)
PASS: lldb-unit :: Utility/./UtilityTests/OptionsWithRawTest.WhitespaceInput (907 of 2119)
PASS: lldb-unit :: Expression/./ExpressionTests/ClangExpressionDeclMapTest.TestPersistentDeclLookup (908 of 2119)
PASS: lldb-api :: lang/cpp/const_this/TestConstThis.py (909 of 2119)
PASS: lldb-unit :: Utility/./UtilityTests/StreamTeeTest.Constructor1Stream (910 of 2119)
PASS: lldb-shell :: Reproducer/TestSynchronous.test (911 of 2119)
PASS: lldb-api :: commands/expression/import_base_class_when_class_has_derived_member/TestImportBaseClassWhenClassHasDerivedMember.py (912 of 2119)
PASS: lldb-api :: functionalities/thread_plan/TestThreadPlanCommands.py (913 of 2119)
PASS: lldb-api :: lang/cpp/multiple-inheritance/TestCppMultipleInheritance.py (914 of 2119)
UNSUPPORTED: lldb-shell :: Unwind/unwind-plan-dwarf-dump.test (915 of 2119)
PASS: lldb-shell :: ObjectFile/ELF/compressed-sections.yaml (916 of 2119)
PASS: lldb-unit :: Host/./HostTests/HostInfoTest.GetAugmentedArchSpec (917 of 2119)
PASS: lldb-api :: types/TestLongTypes.py (918 of 2119)
PASS: lldb-api :: functionalities/breakpoint/debugbreak/TestDebugBreak.py (919 of 2119)
PASS: lldb-unit :: Utility/./UtilityTests/StringListTest.InsertStringAtIndexStart (920 of 2119)
PASS: lldb-unit :: Utility/./UtilityTests/UriParserTest.PortOverflow (921 of 2119)
PASS: lldb-unit :: Process/minidump/./LLDBMinidumpTests/MinidumpParserTest.MinidumpDuplicateModuleMinAddress (922 of 2119)
PASS: lldb-unit :: Core/./LLDBCoreTests/ModuleSpecTest.InvalidInMemoryBuffer (923 of 2119)
PASS: lldb-api :: commands/expression/multiline-navigation/TestMultilineNavigation.py (924 of 2119)
PASS: lldb-api :: functionalities/thread/concurrent_events/TestConcurrentManyBreakpoints.py (925 of 2119)
PASS: lldb-unit :: Utility/./UtilityTests/ConstStringTest.FromMidOfBufferStringRef (926 of 2119)
PASS: lldb-api :: commands/log/basic/TestLogging.py (927 of 2119)
PASS: lldb-api :: commands/watchpoints/watchpoint_on_vectors/TestValueOfVectorVariable.py (928 of 2119)
PASS: lldb-api :: terminal/TestEditline.py (929 of 2119)
PASS: lldb-unit :: Utility/./UtilityTests/SerializationRountripTest.SerializeDeserializeCString (930 of 2119)
PASS: lldb-api :: python_api/watchpoint/watchlocation/TestSetWatchlocation.py (931 of 2119)
PASS: lldb-shell :: ScriptInterpreter/None/none.test (932 of 2119)
PASS: lldb-api :: commands/watchpoints/watchpoint_commands/command/TestWatchpointCommandLLDB.py (933 of 2119)
UNSUPPORTED: lldb-api :: lang/cpp/printf/TestPrintf.py (934 of 2119)
PASS: lldb-api :: functionalities/breakpoint/breakpoint_locations/TestBreakpointLocations.py (935 of 2119)
PASS: lldb-api :: lang/c/enum_types/TestEnumTypes.py (936 of 2119)
PASS: lldb-unit :: Host/./HostTests/NativeProcessProtocolTest.ReadCStringFromMemory (937 of 2119)
PASS: lldb-api :: commands/expression/expr-in-syscall/TestExpressionInSyscall.py (938 of 2119)
PASS: lldb-shell :: ScriptInterpreter/Python/eof.test (939 of 2119)
PASS: lldb-shell :: Quit/TestQuitExitCodeHex0.test (940 of 2119)
PASS: lldb-shell :: ObjectFile/ELF/minidebuginfo-corrupt-xz.yaml (941 of 2119)
UNSUPPORTED: lldb-shell :: Register/x86-ymm-read.test (942 of 2119)
PASS: lldb-unit :: Utility/./UtilityTests/AnsiTerminal.Twice (943 of 2119)
PASS: lldb-unit :: SymbolFile/NativePDB/./SymbolFileNativePDBTests/PDBFPOProgramToDWARFExpressionTests.UnknownOp (944 of 2119)
PASS: lldb-shell :: Driver/LocalLLDBInit.test (945 of 2119)
PASS: lldb-api :: lang/cpp/overloaded-functions/TestOverloadedFunctions.py (946 of 2119)
PASS: lldb-unit :: Utility/./UtilityTests/StreamTest.PutPtr (947 of 2119)
PASS: lldb-api :: lang/c/register_variables/TestRegisterVariables.py (948 of 2119)
PASS: lldb-unit :: Utility/./UtilityTests/StreamTest.PutStringAsRawHex8 (949 of 2119)
PASS: lldb-unit :: Utility/./UtilityTests/CompletionRequest.TryCompleteCurrentArgGood (950 of 2119)
UNSUPPORTED: lldb-api :: tools/lldb-vscode/disconnect/TestVSCode_disconnect.py (951 of 2119)
PASS: lldb-unit :: Utility/./UtilityTests/StringExtractorTest.GetHexU8_InvalidHex_NoEof (952 of 2119)
PASS: lldb-api :: commands/source/info/TestSourceInfo.py (953 of 2119)
PASS: lldb-unit :: Language/Highlighting/./HighlighterTests/HighlighterTest.HighlighterSelectionType (954 of 2119)
PASS: lldb-shell :: SymbolFile/DWARF/find-method.cpp (955 of 2119)
PASS: lldb-api :: lang/objc/foundation/TestObjCMethods.py (956 of 2119)
PASS: lldb-shell :: SymbolFile/DWARF/compilercontext.ll (957 of 2119)
PASS: lldb-api :: macosx/universal/TestUniversal.py (958 of 2119)
PASS: lldb-unit :: Utility/./UtilityTests/StreamTeeTest.Constructor2Streams (959 of 2119)
PASS: lldb-api :: lang/c/bitfields/TestBitfields.py (960 of 2119)
UNSUPPORTED: lldb-shell :: Expr/TestIRMemoryMapWindows.test (961 of 2119)
PASS: lldb-api :: macosx/dyld-trie-symbols/TestDyldTrieSymbols.py (962 of 2119)
PASS: lldb-api :: commands/platform/file/read/TestPlatformFileRead.py (963 of 2119)
PASS: lldb-api :: python_api/sbvalue_const_addrof/TestSBValueConstAddrOf.py (964 of 2119)
UNSUPPORTED: lldb-shell :: ScriptInterpreter/Lua/io.test (965 of 2119)
PASS: lldb-api :: tools/lldb-server/TestGdbRemoteRegisterState.py (966 of 2119)
PASS: lldb-unit :: Utility/./UtilityTests/StringListTest.DefaultConstructor (967 of 2119)
PASS: lldb-unit :: Language/Highlighting/./HighlighterTests/HighlighterTest.ClangEmptyInput (968 of 2119)
PASS: lldb-api :: tools/lldb-server/commandline/TestStubSetSID.py (969 of 2119)
PASS: lldb-unit :: Utility/./UtilityTests/StreamTest.PutHex32ByteOrderBig (970 of 2119)
PASS: lldb-unit :: Target/./TargetTests/PathMappingListTest.AbsoluteTests (971 of 2119)
PASS: lldb-unit :: ObjectFile/Breakpad/./ObjectFileBreakpadTests/StackCFIRecord.parse (972 of 2119)
PASS: lldb-unit :: Utility/./UtilityTests/RangeTest.Clear (973 of 2119)
PASS: lldb-unit :: Utility/./UtilityTests/ProcessInstanceInfo.DumpTable_invalidUID (974 of 2119)
PASS: lldb-unit :: Utility/./UtilityTests/StatusTest.ErrorCodeConstructor (975 of 2119)
PASS: lldb-unit :: UnwindAssembly/x86/./UnwindAssemblyx86Tests/Testx86AssemblyInspectionEngine.TestPushESI (976 of 2119)
PASS: lldb-unit :: Utility/./UtilityTests/StringListTest.CopyList (977 of 2119)
UNSUPPORTED: lldb-shell :: SymbolFile/PDB/function-level-linking.test (978 of 2119)
PASS: lldb-shell :: SymbolFile/Breakpad/line-table-discontinuous-file-ids.test (979 of 2119)
UNSUPPORTED: lldb-api :: functionalities/process_save_core/TestProcessSaveCore.py (980 of 2119)
UNSUPPORTED: lldb-shell :: ObjectFile/ELF/minidebuginfo-no-lzma.yaml (981 of 2119)
PASS: lldb-unit :: Core/./LLDBCoreTests/UniqueCStringMap.NoDefaultConstructor (982 of 2119)
PASS: lldb-api :: functionalities/inferior-crashing/TestInferiorCrashing.py (983 of 2119)
PASS: lldb-unit :: Utility/./UtilityTests/StringListTest.Clear (984 of 2119)
PASS: lldb-api :: functionalities/data-formatter/data-formatter-enum-format/TestDataFormatterEnumFormat.py (985 of 2119)
PASS: lldb-unit :: SymbolFile/NativePDB/./SymbolFileNativePDBTests/PDBFPOProgramToDWARFExpressionTests.MultipleIndependentAssignments (986 of 2119)
PASS: lldb-api :: macosx/profile_vrs_detach/TestDetachVrsProfile.py (987 of 2119)
PASS: lldb-unit :: UnwindAssembly/x86/./UnwindAssemblyx86Tests/Testx86AssemblyInspectionEngine.TestPushEDI (988 of 2119)
PASS: lldb-unit :: Utility/./UtilityTests/BinaryStreamTest.PutSLEB128MaxValue (989 of 2119)
PASS: lldb-unit :: UnwindAssembly/x86/./UnwindAssemblyx86Tests/Testx86AssemblyInspectionEngine.TestPushR12 (990 of 2119)
PASS: lldb-api :: functionalities/thread/state_after_expression/TestStateAfterExpression.py (991 of 2119)
PASS: lldb-api :: functionalities/tail_call_frames/disambiguate_paths_to_common_sink/TestDisambiguatePathsToCommonSink.py (992 of 2119)
PASS: lldb-api :: functionalities/thread/concurrent_events/TestConcurrentBreakpointOneDelayBreakpointThreads.py (993 of 2119)
PASS: lldb-api :: functionalities/thread/concurrent_events/TestConcurrentDelayedCrashWithBreakpointWatchpoint.py (994 of 2119)
UNSUPPORTED: lldb-api :: arm/breakpoint-it/TestBreakpointIt.py (995 of 2119)
PASS: lldb-api :: functionalities/pre_run_dylibs/TestPreRunDylibs.py (996 of 2119)
PASS: lldb-shell :: SymbolFile/DWARF/debug-types-basic.test (997 of 2119)
PASS: lldb-api :: python_api/watchpoint/TestWatchpointIgnoreCount.py (998 of 2119)
PASS: lldb-unit :: Utility/./UtilityTests/VMRange.Ordering (999 of 2119)
PASS: lldb-unit :: Utility/./UtilityTests/FileSpecTest.EqualDotsPosix (1000 of 2119)
PASS: lldb-unit :: Process/minidump/./LLDBMinidumpTests/MinidumpParserTest.FindMemoryRangeWithFullMemoryMinidump (1001 of 2119)
PASS: lldb-api :: lang/cpp/class_types/TestClassTypesDisassembly.py (1002 of 2119)
PASS: lldb-api :: lang/objc/objc-struct-argument/TestObjCStructArgument.py (1003 of 2119)
PASS: lldb-unit :: Utility/./UtilityTests/ListenerTest.GetEventWait (1004 of 2119)
PASS: lldb-shell :: Breakpoint/implicit_const_form_support.test (1005 of 2119)
PASS: lldb-unit :: Process/gdb-remote/./ProcessGdbRemoteTests/GDBRemoteClientBaseTest.SendContinueAndAsyncSignal (1006 of 2119)
PASS: lldb-unit :: UnwindAssembly/x86/./UnwindAssemblyx86Tests/Testx86AssemblyInspectionEngine.TestReturnDetect (1007 of 2119)
UNSUPPORTED: lldb-api :: functionalities/data-formatter/data-formatter-stl/libstdcpp/tuple/TestDataFormatterStdTuple.py (1008 of 2119)
PASS: lldb-api :: python_api/value/empty_class/TestValueAPIEmptyClass.py (1009 of 2119)
PASS: lldb-shell :: Driver/TestCore.test (1010 of 2119)
PASS: lldb-unit :: UnwindAssembly/x86/./UnwindAssemblyx86Tests/Testx86AssemblyInspectionEngine.TestMovRSPtoRBP (1011 of 2119)
PASS: lldb-unit :: UnwindAssembly/ARM64/./Arm64InstEmulationTests/TestArm64InstEmulation.TestCFARegisterTrackedAcrossJumps (1012 of 2119)
PASS: lldb-unit :: Language/Highlighting/./HighlighterTests/HighlighterTest.ClangCursorPos (1013 of 2119)
PASS: lldb-api :: functionalities/process_group/TestChangeProcessGroup.py (1014 of 2119)
PASS: lldb-unit :: ScriptInterpreter/Python/./ScriptInterpreterPythonTests/PythonDataObjectsTest.TestCallable (1015 of 2119)
PASS: lldb-api :: functionalities/postmortem/mach-core/TestMachCore.py (1016 of 2119)
PASS: lldb-unit :: Core/./LLDBCoreTests/ModuleSpecTest.TestELFFile (1017 of 2119)
PASS: lldb-unit :: Utility/./UtilityTests/LogChannelEnabledTest.LLDB_LOG_ERROR (1018 of 2119)
PASS: lldb-api :: functionalities/set-data/TestSetData.py (1019 of 2119)
PASS: lldb-api :: functionalities/thread/concurrent_events/TestConcurrentSignalWatch.py (1020 of 2119)
PASS: lldb-shell :: SymbolFile/DWARF/debug-types-address-ranges.s (1021 of 2119)
PASS: lldb-api :: functionalities/float-display/TestFloatDisplay.py (1022 of 2119)
PASS: lldb-api :: functionalities/data-formatter/data-formatter-synthtype/TestDataFormatterSynthType.py (1023 of 2119)
PASS: lldb-unit :: Utility/./UtilityTests/RangeDataVector.CustomSort (1024 of 2119)
PASS: lldb-unit :: Utility/./UtilityTests/DataExtractorTest.GetBitfield (1025 of 2119)
PASS: lldb-api :: commands/expression/timeout/TestCallWithTimeout.py (1026 of 2119)
PASS: lldb-api :: lang/objc/foundation/TestObjCMethodsString.py (1027 of 2119)
PASS: lldb-shell :: VSCode/TestOptions.test (1028 of 2119)
PASS: lldb-unit :: Core/./LLDBCoreTests/RichManglingContextTest.Basic (1029 of 2119)
PASS: lldb-unit :: Utility/./UtilityTests/FileSpecTest.CopyByAppendingPathComponent (1030 of 2119)
PASS: lldb-unit :: Process/gdb-remote/./ProcessGdbRemoteTests/GDBRemoteCommunicationClientTest.SendGetMetaDataPacket (1031 of 2119)
PASS: lldb-unit :: Utility/./UtilityTests/DataExtractorTest.GetMaxU64 (1032 of 2119)
PASS: lldb-unit :: Utility/./UtilityTests/RangeTest.SlideZero (1033 of 2119)
PASS: lldb-unit :: Utility/./UtilityTests/CompletionRequest.DuplicateFilteringWithComments (1034 of 2119)
PASS: lldb-api :: lang/cpp/static_methods/TestCPPStaticMethods.py (1035 of 2119)
PASS: lldb-api :: functionalities/data-formatter/data-formatter-objc/TestDataFormatterObjCExpr.py (1036 of 2119)
PASS: lldb-api :: tools/lldb-vscode/console/TestVSCode_console.py (1037 of 2119)
PASS: lldb-unit :: Utility/./UtilityTests/RecordReplayTest.InstrumentedBarPtr (1038 of 2119)
PASS: lldb-shell :: SymbolFile/DWARF/find-basic-function.cpp (1039 of 2119)
PASS: lldb-unit :: Symbol/./SymbolTests/TestTypeSystemClang.AddMethodToObjCObjectType (1040 of 2119)
PASS: lldb-unit :: UnwindAssembly/x86/./UnwindAssemblyx86Tests/Testx86AssemblyInspectionEngine.TestPopR15 (1041 of 2119)
PASS: lldb-shell :: ObjectFile/Breakpad/sections-trailing-func.test (1042 of 2119)
PASS: lldb-api :: lang/objc/modules-incomplete/TestIncompleteModules.py (1043 of 2119)
PASS: lldb-api :: lang/objc/objc-new-syntax/TestObjCNewSyntaxDictionary.py (1044 of 2119)
UNSUPPORTED: lldb-shell :: SymbolFile/PDB/vbases.test (1045 of 2119)
PASS: lldb-unit :: Utility/./UtilityTests/SharedCluster.ClusterManager (1046 of 2119)
PASS: lldb-shell :: SymbolFile/NativePDB/s_constant.cpp (1047 of 2119)
PASS: lldb-api :: lang/objc/ptr_refs/TestPtrRefsObjC.py (1048 of 2119)
PASS: lldb-unit :: Utility/./UtilityTests/ArchSpecTest.TripleComponentsWereSpecified (1049 of 2119)
PASS: lldb-api :: functionalities/thread/ignore_suspended/TestIgnoreSuspendedThread.py (1050 of 2119)
PASS: lldb-api :: functionalities/data-formatter/var-in-aggregate-misuse/TestVarInAggregateMisuse.py (1051 of 2119)
PASS: lldb-shell :: ObjectFile/ELF/PT_LOAD-empty.yaml (1052 of 2119)
PASS: lldb-api :: commands/expression/po_verbosity/TestPoVerbosity.py (1053 of 2119)
PASS: lldb-unit :: Utility/./UtilityTests/XcodeSDKTest.SDKSupportsModules (1054 of 2119)
PASS: lldb-api :: python_api/frame/TestFrames.py (1055 of 2119)
PASS: lldb-unit :: Breakpoint/./LLDBBreakpointTests/BreakpointIDTest.StringIsBreakpointName (1056 of 2119)
UNSUPPORTED: lldb-shell :: BuildScript/toolchain-msvc.test (1057 of 2119)
PASS: lldb-api :: functionalities/thread/concurrent_events/TestConcurrentCrashWithWatchpointBreakpointSignal.py (1058 of 2119)
PASS: lldb-unit :: Utility/./UtilityTests/VASprintfTest.EncodingError (1059 of 2119)
PASS: lldb-unit :: SymbolFile/NativePDB/./SymbolFileNativePDBTests/PDBFPOProgramToDWARFExpressionTests.SingleAssignmentRegisterRef (1060 of 2119)
PASS: lldb-unit :: Utility/./UtilityTests/RecordReplayTest.InstrumentedBarRef (1061 of 2119)
PASS: lldb-unit :: Core/./LLDBCoreTests/MangledTest.EmptyForInvalidName (1062 of 2119)
PASS: lldb-api :: tools/lldb-server/TestGdbRemoteHostInfo.py (1063 of 2119)
PASS: lldb-api :: commands/process/attach/TestProcessAttach.py (1064 of 2119)
PASS: lldb-unit :: ObjectFile/Breakpad/./ObjectFileBreakpadTests/InfoRecord.parse (1065 of 2119)
PASS: lldb-api :: python_api/sbstructureddata/TestStructuredDataAPI.py (1066 of 2119)
PASS: lldb-api :: functionalities/breakpoint/global_constructor/TestBreakpointInGlobalConstructor.py (1067 of 2119)
PASS: lldb-unit :: Utility/./UtilityTests/StringListTest.AppendStringMove (1068 of 2119)
PASS: lldb-api :: commands/expression/import-std-module/vector-dbg-info-content/TestDbgInfoContentVectorFromStdModule.py (1069 of 2119)
PASS: lldb-api :: macosx/version_zero/TestGetVersionZeroVersion.py (1070 of 2119)
PASS: lldb-api :: functionalities/breakpoint/breakpoint_options/TestBreakpointOptions.py (1071 of 2119)
PASS: lldb-unit :: Utility/./UtilityTests/DataExtractorTest.GetDoubleUnaligned (1072 of 2119)
PASS: lldb-unit :: Process/gdb-remote/./ProcessGdbRemoteTests/GDBRemoteCommunicationClientTest.GetMemoryRegionInfoInvalidResponse (1073 of 2119)
PASS: lldb-api :: functionalities/breakpoint/step_over_breakpoint/TestStepOverBreakpoint.py (1074 of 2119)
PASS: lldb-api :: macosx/safe-to-func-call/TestSafeFuncCalls.py (1075 of 2119)
PASS: lldb-unit :: Symbol/./SymbolTests/SymbolsTest.TerminateLocateExecutableSymbolFileForUnknownExecutableAndUnknownSymbolFile (1076 of 2119)
PASS: lldb-api :: functionalities/data-formatter/stringprinter/TestStringPrinter.py (1077 of 2119)
PASS: lldb-shell :: SymbolFile/DWARF/gnu-style-compression.cpp (1078 of 2119)
PASS: lldb-api :: functionalities/inferior-assert/TestInferiorAssert.py (1079 of 2119)
PASS: lldb-api :: commands/expression/import-std-module/vector-bool/TestVectorBoolFromStdModule.py (1080 of 2119)
PASS: lldb-api :: lang/objc/objc-ivar-offsets/TestObjCIvarOffsets.py (1081 of 2119)
PASS: lldb-unit :: Utility/./UtilityTests/StringExtractorTest.DecodeHexU8_InvalidHex2 (1082 of 2119)
PASS: lldb-unit :: Utility/./UtilityTests/NameMatchesTest.RegularExpression (1083 of 2119)
PASS: lldb-unit :: Utility/./UtilityTests/DeserializerTest.HasData (1084 of 2119)
PASS: lldb-unit :: Utility/./UtilityTests/RangeTest.Copy (1085 of 2119)
PASS: lldb-unit :: UnwindAssembly/x86/./UnwindAssemblyx86Tests/Testx86AssemblyInspectionEngine.TestAddESP (1086 of 2119)
PASS: lldb-unit :: UnwindAssembly/x86/./UnwindAssemblyx86Tests/Testx86AssemblyInspectionEngine.TestPushR15 (1087 of 2119)
PASS: lldb-api :: commands/process/attach/attach_denied/TestAttachDenied.py (1088 of 2119)
PASS: lldb-unit :: UnwindAssembly/x86/./UnwindAssemblyx86Tests/Testx86AssemblyInspectionEngine.TestStackRealign8BitDisp_i386 (1089 of 2119)
PASS: lldb-api :: functionalities/thread/concurrent_events/TestConcurrentTwoBreakpointsOneWatchpoint.py (1090 of 2119)
PASS: lldb-api :: macosx/order/TestOrderFile.py (1091 of 2119)
UNSUPPORTED: lldb-api :: tools/intel-features/intel-pt/test/TestIntelPTSimpleBinary.py (1092 of 2119)
PASS: lldb-api :: functionalities/tail_call_frames/cross_dso/TestCrossDSOTailCalls.py (1093 of 2119)
PASS: lldb-shell :: SymbolFile/DWARF/DW_OP_piece-smaller-than-struct.s (1094 of 2119)
PASS: lldb-unit :: UnwindAssembly/x86/./UnwindAssemblyx86Tests/Testx86AssemblyInspectionEngine.TestSpArithx86_64Augmented (1095 of 2119)
PASS: lldb-shell :: SymbolFile/DWARF/DW_TAG_variable-invalid_location.s (1096 of 2119)
PASS: lldb-unit :: Process/minidump/./LLDBMinidumpTests/MinidumpParserTest.GetArchitecture (1097 of 2119)
PASS: lldb-api :: functionalities/thread/concurrent_events/TestConcurrentManyCrash.py (1098 of 2119)
PASS: lldb-unit :: Utility/./UtilityTests/VMRange.Clear (1099 of 2119)
PASS: lldb-api :: macosx/find-app-in-bundle/TestFindAppInBundle.py (1100 of 2119)
PASS: lldb-unit :: Utility/./UtilityTests/ArgsTest.TestOverwriteArgs (1101 of 2119)
PASS: lldb-unit :: Utility/./UtilityTests/DataExtractorTest.GetULEB128_bit63 (1102 of 2119)
PASS: lldb-shell :: SymbolFile/DWARF/anon_class_w_and_wo_export_symbols.ll (1103 of 2119)
PASS: lldb-api :: functionalities/process_crash_info/TestProcessCrashInfo.py (1104 of 2119)
PASS: lldb-unit :: Utility/./UtilityTests/StringListTest.InsertStringAtIndexMove (1105 of 2119)
PASS: lldb-api :: lang/objc/orderedset/TestOrderedSet.py (1106 of 2119)
PASS: lldb-unit :: Utility/./UtilityTests/FileSpecTest.Yaml (1107 of 2119)
UNSUPPORTED: lldb-api :: functionalities/darwin_log/filter/exact_match/subsystem/TestDarwinLogFilterMatchSubsystem.py (1108 of 2119)
PASS: lldb-api :: commands/expression/ignore-artificial-constructors/TestIgnoreArtificialConstructors.py (1109 of 2119)
PASS: lldb-api :: lang/objc/bitfield_ivars/TestBitfieldIvars.py (1110 of 2119)
PASS: lldb-api :: python_api/thread/TestThreadAPI.py (1111 of 2119)
UNSUPPORTED: lldb-api :: functionalities/breakpoint/hardware_breakpoints/hardware_breakpoint_on_multiple_threads/TestHWBreakMultiThread.py (1112 of 2119)
PASS: lldb-shell :: SymbolFile/DWARF/dwarf5-atomic.s (1113 of 2119)
PASS: lldb-api :: commands/expression/formatters/TestFormatters.py (1114 of 2119)
PASS: lldb-unit :: Utility/./UtilityTests/OptionsWithRawTest.SingleWhitespaceInput (1115 of 2119)
PASS: lldb-api :: functionalities/breakpoint/comp_dir_symlink/TestCompDirSymLink.py (1116 of 2119)
PASS: lldb-unit :: Process/minidump/./LLDBMinidumpTests/MinidumpParserTest.GetLinuxProcStatus (1117 of 2119)
PASS: lldb-unit :: ScriptInterpreter/Python/./ScriptInterpreterPythonTests/PythonDataObjectsTest.TestGlobalNameResolutionWithDot (1118 of 2119)
PASS: lldb-unit :: Process/gdb-remote/./ProcessGdbRemoteTests/GDBRemoteCommunicationClientTest.WriteRegisterNoSuffix (1119 of 2119)
PASS: lldb-api :: macosx/save_crashlog/TestSaveCrashlog.py (1120 of 2119)
PASS: lldb-unit :: Process/minidump/./LLDBMinidumpTests/MinidumpParserTest.GetMemoryRegionInfoFromMemory64List (1121 of 2119)
PASS: lldb-api :: commands/watchpoints/watchpoint_size/TestWatchpointSizes.py (1122 of 2119)
PASS: lldb-unit :: Utility/./UtilityTests/StringListTest.ForRangeEmpty (1123 of 2119)
PASS: lldb-unit :: Process/minidump/./LLDBMinidumpTests/MinidumpParserTest.GetPidWindows (1124 of 2119)
PASS: lldb-shell :: Quit/TestQuitExitCode-30.test (1125 of 2119)
UNSUPPORTED: lldb-shell :: Unwind/eh-frame-augment-noop.test (1126 of 2119)
PASS: lldb-unit :: Interpreter/./InterpreterTests/OptionValueFileColonLine.setFromString (1127 of 2119)
PASS: lldb-unit :: Host/./HostTests/MainLoopTest.DetectsEOF (1128 of 2119)
PASS: lldb-unit :: ScriptInterpreter/Python/./ScriptInterpreterPythonTests/PythonDataObjectsTest.TestPythonDictionaryValueEquality (1129 of 2119)
PASS: lldb-unit :: Utility/./UtilityTests/ScalarTest.Promotion (1130 of 2119)
PASS: lldb-unit :: Utility/./UtilityTests/StringLexerTest.AdvanceIf (1131 of 2119)
PASS: lldb-unit :: Host/./HostTests/FileSystemTest.Resolve (1132 of 2119)
PASS: lldb-unit :: ScriptInterpreter/Python/./ScriptInterpreterPythonTests/PythonDataObjectsTest.TestPythonListToStructuredList (1133 of 2119)
PASS: lldb-unit :: ScriptInterpreter/Python/./ScriptInterpreterPythonTests/PythonDataObjectsTest.TestPythonDictionaryToStructuredDictionary (1134 of 2119)
UNSUPPORTED: lldb-api :: lang/cpp/static_members/TestCPPStaticMembers.py (1135 of 2119)
PASS: lldb-api :: functionalities/breakpoint/cpp/TestCPPBreakpointLocations.py (1136 of 2119)
PASS: lldb-api :: functionalities/unwind/noreturn/TestNoreturnUnwind.py (1137 of 2119)
UNSUPPORTED: lldb-shell :: SymbolFile/PDB/variables-locations.test (1138 of 2119)
PASS: lldb-api :: commands/command/invalid-args/TestInvalidArgsCommand.py (1139 of 2119)
PASS: lldb-api :: python_api/sbdata/TestSBData.py (1140 of 2119)
UNSUPPORTED: lldb-api :: lang/cpp/function-template-parameter-pack/TestFunctionTemplateParameterPack.py (1141 of 2119)
PASS: lldb-api :: functionalities/recursion/TestValueObjectRecursion.py (1142 of 2119)
PASS: lldb-shell :: SymbolFile/Breakpad/symtab.test (1143 of 2119)
PASS: lldb-api :: commands/expression/persistent_ptr_update/TestPersistentPtrUpdate.py (1144 of 2119)
PASS: lldb-api :: commands/expression/anonymous-struct/TestCallUserAnonTypedef.py (1145 of 2119)
PASS: lldb-api :: commands/command/script/import/rdar-12586188/TestRdar12586188.py (1146 of 2119)
PASS: lldb-unit :: UnwindAssembly/x86/./UnwindAssemblyx86Tests/Testx86AssemblyInspectionEngine.TestLEAVE (1147 of 2119)
PASS: lldb-api :: lang/c/strings/TestCStrings.py (1148 of 2119)
PASS: lldb-unit :: Utility/./UtilityTests/StringListTest.InsertStringAtIndexOutOfBounds (1149 of 2119)
PASS: lldb-unit :: ObjectFile/Breakpad/./ObjectFileBreakpadTests/PublicRecord.parse (1150 of 2119)
UNSUPPORTED: lldb-shell :: SymbolFile/DWARF/split-dwarf-expression-eval-bug.cpp (1151 of 2119)
PASS: lldb-api :: lang/cpp/template/TestTemplateArgs.py (1152 of 2119)
PASS: lldb-api :: tools/lldb-server/TestLldbGdbServer.py (1153 of 2119)
PASS: lldb-shell :: SymbolFile/DWARF/debug_line-tombstone.s (1154 of 2119)
PASS: lldb-shell :: Breakpoint/debug_rnglistx_rlex.test (1155 of 2119)
PASS: lldb-api :: lang/cpp/global_variables/TestCPPGlobalVariables.py (1156 of 2119)
PASS: lldb-api :: commands/expression/import-std-module/list/TestListFromStdModule.py (1157 of 2119)
PASS: lldb-api :: lang/objc/rdar-11355592/TestRdar11355592.py (1158 of 2119)
PASS: lldb-shell :: SymbolFile/DWARF/clang-ast-from-dwarf-unamed-and-anon-structs.cpp (1159 of 2119)
PASS: lldb-unit :: Process/gdb-remote/./ProcessGdbRemoteTests/GDBRemoteCommunicationClientTest.GetQOffsets (1160 of 2119)
PASS: lldb-unit :: Expression/./ExpressionTests/ClangHostTest.ComputeClangResourceDirectory (1161 of 2119)
PASS: lldb-unit :: ObjectFile/PECOFF/./ObjectFilePECOFFTests/PECallFrameInfoTest.Chained_eh (1162 of 2119)
PASS: lldb-api :: commands/watchpoints/watchpoint_commands/command/TestWatchpointCommandPython.py (1163 of 2119)
PASS: lldb-shell :: Commands/command-target-modules-dump-sections.yaml (1164 of 2119)
PASS: lldb-api :: tools/lldb-server/inferior-crash/TestGdbRemoteAbort.py (1165 of 2119)
PASS: lldb-unit :: Utility/./UtilityTests/StringListTest.Join (1166 of 2119)
PASS: lldb-unit :: Utility/./UtilityTests/AnsiTerminal.AtEnd (1167 of 2119)
PASS: lldb-api :: functionalities/data-formatter/data-formatter-stl/libcxx/atomic/TestLibCxxAtomic.py (1168 of 2119)
PASS: lldb-unit :: Utility/./UtilityTests/StreamTeeTest.DefaultConstructor (1169 of 2119)
PASS: lldb-api :: commands/gui/viewlarge/TestGuiViewLarge.py (1170 of 2119)
PASS: lldb-shell :: ExecControl/StopHook/stop-hook.test (1171 of 2119)
PASS: lldb-api :: commands/expression/rdar44436068/Test128BitsInteger.py (1172 of 2119)
PASS: lldb-unit :: ObjectFile/Breakpad/./ObjectFileBreakpadTests/ModuleRecord.parse (1173 of 2119)
XFAIL: lldb-shell :: Register/x86-mm-xmm-write.test (1174 of 2119)
PASS: lldb-api :: functionalities/tail_call_frames/disambiguate_tail_call_seq/TestDisambiguateTailCallSeq.py (1175 of 2119)
PASS: lldb-api :: commands/expression/persistent_variables/TestPersistentVariables.py (1176 of 2119)
PASS: lldb-api :: commands/frame/var-scope/TestFrameVariableScope.py (1177 of 2119)
PASS: lldb-api :: commands/watchpoints/watchpoint_set_command/TestWatchLocationWithWatchSet.py (1178 of 2119)
PASS: lldb-unit :: Utility/./UtilityTests/ScalarTest.SetValueFromCString (1179 of 2119)
PASS: lldb-api :: functionalities/thread/concurrent_events/TestConcurrentTwoWatchpointThreads.py (1180 of 2119)
PASS: lldb-unit :: Process/gdb-remote/./ProcessGdbRemoteTests/GDBRemoteClientBaseTest.InterruptNoResponse (1181 of 2119)
PASS: lldb-unit :: Symbol/./SymbolTests/TestClangASTImporter.MetadataPropagationAfterCopying (1182 of 2119)
PASS: lldb-api :: lang/objc/objc-ivar-protocols/TestIvarProtocols.py (1183 of 2119)
PASS: lldb-unit :: Symbol/./SymbolTests/TestTypeSystemClang.TestGetTypeClassTypeOfExpr (1184 of 2119)
PASS: lldb-unit :: Symbol/./SymbolTests/TestTypeSystemClang.TestGetEnumIntegerTypeInvalid (1185 of 2119)
PASS: lldb-unit :: Host/./HostTests/SocketTest.TCPGetConnectURI (1186 of 2119)
PASS: lldb-api :: functionalities/gdb_remote_client/TestThreadSelectionBug.py (1187 of 2119)
PASS: lldb-unit :: Utility/./UtilityTests/Flags.AllSet (1188 of 2119)
PASS: lldb-api :: commands/expression/radar_8638051/Test8638051.py (1189 of 2119)
PASS: lldb-shell :: SymbolFile/dissassemble-entry-point.s (1190 of 2119)
PASS: lldb-unit :: ScriptInterpreter/Python/./ScriptInterpreterPythonTests/PythonDataObjectsTest.TestPythonTupleToStructuredList (1191 of 2119)
PASS: lldb-api :: functionalities/data-formatter/data-formatter-stl/libcxx/string/TestDataFormatterLibcxxString.py (1192 of 2119)
PASS: lldb-unit :: Utility/./UtilityTests/StringExtractorTest.GetNameColonValueNoColon (1193 of 2119)
PASS: lldb-api :: functionalities/thread/concurrent_events/TestConcurrentTwoBreakpointsOneSignal.py (1194 of 2119)
PASS: lldb-api :: functionalities/data-formatter/data-formatter-stl/libcxx/vbool/TestDataFormatterLibcxxVBool.py (1195 of 2119)
PASS: lldb-unit :: Process/minidump/./LLDBMinidumpTests/MinidumpParserTest.GetThreadContext_x86_32_wow64 (1196 of 2119)
PASS: lldb-api :: lang/objc/modules-auto-import/TestModulesAutoImport.py (1197 of 2119)
PASS: lldb-unit :: Process/gdb-remote/./ProcessGdbRemoteTests/GDBRemoteClientBaseTest.SendContinueAndAsyncPacket (1198 of 2119)
UNSUPPORTED: lldb-api :: functionalities/darwin_log/filter/exact_match/message/TestDarwinLogFilterMatchMessage.py (1199 of 2119)
PASS: lldb-api :: macosx/thread_suspend/TestInternalThreadSuspension.py (1200 of 2119)
PASS: lldb-unit :: Utility/./UtilityTests/StringExtractorTest.InitMisc (1201 of 2119)
UNSUPPORTED: lldb-api :: linux/thread/create_during_instruction_step/TestCreateDuringInstructionStep.py (1202 of 2119)
PASS: lldb-shell :: Settings/TestSettingsSet.test (1203 of 2119)
PASS: lldb-api :: commands/expression/namespace_local_var_same_name_cpp_and_c/TestNamespaceLocalVarSameNameCppAndC.py (1204 of 2119)
PASS: lldb-api :: lang/objc/modules-hash-mismatch/TestClangModulesHashMismatch.py (1205 of 2119)
PASS: lldb-unit :: Utility/./UtilityTests/DataExtractorTest.GetCStrUnterminated (1206 of 2119)
PASS: lldb-unit :: SymbolFile/DWARF/./SymbolFileDWARFTests/SymbolFileDWARFTests.TestAbbrevNullAttrValidForm (1207 of 2119)
PASS: lldb-unit :: Utility/./UtilityTests/BinaryStreamTest.PutSLEB128SevenBytes (1208 of 2119)
PASS: lldb-api :: functionalities/thread/concurrent_events/TestConcurrentWatchBreak.py (1209 of 2119)
PASS: lldb-api :: functionalities/data-formatter/poarray/TestPrintObjectArray.py (1210 of 2119)
PASS: lldb-unit :: Symbol/./SymbolTests/LineEntryTest.GetSameLineContiguousAddressRangeOneInline (1211 of 2119)
PASS: lldb-api :: functionalities/target_var/TestTargetVar.py (1212 of 2119)
PASS: lldb-shell :: Minidump/no-process-id.yaml (1213 of 2119)
PASS: lldb-unit :: Utility/./UtilityTests/FileSpecTest.EqualSeparator (1214 of 2119)
UNSUPPORTED: lldb-api :: tools/lldb-server/registers-target-xml-reading/TestGdbRemoteTargetXmlPacket.py (1215 of 2119)
PASS: lldb-unit :: UnwindAssembly/x86/./UnwindAssemblyx86Tests/Testx86AssemblyInspectionEngine.Test32bitFramelessSmallStackFrame (1216 of 2119)
PASS: lldb-unit :: Utility/./UtilityTests/RegularExpression.Valid (1217 of 2119)
PASS: lldb-unit :: Utility/./UtilityTests/RecordReplayTest.InstrumentedFooSameThis (1218 of 2119)
PASS: lldb-api :: lang/objc/conflicting-definition/TestConflictingDefinition.py (1219 of 2119)
PASS: lldb-unit :: Symbol/./SymbolTests/TestTypeSystemClang.TemplateArguments (1220 of 2119)
PASS: lldb-api :: commands/frame/language/TestGuessLanguage.py (1221 of 2119)
PASS: lldb-api :: functionalities/breakpoint/hardware_breakpoints/require_hw_breakpoints/TestRequireHWBreakpoints.py (1222 of 2119)
PASS: lldb-api :: functionalities/tail_call_frames/inlining_and_tail_calls/TestInliningAndTailCalls.py (1223 of 2119)
PASS: lldb-unit :: Process/minidump/./LLDBMinidumpTests/MinidumpParserTest.GetThreadContext_x86_64 (1224 of 2119)
PASS: lldb-unit :: UnwindAssembly/x86/./UnwindAssemblyx86Tests/Testx86AssemblyInspectionEngine.TestPopEBX (1225 of 2119)
PASS: lldb-unit :: SymbolFile/NativePDB/./SymbolFileNativePDBTests/PDBFPOProgramToDWARFExpressionTests.InvalidOpBinary (1226 of 2119)
PASS: lldb-unit :: SymbolFile/DWARF/./SymbolFileDWARFTests/XcodeSDKModuleTests.TestModuleGetXcodeSDK (1227 of 2119)
PASS: lldb-unit :: Process/gdb-remote/./ProcessGdbRemoteTests/GDBRemoteClientBaseTest.SendContinueAndInterrupt2PacketBug (1228 of 2119)
PASS: lldb-api :: commands/target/basic/TestTargetCommand.py (1229 of 2119)
PASS: lldb-unit :: UnwindAssembly/x86/./UnwindAssemblyx86Tests/Testx86AssemblyInspectionEngine.TestDisassemblyMidFunctionEpilogues (1230 of 2119)
PASS: lldb-api :: commands/expression/diagnostics/TestExprDiagnostics.py (1231 of 2119)
PASS: lldb-unit :: Utility/./UtilityTests/SerializationRountripTest.SerializeDeserializeCStringNull (1232 of 2119)
PASS: lldb-api :: lang/objc/objc_direct-methods/TestObjCDirectMethods.py (1233 of 2119)
PASS: lldb-unit :: UnwindAssembly/ARM64/./Arm64InstEmulationTests/TestArm64InstEmulation.TestSimpleDarwinFunction (1234 of 2119)
PASS: lldb-unit :: Process/minidump/./LLDBMinidumpTests/MinidumpParserTest.InvalidMinidump (1235 of 2119)
PASS: lldb-unit :: ObjectFile/Breakpad/./ObjectFileBreakpadTests/FileRecord.parse (1236 of 2119)
PASS: lldb-unit :: Symbol/./SymbolTests/TestTypeSystemClang.TestDeletingImplicitCopyCstrDueToMoveCStr (1237 of 2119)
PASS: lldb-shell :: SymbolFile/DWARF/split-dwarf-multiple-cu.ll (1238 of 2119)
PASS: lldb-unit :: Utility/./UtilityTests/StringListTest.SplitIntoLinesSingleTrailingCR (1239 of 2119)
PASS: lldb-api :: lang/cpp/char8_t/TestCxxChar8_t.py (1240 of 2119)
PASS: lldb-shell :: Driver/TestPositionalArgs.test (1241 of 2119)
PASS: lldb-unit :: Utility/./UtilityTests/ArgsTest.ReplaceArgumentAtIndexShort (1242 of 2119)
PASS: lldb-api :: lang/c/blocks/TestBlocks.py (1243 of 2119)
PASS: lldb-unit :: Utility/./UtilityTests/StringExtractorTest.GetHexBytesAvail_Partial (1244 of 2119)
UNSUPPORTED: lldb-shell :: SymbolFile/NativePDB/local-variables.cpp (1245 of 2119)
UNSUPPORTED: lldb-api :: commands/watchpoints/hello_watchlocation/TestWatchLocation.py (1246 of 2119)
PASS: lldb-shell :: SymbolFile/DWARF/dir-separator-no-comp-dir.s (1247 of 2119)
PASS: lldb-shell :: SymbolFile/DWARF/debug_ranges-missing-section.s (1248 of 2119)
PASS: lldb-api :: lang/cpp/typedef/TestCppTypedef.py (1249 of 2119)
PASS: lldb-api :: tools/lldb-vscode/step/TestVSCode_step.py (1250 of 2119)
PASS: lldb-api :: commands/expression/inline-namespace/TestInlineNamespace.py (1251 of 2119)
PASS: lldb-unit :: Utility/./UtilityTests/StreamTest.PutMaxHex64ByteOrderLittle (1252 of 2119)
PASS: lldb-unit :: Utility/./UtilityTests/BinaryStreamTest.PutULEB128SixBytes (1253 of 2119)
UNSUPPORTED: lldb-api :: api/multiple-debuggers/TestMultipleDebuggers.py (1254 of 2119)
PASS: lldb-unit :: SymbolFile/DWARF/./SymbolFileDWARFTests/SymbolFileDWARFTests.TestAbilitiesForDWARF (1255 of 2119)
PASS: lldb-shell :: SymbolFile/DWARF/debug_loclists-dwo.s (1256 of 2119)
PASS: lldb-shell :: Breakpoint/ppc64-localentry.test (1257 of 2119)
PASS: lldb-api :: commands/expression/completion/TestExprCompletion.py (1258 of 2119)
PASS: lldb-unit :: UnwindAssembly/x86/./UnwindAssemblyx86Tests/Testx86AssemblyInspectionEngine.TestSimplei386ugmented (1259 of 2119)
PASS: lldb-unit :: Utility/./UtilityTests/BinaryStreamTest.PutSLEB128TwoBytes (1260 of 2119)
PASS: lldb-unit :: Symbol/./SymbolTests/TestTypeSystemClang.TestDisplayNameEmpty (1261 of 2119)
PASS: lldb-api :: functionalities/tail_call_frames/disambiguate_call_site/TestDisambiguateCallSite.py (1262 of 2119)
PASS: lldb-unit :: UnwindAssembly/x86/./UnwindAssemblyx86Tests/Testx86AssemblyInspectionEngine.TestStackRealign32BitDisp_x86_64 (1263 of 2119)
PASS: lldb-api :: commands/watchpoints/watchpoint_commands/TestWatchpointCommands.py (1264 of 2119)
PASS: lldb-unit :: UnwindAssembly/x86/./UnwindAssemblyx86Tests/Testx86AssemblyInspectionEngine.TestSubESP (1265 of 2119)
PASS: lldb-unit :: Utility/./UtilityTests/StreamTest.ShiftOperatorChars (1266 of 2119)
PASS: lldb-shell :: ObjectFile/PECOFF/dep-modules.yaml (1267 of 2119)
PASS: lldb-unit :: Utility/./UtilityTests/ConstStringTest.MangledCounterpart (1268 of 2119)
PASS: lldb-api :: functionalities/data-formatter/data-formatter-stl/libcxx/initializerlist/TestInitializerList.py (1269 of 2119)
PASS: lldb-unit :: Utility/./UtilityTests/FileSpecTest.IsRelative (1270 of 2119)
PASS: lldb-unit :: Utility/./UtilityTests/StreamTest.PutHex16ByteOrderLittle (1271 of 2119)
UNSUPPORTED: lldb-api :: functionalities/unwind/ehframe/TestEhFrameUnwind.py (1272 of 2119)
PASS: lldb-api :: functionalities/step_scripted/TestStepScripted.py (1273 of 2119)
PASS: lldb-shell :: SymbolFile/Breakpad/stack-cfi-parsing.test (1274 of 2119)
PASS: lldb-api :: lang/cpp/auto/TestCPPAuto.py (1275 of 2119)
PASS: lldb-api :: commands/expression/import-std-module/forward_list-dbg-info-content/TestDbgInfoContentForwardListFromStdModule.py (1276 of 2119)
PASS: lldb-api :: functionalities/thread/concurrent_events/TestConcurrentDelaySignalBreak.py (1277 of 2119)
PASS: lldb-api :: lang/c/array_types/TestArrayTypes.py (1278 of 2119)
PASS: lldb-api :: commands/version/TestVersion.py (1279 of 2119)
PASS: lldb-unit :: Host/./HostTests/SocketTest.DomainGetConnectURI (1280 of 2119)
PASS: lldb-unit :: SymbolFile/NativePDB/./SymbolFileNativePDBTests/PDBFPOProgramToDWARFExpressionTests.DependencyChain (1281 of 2119)
PASS: lldb-unit :: Utility/./UtilityTests/UriParserTest.SchemeHostSeparator4 (1282 of 2119)
PASS: lldb-unit :: DataFormatter/./LLDBFormatterTests/TypeMatcherTests.CreatedBySameMatchString (1283 of 2119)
PASS: lldb-unit :: Utility/./UtilityTests/PassiveReplayTest.InstrumentedBarPtr (1284 of 2119)
PASS: lldb-api :: lang/objc/modules-non-objc-target/TestObjCModulesNonObjCTarget.py (1285 of 2119)
PASS: lldb-unit :: Utility/./UtilityTests/CompletionRequest.TestCompletionOwnership (1286 of 2119)
UNSUPPORTED: lldb-api :: commands/register/register/intel_xtended_registers/TestMPXRegisters.py (1287 of 2119)
PASS: lldb-unit :: Utility/./UtilityTests/StreamTest.PutHex64ByteOrderBig (1288 of 2119)
PASS: lldb-unit :: Utility/./UtilityTests/UriParserTest.Empty (1289 of 2119)
UNSUPPORTED: lldb-api :: commands/register/register/intel_xtended_registers/mpx_bound_violation/TestBoundViolation.py (1290 of 2119)
PASS: lldb-api :: lang/c/const_variables/TestConstVariables.py (1291 of 2119)
PASS: lldb-unit :: SymbolFile/DWARF/./SymbolFileDWARFTests/DWARFASTParserClangTests.EnsureAllDIEsInDeclContextHaveBeenParsedParsesOnlyMatchingEntries (1292 of 2119)
UNSUPPORTED: lldb-api :: benchmarks/turnaround/TestCompileRunToBreakpointTurnaround.py (1293 of 2119)
PASS: lldb-shell :: ObjectFile/ELF/many-sections.s (1294 of 2119)
PASS: lldb-api :: functionalities/value_md5_crash/TestValueMD5Crash.py (1295 of 2119)
PASS: lldb-shell :: SymbolFile/NativePDB/ast-functions.cpp (1296 of 2119)
PASS: lldb-unit :: UnwindAssembly/x86/./UnwindAssemblyx86Tests/Testx86AssemblyInspectionEngine.Test64bitFramelessBigStackFrame (1297 of 2119)
PASS: lldb-unit :: DataFormatter/./LLDBFormatterTests/TypeMatcherTests.RegexMatchPart (1298 of 2119)
PASS: lldb-api :: functionalities/data-formatter/data-formatter-synth/TestDataFormatterSynth.py (1299 of 2119)
UNSUPPORTED: lldb-api :: functionalities/data-formatter/data-formatter-stl/libstdcpp/vbool/TestDataFormatterStdVBool.py (1300 of 2119)
PASS: lldb-unit :: Utility/./UtilityTests/StringLexerTest.HasAtLeast (1301 of 2119)
PASS: lldb-unit :: Utility/./UtilityTests/FileSpecTest.GuessPathStyle (1302 of 2119)
PASS: lldb-unit :: Utility/./UtilityTests/AnsiTerminal.WhiteSpace (1303 of 2119)
PASS: lldb-unit :: Host/./HostTests/FileSystemTest.OpenErrno (1304 of 2119)
PASS: lldb-unit :: Utility/./UtilityTests/StringExtractorTest.GetNameColonValueContainsColon (1305 of 2119)
PASS: lldb-unit :: Utility/./UtilityTests/PassiveReplayTest.InstrumentedBar (1306 of 2119)
PASS: lldb-api :: commands/watchpoints/watchpoint_events/TestWatchpointEvents.py (1307 of 2119)
PASS: lldb-unit :: Utility/./UtilityTests/StringExtractorTest.GetHexU8_Underflow_NoEof (1308 of 2119)
PASS: lldb-api :: functionalities/data-formatter/parray/TestPrintArray.py (1309 of 2119)
PASS: lldb-unit :: Symbol/./SymbolTests/TestClangASTImporter.DeportTypeTagDecl (1310 of 2119)
PASS: lldb-unit :: Host/./HostTests/Host.WaitStatusFormat (1311 of 2119)
PASS: lldb-unit :: Target/./TargetTests/PathMappingListTest.RemapRoot (1312 of 2119)
PASS: lldb-unit :: Utility/./UtilityTests/PassiveReplayTest.InstrumentedBarRef (1313 of 2119)
PASS: lldb-unit :: Language/Highlighting/./HighlighterTests/HighlighterTest.ClangTrailingBackslashWithWhitespace (1314 of 2119)
PASS: lldb-unit :: Utility/./UtilityTests/StreamTest.QuotedCString (1315 of 2119)
UNSUPPORTED: lldb-shell :: Register/x86-64-zmm-read.test (1316 of 2119)
PASS: lldb-unit :: Utility/./UtilityTests/StreamTest.AddressPrefixAndSuffix (1317 of 2119)
PASS: lldb-api :: functionalities/stats_api/TestStatisticsAPI.py (1318 of 2119)
PASS: lldb-api :: types/TestCharType.py (1319 of 2119)
PASS: lldb-api :: functionalities/breakpoint/breakpoint_set_restart/TestBreakpointSetRestart.py (1320 of 2119)
PASS: lldb-api :: functionalities/breakpoint/source_regexp/TestSourceRegexBreakpoints.py (1321 of 2119)
PASS: lldb-unit :: Utility/./UtilityTests/RangeTest.Slide (1322 of 2119)
PASS: lldb-api :: commands/platform/process/list/TestProcessList.py (1323 of 2119)
PASS: lldb-shell :: SymbolFile/NativePDB/function-types-classes.cpp (1324 of 2119)
PASS: lldb-api :: tools/lldb-server/TestGdbRemoteAttach.py (1325 of 2119)
PASS: lldb-api :: functionalities/data-formatter/varscript_formatting/TestDataFormatterVarScriptFormatting.py (1326 of 2119)
PASS: lldb-api :: macosx/nslog/TestDarwinNSLogOutput.py (1327 of 2119)
PASS: lldb-unit :: Utility/./UtilityTests/EnvironmentTest.EnvpConstruction (1328 of 2119)
PASS: lldb-api :: functionalities/data-formatter/frameformat_smallstruct/TestFrameFormatSmallStruct.py (1329 of 2119)
PASS: lldb-unit :: Utility/./UtilityTests/VMRange.Reset (1330 of 2119)
UNSUPPORTED: lldb-shell :: Register/x86-ymm-write.test (1331 of 2119)
PASS: lldb-unit :: Utility/./UtilityTests/StreamTest.Indent (1332 of 2119)
PASS: lldb-shell :: ObjectFile/ELF/aarch64-relocations.yaml (1333 of 2119)
PASS: lldb-unit :: Utility/./UtilityTests/StreamTeeTest.AppendStream (1334 of 2119)
UNSUPPORTED: lldb-api :: functionalities/thread/break_after_join/TestBreakAfterJoin.py (1335 of 2119)
PASS: lldb-unit :: Symbol/./SymbolTests/DWARFCallFrameInfoTest.Basic_eh (1336 of 2119)
PASS: lldb-unit :: SymbolFile/NativePDB/./SymbolFileNativePDBTests/PDBFPOProgramToDWARFExpressionTests.UnresolvedDependentCyclicRegisterAssignmentReference (1337 of 2119)
PASS: lldb-api :: functionalities/data-formatter/data-formatter-synthval/TestDataFormatterSynthVal.py (1338 of 2119)
PASS: lldb-unit :: Utility/./UtilityTests/StringListTest.SplitIntoLines (1339 of 2119)
PASS: lldb-api :: lang/cpp/function-qualifiers/TestCppFunctionQualifiers.py (1340 of 2119)
PASS: lldb-unit :: Utility/./UtilityTests/StreamTest.PutRawBytesToLittleEndian (1341 of 2119)
PASS: lldb-api :: tools/lldb-server/register-reading/TestGdbRemoteGPacket.py (1342 of 2119)
PASS: lldb-api :: python_api/sbplatform/TestSBPlatform.py (1343 of 2119)
PASS: lldb-unit :: Utility/./UtilityTests/StringLexerTest.NextIfList (1344 of 2119)
PASS: lldb-unit :: Utility/./UtilityTests/IndexToObjectTest.ObjectForIndex (1345 of 2119)
PASS: lldb-api :: functionalities/data-formatter/array_typedef/TestArrayTypedef.py (1346 of 2119)
PASS: lldb-api :: commands/target/modules/search-paths/insert/TestTargetModulesSearchpathsInsert.py (1347 of 2119)
PASS: lldb-unit :: Interpreter/./InterpreterTests/OptionArgParserTest.toBoolean (1348 of 2119)
PASS: lldb-unit :: Utility/./UtilityTests/RangeTest.SizeTypes (1349 of 2119)
PASS: lldb-unit :: Process/minidump/./LLDBMinidumpTests/MinidumpParserTest.GetExceptionStream (1350 of 2119)
PASS: lldb-shell :: Breakpoint/single-file-split-dwarf.test (1351 of 2119)
PASS: lldb-unit :: UnwindAssembly/x86/./UnwindAssemblyx86Tests/Testx86AssemblyInspectionEngine.TestPopRBPWithREX (1352 of 2119)
PASS: lldb-unit :: Expression/./ExpressionTests/CppModuleConfigurationTest.IgnoreLibStdCpp (1353 of 2119)
FAIL: lldb-shell :: SymbolFile/DWARF/debug-line-basic.s (1354 of 2119)
******************** TEST 'lldb-shell :: SymbolFile/DWARF/debug-line-basic.s' FAILED ********************
Script:
--
: 'RUN: at line 8';   /Users/buildslave/jenkins/workspace/lldb-cmake/lldb-build/bin/llvm-mc -triple x86_64-pc-linux /Users/buildslave/jenkins/workspace/lldb-cmake/llvm-project/lldb/test/Shell/SymbolFile/DWARF/debug-line-basic.s -filetype=obj > /Users/buildslave/jenkins/workspace/lldb-cmake/lldb-build/tools/lldb/test/SymbolFile/DWARF/Output/debug-line-basic.s.tmp.o
: 'RUN: at line 9';   /Users/buildslave/jenkins/workspace/lldb-cmake/lldb-build/bin/ld.lld --script=/Users/buildslave/jenkins/workspace/lldb-cmake/llvm-project/lldb/test/Shell/SymbolFile/DWARF/Inputs/debug-line-basic.script /Users/buildslave/jenkins/workspace/lldb-cmake/lldb-build/tools/lldb/test/SymbolFile/DWARF/Output/debug-line-basic.s.tmp.o -o /Users/buildslave/jenkins/workspace/lldb-cmake/lldb-build/tools/lldb/test/SymbolFile/DWARF/Output/debug-line-basic.s.tmp
: 'RUN: at line 10';   /Users/buildslave/jenkins/workspace/lldb-cmake/lldb-build/bin/lldb --no-lldbinit -S /Users/buildslave/jenkins/workspace/lldb-cmake/lldb-build/tools/lldb/test/Shell/lit-lldb-init /Users/buildslave/jenkins/workspace/lldb-cmake/lldb-build/tools/lldb/test/SymbolFile/DWARF/Output/debug-line-basic.s.tmp -o "image dump line-table -v a.c" -o exit | /Users/buildslave/jenkins/workspace/lldb-cmake/lldb-build/bin/FileCheck /Users/buildslave/jenkins/workspace/lldb-cmake/llvm-project/lldb/test/Shell/SymbolFile/DWARF/debug-line-basic.s
--
Exit Code: 1

Hide Details

Command Output (stderr): -- warning: No source filenames matched 'a.c'. error: no source filenames matched any command arguments /Users/buildslave/jenkins/workspace/lldb-cmake/llvm-project/lldb/test/Shell/SymbolFile/DWARF/debug-line-basic.s:15:10: error: CHECK: expected string not found in input # CHECK: Line table for /tmp/a.c ^ <stdin>:1:1: note: scanning from here (lldb) command source -s 0 '/Users/buildslave/jenkins/workspace/lldb-cmake/lldb-build/tools/lldb/test/Shell/lit-lldb-init' ^ <stdin>:12:19: note: possible intended match here (lldb) image dump line-table -v a.c ^

Hide Details

Input file: <stdin> Check file: /Users/buildslave/jenkins/workspace/lldb-cmake/llvm-project/lldb/test/Shell/SymbolFile/DWARF/debug-line-basic.s

Hide Details

-dump-input=help explains the following input dump.

Hide Details

Input was: <<<<<< 1: (lldb) command source -s 0 '/Users/buildslave/jenkins/workspace/lldb-cmake/lldb-build/tools/lldb/test/Shell/lit-lldb-init' check:15'0 X~~~~~~~~~~~~~~~~~~~~~~~~~~~~~~~~~~~~~~~~~~~~~~~~~~~~~~~~~~~~~~~~~~~~~~~~~~~~~~~~~~~~~~~~~~~~~~~~~~~~~~~~~~~~~~~~~~~~~~~~~ error: no match found 2: Executing commands in '/Users/buildslave/jenkins/workspace/lldb-cmake/lldb-build/tools/lldb/test/Shell/lit-lldb-init'. check:15'0 ~~~~~~~~~~~~~~~~~~~~~~~~~~~~~~~~~~~~~~~~~~~~~~~~~~~~~~~~~~~~~~~~~~~~~~~~~~~~~~~~~~~~~~~~~~~~~~~~~~~~~~~~~~~~~~~~~~~~~~ 3: (lldb) # LLDB init file for the LIT tests. check:15'0 ~~~~~~~~~~~~~~~~~~~~~~~~~~~~~~~~~~~~~~~~~~ 4: (lldb) settings set symbols.enable-external-lookup false check:15'0 ~~~~~~~~~~~~~~~~~~~~~~~~~~~~~~~~~~~~~~~~~~~~~~~~~~~~~~~~ 5: (lldb) settings set plugin.process.gdb-remote.packet-timeout 60 check:15'0 ~~~~~~~~~~~~~~~~~~~~~~~~~~~~~~~~~~~~~~~~~~~~~~~~~~~~~~~~~~~~~~~ 6: (lldb) settings set interpreter.echo-comment-commands false check:15'0 ~~~~~~~~~~~~~~~~~~~~~~~~~~~~~~~~~~~~~~~~~~~~~~~~~~~~~~~~~~~ 7: (lldb) settings set symbols.clang-modules-cache-path "/Users/buildslave/jenkins/workspace/lldb-cmake/lldb-build/lldb-test-build.noindex/module-cache-lldb" check:15'0 ~~~~~~~~~~~~~~~~~~~~~~~~~~~~~~~~~~~~~~~~~~~~~~~~~~~~~~~~~~~~~~~~~~~~~~~~~~~~~~~~~~~~~~~~~~~~~~~~~~~~~~~~~~~~~~~~~~~~~~~~~~~~~~~~~~~~~~~~~~~~~~~~~~~~~~~~~~ 8: (lldb) settings set target.auto-apply-fixits false check:15'0 ~~~~~~~~~~~~~~~~~~~~~~~~~~~~~~~~~~~~~~~~~~~~~~~~~~ 9: (lldb) settings set target.inherit-tcc true check:15'0 ~~~~~~~~~~~~~~~~~~~~~~~~~~~~~~~~~~~~~~~~~~~ 10: (lldb) target create "/Users/buildslave/jenkins/workspace/lldb-cmake/lldb-build/tools/lldb/test/SymbolFile/DWARF/Output/debug-line-basic.s.tmp" check:15'0 ~~~~~~~~~~~~~~~~~~~~~~~~~~~~~~~~~~~~~~~~~~~~~~~~~~~~~~~~~~~~~~~~~~~~~~~~~~~~~~~~~~~~~~~~~~~~~~~~~~~~~~~~~~~~~~~~~~~~~~~~~~~~~~~~~~~~~~~~~~~~~~~ 11: Current executable set to '/Users/buildslave/jenkins/workspace/lldb-cmake/lldb-build/tools/lldb/test/SymbolFile/DWARF/Output/debug-line-basic.s.tmp' (x86_64). check:15'0 ~~~~~~~~~~~~~~~~~~~~~~~~~~~~~~~~~~~~~~~~~~~~~~~~~~~~~~~~~~~~~~~~~~~~~~~~~~~~~~~~~~~~~~~~~~~~~~~~~~~~~~~~~~~~~~~~~~~~~~~~~~~~~~~~~~~~~~~~~~~~~~~~~~~~~~~~~~~~~~ 12: (lldb) image dump line-table -v a.c check:15'0 ~~~~~~~~~~~~~~~~~~~~~~~~~~~~~~~~~~~ check:15'1 ? possible intended match >>>>>>

Hide Details

--

Hide Details

******************** PASS: lldb-api :: python_api/symbol-context/TestSymbolContext.py (1355 of 2119) PASS: lldb-unit :: Utility/./UtilityTests/StringListTest.RemoveBlankLines (1356 of 2119) PASS: lldb-api :: python_api/findvalue_duplist/TestSBFrameFindValue.py (1357 of 2119) UNSUPPORTED: lldb-shell :: SymbolFile/PDB/pointers.test (1358 of 2119) PASS: lldb-unit :: Utility/./UtilityTests/OptionsWithRawTest.EmptyInput (1359 of 2119) PASS: lldb-unit :: Host/./HostTests/NativeProcessProtocolTest.SetBreakpointFailRead (1360 of 2119) UNSUPPORTED: lldb-api :: functionalities/darwin_log/format/TestDarwinLogMessageFormat.py (1361 of 2119) PASS: lldb-unit :: Utility/./UtilityTests/UUIDTest.Validity (1362 of 2119) PASS: lldb-shell :: ObjectFile/PECOFF/disassemble-thumb.yaml (1363 of 2119) PASS: lldb-api :: lang/objc/print-obj/TestPrintObj.py (1364 of 2119) PASS: lldb-unit :: ScriptInterpreter/Python/./ScriptInterpreterPythonTests/PythonDataObjectsTest.TestObjectAttributes (1365 of 2119) PASS: lldb-unit :: Expression/./ExpressionTests/DWARFExpression.DW_OP_stack_value (1366 of 2119) PASS: lldb-unit :: Utility/./UtilityTests/StreamTest.PutCharNull (1367 of 2119) PASS: lldb-shell :: SymbolFile/NativePDB/ast-types.cpp (1368 of 2119) PASS: lldb-api :: functionalities/thread/crash_during_step/TestCrashDuringStep.py (1369 of 2119) PASS: lldb-unit :: Process/gdb-remote/./ProcessGdbRemoteTests/GDBRemoteClientBaseTest.SendContinueAndInterrupt (1370 of 2119) PASS: lldb-unit :: Utility/./UtilityTests/ConstStringTest.YAML (1371 of 2119) PASS: lldb-shell :: Reproducer/TestDump.test (1372 of 2119) PASS: lldb-api :: commands/expression/unicode-in-variable/TestUnicodeInVariable.py (1373 of 2119) PASS: lldb-api :: functionalities/breakpoint/auto_continue/TestBreakpointAutoContinue.py (1374 of 2119) PASS: lldb-unit :: Language/Highlighting/./HighlighterTests/HighlighterTest.ClangTrailingBackslashBeforeNewline (1375 of 2119) PASS: lldb-unit :: Process/gdb-remote/./ProcessGdbRemoteTests/GDBRemoteCommunicationClientTest.SendGetTraceConfigPacket (1376 of 2119) PASS: lldb-api :: functionalities/data-formatter/language_category_updates/TestDataFormatterLanguageCategoryUpdates.py (1377 of 2119) PASS: lldb-unit :: Utility/./UtilityTests/NameMatchesTest.Ignore (1378 of 2119) PASS: lldb-api :: functionalities/inferior-changed/TestInferiorChanged.py (1379 of 2119) PASS: lldb-api :: lang/cpp/class_types/TestClassTypes.py (1380 of 2119) PASS: lldb-unit :: debugserver/./debugserverTests/RNBSocket.AnyListen (1381 of 2119) UNSUPPORTED: lldb-api :: benchmarks/expression/TestExpressionCmd.py (1382 of 2119) PASS: lldb-unit :: Expression/./ExpressionTests/DiagnosticManagerTest.GetStringPreserveOrder (1383 of 2119) PASS: lldb-api :: sanity/TestModuleCacheSanity.py (1384 of 2119) PASS: lldb-api :: functionalities/limit-debug-info/TestLimitDebugInfo.py (1385 of 2119) PASS: lldb-api :: commands/gui/basicdebug/TestGuiBasicDebug.py (1386 of 2119) PASS: lldb-api :: functionalities/thread/concurrent_events/TestConcurrentCrashWithBreak.py (1387 of 2119) PASS: lldb-unit :: ScriptInterpreter/Python/./ScriptInterpreterPythonTests/PythonDataObjectsTest.TestResetting (1388 of 2119) PASS: lldb-unit :: Utility/./UtilityTests/XcodeSDKTest.FindXcodeContentsDirectoryInPath (1389 of 2119) PASS: lldb-api :: functionalities/thread/backtrace_all/TestBacktraceAll.py (1390 of 2119) PASS: lldb-unit :: Utility/./UtilityTests/DataExtractorTest.GetSLEB128_bit63 (1391 of 2119) PASS: lldb-unit :: Utility/./UtilityTests/StringExtractorTest.GetNameColonValueNoSemicolon (1392 of 2119) PASS: lldb-unit :: Symbol/./SymbolTests/DWARFCallFrameInfoTest.Basic_dwarf3 (1393 of 2119) PASS: lldb-api :: functionalities/tail_call_frames/cross_object/TestCrossObjectTailCalls.py (1394 of 2119) PASS: lldb-api :: lang/objc/objc-checker/TestObjCCheckers.py (1395 of 2119) PASS: lldb-unit :: Process/gdb-remote/./ProcessGdbRemoteTests/GDBRemoteCommunicationServerTest.SendErrorResponse_UnimplementedError (1396 of 2119) UNSUPPORTED: lldb-shell :: ScriptInterpreter/Lua/command_script_import.test (1397 of 2119) PASS: lldb-unit :: Symbol/./SymbolTests/LineEntryTest.GetSameLineContiguousAddressRangeNestedInline (1398 of 2119) PASS: lldb-shell :: Settings/TestStopCommandSourceOnError.test (1399 of 2119) PASS: lldb-unit :: Utility/./UtilityTests/BinaryStreamTest.PutSLEB128SixBytes (1400 of 2119) UNSUPPORTED: lldb-api :: functionalities/darwin_log/basic/TestDarwinLogBasic.py (1401 of 2119) UNSUPPORTED: lldb-api :: commands/watchpoints/variable_out_of_scope/TestWatchedVarHitWhenInScope.py (1402 of 2119) PASS: lldb-unit :: Utility/./UtilityTests/BinaryStreamTest.PutSLEB128Zero (1403 of 2119) PASS: lldb-unit :: Host/./HostTests/SocketTest.TCPListen0GetPort (1404 of 2119) PASS: lldb-api :: commands/breakpoint/command/list/TestBreakpointCommandList.py (1405 of 2119) PASS: lldb-unit :: Utility/./UtilityTests/RangeDataVector.FindEntryIndexesThatContain_Overlap (1406 of 2119) PASS: lldb-unit :: Utility/./UtilityTests/RangeTest.LessThan (1407 of 2119) PASS: lldb-shell :: SymbolFile/DWARF/find-inline-method.s (1408 of 2119) PASS: lldb-api :: functionalities/show_location/TestShowLocationDwarf5.py (1409 of 2119) PASS: lldb-unit :: Utility/./UtilityTests/StringListTest.ShiftCString (1410 of 2119) PASS: lldb-unit :: Symbol/./SymbolTests/TestTypeSystemClang.TestDisplayName (1411 of 2119) PASS: lldb-shell :: SymbolFile/DWARF/debug_ranges.s (1412 of 2119) PASS: lldb-unit :: Process/minidump/./LLDBMinidumpTests/MinidumpParserTest.GetMiscInfoWindows (1413 of 2119) PASS: lldb-api :: macosx/macCatalyst/TestMacCatalyst.py (1414 of 2119) PASS: lldb-unit :: Utility/./UtilityTests/StringExtractorTest.GetU32BigEndian (1415 of 2119) PASS: lldb-api :: functionalities/gdb_remote_client/TestGDBRemoteLoad.py (1416 of 2119) PASS: lldb-unit :: Utility/./UtilityTests/UUIDTest.RelationalOperators (1417 of 2119) PASS: lldb-unit :: Utility/./UtilityTests/OptionsWithRawTest.QuotedSuffix (1418 of 2119) PASS: lldb-unit :: Utility/./UtilityTests/AnsiTerminal.Empty (1419 of 2119) PASS: lldb-shell :: Settings/TestEchoCommands.test (1420 of 2119) PASS: lldb-unit :: Utility/./UtilityTests/TimerTest.CategoryTimes2 (1421 of 2119) PASS: lldb-api :: lang/c/shared_lib/TestSharedLib.py (1422 of 2119) PASS: lldb-unit :: Utility/./UtilityTests/RangeTest.NotEqual (1423 of 2119) PASS: lldb-api :: commands/expression/import-std-module/shared_ptr-dbg-info-content/TestSharedPtrDbgInfoContentFromStdModule.py (1424 of 2119) UNSUPPORTED: lldb-api :: lang/c/typedef/Testtypedef.py (1425 of 2119) PASS: lldb-unit :: Core/./LLDBCoreTests/CommunicationTest.SynchronizeWhileClosing (1426 of 2119) PASS: lldb-shell :: Commands/command-disassemble-process.yaml (1427 of 2119) PASS: lldb-api :: commands/process/launch-with-shellexpand/TestLaunchWithShellExpand.py (1428 of 2119) PASS: lldb-unit :: ObjectFile/ELF/./ObjectFileELFTests/ObjectFileELFTest.SectionsResolveConsistently (1429 of 2119) PASS: lldb-shell :: Quit/TestQuitExitCodeHexA.test (1430 of 2119) PASS: lldb-shell :: Commands/command-regex-delete.test (1431 of 2119) PASS: lldb-unit :: Host/./HostTests/FileSystemTest.EmptyTest (1432 of 2119) PASS: lldb-api :: commands/expression/unwind_expression/TestUnwindExpression.py (1433 of 2119) PASS: lldb-api :: commands/platform/basic/TestPlatformPython.py (1434 of 2119) PASS: lldb-unit :: Expression/./ExpressionTests/CppModuleConfigurationTest.Sysroot (1435 of 2119) PASS: lldb-shell :: Commands/command-backtrace.test (1436 of 2119) PASS: lldb-unit :: DataFormatter/./LLDBFormatterTests/StringPrinterTests.SwiftUTF8 (1437 of 2119) PASS: lldb-api :: functionalities/signal/handle-abrt/TestHandleAbort.py (1438 of 2119) PASS: lldb-api :: functionalities/load_unload/TestLoadUnload.py (1439 of 2119) PASS: lldb-api :: functionalities/thread/concurrent_events/TestConcurrentSignalDelayWatch.py (1440 of 2119) PASS: lldb-api :: lang/cpp/chained-calls/TestCppChainedCalls.py (1441 of 2119) PASS: lldb-api :: commands/frame/diagnose/dereference-function-return/TestDiagnoseDereferenceFunctionReturn.py (1442 of 2119) PASS: lldb-unit :: Utility/./UtilityTests/VMRange.IsValid (1443 of 2119) PASS: lldb-shell :: ObjectFile/ELF/PT_LOAD.yaml (1444 of 2119) PASS: lldb-shell :: SymbolFile/DWARF/find-variable-dwo.cpp (1445 of 2119) PASS: lldb-api :: types/TestShortType.py (1446 of 2119) PASS: lldb-unit :: Host/./HostTests/FileSystemTest.GetPermissions (1447 of 2119) PASS: lldb-unit :: Utility/./UtilityTests/StreamTeeTest.GetStreamAtIndexOutOfBounds (1448 of 2119) PASS: lldb-api :: lang/cpp/nested-class-other-compilation-unit/TestNestedClassWithParentInAnotherCU.py (1449 of 2119) PASS: lldb-api :: functionalities/data-formatter/type_summary_list_script/TestTypeSummaryListScript.py (1450 of 2119) UNSUPPORTED: lldb-api :: functionalities/thread/concurrent_events/TestConcurrentManySignals.py (1451 of 2119) UNSUPPORTED: lldb-api :: functionalities/data-formatter/data-formatter-stl/libstdcpp/string/TestDataFormatterStdString.py (1452 of 2119) PASS: lldb-shell :: BuildScript/compiler-full-path.test (1453 of 2119) PASS: lldb-unit :: Process/gdb-remote/./ProcessGdbRemoteTests/GDBRemoteCommunicationClientTest.WriteRegister (1454 of 2119) PASS: lldb-unit :: Utility/./UtilityTests/Flags.AnySet (1455 of 2119) PASS: lldb-api :: functionalities/dead-strip/TestDeadStrip.py (1456 of 2119) PASS: lldb-unit :: Utility/./UtilityTests/RecordReplayTest.InstrumentedBar (1457 of 2119) PASS: lldb-shell :: SymbolFile/DWARF/inline-function-address.ll (1458 of 2119) PASS: lldb-shell :: Reproducer/Functionalities/TestExpressionEvaluation.test (1459 of 2119) PASS: lldb-unit :: Utility/./UtilityTests/StringListTest.CopyListSingle (1460 of 2119) PASS: lldb-unit :: Utility/./UtilityTests/XcodeSDKTest.ParseTest (1461 of 2119) PASS: lldb-shell :: SymbolFile/DWARF/debug-types-line-tables.s (1462 of 2119) PASS: lldb-unit :: Utility/./UtilityTests/UriParserTest.SchemeHostSeparator2 (1463 of 2119) PASS: lldb-unit :: Utility/./UtilityTests/StringExtractorTest.GetHexU8_Extra_NoEof (1464 of 2119) PASS: lldb-unit :: debugserver/./debugserverTests/JSON.Parse (1465 of 2119) PASS: lldb-unit :: Platform/./LLDBPlatformTests/PlatformAppleSimulatorTest.TestSimHasSimEnvionament (1466 of 2119) UNSUPPORTED: lldb-api :: commands/expression/macros/TestMacros.py (1467 of 2119) PASS: lldb-api :: commands/frame/diagnose/virtual-method-call/TestDiagnoseDereferenceVirtualMethodCall.py (1468 of 2119) PASS: lldb-api :: functionalities/history/TestHistoryRecall.py (1469 of 2119) PASS: lldb-unit :: Utility/./UtilityTests/VMRange.ContainsAddr (1470 of 2119) PASS: lldb-unit :: Utility/./UtilityTests/StringListTest.SplitIntoLinesEmpty (1471 of 2119) PASS: lldb-unit :: ObjectFile/PECOFF/./ObjectFilePECOFFTests/PECallFrameInfoTest.Frame_reg_eh (1472 of 2119) PASS: lldb-api :: commands/settings/TestSettings.py (1473 of 2119) UNSUPPORTED: lldb-shell :: BuildScript/toolchain-clang-cl.test (1474 of 2119) PASS: lldb-unit :: Language/Highlighting/./HighlighterTests/HighlighterTest.ClangStringLiterals (1475 of 2119) PASS: lldb-unit :: Utility/./UtilityTests/StringExtractorTest.GetHexBytes (1476 of 2119) PASS: lldb-api :: functionalities/thread/concurrent_events/TestConcurrentTwoBreakpointThreads.py (1477 of 2119) PASS: lldb-shell :: SymbolFile/NativePDB/nested-types.cpp (1478 of 2119) PASS: lldb-api :: functionalities/exec/TestExec.py (1479 of 2119) PASS: lldb-api :: functionalities/tail_call_frames/unambiguous_sequence/TestUnambiguousTailCalls.py (1480 of 2119) PASS: lldb-unit :: Symbol/./SymbolTests/TestTypeSystemClang.TestNotDeletingUserCopyCstrDueToMoveCStr (1481 of 2119) UNSUPPORTED: lldb-api :: functionalities/signal/handle-segv/TestHandleSegv.py (1482 of 2119) PASS: lldb-unit :: Utility/./UtilityTests/ArchSpecTest.TestSetTriple (1483 of 2119) PASS: lldb-unit :: Language/CLanguages/./LanguageCLanguagesTests/CLanguages.LookupCLanguagesByLanguageType (1484 of 2119) PASS: lldb-unit :: Utility/./UtilityTests/RangeTest.Equal (1485 of 2119) PASS: lldb-unit :: Core/./LLDBCoreTests/MangledTest.ResultForValidName (1486 of 2119) PASS: lldb-shell :: Reproducer/TestDriverOptions.test (1487 of 2119) PASS: lldb-unit :: ScriptInterpreter/Python/./ScriptInterpreterPythonTests/PythonDataObjectsTest.TestPythonIntegerToStructuredInteger (1488 of 2119) PASS: lldb-api :: functionalities/source-map/TestTargetSourceMap.py (1489 of 2119) PASS: lldb-unit :: Language/CPlusPlus/./LanguageCPlusPlusTests/CPlusPlusLanguage.FindAlternateFunctionManglings (1490 of 2119) PASS: lldb-api :: commands/target/create-deps/TestTargetCreateDeps.py (1491 of 2119) PASS: lldb-api :: commands/expression/import-std-module/weak_ptr-dbg-info-content/TestDbgInfoContentWeakPtrFromStdModule.py (1492 of 2119) PASS: lldb-unit :: ScriptInterpreter/Python/./ScriptInterpreterPythonTests/PythonDataObjectsTest.TestPythonListManipulation (1493 of 2119) PASS: lldb-unit :: Target/./TargetTests/StackFrameRecognizerTest.NullModuleRegex (1494 of 2119) PASS: lldb-unit :: Language/CPlusPlus/./LanguageCPlusPlusTests/CPlusPlusLanguage.MethodNameParsing (1495 of 2119) PASS: lldb-unit :: SymbolFile/NativePDB/./SymbolFileNativePDBTests/PDBFPOProgramToDWARFExpressionTests.InvalidOpUnary (1496 of 2119) PASS: lldb-shell :: SymbolFile/DWARF/clang-ast-from-dwarf-objc-property.m (1497 of 2119) PASS: lldb-api :: python_api/lldbutil/iter/TestLLDBIterator.py (1498 of 2119) PASS: lldb-unit :: UnwindAssembly/x86/./UnwindAssemblyx86Tests/Testx86AssemblyInspectionEngine.TestPopRBP (1499 of 2119) PASS: lldb-api :: functionalities/load_using_paths/TestLoadUsingPaths.py (1500 of 2119) PASS: lldb-api :: commands/command/source/TestCommandSource.py (1501 of 2119) UNSUPPORTED: lldb-api :: linux/sepdebugsymlink/TestTargetSymbolsSepDebugSymlink.py (1502 of 2119) PASS: lldb-unit :: Utility/./UtilityTests/OptionsWithRawTest.EmptySuffixSingleWhitespace (1503 of 2119) PASS: lldb-unit :: Utility/./UtilityTests/ArchSpecTest.TestParseMachCPUDashSubtypeTripleSimple (1504 of 2119) PASS: lldb-api :: lang/cpp/class_static/TestStaticVariables.py (1505 of 2119) PASS: lldb-unit :: Utility/./UtilityTests/UriParserTest.SchemeHostSeparator3 (1506 of 2119) PASS: lldb-unit :: Utility/./UtilityTests/UriParserTest.SchemeHostSeparator (1507 of 2119) PASS: lldb-shell :: ObjectFile/PECOFF/section-types.yaml (1508 of 2119) PASS: lldb-unit :: Utility/./UtilityTests/OptionsWithRawTest.EmptySuffix (1509 of 2119) PASS: lldb-shell :: Driver/TestNoUseColor.test (1510 of 2119) PASS: lldb-shell :: ObjectFile/ELF/PT_LOAD-overlap.yaml (1511 of 2119) PASS: lldb-unit :: Utility/./UtilityTests/CompletionRequest.TryCompleteCurrentArgMode (1512 of 2119) PASS: lldb-api :: commands/expression/import-std-module/basic/TestImportStdModule.py (1513 of 2119) PASS: lldb-unit :: Language/CPlusPlus/./LanguageCPlusPlusTests/CPlusPlusLanguage.ExtractContextAndIdentifier (1514 of 2119) PASS: lldb-unit :: Host/./HostTests/FileSystemTest.GetByteSize (1515 of 2119) PASS: lldb-unit :: Utility/./UtilityTests/RangeTest.DoesIntersect (1516 of 2119) PASS: lldb-api :: python_api/sblaunchinfo/TestSBLaunchInfo.py (1517 of 2119) PASS: lldb-unit :: Utility/./UtilityTests/ArgsTest.TestUnknownEscape (1518 of 2119) UNSUPPORTED: lldb-api :: commands/expression/call-restarts/TestCallThatRestarts.py (1519 of 2119) PASS: lldb-unit :: Signals/./SignalsTests/UnixSignalsTest.GetFilteredSignals (1520 of 2119) PASS: lldb-unit :: debugserver/./debugserverTests/RNBSocket.LoopBackListenIPv6 (1521 of 2119) PASS: lldb-api :: commands/expression/import-std-module/stack/TestStackFromStdModule.py (1522 of 2119) PASS: lldb-api :: tools/lldb-vscode/variables/TestVSCode_variables.py (1523 of 2119) PASS: lldb-api :: commands/frame/var/TestFrameVar.py (1524 of 2119) PASS: lldb-unit :: Utility/./UtilityTests/StringExtractorTest.GetU64BigEndian (1525 of 2119) PASS: lldb-api :: functionalities/data-formatter/type_summary_list_arg/TestTypeSummaryListArg.py (1526 of 2119) PASS: lldb-unit :: Utility/./UtilityTests/StreamTest.AddressSuffix (1527 of 2119) PASS: lldb-api :: lang/cpp/stl/TestSTL.py (1528 of 2119) PASS: lldb-unit :: Utility/./UtilityTests/StreamTeeTest.CopyConstructor (1529 of 2119) PASS: lldb-unit :: ScriptInterpreter/Python/./ScriptInterpreterPythonTests/PythonDataObjectsTest.TestPythonDictionaryManipulation (1530 of 2119) PASS: lldb-unit :: Utility/./UtilityTests/StringLexerTest.PutBack (1531 of 2119) PASS: lldb-api :: lang/objc/modules-app-update/TestClangModulesAppUpdate.py (1532 of 2119) PASS: lldb-api :: commands/expression/call-function/TestCallUserDefinedFunction.py (1533 of 2119) PASS: lldb-shell :: Minidump/dump-all.test (1534 of 2119) PASS: lldb-api :: lang/objc/modules-compile-error/TestModulesCompileError.py (1535 of 2119) PASS: lldb-api :: commands/expression/cast_int_to_anonymous_enum/TestCastIntToAnonymousEnum.py (1536 of 2119) PASS: lldb-api :: functionalities/data-formatter/data-formatter-named-summaries/TestDataFormatterNamedSummaries.py (1537 of 2119) PASS: lldb-api :: lang/cpp/enum_types/TestCPP11EnumTypes.py (1538 of 2119) PASS: lldb-shell :: SymbolFile/NativePDB/break-by-function.cpp (1539 of 2119) PASS: lldb-unit :: Utility/./UtilityTests/StringExtractorTest.GetHexU8_Underflow (1540 of 2119) PASS: lldb-unit :: Process/gdb-remote/./ProcessGdbRemoteTests/GDBRemoteCommunicationClientTest.GetModulesInfo_UUID20 (1541 of 2119) PASS: lldb-api :: commands/target/dump-symtab-demangle/TestDumpSymtabDemangle.py (1542 of 2119) PASS: lldb-unit :: API/./APITests/SBCommandInterpreterTest.MultiWordCommand (1543 of 2119) UNSUPPORTED: lldb-api :: tools/lldb-server/platform-process-connect/TestPlatformProcessConnect.py (1544 of 2119) PASS: lldb-api :: functionalities/thread/concurrent_events/TestConcurrentBreakpointDelayBreakpointOneSignal.py (1545 of 2119) PASS: lldb-unit :: Utility/./UtilityTests/ScalarTest.Getters (1546 of 2119) PASS: lldb-unit :: Symbol/./SymbolTests/PostfixExpression.ToDWARF (1547 of 2119) UNSUPPORTED: lldb-shell :: ScriptInterpreter/Lua/lua.test (1548 of 2119) PASS: lldb-shell :: SymbolFile/DWARF/DW_TAG_basic_type_DW_ATE_UTF_nonC.ll (1549 of 2119) PASS: lldb-api :: functionalities/thread/concurrent_events/TestConcurrentDelayedCrashWithBreakpointSignal.py (1550 of 2119) PASS: lldb-unit :: Utility/./UtilityTests/OptionsWithRawTest.SingleWordSuffix (1551 of 2119) PASS: lldb-api :: functionalities/non-overlapping-index-variable-i/TestIndexVariable.py (1552 of 2119) PASS: lldb-shell :: ObjectFile/Breakpad/uuid-matching-mac.test (1553 of 2119) PASS: lldb-unit :: Utility/./UtilityTests/StringListTest.LongestCommonPrefixNoPrefix (1554 of 2119) PASS: lldb-unit :: Host/./HostTests/SocketTest.UDPConnect (1555 of 2119) PASS: lldb-api :: commands/process/attach-resume/TestAttachResume.py (1556 of 2119) PASS: lldb-unit :: Host/./HostTests/SocketTest.TCPGetAddress (1557 of 2119) UNSUPPORTED: lldb-api :: macosx/simulator/TestSimulatorPlatform.py (1558 of 2119) PASS: lldb-api :: functionalities/tsan/thread_numbers/TestTsanThreadNumbers.py (1559 of 2119) PASS: lldb-unit :: Utility/./UtilityTests/UriParserTest.BadPort2 (1560 of 2119) PASS: lldb-unit :: Utility/./UtilityTests/StreamTest.PutBytesAsRawHex8ToBigEndian (1561 of 2119) PASS: lldb-api :: functionalities/dynamic_value_child_count/TestDynamicValueChildCount.py (1562 of 2119) PASS: lldb-unit :: Utility/./UtilityTests/RangeTest.DoesAdjoinOrIntersect (1563 of 2119) PASS: lldb-api :: commands/expression/deleting-implicit-copy-constructor/TestDeletingImplicitCopyConstructor.py (1564 of 2119) PASS: lldb-api :: commands/target/select/TestTargetSelect.py (1565 of 2119) PASS: lldb-unit :: Utility/./UtilityTests/ConstStringTest.CompareStringRef (1566 of 2119) PASS: lldb-unit :: UnwindAssembly/PPC64/./PPC64InstEmulationTests/TestPPC64InstEmulation.TestSimpleFunction (1567 of 2119) PASS: lldb-api :: lang/objc/foundation/TestObjCMethodsNSArray.py (1568 of 2119) PASS: lldb-unit :: Utility/./UtilityTests/UserIDResolver.GetUserName (1569 of 2119) PASS: lldb-shell :: SymbolFile/DWARF/dwarf5-index-is-used.cpp (1570 of 2119) UNSUPPORTED: lldb-api :: android/platform/TestDefaultCacheLineSize.py (1571 of 2119) PASS: lldb-unit :: Utility/./UtilityTests/ArchSpecTest.OperatorBool (1572 of 2119) PASS: lldb-unit :: UnwindAssembly/x86/./UnwindAssemblyx86Tests/Testx86AssemblyInspectionEngine.TestPopR13 (1573 of 2119) PASS: lldb-api :: macosx/DBGSourcePathRemapping/TestDSYMSourcePathRemapping.py (1574 of 2119) PASS: lldb-unit :: Utility/./UtilityTests/StreamTest.AddressRangeInvalidRange (1575 of 2119) PASS: lldb-api :: functionalities/fat_archives/TestFatArchives.py (1576 of 2119) PASS: lldb-api :: lang/cpp/thread_local/TestThreadLocal.py (1577 of 2119) PASS: lldb-api :: functionalities/optimized_code/TestNoASanExceptionAfterEvalOP_piece.py (1578 of 2119) PASS: lldb-api :: functionalities/gdb_remote_client/TestJLink6Armv7RegisterDefinition.py (1579 of 2119) PASS: lldb-unit :: Utility/./UtilityTests/StringListTest.LongestCommonPrefixSingleElement (1580 of 2119) PASS: lldb-unit :: Utility/./UtilityTests/RegularExpression.Empty (1581 of 2119) PASS: lldb-api :: lang/cpp/operators/TestCppOperators.py (1582 of 2119) PASS: lldb-unit :: Symbol/./SymbolTests/TestTypeSystemClang.TestBuiltinTypeForEncodingAndBitSize (1583 of 2119) PASS: lldb-shell :: Register/x86-64-ymm-read.test (1584 of 2119) PASS: lldb-api :: functionalities/gdb_remote_client/TestIOSSimulator.py (1585 of 2119) PASS: lldb-api :: python_api/process/io/TestProcessIO.py (1586 of 2119) PASS: lldb-api :: commands/watchpoints/multiple_threads/TestWatchpointMultipleThreads.py (1587 of 2119) PASS: lldb-api :: functionalities/paths/TestPaths.py (1588 of 2119) PASS: lldb-unit :: Utility/./UtilityTests/LogTest.Register (1589 of 2119) PASS: lldb-api :: functionalities/wrong_commands/TestWrongCommands.py (1590 of 2119) PASS: lldb-unit :: Symbol/./SymbolTests/TestTypeSystemClang.TestGetBasicTypeFromName (1591 of 2119) PASS: lldb-api :: functionalities/data-formatter/builtin-formats/TestBuiltinFormats.py (1592 of 2119) PASS: lldb-unit :: Host/./HostTests/FileSystemTest.Exists (1593 of 2119) PASS: lldb-unit :: Expression/./ExpressionTests/DiagnosticManagerTest.GetStringBasic (1594 of 2119) PASS: lldb-api :: commands/expression/fixits/TestFixIts.py (1595 of 2119) PASS: lldb-shell :: ObjectFile/ELF/short-build-id.yaml (1596 of 2119) PASS: lldb-unit :: Symbol/./SymbolTests/TestClangASTImporter.CanImportInvalidType (1597 of 2119) PASS: lldb-api :: lang/c/complex/TestComplexC99.py (1598 of 2119) PASS: lldb-api :: commands/frame/diagnose/dereference-this/TestDiagnoseDereferenceThis.py (1599 of 2119) PASS: lldb-unit :: Process/minidump/./LLDBMinidumpTests/MinidumpParserTest.GetPidWow64 (1600 of 2119) PASS: lldb-api :: commands/settings/use_source_cache/TestUseSourceCache.py (1601 of 2119) PASS: lldb-unit :: Language/Highlighting/./HighlighterTests/HighlighterTest.ClangCommas (1602 of 2119) PASS: lldb-unit :: DataFormatter/./LLDBFormatterTests/TypeMatcherTests.ExactName (1603 of 2119) UNSUPPORTED: lldb-api :: functionalities/darwin_log/filter/exact_match/category/TestDarwinLogFilterMatchCategory.py (1604 of 2119) PASS: lldb-shell :: Register/x86-64-read.test (1605 of 2119) PASS: lldb-unit :: Process/gdb-remote/./ProcessGdbRemoteTests/GDBRemoteCommunicationClientTest.SendGetDataPacket (1606 of 2119) PASS: lldb-api :: terminal/TestSTTYBeforeAndAfter.py (1607 of 2119) PASS: lldb-unit :: Utility/./UtilityTests/LogChannelEnabledTest.log_options (1608 of 2119) PASS: lldb-shell :: Settings/TestModuleCacheSanity.test (1609 of 2119) PASS: lldb-api :: commands/target/stop-hooks/TestStopHooks.py (1610 of 2119) UNSUPPORTED: lldb-shell :: Register/x86-zmm-write.test (1611 of 2119) PASS: lldb-unit :: Utility/./UtilityTests/StatusTest.ErrorConstructor (1612 of 2119) PASS: lldb-api :: functionalities/tail_call_frames/thread_step_out_message/TestArtificialFrameStepOutMessage.py (1613 of 2119) UNSUPPORTED: lldb-shell :: Register/aarch64-fp-read.test (1614 of 2119) PASS: lldb-api :: python_api/disassemble-raw-data/TestDisassembleRawData.py (1615 of 2119) PASS: lldb-unit :: Utility/./UtilityTests/GeneratorTest.YamlMultiProvider (1616 of 2119) PASS: lldb-api :: lang/objcxx/objcxx-ivar-vector/TestIvarVector.py (1617 of 2119) PASS: lldb-api :: functionalities/breakpoint/breakpoint_command/TestBreakpointCommandsFromPython.py (1618 of 2119) PASS: lldb-unit :: Expression/./ExpressionTests/DWARFExpression.DW_OP_unknown (1619 of 2119) UNSUPPORTED: lldb-api :: benchmarks/stepping/TestSteppingSpeed.py (1620 of 2119) UNSUPPORTED: lldb-api :: lang/objc/objc-dynamic-value/TestObjCDynamicValue.py (1621 of 2119) PASS: lldb-unit :: UnwindAssembly/x86/./UnwindAssemblyx86Tests/Testx86AssemblyInspectionEngine.TestCALLNextInsn (1622 of 2119) PASS: lldb-shell :: Unwind/eh-frame-dwarf-unwind.test (1623 of 2119) PASS: lldb-unit :: Utility/./UtilityTests/ProcessInstanceInfo.DumpTable (1624 of 2119) PASS: lldb-unit :: UnwindAssembly/x86/./UnwindAssemblyx86Tests/Testx86AssemblyInspectionEngine.TestPopEBP (1625 of 2119) PASS: lldb-unit :: SymbolFile/NativePDB/./SymbolFileNativePDBTests/PDBFPOProgramToDWARFExpressionTests.UnresolvedRegisterReference (1626 of 2119) PASS: lldb-api :: commands/expression/invalid-args/TestInvalidArgsExpression.py (1627 of 2119) PASS: lldb-api :: commands/watchpoints/watchpoint_disable/TestWatchpointDisable.py (1628 of 2119) PASS: lldb-unit :: UnwindAssembly/x86/./UnwindAssemblyx86Tests/Testx86AssemblyInspectionEngine.TestPushRBP (1629 of 2119) PASS: lldb-api :: python_api/watchpoint/TestSetWatchpoint.py (1630 of 2119) PASS: lldb-unit :: Utility/./UtilityTests/ScalarTest.ExtractBitfield (1631 of 2119) PASS: lldb-api :: lang/objc/variadic_methods/TestVariadicMethods.py (1632 of 2119) UNSUPPORTED: lldb-api :: functionalities/darwin_log/filter/regex/category/TestDarwinLogFilterRegexCategory.py (1633 of 2119) PASS: lldb-unit :: Utility/./UtilityTests/VMRange.SetEndAddress (1634 of 2119) PASS: lldb-api :: python_api/target/TestTargetAPI.py (1635 of 2119) PASS: lldb-unit :: DataFormatter/./LLDBFormatterTests/FormatManagerTests.CompatibleLangs (1636 of 2119) PASS: lldb-api :: functionalities/breakpoint/address_breakpoints/TestAddressBreakpoints.py (1637 of 2119) PASS: lldb-unit :: ScriptInterpreter/Python/./ScriptInterpreterPythonTests/PythonDataObjectsTest.TestRun (1638 of 2119) PASS: lldb-api :: functionalities/data-formatter/data-formatter-stl/libcxx/list/loop/TestDataFormatterLibcxxListLoop.py (1639 of 2119) PASS: lldb-api :: commands/expression/dont_allow_jit/TestAllowJIT.py (1640 of 2119) PASS: lldb-api :: functionalities/thread/concurrent_events/TestConcurrentTwoWatchpointsOneBreakpoint.py (1641 of 2119) PASS: lldb-shell :: Reproducer/TestReuseDirectory.test (1642 of 2119) PASS: lldb-unit :: Language/Highlighting/./HighlighterTests/HighlighterTest.ClangBraces (1643 of 2119) PASS: lldb-unit :: SymbolFile/DWARF/./SymbolFileDWARFTests/SymbolFileDWARFTests.TestAbbrevOrder1Start1 (1644 of 2119) PASS: lldb-api :: functionalities/plugins/python_os_plugin/TestPythonOSPlugin.py (1645 of 2119) PASS: lldb-api :: functionalities/memory/find/TestMemoryFind.py (1646 of 2119) PASS: lldb-api :: commands/expression/import-std-module/no-std-module/TestMissingStdModule.py (1647 of 2119) PASS: lldb-unit :: Utility/./UtilityTests/ReproducerTest.SetReplay (1648 of 2119) PASS: lldb-unit :: ObjectFile/MachO/./ObjectFileMachOTests/ObjectFileMachOTest.ModuleFromSharedCacheInfo (1649 of 2119) PASS: lldb-unit :: Utility/./UtilityTests/StringExtractorTest.GetHexBytesAvail_OddPair (1650 of 2119) PASS: lldb-api :: arm/emulation/TestEmulations.py (1651 of 2119) PASS: lldb-api :: commands/expression/import-std-module/sysroot/TestStdModuleSysroot.py (1652 of 2119) PASS: lldb-unit :: Utility/./UtilityTests/RegularExpression.CopyAssignment (1653 of 2119) PASS: lldb-shell :: SymbolFile/DWARF/debug_line-relative_path.s (1654 of 2119) PASS: lldb-unit :: Utility/./UtilityTests/ScalarTest.LongLongAssigmentOperator (1655 of 2119) PASS: lldb-unit :: Utility/./UtilityTests/DataExtractorTest.GetMaxS64 (1656 of 2119) PASS: lldb-unit :: Utility/./UtilityTests/StringListTest.GetMaxStringLengthIncreasingSize (1657 of 2119) PASS: lldb-unit :: debugserver/./debugserverTests/RNBSocket.LoopBackListenIPv4 (1658 of 2119) PASS: lldb-api :: lang/c/modules/TestCModules.py (1659 of 2119) PASS: lldb-unit :: Host/./HostTests/FileSystemTest.MakeAbsolute (1660 of 2119) PASS: lldb-shell :: Driver/TestHelp.test (1661 of 2119) PASS: lldb-api :: functionalities/step-avoids-no-debug/TestStepNoDebug.py (1662 of 2119) PASS: lldb-api :: lang/objc/foundation/TestFoundationDisassembly.py (1663 of 2119) PASS: lldb-unit :: Utility/./UtilityTests/BroadcasterTest.BroadcastEvent (1664 of 2119) PASS: lldb-api :: lang/c/local_variables/TestLocalVariables.py (1665 of 2119) PASS: lldb-unit :: Utility/./UtilityTests/StreamTest.PutBytesAsRawHex8ToMixedEndian (1666 of 2119) PASS: lldb-api :: commands/expression/class_template_specialization_empty_pack/TestClassTemplateSpecializationParametersHandling.py (1667 of 2119) PASS: lldb-unit :: Utility/./UtilityTests/RecordReplayTest.InstrumentedFoo (1668 of 2119) PASS: lldb-unit :: Utility/./UtilityTests/OptionsWithRawTest.MultiWordSuffix (1669 of 2119) PASS: lldb-api :: lang/objc/objc-class-method/TestObjCClassMethod.py (1670 of 2119) PASS: lldb-api :: tools/lldb-server/TestGdbRemoteKill.py (1671 of 2119) PASS: lldb-api :: python_api/exprpath_synthetic/TestExprPathSynthetic.py (1672 of 2119) PASS: lldb-shell :: Minidump/Windows/find-module.test (1673 of 2119) PASS: lldb-unit :: Target/./TargetTests/ModuleCacheTest.GetAndPutStrangeHostname (1674 of 2119) PASS: lldb-api :: functionalities/gdb_remote_client/TestStopPCs.py (1675 of 2119) UNSUPPORTED: lldb-api :: functionalities/darwin_log/filter/exact_match/activity/TestDarwinLogFilterMatchActivity.py (1676 of 2119) PASS: lldb-shell :: ObjectFile/ELF/netbsd-exec-8.99.30-amd64.yaml (1677 of 2119) PASS: lldb-api :: functionalities/breakpoint/move_nearest/TestMoveNearest.py (1678 of 2119) PASS: lldb-unit :: ScriptInterpreter/Python/./ScriptInterpreterPythonTests/PythonDataObjectsTest.TestPythonTupleInitializerList (1679 of 2119) PASS: lldb-unit :: Utility/./UtilityTests/StreamTest.AddressRange (1680 of 2119) PASS: lldb-api :: lang/cpp/function_refs/TestFunctionRefs.py (1681 of 2119) PASS: lldb-api :: lang/cpp/trivial_abi/TestTrivialABI.py (1682 of 2119) PASS: lldb-shell :: Breakpoint/debug_rnglist_offset_pair.test (1683 of 2119) PASS: lldb-unit :: ScriptInterpreter/Python/./ScriptInterpreterPythonTests/PythonDataObjectsTest.TestPythonCallableInvoke (1684 of 2119) PASS: lldb-shell :: SymbolFile/DWARF/split-dwarf-inlining.cpp (1685 of 2119) PASS: lldb-api :: functionalities/postmortem/netbsd-core/TestNetBSDCore.py (1686 of 2119) PASS: lldb-shell :: SymbolFile/Breakpad/unwind-via-stack-cfi.test (1687 of 2119) UNSUPPORTED: lldb-shell :: SymbolFile/NativePDB/stack_unwinding01.cpp (1688 of 2119) PASS: lldb-unit :: Utility/./UtilityTests/RangeTest.EqualInvalid (1689 of 2119) PASS: lldb-shell :: Settings/TestFrameFormatNoColor.test (1690 of 2119) PASS: lldb-unit :: Utility/./UtilityTests/ScalarTest.Equality (1691 of 2119) PASS: lldb-unit :: Utility/./UtilityTests/ScalarTest.SetValueFromData (1692 of 2119) PASS: lldb-api :: lang/objcxx/cxx-bridged-po/TestObjCXXBridgedPO.py (1693 of 2119) PASS: lldb-unit :: Interpreter/./InterpreterTests/OptionArgParserTest.toScriptLanguage (1694 of 2119) PASS: lldb-api :: functionalities/thread/concurrent_events/TestConcurrentTwoBreakpointsOneDelaySignal.py (1695 of 2119) PASS: lldb-api :: functionalities/data-formatter/user-format-vs-summary/TestUserFormatVsSummary.py (1696 of 2119) PASS: lldb-unit :: Utility/./UtilityTests/StringListTest.ShiftMove (1697 of 2119) PASS: lldb-api :: functionalities/data-formatter/data-formatter-stl/libcxx/forward_list/TestDataFormatterLibcxxForwardList.py (1698 of 2119) UNSUPPORTED: lldb-shell :: Process/Windows/exception_access_violation.cpp (1699 of 2119) PASS: lldb-api :: lang/objc/rdar-10967107/TestRdar10967107.py (1700 of 2119) PASS: lldb-api :: functionalities/data-formatter/data-formatter-stl/libcxx/optional/TestDataFormatterLibcxxOptional.py (1701 of 2119) PASS: lldb-unit :: Process/minidump/./LLDBMinidumpTests/RegisterContextMinidump.ConvertMinidumpContext_x86_32 (1702 of 2119) PASS: lldb-api :: functionalities/gdb_remote_client/TestNestedRegDefinitions.py (1703 of 2119) PASS: lldb-api :: lang/objc/objc-new-syntax/TestObjCNewSyntaxLiteral.py (1704 of 2119) PASS: lldb-shell :: Quit/TestQuitExitCodeTooManyArgs.test (1705 of 2119) PASS: lldb-unit :: Utility/./UtilityTests/StringLexerTest.GetUnlexed (1706 of 2119) PASS: lldb-unit :: Utility/./UtilityTests/ScalarTest.Comparison (1707 of 2119) PASS: lldb-unit :: Utility/./UtilityTests/NameMatchesTest.StartsWith (1708 of 2119) PASS: lldb-shell :: SymbolFile/NativePDB/globals-fundamental.cpp (1709 of 2119) PASS: lldb-api :: lang/mixed/TestMixedLanguages.py (1710 of 2119) PASS: lldb-shell :: Unwind/thread-step-out-ret-addr-check.test (1711 of 2119) PASS: lldb-unit :: Utility/./UtilityTests/OptionsWithRawTest.EmptyArgsOnlySuffix (1712 of 2119) PASS: lldb-unit :: UnwindAssembly/x86/./UnwindAssemblyx86Tests/Testx86AssemblyInspectionEngine.TestSimple32bitFrameFunction (1713 of 2119) PASS: lldb-shell :: Driver/TestUseColor.test (1714 of 2119) PASS: lldb-unit :: Language/Highlighting/./HighlighterTests/HighlighterTest.FallbackHighlighter (1715 of 2119) PASS: lldb-api :: commands/quit/TestQuit.py (1716 of 2119) PASS: lldb-unit :: Utility/./UtilityTests/ArgsTest.ReplaceArgumentAtIndexLonger (1717 of 2119) UNSUPPORTED: lldb-shell :: ScriptInterpreter/Lua/bindings.test (1718 of 2119) PASS: lldb-unit :: Utility/./UtilityTests/FileSpecTest.EqualDotsWindows (1719 of 2119) PASS: lldb-unit :: Expression/./ExpressionTests/CppModuleConfigurationTest.Xcode (1720 of 2119) PASS: lldb-unit :: Utility/./UtilityTests/StringExtractorTest.GetHexBytes_OddPair2 (1721 of 2119) PASS: lldb-shell :: Expr/TestMultilineExpr.test (1722 of 2119) PASS: lldb-unit :: Utility/./UtilityTests/StringListTest.AppendListCStringArray (1723 of 2119) PASS: lldb-api :: functionalities/data-formatter/data-formatter-stl/libcxx/variant/TestDataFormatterLibcxxVariant.py (1724 of 2119) PASS: lldb-shell :: SymbolFile/Breakpad/stack-cfi-arm.yaml (1725 of 2119) PASS: lldb-shell :: SymbolFile/symbol-binding.test (1726 of 2119) PASS: lldb-unit :: UnwindAssembly/PPC64/./PPC64InstEmulationTests/TestPPC64InstEmulation.TestMediumFunction (1727 of 2119) PASS: lldb-shell :: SymbolFile/DWARF/find-variable-file.cpp (1728 of 2119) PASS: lldb-unit :: Utility/./UtilityTests/ArgsTest.EscapeLLDBCommandArgument (1729 of 2119) PASS: lldb-unit :: Utility/./UtilityTests/TimerTest.CategoryTimes (1730 of 2119) PASS: lldb-unit :: tools/lldb-server/tests/./LLDBServerTests/TestBase.DebugserverEnv (1731 of 2119) PASS: lldb-unit :: SymbolFile/DWARF/./SymbolFileDWARFTests/SymbolFileDWARFTests.ParseArangesNonzeroSegmentSize (1732 of 2119) UNSUPPORTED: lldb-api :: commands/watchpoints/multi_watchpoint_slots/TestWatchpointMultipleSlots.py (1733 of 2119) PASS: lldb-api :: commands/expression/char/TestExprsChar.py (1734 of 2119) PASS: lldb-unit :: SymbolFile/NativePDB/./SymbolFileNativePDBTests/PDBFPOProgramToDWARFExpressionTests.UnresolvedRegisterAssignmentReference (1735 of 2119) PASS: lldb-unit :: UnwindAssembly/x86/./UnwindAssemblyx86Tests/Testx86AssemblyInspectionEngine.TestPush0 (1736 of 2119) PASS: lldb-api :: macosx/add-dsym/TestAddDsymMidExecutionCommand.py (1737 of 2119) PASS: lldb-shell :: SymbolFile/NativePDB/function-types-builtins.cpp (1738 of 2119) PASS: lldb-api :: lang/cpp/namespace_definitions/TestNamespaceDefinitions.py (1739 of 2119) PASS: lldb-unit :: DataFormatter/./LLDBFormatterTests/StringPrinterTests.CxxUTF8 (1740 of 2119) PASS: lldb-api :: tools/lldb-vscode/breakpoint/TestVSCode_setBreakpoints.py (1741 of 2119) PASS: lldb-api :: functionalities/tsan/global_location/TestTsanGlobalLocation.py (1742 of 2119) PASS: lldb-unit :: Language/Highlighting/./HighlighterTests/HighlighterTest.ClangUnterminatedString (1743 of 2119) PASS: lldb-shell :: Breakpoint/split-dwarf-5-addrbase.test (1744 of 2119) PASS: lldb-api :: lang/cpp/namespace/TestNamespaceLookup.py (1745 of 2119) PASS: lldb-unit :: Utility/./UtilityTests/StringExtractorTest.GetHexBytes_Partial (1746 of 2119) PASS: lldb-unit :: Utility/./UtilityTests/LogTest.LLDB_LOG_nullptr (1747 of 2119) PASS: lldb-api :: functionalities/type_completion/TestTypeCompletion.py (1748 of 2119) PASS: lldb-unit :: Process/minidump/./LLDBMinidumpTests/MinidumpParserTest.GetThreadContext_x86_32 (1749 of 2119) PASS: lldb-unit :: UnwindAssembly/x86/./UnwindAssemblyx86Tests/Testx86AssemblyInspectionEngine.TestPushR14 (1750 of 2119) PASS: lldb-unit :: SymbolFile/DWARF/./SymbolFileDWARFTests/SymbolFileDWARFTests.TestAbbrevOutOfOrder (1751 of 2119) PASS: lldb-api :: commands/expression/entry-bp/TestExprEntryBP.py (1752 of 2119) PASS: lldb-unit :: Utility/./UtilityTests/StringListTest.AppendListCStringArrayEmpty (1753 of 2119) PASS: lldb-unit :: Expression/./ExpressionTests/CppModuleConfigurationTest.AmbiguousLibCpp (1754 of 2119) PASS: lldb-unit :: UnwindAssembly/x86/./UnwindAssemblyx86Tests/Testx86AssemblyInspectionEngine.TestPushR13 (1755 of 2119) PASS: lldb-api :: functionalities/postmortem/minidump-new/TestMiniDumpNew.py (1756 of 2119) PASS: lldb-unit :: Utility/./UtilityTests/StringExtractorTest.GetHexBytes_Underflow (1757 of 2119) UNSUPPORTED: lldb-api :: functionalities/data-formatter/data-formatter-stl/libstdcpp/map/TestDataFormatterStdMap.py (1758 of 2119) PASS: lldb-api :: commands/frame/diagnose/array/TestArray.py (1759 of 2119) PASS: lldb-api :: lang/objc/objc-struct-return/TestObjCStructReturn.py (1760 of 2119) PASS: lldb-api :: types/TestCharTypeExpr.py (1761 of 2119) PASS: lldb-unit :: Disassembler/./DisassemblerTests/TestArmv7Disassembly.TestCortexFPDisass (1762 of 2119) PASS: lldb-unit :: Utility/./UtilityTests/GeneratorTest.GetOrCreate (1763 of 2119) PASS: lldb-shell :: SymbolFile/NativePDB/break-by-line.cpp (1764 of 2119) PASS: lldb-api :: tools/lldb-vscode/coreFile/TestVSCode_coreFile.py (1765 of 2119) PASS: lldb-api :: python_api/breakpoint/TestBreakpointAPI.py (1766 of 2119) PASS: lldb-api :: commands/expression/persistent_types/TestPersistentTypes.py (1767 of 2119) UNSUPPORTED: lldb-shell :: ObjectFile/ELF/minidebuginfo-set-and-hit-breakpoint.test (1768 of 2119) PASS: lldb-unit :: Utility/./UtilityTests/StreamTest.AddressRangeSize (1769 of 2119) PASS: lldb-unit :: Language/Highlighting/./HighlighterTests/HighlighterTest.ClangSquareBrackets (1770 of 2119) PASS: lldb-api :: commands/disassemble/basic/TestDisassembleBreakpoint.py (1771 of 2119) UNSUPPORTED: lldb-shell :: SymbolFile/PDB/ast-restore.test (1772 of 2119) UNSUPPORTED: lldb-api :: functionalities/data-formatter/data-formatter-stl/libstdcpp/vector/TestDataFormatterStdVector.py (1773 of 2119) XFAIL: lldb-shell :: Register/x86-64-ymm-write.test (1774 of 2119) PASS: lldb-unit :: Utility/./UtilityTests/Predicate.WaitForValueNotEqualTo (1775 of 2119) PASS: lldb-api :: functionalities/data-formatter/data-formatter-objc/TestDataFormatterObjCNSError.py (1776 of 2119) PASS: lldb-api :: lang/cpp/typeof/TestTypeOfDeclTypeExpr.py (1777 of 2119) PASS: lldb-unit :: ObjectFile/Breakpad/./ObjectFileBreakpadTests/LineRecord.parse (1778 of 2119) PASS: lldb-unit :: ScriptInterpreter/Python/./ScriptInterpreterPythonTests/PythonDataObjectsTest.TestPythonListValueEquality (1779 of 2119) PASS: lldb-api :: lang/cpp/rvalue-references/TestRvalueReferences.py (1780 of 2119) PASS: lldb-api :: lang/cpp/accelerator-table/TestCPPAccelerator.py (1781 of 2119) PASS: lldb-unit :: UnwindAssembly/x86/./UnwindAssemblyx86Tests/Testx86AssemblyInspectionEngine.Test32bitFramelessBigStackFrame (1782 of 2119) PASS: lldb-unit :: Host/./HostTests/NativeProcessProtocolTest.ReadCStringFromMemory_CrossPageBoundary (1783 of 2119) PASS: lldb-unit :: Utility/./UtilityTests/RangeTest.ContainsRange (1784 of 2119) PASS: lldb-unit :: Utility/./UtilityTests/TimerTest.CategoryTimesStats (1785 of 2119) PASS: lldb-unit :: Symbol/./SymbolTests/TestClangASTImporter.DeportDeclTagDecl (1786 of 2119) PASS: lldb-api :: functionalities/postmortem/minidump/TestMiniDump.py (1787 of 2119) PASS: lldb-api :: commands/expression/context-object/TestContextObject.py (1788 of 2119) PASS: lldb-api :: lang/cpp/extern_c/TestExternCSymbols.py (1789 of 2119) PASS: lldb-shell :: SymbolFile/DWARF/deterministic-build.cpp (1790 of 2119) PASS: lldb-api :: functionalities/data-formatter/data-formatter-smart-array/TestDataFormatterSmartArray.py (1791 of 2119) PASS: lldb-api :: tools/lldb-server/TestGdbRemoteThreadsInStopReply.py (1792 of 2119) PASS: lldb-api :: commands/expression/import-std-module/conflicts/TestStdModuleWithConflicts.py (1793 of 2119) PASS: lldb-unit :: Utility/./UtilityTests/LogChannelTest.Disable (1794 of 2119) PASS: lldb-api :: functionalities/ptr_refs/TestPtrRefs.py (1795 of 2119) PASS: lldb-unit :: Utility/./UtilityTests/SerializationRountripTest.SerializeDeserializeCStringArray (1796 of 2119) PASS: lldb-api :: functionalities/data-formatter/data-formatter-stl/libcxx/map/TestDataFormatterLibccMap.py (1797 of 2119) PASS: lldb-api :: lang/objc/self/TestObjCSelf.py (1798 of 2119) UNSUPPORTED: lldb-shell :: Register/x86-64-zmm-write.test (1799 of 2119) PASS: lldb-unit :: Utility/./UtilityTests/StringExtractorTest.GetHexU8_Exact (1800 of 2119) PASS: lldb-unit :: Utility/./UtilityTests/StreamTest.SetIndentLevel (1801 of 2119) PASS: lldb-shell :: Process/UnsupportedLanguage.test (1802 of 2119) PASS: lldb-unit :: Utility/./UtilityTests/StringExtractorTest.GetHexBytes_FullString (1803 of 2119) PASS: lldb-shell :: Driver/TestProcessAttach.test (1804 of 2119) PASS: lldb-api :: functionalities/gdb_remote_client/TestArmRegisterDefinition.py (1805 of 2119) PASS: lldb-api :: lang/cpp/this_class_type_mixing/TestThisClassTypeMixing.py (1806 of 2119) PASS: lldb-unit :: Utility/./UtilityTests/StringListTest.PopBack (1807 of 2119) PASS: lldb-unit :: Expression/./ExpressionTests/DiagnosticManagerTest.GetStringNoDiags (1808 of 2119) PASS: lldb-unit :: Utility/./UtilityTests/BinaryStreamTest.PutSLEB128One (1809 of 2119) PASS: lldb-api :: commands/command/nested_alias/TestNestedAlias.py (1810 of 2119) PASS: lldb-unit :: Utility/./UtilityTests/FileSpecTest.OperatorBool (1811 of 2119) UNSUPPORTED: lldb-api :: functionalities/darwin_log/source/debug/TestDarwinLogSourceDebug.py (1812 of 2119) PASS: lldb-unit :: Utility/./UtilityTests/StringExtractorTest.GetHexU8_InvalidHex (1813 of 2119) PASS: lldb-api :: commands/expression/function_template_specialization_temp_args/TestFunctionTemplateSpecializationTempArgs.py (1814 of 2119) PASS: lldb-api :: commands/expression/import-std-module/forward_list/TestForwardListFromStdModule.py (1815 of 2119) PASS: lldb-api :: lang/objc/foundation/TestRuntimeTypes.py (1816 of 2119) PASS: lldb-api :: macosx/find-dsym/deep-bundle/TestDeepBundle.py (1817 of 2119) PASS: lldb-api :: tools/lldb-server/TestGdbRemoteProcessInfo.py (1818 of 2119) PASS: lldb-api :: tools/lldb-vscode/breakpoint-events/TestVSCode_breakpointEvents.py (1819 of 2119) PASS: lldb-shell :: Driver/TestError.test (1820 of 2119) UNSUPPORTED: lldb-api :: functionalities/darwin_log/filter/regex/message/TestDarwinLogFilterRegexMessage.py (1821 of 2119) PASS: lldb-unit :: Utility/./UtilityTests/ArgsTest.TestSingleQuotedArgWithSpace (1822 of 2119) PASS: lldb-api :: tools/lldb-vscode/launch/TestVSCode_launch.py (1823 of 2119) PASS: lldb-unit :: ScriptInterpreter/Python/./ScriptInterpreterPythonTests/PythonDataObjectsTest.TestPythonFile (1824 of 2119) PASS: lldb-unit :: Utility/./UtilityTests/Flags.IsClear (1825 of 2119) PASS: lldb-api :: macosx/lc-note/kern-ver-str/TestKernVerStrLCNOTE.py (1826 of 2119) UNSUPPORTED: lldb-shell :: SymbolFile/PDB/enums-layout.test (1827 of 2119) PASS: lldb-shell :: SymbolFile/NativePDB/disassembly.cpp (1828 of 2119) PASS: lldb-api :: functionalities/data-formatter/ptr_ref_typedef/TestPtrRef2Typedef.py (1829 of 2119) PASS: lldb-unit :: Utility/./UtilityTests/StringExtractorTest.InitEmpty (1830 of 2119) PASS: lldb-unit :: Utility/./UtilityTests/BinaryStreamTest.PutULEB128MaxValue (1831 of 2119) PASS: lldb-api :: functionalities/gdb_remote_client/TestRestartBug.py (1832 of 2119) PASS: lldb-unit :: Utility/./UtilityTests/UriParserTest.Minimal (1833 of 2119) UNSUPPORTED: lldb-api :: commands/expression/completion-crash-invalid-iterator/TestInvalidIteratorCompletionCrash.py (1834 of 2119) PASS: lldb-shell :: Breakpoint/split-dwarf5-debug-stroffsets.test (1835 of 2119) PASS: lldb-unit :: Utility/./UtilityTests/SerializationRountripTest.SerializeDeserializeObjectReference (1836 of 2119) PASS: lldb-api :: lang/cpp/dynamic-value/TestCppValueCast.py (1837 of 2119) PASS: lldb-unit :: Utility/./UtilityTests/TimerTest.CategoryTimesNested (1838 of 2119) PASS: lldb-api :: commands/expression/top-level/TestTopLevelExprs.py (1839 of 2119) PASS: lldb-shell :: ObjectFile/ELF/section-permissions.yaml (1840 of 2119) PASS: lldb-api :: functionalities/object-file/TestImageListMultiArchitecture.py (1841 of 2119) PASS: lldb-api :: commands/reproducer/invalid-args/TestInvalidArgsReproducer.py (1842 of 2119) PASS: lldb-unit :: Process/minidump/./LLDBMinidumpTests/MinidumpParserTest.GetMemoryRegionInfoFromMemoryList (1843 of 2119) PASS: lldb-unit :: ScriptInterpreter/Python/./ScriptInterpreterPythonTests/PythonDataObjectsTest.TestPythonTupleInitializerList2 (1844 of 2119) PASS: lldb-api :: commands/breakpoint/set/func-regex/TestBreakpointRegexError.py (1845 of 2119) UNSUPPORTED: lldb-shell :: ScriptInterpreter/Lua/convenience_variables.test (1846 of 2119) PASS: lldb-api :: lang/c/step_over_no_deadlock/TestStepOverDoesntBlock.py (1847 of 2119) PASS: lldb-unit :: Signals/./SignalsTests/UnixSignalsTest.Iteration (1848 of 2119) PASS: lldb-unit :: Language/Highlighting/./HighlighterTests/HighlighterTest.ClangIdentifiers (1849 of 2119) PASS: lldb-unit :: Utility/./UtilityTests/BinaryStreamTest.PutULEB128One (1850 of 2119) PASS: lldb-unit :: Process/./ProcessEventDataTests/ProcessEventDataTest.ShouldStop (1851 of 2119) PASS: lldb-unit :: UnwindAssembly/x86/./UnwindAssemblyx86Tests/Testx86AssemblyInspectionEngine.TestPopR14 (1852 of 2119) PASS: lldb-unit :: Process/gdb-remote/./ProcessGdbRemoteTests/GDBRemoteCommunicationTest.ReadPacket_checksum (1853 of 2119) PASS: lldb-unit :: API/./APITests/SBCommandInterpreterTest.SingleWordCommand (1854 of 2119) PASS: lldb-unit :: Utility/./UtilityTests/StringListTest.LongestCommonPrefix (1855 of 2119) PASS: lldb-shell :: Driver/TestRepl.test (1856 of 2119) PASS: lldb-api :: commands/watchpoints/multiple_hits/TestMultipleHits.py (1857 of 2119) UNSUPPORTED: lldb-shell :: Register/arm-gp-read.test (1858 of 2119) PASS: lldb-unit :: Utility/./UtilityTests/XcodeSDKTest.GetCanonicalNameAndConstruct (1859 of 2119) PASS: lldb-api :: functionalities/tail_call_frames/sbapi_support/TestTailCallFrameSBAPI.py (1860 of 2119) PASS: lldb-unit :: Utility/./UtilityTests/StringListTest.JoinMultiCharSeparator (1861 of 2119) PASS: lldb-shell :: SymbolFile/DWARF/debug-types-missing-signature.test (1862 of 2119) PASS: lldb-api :: iohandler/resize/TestIOHandlerResizeNoEditline.py (1863 of 2119) PASS: lldb-shell :: ObjectFile/ELF/duplicate-section.yaml (1864 of 2119) UNSUPPORTED: lldb-shell :: Unwind/eh-frame-small-fde.test (1865 of 2119) PASS: lldb-shell :: SymbolFile/DWARF/debug-types-dwo-cross-reference.cpp (1866 of 2119) PASS: lldb-unit :: Utility/./UtilityTests/RangeTest.NotEqualInvalid (1867 of 2119) PASS: lldb-api :: lang/c/global_variables/TestGlobalVariables.py (1868 of 2119) PASS: lldb-shell :: Quit/TestQuitExitCode0.test (1869 of 2119) PASS: lldb-api :: functionalities/data-formatter/nsdictionarysynth/TestNSDictionarySynthetic.py (1870 of 2119) PASS: lldb-unit :: UnwindAssembly/x86/./UnwindAssemblyx86Tests/Testx86AssemblyInspectionEngine.TestDisassemblyJunkBytes (1871 of 2119) PASS: lldb-shell :: SymbolFile/DWARF/find-basic-variable.cpp (1872 of 2119) PASS: lldb-unit :: Language/Highlighting/./HighlighterTests/HighlighterTest.ClangCursorPosBeforeOtherToken (1873 of 2119) PASS: lldb-api :: linux/builtin_trap/TestBuiltinTrap.py (1874 of 2119) PASS: lldb-shell :: Quit/TestQuitExitCodeNonInt.test (1875 of 2119) PASS: lldb-unit :: Utility/./UtilityTests/StringExtractorTest.DecodeHexU8_Underflow2 (1876 of 2119) PASS: lldb-unit :: Symbol/./SymbolTests/SymbolsTest.LocateExecutableSymbolFileForUnknownExecutableAndMissingSymbolFile (1877 of 2119) PASS: lldb-unit :: Expression/./ExpressionTests/DiagnosticManagerTest.PutString (1878 of 2119) PASS: lldb-unit :: Language/CPlusPlus/./LanguageCPlusPlusTests/CPlusPlusLanguage.CPlusPlusNameParser (1879 of 2119) PASS: lldb-shell :: SymbolFile/DWARF/apple-index-is-used.cpp (1880 of 2119) PASS: lldb-api :: lang/objc/foundation/TestObjCMethods2.py (1881 of 2119) PASS: lldb-unit :: Utility/./UtilityTests/UUIDTest.SetFromStringRef (1882 of 2119) PASS: lldb-shell :: SymbolFile/DWARF/parallel-indexing-stress.s (1883 of 2119) PASS: lldb-unit :: Language/Highlighting/./HighlighterTests/HighlighterTest.ClangOperators (1884 of 2119) PASS: lldb-api :: functionalities/data-formatter/data-formatter-objc/TestDataFormatterObjCKVO.py (1885 of 2119) PASS: lldb-api :: functionalities/breakpoint/breakpoint_by_line_and_column/TestBreakpointByLineAndColumn.py (1886 of 2119) PASS: lldb-api :: python_api/function_symbol/TestSymbolAPI.py (1887 of 2119) PASS: lldb-unit :: Utility/./UtilityTests/ArgsTest.GetQuotedCommandString (1888 of 2119) PASS: lldb-unit :: Utility/./UtilityTests/DataExtractorTest.GetFloatUnaligned (1889 of 2119) PASS: lldb-api :: commands/frame/recognizer/TestFrameRecognizer.py (1890 of 2119) UNSUPPORTED: lldb-api :: arm/breakpoint-thumb-codesection/TestBreakpointThumbCodesection.py (1891 of 2119) PASS: lldb-shell :: Commands/command-thread-select.test (1892 of 2119) PASS: lldb-unit :: Expression/./ExpressionTests/CppModuleConfigurationTest.UnknownLibCppFile (1893 of 2119) PASS: lldb-shell :: ObjectFile/ELF/build-id-case.yaml (1894 of 2119) PASS: lldb-unit :: Process/gdb-remote/./ProcessGdbRemoteTests/GDBRemoteCommunicationServerTest.SendErrorResponse_StringError (1895 of 2119) UNSUPPORTED: lldb-shell :: SymbolFile/PDB/expressions.test (1896 of 2119) PASS: lldb-unit :: Symbol/./SymbolTests/TestTypeSystemClang.TestRecordHasFields (1897 of 2119) PASS: lldb-unit :: Host/./HostTests/NativeProcessProtocolTest.SetBreakpointFailVerify (1898 of 2119) PASS: lldb-api :: functionalities/jitloader_gdb/TestJITLoaderGDB.py (1899 of 2119) PASS: lldb-unit :: Utility/./UtilityTests/StreamTest.PutChar (1900 of 2119) PASS: lldb-unit :: Utility/./UtilityTests/StreamTest.PutCString (1901 of 2119) PASS: lldb-api :: commands/expression/ir-interpreter/TestIRInterpreter.py (1902 of 2119) PASS: lldb-api :: functionalities/thread/concurrent_events/TestConcurrentNWatchNBreak.py (1903 of 2119) PASS: lldb-unit :: Utility/./UtilityTests/GeneratorTest.Get (1904 of 2119) PASS: lldb-unit :: Process/gdb-remote/./ProcessGdbRemoteTests/GDBRemoteCommunicationClientTest.GetModulesInfoInvalidResponse (1905 of 2119) PASS: lldb-shell :: Reproducer/Functionalities/TestImageList.test (1906 of 2119) PASS: lldb-unit :: Utility/./UtilityTests/UriParserTest.TypicalPortPathIPv6 (1907 of 2119) PASS: lldb-api :: macosx/duplicate-archive-members/TestDuplicateMembers.py (1908 of 2119) UNSUPPORTED: lldb-api :: functionalities/unwind/standard/TestStandardUnwind.py (1909 of 2119) PASS: lldb-shell :: SymbolFile/DWARF/debug-types-signature-loop.s (1910 of 2119) PASS: lldb-api :: functionalities/breakpoint/breakpoint_hit_count/TestBreakpointHitCount.py (1911 of 2119) PASS: lldb-unit :: Utility/./UtilityTests/BinaryStreamTest.PutULEB128FourBytes (1912 of 2119) PASS: lldb-unit :: SymbolFile/NativePDB/./SymbolFileNativePDBTests/PDBFPOProgramToDWARFExpressionTests.UnresolvedCyclicRegisterAssignmentReference (1913 of 2119) PASS: lldb-unit :: Platform/./LLDBPlatformTests/PlatformDarwinTest.FindComponentInPath (1914 of 2119) PASS: lldb-unit :: Utility/./UtilityTests/OptionsWithRawTest.TerminatedQuote (1915 of 2119) PASS: lldb-api :: source-manager/TestSourceManager.py (1916 of 2119) PASS: lldb-api :: functionalities/thread/concurrent_events/TestConcurrentManyWatchpoints.py (1917 of 2119) PASS: lldb-unit :: Utility/./UtilityTests/ConstStringTest.UpdateMangledCounterpart (1918 of 2119) PASS: lldb-api :: functionalities/data-formatter/data-formatter-objc/TestDataFormatterObjCNSData.py (1919 of 2119) PASS: lldb-api :: python_api/watchpoint/condition/TestWatchpointConditionAPI.py (1920 of 2119) PASS: lldb-unit :: Utility/./UtilityTests/StructuredDataTest.StringDump (1921 of 2119) PASS: lldb-unit :: Host/./HostTests/NativeProcessProtocolTest.ReadMemoryWithoutTrap (1922 of 2119) PASS: lldb-unit :: Utility/./UtilityTests/StringListTest.AppendStringCString (1923 of 2119) PASS: lldb-unit :: Host/./HostTests/MainLoopTest.Signal (1924 of 2119) PASS: lldb-shell :: Process/Optimization.test (1925 of 2119) PASS: lldb-unit :: Expression/./ExpressionTests/DiagnosticManagerTest.AppendMessageNoDiag (1926 of 2119) UNSUPPORTED: lldb-api :: functionalities/thread/multi_break/TestMultipleBreakpoints.py (1927 of 2119) PASS: lldb-shell :: SymbolFile/DWARF/childless-compile-unit.s (1928 of 2119) PASS: lldb-unit :: Expression/./ExpressionTests/DiagnosticManagerTest.PutStringSeverities (1929 of 2119) UNSUPPORTED: lldb-shell :: ScriptInterpreter/Lua/quit.test (1930 of 2119) PASS: lldb-shell :: ObjectFile/Breakpad/sections.test (1931 of 2119) PASS: lldb-api :: functionalities/data-formatter/data-formatter-objc/TestDataFormatterObjCNSURL.py (1932 of 2119) PASS: lldb-unit :: Utility/./UtilityTests/VMRange.Comparison (1933 of 2119) UNSUPPORTED: lldb-api :: functionalities/data-formatter/data-formatter-stl/libstdcpp/smart_ptr/TestDataFormatterStdSmartPtr.py (1934 of 2119) PASS: lldb-unit :: Utility/./UtilityTests/VASprintfTest.BufferResize (1935 of 2119) PASS: lldb-unit :: Utility/./UtilityTests/RangeDataVector.FindEntryIndexesThatContain (1936 of 2119) PASS: lldb-api :: commands/expression/two-files/TestObjCTypeQueryFromOtherCompileUnit.py (1937 of 2119) PASS: lldb-api :: commands/expression/namespace_local_var_same_name_obj_c/TestNamespaceLocalVarSameNameObjC.py (1938 of 2119) PASS: lldb-shell :: ObjectFile/MachO/lc_build_version.yaml (1939 of 2119) PASS: lldb-unit :: Symbol/./SymbolTests/TestTypeSystemClang.TestGetTypeClassDeclType (1940 of 2119) PASS: lldb-api :: lang/objc/modules-cache/TestClangModulesCache.py (1941 of 2119) PASS: lldb-shell :: Heap/heap-cstr.test (1942 of 2119) PASS: lldb-api :: functionalities/data-formatter/data-formatter-proper-plurals/TestFormattersOneIsSingular.py (1943 of 2119) PASS: lldb-unit :: Instruction/./EmulatorTests/TestAArch64Emulator.TestOverflow (1944 of 2119) PASS: lldb-api :: commands/frame/diagnose/complicated-expression/TestComplicatedExpression.py (1945 of 2119) UNSUPPORTED: lldb-shell :: ScriptInterpreter/Lua/persistent_state.test (1946 of 2119) PASS: lldb-api :: functionalities/postmortem/elf-core/TestLinuxCore.py (1947 of 2119) PASS: lldb-api :: functionalities/thread/concurrent_events/TestConcurrentDelayWatchBreak.py (1948 of 2119) PASS: lldb-api :: lang/objc/modules-inline-functions/TestModulesInlineFunctions.py (1949 of 2119) PASS: lldb-unit :: SymbolFile/DWARF/./SymbolFileDWARFTests/SymbolFileDWARFTests.TestAbbrevValidAttrNullForm (1950 of 2119) PASS: lldb-unit :: UnwindAssembly/x86/./UnwindAssemblyx86Tests/Testx86AssemblyInspectionEngine.TestPopRBX (1951 of 2119) PASS: lldb-shell :: SymbolFile/DWARF/debug-types-dwarf5.s (1952 of 2119) PASS: lldb-api :: functionalities/thread/jump/TestThreadJump.py (1953 of 2119) PASS: lldb-unit :: Utility/./UtilityTests/ArgsTest.TestTrailingBackslash (1954 of 2119) PASS: lldb-unit :: Target/./TargetTests/ModuleCacheTest.GetAndPutUuidExists (1955 of 2119) PASS: lldb-api :: lang/cpp/symbols/TestSymbols.py (1956 of 2119) PASS: lldb-api :: python_api/lldbutil/iter/TestRegistersIterator.py (1957 of 2119) PASS: lldb-api :: functionalities/tail_call_frames/ambiguous_tail_call_seq1/TestAmbiguousTailCallSeq1.py (1958 of 2119) PASS: lldb-api :: commands/expression/import-std-module/unique_ptr/TestUniquePtrFromStdModule.py (1959 of 2119) PASS: lldb-api :: functionalities/data-formatter/synthupdate/TestSyntheticFilterRecompute.py (1960 of 2119) PASS: lldb-api :: lang/cpp/constructors/TestCppConstructors.py (1961 of 2119) PASS: lldb-unit :: Utility/./UtilityTests/StringListTest.SetSize (1962 of 2119) UNSUPPORTED: lldb-shell :: Register/x86-64-ymm16-write.test (1963 of 2119) PASS: lldb-unit :: Utility/./UtilityTests/UriParserTest.MinimalPath (1964 of 2119) PASS: lldb-unit :: Symbol/./SymbolTests/TestClangASTImporter.CompleteFwdDeclWithOtherOrigin (1965 of 2119) PASS: lldb-api :: functionalities/data-formatter/dump_dynamic/TestDumpDynamic.py (1966 of 2119) PASS: lldb-api :: lang/cpp/incomplete-types/TestCppIncompleteTypes.py (1967 of 2119) PASS: lldb-api :: functionalities/thread/concurrent_events/TestConcurrentTwoWatchpointsOneDelayBreakpoint.py (1968 of 2119) PASS: lldb-api :: functionalities/gdb_remote_client/TestWasm.py (1969 of 2119) PASS: lldb-unit :: Expression/./ExpressionTests/CppModuleConfigurationTest.LibCppV2 (1970 of 2119) PASS: lldb-unit :: Expression/./ExpressionTests/DiagnosticManagerTest.AddDiagnostic (1971 of 2119) PASS: lldb-api :: functionalities/unwind/noreturn/module-end/TestNoReturnModuleEnd.py (1972 of 2119) PASS: lldb-unit :: Utility/./UtilityTests/ArgsTest.StringListConstructor (1973 of 2119) PASS: lldb-unit :: Interpreter/./InterpreterTests/CompletionTest.FileCompletionAbsolute (1974 of 2119) PASS: lldb-shell :: ObjectFile/PECOFF/invalid-export-table.yaml (1975 of 2119) PASS: lldb-unit :: Utility/./UtilityTests/LogChannelTest.List (1976 of 2119) UNSUPPORTED: lldb-api :: functionalities/darwin_log/filter/exact_match/activity-chain/TestDarwinLogFilterMatchActivityChain.py (1977 of 2119) PASS: lldb-api :: commands/watchpoints/hello_watchpoint/TestMyFirstWatchpoint.py (1978 of 2119) PASS: lldb-unit :: UnwindAssembly/x86/./UnwindAssemblyx86Tests/Testx86AssemblyInspectionEngine.Test32BitOnlyInstruction (1979 of 2119) PASS: lldb-unit :: Process/minidump/./LLDBMinidumpTests/MinidumpParserTest.GetMemory (1980 of 2119) PASS: lldb-unit :: UnwindAssembly/x86/./UnwindAssemblyx86Tests/Testx86AssemblyInspectionEngine.TestSimplex86_64Augmented (1981 of 2119) PASS: lldb-unit :: Utility/./UtilityTests/StringListTest.GetMaxStringLengthEmpty (1982 of 2119) PASS: lldb-unit :: ObjectFile/PECOFF/./ObjectFilePECOFFTests/PECallFrameInfoTest.Basic_eh (1983 of 2119) PASS: lldb-shell :: ObjectFile/ELF/PT_LOAD-overlap-PT_TLS.yaml (1984 of 2119) PASS: lldb-unit :: Utility/./UtilityTests/RangeVector.CombineConsecutiveRanges (1985 of 2119) PASS: lldb-unit :: Utility/./UtilityTests/BinaryStreamTest.PutULEB128Zero (1986 of 2119) PASS: lldb-unit :: Utility/./UtilityTests/StateTest.Formatv (1987 of 2119) PASS: lldb-unit :: Process/minidump/./LLDBMinidumpTests/MinidumpParserTest.GetMemoryRegionInfoLinuxMaps (1988 of 2119) PASS: lldb-shell :: Driver/TestCommands.test (1989 of 2119) PASS: lldb-unit :: Utility/./UtilityTests/FileSpecTest.GetPath (1990 of 2119) PASS: lldb-unit :: Utility/./UtilityTests/StringListTest.LongestCommonPrefixEmpty (1991 of 2119) PASS: lldb-unit :: Language/Highlighting/./HighlighterTests/HighlighterTest.ClangTrailingBackslashMissingNewLine (1992 of 2119) PASS: lldb-api :: commands/expression/import-std-module/shared_ptr/TestSharedPtrFromStdModule.py (1993 of 2119) PASS: lldb-api :: functionalities/signal/raise/TestRaise.py (1994 of 2119) PASS: lldb-shell :: SymbolFile/NativePDB/source-list.cpp (1995 of 2119) PASS: lldb-shell :: Host/TestCustomShell.test (1996 of 2119) PASS: lldb-unit :: Utility/./UtilityTests/StatusTest.ErrorConversion (1997 of 2119) PASS: lldb-unit :: Process/gdb-remote/./ProcessGdbRemoteTests/GDBRemoteClientBaseTest.SendContinueDelegateStructuredDataReceipt (1998 of 2119) PASS: lldb-api :: lang/cpp/dynamic-value-same-basename/TestDynamicValueSameBase.py (1999 of 2119) UNSUPPORTED: lldb-api :: functionalities/darwin_log/source/info/TestDarwinLogSourceInfo.py (2000 of 2119) PASS: lldb-unit :: Utility/./UtilityTests/StreamTest.ShiftOperatorStrings (2001 of 2119) PASS: lldb-unit :: Utility/./UtilityTests/ArchSpecTest.MergeFromMachOUnknown (2002 of 2119) PASS: lldb-unit :: Utility/./UtilityTests/StringExtractorTest.DecodeHexU8_InvalidHex (2003 of 2119) PASS: lldb-api :: functionalities/target-new-solib-notifications/TestModuleLoadedNotifys.py (2004 of 2119) PASS: lldb-api :: commands/gui/basic/TestGuiBasic.py (2005 of 2119) PASS: lldb-api :: commands/command/delete/TestCommandDelete.py (2006 of 2119) PASS: lldb-unit :: Target/./TargetTests/PathMappingListTest.RelativeTests (2007 of 2119) PASS: lldb-unit :: Utility/./UtilityTests/RegisterValueTest.GetSet8 (2008 of 2119) PASS: lldb-unit :: Utility/./UtilityTests/RangeTest.Constructor (2009 of 2119) PASS: lldb-api :: functionalities/data-formatter/data-formatter-caching/TestDataFormatterCaching.py (2010 of 2119) UNSUPPORTED: lldb-shell :: Register/x86-gp-write.test (2011 of 2119) PASS: lldb-unit :: Process/gdb-remote/./ProcessGdbRemoteTests/GDBRemoteCommunicationClientTest.SendSignalsToIgnore (2012 of 2119) PASS: lldb-unit :: ObjectFile/Breakpad/./ObjectFileBreakpadTests/Record.classify (2013 of 2119) PASS: lldb-unit :: Symbol/./SymbolTests/TestClangASTImporter.RecordLayout (2014 of 2119) PASS: lldb-api :: functionalities/breakpoint/inlined_breakpoints/TestInlinedBreakpoints.py (2015 of 2119) PASS: lldb-api :: commands/frame/diagnose/inheritance/TestDiagnoseInheritance.py (2016 of 2119) PASS: lldb-unit :: Utility/./UtilityTests/VASprintfTest.NoBufferResize (2017 of 2119) PASS: lldb-shell :: SymbolFile/DWARF/win-i386-line-table.s (2018 of 2119) PASS: lldb-unit :: Process/minidump/./LLDBMinidumpTests/RegisterContextMinidump.CheckRegisterContextMinidump_ARM (2019 of 2119) PASS: lldb-unit :: Utility/./UtilityTests/UriParserTest.BadPort (2020 of 2119) PASS: lldb-api :: commands/process/signal/TestProcessSignal.py (2021 of 2119) PASS: lldb-api :: commands/command/script_alias/TestCommandScriptAlias.py (2022 of 2119) UNSUPPORTED: lldb-api :: tools/lldb-server/thread-name/TestGdbRemoteThreadName.py (2023 of 2119) PASS: lldb-unit :: Utility/./UtilityTests/LogChannelTest.EnableOptions (2024 of 2119) PASS: lldb-unit :: Language/Highlighting/./HighlighterTests/HighlighterTest.ClangCursorPosInOtherToken (2025 of 2119) PASS: lldb-unit :: Utility/./UtilityTests/StringListTest.CopyListEmpty (2026 of 2119) PASS: lldb-api :: sanity/TestSettingSkipping.py (2027 of 2119) PASS: lldb-api :: functionalities/data-formatter/synthcapping/TestSyntheticCapping.py (2028 of 2119) PASS: lldb-unit :: UnwindAssembly/x86/./UnwindAssemblyx86Tests/Testx86AssemblyInspectionEngine.TestStackRealignMSVC_i386 (2029 of 2119) PASS: lldb-unit :: Symbol/./SymbolTests/DWARFCallFrameInfoTest.Basic_dwarf4 (2030 of 2119) PASS: lldb-api :: python_api/frame/get-variables/TestGetVariables.py (2031 of 2119) PASS: lldb-api :: commands/frame/diagnose/local-variable/TestLocalVariable.py (2032 of 2119) PASS: lldb-api :: commands/expression/weak_symbols/TestWeakSymbols.py (2033 of 2119) PASS: lldb-unit :: Utility/./UtilityTests/StreamTest.PutRawBytesToMixedEndian (2034 of 2119) PASS: lldb-api :: functionalities/gdb_remote_client/TestTargetXMLArch.py (2035 of 2119) PASS: lldb-unit :: Process/minidump/./LLDBMinidumpTests/MinidumpParserTest.GetMiscInfo_no_stream (2036 of 2119) PASS: lldb-unit :: Utility/./UtilityTests/UriParserTest.BracketedHostnameWithPortIPv6 (2037 of 2119) PASS: lldb-unit :: Process/minidump/./LLDBMinidumpTests/MinidumpParserTest.MinidumpModuleOrder (2038 of 2119) PASS: lldb-unit :: Utility/./UtilityTests/ArgsTest.TestQuotedTrailingBackslash (2039 of 2119) PASS: lldb-unit :: Utility/./UtilityTests/StreamTest.PutHex8 (2040 of 2119) PASS: lldb-unit :: Utility/./UtilityTests/RangeDataVector.FindEntryThatContains (2041 of 2119) PASS: lldb-shell :: Watchpoint/SetErrorCases.test (2042 of 2119) PASS: lldb-unit :: Core/./LLDBCoreTests/StreamCallbackTest.Callback (2043 of 2119) PASS: lldb-unit :: Expression/./ExpressionTests/DiagnosticManagerTest.HasFixits (2044 of 2119) PASS: lldb-unit :: Utility/./UtilityTests/StringListTest.ForRange (2045 of 2119) PASS: lldb-shell :: ObjectFile/MachO/lc_version_min.yaml (2046 of 2119) PASS: lldb-api :: functionalities/data-formatter/setvaluefromcstring/TestSetValueFromCString.py (2047 of 2119) PASS: lldb-api :: tools/lldb-server/TestGdbRemoteExitCode.py (2048 of 2119) PASS: lldb-unit :: Language/Highlighting/./HighlighterTests/HighlighterTest.HighlighterSelectionPath (2049 of 2119) PASS: lldb-api :: functionalities/data-formatter/data-formatter-python-synth/TestDataFormatterPythonSynth.py (2050 of 2119) PASS: lldb-api :: commands/expression/multiline-completion/TestMultilineCompletion.py (2051 of 2119) PASS: lldb-unit :: Utility/./UtilityTests/BinaryStreamTest.PutSLEB128OneByte (2052 of 2119) PASS: lldb-api :: python_api/interpreter/TestCommandInterpreterAPI.py (2053 of 2119) PASS: lldb-unit :: Utility/./UtilityTests/AnsiTerminal.Unknown (2054 of 2119) PASS: lldb-api :: functionalities/thread/concurrent_events/TestConcurrentWatchpointWithDelayWatchpointThreads.py (2055 of 2119) PASS: lldb-api :: functionalities/data-formatter/typedef_array/TestTypedefArray.py (2056 of 2119) PASS: lldb-api :: lang/cpp/nsimport/TestCppNsImport.py (2057 of 2119) PASS: lldb-api :: commands/expression/import-std-module/unique_ptr-dbg-info-content/TestUniquePtrDbgInfoContent.py (2058 of 2119) PASS: lldb-unit :: UnwindAssembly/x86/./UnwindAssemblyx86Tests/Testx86AssemblyInspectionEngine.TestPushEAX (2059 of 2119) UNSUPPORTED: lldb-api :: tools/lldb-vscode/completions/TestVSCode_completions.py (2060 of 2119) UNSUPPORTED: lldb-shell :: SymbolFile/PDB/function-nested-block.test (2061 of 2119) PASS: lldb-api :: functionalities/gdb_remote_client/TestGDBRemoteClient.py (2062 of 2119) PASS: lldb-unit :: Utility/./UtilityTests/AnsiTerminal.KnownPrefix (2063 of 2119) PASS: lldb-api :: iohandler/unicode/TestUnicode.py (2064 of 2119) PASS: lldb-unit :: Host/./HostTests/Host.GetEnvironment (2065 of 2119) PASS: lldb-unit :: Utility/./UtilityTests/ArgsTest.TestSingleArg (2066 of 2119) PASS: lldb-unit :: Editline/./EditlineTests/EditlineTestFixture.EditlineReceivesSingleLineText (2067 of 2119) PASS: lldb-unit :: Utility/./UtilityTests/SerializationRountripTest.SerializeDeserializeObjectPointer (2068 of 2119) PASS: lldb-unit :: Utility/./UtilityTests/StringListTest.ShiftStdString (2069 of 2119) PASS: lldb-shell :: Minidump/memory-region.yaml (2070 of 2119) UNSUPPORTED: lldb-api :: functionalities/data-formatter/data-formatter-stl/libstdcpp/unique_ptr/TestDataFormatterStdUniquePtr.py (2071 of 2119) PASS: lldb-unit :: Utility/./UtilityTests/ScalarTest.GetBytes (2072 of 2119) PASS: lldb-unit :: ScriptInterpreter/Python/./ScriptInterpreterPythonTests/PythonDataObjectsTest.TestPythonStringToStructuredString (2073 of 2119) PASS: lldb-api :: api/listeners/TestListener.py (2074 of 2119) PASS: lldb-unit :: Process/minidump/./LLDBMinidumpTests/MinidumpParserTest.GetLinuxProcStatus_no_stream (2075 of 2119) UNSUPPORTED: lldb-shell :: Reproducer/TestLuaImport.test (2076 of 2119) PASS: lldb-shell :: SymbolFile/Breakpad/line-table-mixed-path-styles.test (2077 of 2119) PASS: lldb-api :: lang/objc/objc-new-syntax/TestObjCNewSyntaxArray.py (2078 of 2119) PASS: lldb-api :: lang/cpp/stl/TestStdCXXDisassembly.py (2079 of 2119) PASS: lldb-shell :: SymbolFile/DWARF/find-function-regex.cpp (2080 of 2119) PASS: lldb-unit :: Expression/./ExpressionTests/DiagnosticManagerTest.GetStringMultiline (2081 of 2119) PASS: lldb-unit :: ScriptInterpreter/Python/./ScriptInterpreterPythonTests/PythonDataObjectsTest.TestGlobalNameResolutionNoDot (2082 of 2119) UNSUPPORTED: lldb-api :: lang/c/unicode/TestUnicodeSymbols.py (2083 of 2119) PASS: lldb-unit :: Utility/./UtilityTests/UriParserTest.BracketedHostnamePort (2084 of 2119) PASS: lldb-api :: functionalities/return-value/TestReturnValue.py (2085 of 2119) PASS: lldb-unit :: Process/minidump/./LLDBMinidumpTests/MinidumpParserTest.GetMemoryRegionInfo (2086 of 2119) PASS: lldb-unit :: Utility/./UtilityTests/UriParserTest.BracketedHostnameWithColon (2087 of 2119) PASS: lldb-shell :: SymbolFile/DWARF/find-qualified-variable.cpp (2088 of 2119) PASS: lldb-api :: functionalities/backticks/TestBackticksWithoutATarget.py (2089 of 2119) PASS: lldb-unit :: Symbol/./SymbolTests/TestTypeSystemClang.TestUnifyAccessSpecifiers (2090 of 2119) UNSUPPORTED: lldb-api :: linux/add-symbols/TestTargetSymbolsAddCommand.py (2091 of 2119) PASS: lldb-api :: lang/objc/modules/TestObjCModules.py (2092 of 2119) PASS: lldb-unit :: SymbolFile/NativePDB/./SymbolFileNativePDBTests/PDBFPOProgramToDWARFExpressionTests.InvalidAssignmentSingle (2093 of 2119) PASS: lldb-shell :: Settings/TestFrameFormatColor.test (2094 of 2119) PASS: lldb-api :: tools/lldb-server/commandline/TestStubReverseConnect.py (2095 of 2119) PASS: lldb-unit :: Utility/./UtilityTests/CompletionRequest.TryCompleteCurrentArgBad (2096 of 2119) PASS: lldb-api :: lang/objcxx/hide-runtime-values/TestObjCXXHideRuntimeValues.py (2097 of 2119) PASS: lldb-api :: lang/cpp/alignas_base_class/TestAlignAsBaseClass.py (2098 of 2119) PASS: lldb-unit :: Utility/./UtilityTests/StatusTest.Formatv (2099 of 2119) PASS: lldb-api :: lang/cpp/modules-import/TestCXXModulesImport.py (2100 of 2119) PASS: lldb-shell :: SymbolFile/DWARF/DW_AT_loclists_base.s (2101 of 2119) PASS: lldb-api :: functionalities/multidebugger_commands/TestMultipleDebuggersCommands.py (2102 of 2119) PASS: lldb-unit :: Expression/./ExpressionTests/DiagnosticManagerTest.GetStringSeverityLabels (2103 of 2119) PASS: lldb-unit :: ScriptInterpreter/Python/./ScriptInterpreterPythonTests/PythonDataObjectsTest.TestPythonTupleSize (2104 of 2119) PASS: lldb-unit :: Host/./HostTests/ConnectionFileDescriptorTest.TCPGetURIv6 (2105 of 2119) PASS: lldb-shell :: ObjectFile/wasm/unified-debug-sections.yaml (2106 of 2119) PASS: lldb-unit :: Core/./LLDBCoreTests/RichManglingContextTest.IPDRealloc (2107 of 2119) PASS: lldb-api :: lang/cpp/operator-overload/TestOperatorOverload.py (2108 of 2119) PASS: lldb-shell :: ObjectFile/ELF/minidebuginfo-find-symbols.yaml (2109 of 2119) PASS: lldb-unit :: Symbol/./SymbolTests/PostfixExpression.ParseOneExpression (2110 of 2119) PASS: lldb-unit :: Utility/./UtilityTests/FileSpecTest.AppendPathComponent (2111 of 2119) PASS: lldb-api :: python_api/lldbutil/TestSwigVersion.py (2112 of 2119) PASS: lldb-api :: types/TestDoubleTypes.py (2113 of 2119) PASS: lldb-api :: lang/objc/objc-baseclass-sbtype/TestObjCBaseClassSBType.py (2114 of 2119) PASS: lldb-api :: tools/lldb-server/TestAppleSimulatorOSType.py (2115 of 2119) PASS: lldb-api :: lang/objc/objc-super/TestObjCSuper.py (2116 of 2119) PASS: lldb-api :: functionalities/asan/TestMemoryHistory.py (2117 of 2119) PASS: lldb-api :: commands/expression/persist_objc_pointeetype/TestPersistObjCPointeeType.py (2118 of 2119) PASS: lldb-api :: lang/objc/hidden-ivars/TestHiddenIvars.py (2119 of 2119) Slowest Tests: -------------------------------------------------------------------------- 128.12s: lldb-api :: functionalities/postmortem/mach-core/TestMachCore.py 118.06s: lldb-api :: lang/objc/foundation/TestObjCMethods.py 101.57s: lldb-api :: tools/lldb-server/TestLldbGdbServer.py 93.56s: lldb-api :: lang/cpp/enum_types/TestCPP11EnumTypes.py 79.40s: lldb-api :: lang/objc/objc-new-syntax/TestObjCNewSyntaxLiteral.py 76.50s: lldb-api :: lang/objc/foundation/TestFoundationDisassembly.py 76.33s: lldb-api :: lang/objc/objc-new-syntax/TestObjCNewSyntaxDictionary.py 74.04s: lldb-api :: lang/objc/exceptions/TestObjCExceptions.py 73.79s: lldb-api :: tools/lldb-server/TestAppleSimulatorOSType.py 71.05s: lldb-api :: types/TestLongTypes.py 70.74s: lldb-api :: lang/cpp/namespace/TestNamespaceLookup.py 69.45s: lldb-api :: lang/objc/foundation/TestObjCMethodsString.py 67.43s: lldb-api :: api/multithreaded/TestMultithreaded.py 62.73s: lldb-api :: types/TestLongTypesExpr.py 62.16s: lldb-api :: commands/expression/import_builtin_fileid/TestImportBuiltinFileID.py 58.23s: lldb-api :: functionalities/recursion/TestValueObjectRecursion.py 56.41s: lldb-api :: lang/objc/hidden-ivars/TestHiddenIvars.py 54.53s: lldb-api :: lang/objc/objc-property/TestObjCProperty.py 50.67s: lldb-api :: lang/objc/real-definition/TestRealDefinition.py 50.25s: lldb-api :: types/TestIntegerTypeExpr.py

Hide Details

Tests Times: -------------------------------------------------------------------------- [ Range ] :: [ Percentage ] :: [ Count ] -------------------------------------------------------------------------- [120s,130s) :: [ ] :: [ 1/2119] [110s,120s) :: [ ] :: [ 1/2119] [100s,110s) :: [ ] :: [ 1/2119] [ 90s,100s) :: [ ] :: [ 1/2119] [ 80s, 90s) :: [ ] :: [ 1/2119] [ 70s, 80s) :: [ ] :: [ 7/2119] [ 60s, 70s) :: [ ] :: [ 3/2119] [ 50s, 60s) :: [ ] :: [ 5/2119] [ 40s, 50s) :: [ ] :: [ 7/2119] [ 30s, 40s) :: [ ] :: [ 16/2119] [ 20s, 30s) :: [ ] :: [ 50/2119] [ 10s, 20s) :: [*** ] :: [ 168/2119] [ 0s, 10s) :: [*********************************** ] :: [1858/2119] -------------------------------------------------------------------------- ******************** Failed Tests (1): lldb-shell :: SymbolFile/DWARF/debug-line-basic.s

Hide Details

Hide Details

Testing Time: 1106.07s Unsupported : 151 Passed : 1961 Expectedly Failed: 6 Failed : 1 FAILED: tools/lldb/test/CMakeFiles/check-lldb-lit cd /Users/buildslave/jenkins/workspace/lldb-cmake/lldb-build/tools/lldb/test && /usr/local/Frameworks/Python.framework/Versions/3.7/bin/python3.7 /Users/buildslave/jenkins/workspace/lldb-cmake/lldb-build/./bin/llvm-lit -v --time-tests --shuffle --xunit-xml-output=/Users/buildslave/jenkins/workspace/lldb-cmake/test/results.xml -v /Users/buildslave/jenkins/workspace/lldb-cmake/lldb-build/tools/lldb/test ninja: build stopped: subcommand failed. Command failed: Command '['/usr/bin/env', 'TERM=vt100', '/usr/local/bin/ninja', '-v', 'check-lldb']' returned non-zero exit status 1 Command: ['/usr/bin/env', 'TERM=vt100', '/usr/local/bin/ninja', '-v', 'check-lldb'] [Pipeline] } [Pipeline] // timeout [Pipeline] } [Pipeline] // stage [Pipeline] stage [Pipeline] { (Declarative: Post Actions) [Pipeline] scanForIssues [Clang (LLVM based)] Sleeping for 5 seconds due to JENKINS-32191... [Clang (LLVM based)] Parsing console log (workspace: '/Users/buildslave/jenkins/workspace/lldb-cmake') [Clang (LLVM based)] Successfully parsed console log [Clang (LLVM based)] -> found 14 issues (skipped 105 duplicates) [Clang (LLVM based)] Post processing issues on 'green-dragon-10' with source code encoding 'UTF-8' [Clang (LLVM based)] Creating SCM blamer to obtain author and commit information for affected files [Clang (LLVM based)] Creating SCM miner to obtain statistics for affected repository files [Clang (LLVM based)] Resolving file names for all issues in source directory '/Users/buildslave/jenkins/workspace/lldb-cmake' [Clang (LLVM based)] -> resolved paths in source directory (9 found, 0 not found) [Clang (LLVM based)] Resolving module names from module definitions (build.xml, pom.xml, or Manifest.mf files) [Clang (LLVM based)] -> resolved module names for 14 issues [Clang (LLVM based)] Resolving package names (or namespaces) by parsing the affected files [Clang (LLVM based)] -> resolved package names of 8 affected files [Clang (LLVM based)] No filter has been set, publishing all 13 issues [Clang (LLVM based)] Creating fingerprints for all affected code blocks to track issues over different builds [Clang (LLVM based)] -> created fingerprints for 13 issues (skipped 0 issues) [Clang (LLVM based)] Copying affected files to Jenkins' build folder '/Users/Shared/Jenkins/Home/jobs/lldb-cmake/builds/23256/files-with-issues' [Clang (LLVM based)] -> 6 copied, 2 not in workspace, 0 not-found, 0 with I/O error [Pipeline] junit Recording test results [Pipeline] } [Pipeline] // stage [Pipeline] } [Pipeline] // withEnv [Pipeline] } [Pipeline] // node [Pipeline] End of Pipeline ERROR: script returned exit code 1 Finished: FAILURE