FailedConsole Output

Skipping 268 KB.. Full Log
roject/llvm/utils/TableGen/InstrInfoEmitter.cpp
[173/4529] /Applications/Xcode.app/Contents/Developer/Toolchains/XcodeDefault.xctoolchain/usr/bin/c++  -DEXPENSIVE_CHECKS -DGTEST_HAS_RTTI=0 -D_DEBUG -D_GLIBCXX_DEBUG -D__STDC_CONSTANT_MACROS -D__STDC_FORMAT_MACROS -D__STDC_LIMIT_MACROS -Iutils/TableGen -I/Users/buildslave/jenkins/workspace/clang-stage1-cmake-RA-expensive/llvm-project/llvm/utils/TableGen -I/Applications/Xcode.app/Contents/Developer/Platforms/MacOSX.platform/Developer/SDKs/MacOSX10.13.sdk/usr/include/libxml2 -Iinclude -I/Users/buildslave/jenkins/workspace/clang-stage1-cmake-RA-expensive/llvm-project/llvm/include -fPIC -fvisibility-inlines-hidden -Werror=date-time -Werror=unguarded-availability-new -Wall -Wextra -Wno-unused-parameter -Wwrite-strings -Wcast-qual -Wmissing-field-initializers -pedantic -Wno-long-long -Wimplicit-fallthrough -Wcovered-switch-default -Wno-noexcept-type -Wnon-virtual-dtor -Wdelete-non-virtual-dtor -Wstring-conversion -fdiagnostics-color -O3  -isysroot /Applications/Xcode.app/Contents/Developer/Platforms/MacOSX.platform/Developer/SDKs/MacOSX10.13.sdk -mmacosx-version-min=10.9   -UNDEBUG  -fno-exceptions -fno-rtti -std=c++14 -MD -MT utils/TableGen/CMakeFiles/llvm-tblgen.dir/IntrinsicEmitter.cpp.o -MF utils/TableGen/CMakeFiles/llvm-tblgen.dir/IntrinsicEmitter.cpp.o.d -o utils/TableGen/CMakeFiles/llvm-tblgen.dir/IntrinsicEmitter.cpp.o -c /Users/buildslave/jenkins/workspace/clang-stage1-cmake-RA-expensive/llvm-project/llvm/utils/TableGen/IntrinsicEmitter.cpp
[174/4529] /Applications/Xcode.app/Contents/Developer/Toolchains/XcodeDefault.xctoolchain/usr/bin/c++  -DEXPENSIVE_CHECKS -DGTEST_HAS_RTTI=0 -D_DEBUG -D_GLIBCXX_DEBUG -D__STDC_CONSTANT_MACROS -D__STDC_FORMAT_MACROS -D__STDC_LIMIT_MACROS -Iutils/TableGen -I/Users/buildslave/jenkins/workspace/clang-stage1-cmake-RA-expensive/llvm-project/llvm/utils/TableGen -I/Applications/Xcode.app/Contents/Developer/Platforms/MacOSX.platform/Developer/SDKs/MacOSX10.13.sdk/usr/include/libxml2 -Iinclude -I/Users/buildslave/jenkins/workspace/clang-stage1-cmake-RA-expensive/llvm-project/llvm/include -fPIC -fvisibility-inlines-hidden -Werror=date-time -Werror=unguarded-availability-new -Wall -Wextra -Wno-unused-parameter -Wwrite-strings -Wcast-qual -Wmissing-field-initializers -pedantic -Wno-long-long -Wimplicit-fallthrough -Wcovered-switch-default -Wno-noexcept-type -Wnon-virtual-dtor -Wdelete-non-virtual-dtor -Wstring-conversion -fdiagnostics-color -O3  -isysroot /Applications/Xcode.app/Contents/Developer/Platforms/MacOSX.platform/Developer/SDKs/MacOSX10.13.sdk -mmacosx-version-min=10.9   -UNDEBUG  -fno-exceptions -fno-rtti -std=c++14 -MD -MT utils/TableGen/CMakeFiles/llvm-tblgen.dir/SDNodeProperties.cpp.o -MF utils/TableGen/CMakeFiles/llvm-tblgen.dir/SDNodeProperties.cpp.o.d -o utils/TableGen/CMakeFiles/llvm-tblgen.dir/SDNodeProperties.cpp.o -c /Users/buildslave/jenkins/workspace/clang-stage1-cmake-RA-expensive/llvm-project/llvm/utils/TableGen/SDNodeProperties.cpp
[175/4529] /Applications/Xcode.app/Contents/Developer/Toolchains/XcodeDefault.xctoolchain/usr/bin/c++  -DEXPENSIVE_CHECKS -DGTEST_HAS_RTTI=0 -D_DEBUG -D_GLIBCXX_DEBUG -D__STDC_CONSTANT_MACROS -D__STDC_FORMAT_MACROS -D__STDC_LIMIT_MACROS -Iutils/TableGen -I/Users/buildslave/jenkins/workspace/clang-stage1-cmake-RA-expensive/llvm-project/llvm/utils/TableGen -I/Applications/Xcode.app/Contents/Developer/Platforms/MacOSX.platform/Developer/SDKs/MacOSX10.13.sdk/usr/include/libxml2 -Iinclude -I/Users/buildslave/jenkins/workspace/clang-stage1-cmake-RA-expensive/llvm-project/llvm/include -fPIC -fvisibility-inlines-hidden -Werror=date-time -Werror=unguarded-availability-new -Wall -Wextra -Wno-unused-parameter -Wwrite-strings -Wcast-qual -Wmissing-field-initializers -pedantic -Wno-long-long -Wimplicit-fallthrough -Wcovered-switch-default -Wno-noexcept-type -Wnon-virtual-dtor -Wdelete-non-virtual-dtor -Wstring-conversion -fdiagnostics-color -O3  -isysroot /Applications/Xcode.app/Contents/Developer/Platforms/MacOSX.platform/Developer/SDKs/MacOSX10.13.sdk -mmacosx-version-min=10.9   -UNDEBUG  -fno-exceptions -fno-rtti -std=c++14 -MD -MT utils/TableGen/CMakeFiles/llvm-tblgen.dir/FixedLenDecoderEmitter.cpp.o -MF utils/TableGen/CMakeFiles/llvm-tblgen.dir/FixedLenDecoderEmitter.cpp.o.d -o utils/TableGen/CMakeFiles/llvm-tblgen.dir/FixedLenDecoderEmitter.cpp.o -c /Users/buildslave/jenkins/workspace/clang-stage1-cmake-RA-expensive/llvm-project/llvm/utils/TableGen/FixedLenDecoderEmitter.cpp
[176/4529] /Applications/Xcode.app/Contents/Developer/Toolchains/XcodeDefault.xctoolchain/usr/bin/c++  -DEXPENSIVE_CHECKS -DGTEST_HAS_RTTI=0 -D_DEBUG -D_GLIBCXX_DEBUG -D__STDC_CONSTANT_MACROS -D__STDC_FORMAT_MACROS -D__STDC_LIMIT_MACROS -Iutils/TableGen -I/Users/buildslave/jenkins/workspace/clang-stage1-cmake-RA-expensive/llvm-project/llvm/utils/TableGen -I/Applications/Xcode.app/Contents/Developer/Platforms/MacOSX.platform/Developer/SDKs/MacOSX10.13.sdk/usr/include/libxml2 -Iinclude -I/Users/buildslave/jenkins/workspace/clang-stage1-cmake-RA-expensive/llvm-project/llvm/include -fPIC -fvisibility-inlines-hidden -Werror=date-time -Werror=unguarded-availability-new -Wall -Wextra -Wno-unused-parameter -Wwrite-strings -Wcast-qual -Wmissing-field-initializers -pedantic -Wno-long-long -Wimplicit-fallthrough -Wcovered-switch-default -Wno-noexcept-type -Wnon-virtual-dtor -Wdelete-non-virtual-dtor -Wstring-conversion -fdiagnostics-color -O3  -isysroot /Applications/Xcode.app/Contents/Developer/Platforms/MacOSX.platform/Developer/SDKs/MacOSX10.13.sdk -mmacosx-version-min=10.9   -UNDEBUG  -fno-exceptions -fno-rtti -std=c++14 -MD -MT utils/TableGen/CMakeFiles/llvm-tblgen.dir/Types.cpp.o -MF utils/TableGen/CMakeFiles/llvm-tblgen.dir/Types.cpp.o.d -o utils/TableGen/CMakeFiles/llvm-tblgen.dir/Types.cpp.o -c /Users/buildslave/jenkins/workspace/clang-stage1-cmake-RA-expensive/llvm-project/llvm/utils/TableGen/Types.cpp
[177/4529] /Applications/Xcode.app/Contents/Developer/Toolchains/XcodeDefault.xctoolchain/usr/bin/c++  -DEXPENSIVE_CHECKS -DGTEST_HAS_RTTI=0 -D_DEBUG -D_GLIBCXX_DEBUG -D__STDC_CONSTANT_MACROS -D__STDC_FORMAT_MACROS -D__STDC_LIMIT_MACROS -Iutils/TableGen -I/Users/buildslave/jenkins/workspace/clang-stage1-cmake-RA-expensive/llvm-project/llvm/utils/TableGen -I/Applications/Xcode.app/Contents/Developer/Platforms/MacOSX.platform/Developer/SDKs/MacOSX10.13.sdk/usr/include/libxml2 -Iinclude -I/Users/buildslave/jenkins/workspace/clang-stage1-cmake-RA-expensive/llvm-project/llvm/include -fPIC -fvisibility-inlines-hidden -Werror=date-time -Werror=unguarded-availability-new -Wall -Wextra -Wno-unused-parameter -Wwrite-strings -Wcast-qual -Wmissing-field-initializers -pedantic -Wno-long-long -Wimplicit-fallthrough -Wcovered-switch-default -Wno-noexcept-type -Wnon-virtual-dtor -Wdelete-non-virtual-dtor -Wstring-conversion -fdiagnostics-color -O3  -isysroot /Applications/Xcode.app/Contents/Developer/Platforms/MacOSX.platform/Developer/SDKs/MacOSX10.13.sdk -mmacosx-version-min=10.9   -UNDEBUG  -fno-exceptions -fno-rtti -std=c++14 -MD -MT utils/TableGen/CMakeFiles/llvm-tblgen.dir/PseudoLoweringEmitter.cpp.o -MF utils/TableGen/CMakeFiles/llvm-tblgen.dir/PseudoLoweringEmitter.cpp.o.d -o utils/TableGen/CMakeFiles/llvm-tblgen.dir/PseudoLoweringEmitter.cpp.o -c /Users/buildslave/jenkins/workspace/clang-stage1-cmake-RA-expensive/llvm-project/llvm/utils/TableGen/PseudoLoweringEmitter.cpp
[178/4529] /Applications/Xcode.app/Contents/Developer/Toolchains/XcodeDefault.xctoolchain/usr/bin/c++  -DEXPENSIVE_CHECKS -DGTEST_HAS_RTTI=0 -D_DEBUG -D_GLIBCXX_DEBUG -D__STDC_CONSTANT_MACROS -D__STDC_FORMAT_MACROS -D__STDC_LIMIT_MACROS -Iutils/TableGen -I/Users/buildslave/jenkins/workspace/clang-stage1-cmake-RA-expensive/llvm-project/llvm/utils/TableGen -I/Applications/Xcode.app/Contents/Developer/Platforms/MacOSX.platform/Developer/SDKs/MacOSX10.13.sdk/usr/include/libxml2 -Iinclude -I/Users/buildslave/jenkins/workspace/clang-stage1-cmake-RA-expensive/llvm-project/llvm/include -fPIC -fvisibility-inlines-hidden -Werror=date-time -Werror=unguarded-availability-new -Wall -Wextra -Wno-unused-parameter -Wwrite-strings -Wcast-qual -Wmissing-field-initializers -pedantic -Wno-long-long -Wimplicit-fallthrough -Wcovered-switch-default -Wno-noexcept-type -Wnon-virtual-dtor -Wdelete-non-virtual-dtor -Wstring-conversion -fdiagnostics-color -O3  -isysroot /Applications/Xcode.app/Contents/Developer/Platforms/MacOSX.platform/Developer/SDKs/MacOSX10.13.sdk -mmacosx-version-min=10.9   -UNDEBUG  -fno-exceptions -fno-rtti -std=c++14 -MD -MT utils/TableGen/CMakeFiles/llvm-tblgen.dir/SubtargetFeatureInfo.cpp.o -MF utils/TableGen/CMakeFiles/llvm-tblgen.dir/SubtargetFeatureInfo.cpp.o.d -o utils/TableGen/CMakeFiles/llvm-tblgen.dir/SubtargetFeatureInfo.cpp.o -c /Users/buildslave/jenkins/workspace/clang-stage1-cmake-RA-expensive/llvm-project/llvm/utils/TableGen/SubtargetFeatureInfo.cpp
[179/4529] /Applications/Xcode.app/Contents/Developer/Toolchains/XcodeDefault.xctoolchain/usr/bin/c++  -DEXPENSIVE_CHECKS -DGTEST_HAS_RTTI=0 -D_DEBUG -D_GLIBCXX_DEBUG -D__STDC_CONSTANT_MACROS -D__STDC_FORMAT_MACROS -D__STDC_LIMIT_MACROS -Iutils/TableGen -I/Users/buildslave/jenkins/workspace/clang-stage1-cmake-RA-expensive/llvm-project/llvm/utils/TableGen -I/Applications/Xcode.app/Contents/Developer/Platforms/MacOSX.platform/Developer/SDKs/MacOSX10.13.sdk/usr/include/libxml2 -Iinclude -I/Users/buildslave/jenkins/workspace/clang-stage1-cmake-RA-expensive/llvm-project/llvm/include -fPIC -fvisibility-inlines-hidden -Werror=date-time -Werror=unguarded-availability-new -Wall -Wextra -Wno-unused-parameter -Wwrite-strings -Wcast-qual -Wmissing-field-initializers -pedantic -Wno-long-long -Wimplicit-fallthrough -Wcovered-switch-default -Wno-noexcept-type -Wnon-virtual-dtor -Wdelete-non-virtual-dtor -Wstring-conversion -fdiagnostics-color -O3  -isysroot /Applications/Xcode.app/Contents/Developer/Platforms/MacOSX.platform/Developer/SDKs/MacOSX10.13.sdk -mmacosx-version-min=10.9   -UNDEBUG  -fno-exceptions -fno-rtti -std=c++14 -MD -MT utils/TableGen/CMakeFiles/llvm-tblgen.dir/RegisterBankEmitter.cpp.o -MF utils/TableGen/CMakeFiles/llvm-tblgen.dir/RegisterBankEmitter.cpp.o.d -o utils/TableGen/CMakeFiles/llvm-tblgen.dir/RegisterBankEmitter.cpp.o -c /Users/buildslave/jenkins/workspace/clang-stage1-cmake-RA-expensive/llvm-project/llvm/utils/TableGen/RegisterBankEmitter.cpp
[180/4529] /Applications/Xcode.app/Contents/Developer/Toolchains/XcodeDefault.xctoolchain/usr/bin/c++  -DEXPENSIVE_CHECKS -DGTEST_HAS_RTTI=0 -D_DEBUG -D_GLIBCXX_DEBUG -D__STDC_CONSTANT_MACROS -D__STDC_FORMAT_MACROS -D__STDC_LIMIT_MACROS -Iutils/TableGen -I/Users/buildslave/jenkins/workspace/clang-stage1-cmake-RA-expensive/llvm-project/llvm/utils/TableGen -I/Applications/Xcode.app/Contents/Developer/Platforms/MacOSX.platform/Developer/SDKs/MacOSX10.13.sdk/usr/include/libxml2 -Iinclude -I/Users/buildslave/jenkins/workspace/clang-stage1-cmake-RA-expensive/llvm-project/llvm/include -fPIC -fvisibility-inlines-hidden -Werror=date-time -Werror=unguarded-availability-new -Wall -Wextra -Wno-unused-parameter -Wwrite-strings -Wcast-qual -Wmissing-field-initializers -pedantic -Wno-long-long -Wimplicit-fallthrough -Wcovered-switch-default -Wno-noexcept-type -Wnon-virtual-dtor -Wdelete-non-virtual-dtor -Wstring-conversion -fdiagnostics-color -O3  -isysroot /Applications/Xcode.app/Contents/Developer/Platforms/MacOSX.platform/Developer/SDKs/MacOSX10.13.sdk -mmacosx-version-min=10.9   -UNDEBUG  -fno-exceptions -fno-rtti -std=c++14 -MD -MT utils/TableGen/CMakeFiles/llvm-tblgen.dir/X86ModRMFilters.cpp.o -MF utils/TableGen/CMakeFiles/llvm-tblgen.dir/X86ModRMFilters.cpp.o.d -o utils/TableGen/CMakeFiles/llvm-tblgen.dir/X86ModRMFilters.cpp.o -c /Users/buildslave/jenkins/workspace/clang-stage1-cmake-RA-expensive/llvm-project/llvm/utils/TableGen/X86ModRMFilters.cpp
[181/4529] /Applications/Xcode.app/Contents/Developer/Toolchains/XcodeDefault.xctoolchain/usr/bin/c++  -DEXPENSIVE_CHECKS -DGTEST_HAS_RTTI=0 -D_DEBUG -D_GLIBCXX_DEBUG -D__STDC_CONSTANT_MACROS -D__STDC_FORMAT_MACROS -D__STDC_LIMIT_MACROS -Iutils/TableGen -I/Users/buildslave/jenkins/workspace/clang-stage1-cmake-RA-expensive/llvm-project/llvm/utils/TableGen -I/Applications/Xcode.app/Contents/Developer/Platforms/MacOSX.platform/Developer/SDKs/MacOSX10.13.sdk/usr/include/libxml2 -Iinclude -I/Users/buildslave/jenkins/workspace/clang-stage1-cmake-RA-expensive/llvm-project/llvm/include -fPIC -fvisibility-inlines-hidden -Werror=date-time -Werror=unguarded-availability-new -Wall -Wextra -Wno-unused-parameter -Wwrite-strings -Wcast-qual -Wmissing-field-initializers -pedantic -Wno-long-long -Wimplicit-fallthrough -Wcovered-switch-default -Wno-noexcept-type -Wnon-virtual-dtor -Wdelete-non-virtual-dtor -Wstring-conversion -fdiagnostics-color -O3  -isysroot /Applications/Xcode.app/Contents/Developer/Platforms/MacOSX.platform/Developer/SDKs/MacOSX10.13.sdk -mmacosx-version-min=10.9   -UNDEBUG  -fno-exceptions -fno-rtti -std=c++14 -MD -MT utils/TableGen/CMakeFiles/llvm-tblgen.dir/RISCVCompressInstEmitter.cpp.o -MF utils/TableGen/CMakeFiles/llvm-tblgen.dir/RISCVCompressInstEmitter.cpp.o.d -o utils/TableGen/CMakeFiles/llvm-tblgen.dir/RISCVCompressInstEmitter.cpp.o -c /Users/buildslave/jenkins/workspace/clang-stage1-cmake-RA-expensive/llvm-project/llvm/utils/TableGen/RISCVCompressInstEmitter.cpp
[182/4529] /Applications/Xcode.app/Contents/Developer/Toolchains/XcodeDefault.xctoolchain/usr/bin/c++  -DEXPENSIVE_CHECKS -DGTEST_HAS_RTTI=0 -D_DEBUG -D_GLIBCXX_DEBUG -D__STDC_CONSTANT_MACROS -D__STDC_FORMAT_MACROS -D__STDC_LIMIT_MACROS -Iutils/TableGen -I/Users/buildslave/jenkins/workspace/clang-stage1-cmake-RA-expensive/llvm-project/llvm/utils/TableGen -I/Applications/Xcode.app/Contents/Developer/Platforms/MacOSX.platform/Developer/SDKs/MacOSX10.13.sdk/usr/include/libxml2 -Iinclude -I/Users/buildslave/jenkins/workspace/clang-stage1-cmake-RA-expensive/llvm-project/llvm/include -fPIC -fvisibility-inlines-hidden -Werror=date-time -Werror=unguarded-availability-new -Wall -Wextra -Wno-unused-parameter -Wwrite-strings -Wcast-qual -Wmissing-field-initializers -pedantic -Wno-long-long -Wimplicit-fallthrough -Wcovered-switch-default -Wno-noexcept-type -Wnon-virtual-dtor -Wdelete-non-virtual-dtor -Wstring-conversion -fdiagnostics-color -O3  -isysroot /Applications/Xcode.app/Contents/Developer/Platforms/MacOSX.platform/Developer/SDKs/MacOSX10.13.sdk -mmacosx-version-min=10.9   -UNDEBUG  -fno-exceptions -fno-rtti -std=c++14 -MD -MT utils/TableGen/CMakeFiles/llvm-tblgen.dir/X86DisassemblerTables.cpp.o -MF utils/TableGen/CMakeFiles/llvm-tblgen.dir/X86DisassemblerTables.cpp.o.d -o utils/TableGen/CMakeFiles/llvm-tblgen.dir/X86DisassemblerTables.cpp.o -c /Users/buildslave/jenkins/workspace/clang-stage1-cmake-RA-expensive/llvm-project/llvm/utils/TableGen/X86DisassemblerTables.cpp
[183/4529] /Applications/Xcode.app/Contents/Developer/Toolchains/XcodeDefault.xctoolchain/usr/bin/c++  -DEXPENSIVE_CHECKS -DGTEST_HAS_RTTI=0 -D_DEBUG -D_GLIBCXX_DEBUG -D__STDC_CONSTANT_MACROS -D__STDC_FORMAT_MACROS -D__STDC_LIMIT_MACROS -Iutils/TableGen -I/Users/buildslave/jenkins/workspace/clang-stage1-cmake-RA-expensive/llvm-project/llvm/utils/TableGen -I/Applications/Xcode.app/Contents/Developer/Platforms/MacOSX.platform/Developer/SDKs/MacOSX10.13.sdk/usr/include/libxml2 -Iinclude -I/Users/buildslave/jenkins/workspace/clang-stage1-cmake-RA-expensive/llvm-project/llvm/include -fPIC -fvisibility-inlines-hidden -Werror=date-time -Werror=unguarded-availability-new -Wall -Wextra -Wno-unused-parameter -Wwrite-strings -Wcast-qual -Wmissing-field-initializers -pedantic -Wno-long-long -Wimplicit-fallthrough -Wcovered-switch-default -Wno-noexcept-type -Wnon-virtual-dtor -Wdelete-non-virtual-dtor -Wstring-conversion -fdiagnostics-color -O3  -isysroot /Applications/Xcode.app/Contents/Developer/Platforms/MacOSX.platform/Developer/SDKs/MacOSX10.13.sdk -mmacosx-version-min=10.9   -UNDEBUG  -fno-exceptions -fno-rtti -std=c++14 -MD -MT utils/TableGen/CMakeFiles/llvm-tblgen.dir/TableGen.cpp.o -MF utils/TableGen/CMakeFiles/llvm-tblgen.dir/TableGen.cpp.o.d -o utils/TableGen/CMakeFiles/llvm-tblgen.dir/TableGen.cpp.o -c /Users/buildslave/jenkins/workspace/clang-stage1-cmake-RA-expensive/llvm-project/llvm/utils/TableGen/TableGen.cpp
[184/4529] /Applications/Xcode.app/Contents/Developer/Toolchains/XcodeDefault.xctoolchain/usr/bin/c++  -DEXPENSIVE_CHECKS -DGTEST_HAS_RTTI=0 -D_DEBUG -D_GLIBCXX_DEBUG -D__STDC_CONSTANT_MACROS -D__STDC_FORMAT_MACROS -D__STDC_LIMIT_MACROS -Iutils/TableGen -I/Users/buildslave/jenkins/workspace/clang-stage1-cmake-RA-expensive/llvm-project/llvm/utils/TableGen -I/Applications/Xcode.app/Contents/Developer/Platforms/MacOSX.platform/Developer/SDKs/MacOSX10.13.sdk/usr/include/libxml2 -Iinclude -I/Users/buildslave/jenkins/workspace/clang-stage1-cmake-RA-expensive/llvm-project/llvm/include -fPIC -fvisibility-inlines-hidden -Werror=date-time -Werror=unguarded-availability-new -Wall -Wextra -Wno-unused-parameter -Wwrite-strings -Wcast-qual -Wmissing-field-initializers -pedantic -Wno-long-long -Wimplicit-fallthrough -Wcovered-switch-default -Wno-noexcept-type -Wnon-virtual-dtor -Wdelete-non-virtual-dtor -Wstring-conversion -fdiagnostics-color -O3  -isysroot /Applications/Xcode.app/Contents/Developer/Platforms/MacOSX.platform/Developer/SDKs/MacOSX10.13.sdk -mmacosx-version-min=10.9   -UNDEBUG  -fno-exceptions -fno-rtti -std=c++14 -MD -MT utils/TableGen/CMakeFiles/llvm-tblgen.dir/X86EVEX2VEXTablesEmitter.cpp.o -MF utils/TableGen/CMakeFiles/llvm-tblgen.dir/X86EVEX2VEXTablesEmitter.cpp.o.d -o utils/TableGen/CMakeFiles/llvm-tblgen.dir/X86EVEX2VEXTablesEmitter.cpp.o -c /Users/buildslave/jenkins/workspace/clang-stage1-cmake-RA-expensive/llvm-project/llvm/utils/TableGen/X86EVEX2VEXTablesEmitter.cpp
[185/4529] /Applications/Xcode.app/Contents/Developer/Toolchains/XcodeDefault.xctoolchain/usr/bin/c++  -DEXPENSIVE_CHECKS -DGTEST_HAS_RTTI=0 -D_DEBUG -D_GLIBCXX_DEBUG -D__STDC_CONSTANT_MACROS -D__STDC_FORMAT_MACROS -D__STDC_LIMIT_MACROS -Iutils/TableGen -I/Users/buildslave/jenkins/workspace/clang-stage1-cmake-RA-expensive/llvm-project/llvm/utils/TableGen -I/Applications/Xcode.app/Contents/Developer/Platforms/MacOSX.platform/Developer/SDKs/MacOSX10.13.sdk/usr/include/libxml2 -Iinclude -I/Users/buildslave/jenkins/workspace/clang-stage1-cmake-RA-expensive/llvm-project/llvm/include -fPIC -fvisibility-inlines-hidden -Werror=date-time -Werror=unguarded-availability-new -Wall -Wextra -Wno-unused-parameter -Wwrite-strings -Wcast-qual -Wmissing-field-initializers -pedantic -Wno-long-long -Wimplicit-fallthrough -Wcovered-switch-default -Wno-noexcept-type -Wnon-virtual-dtor -Wdelete-non-virtual-dtor -Wstring-conversion -fdiagnostics-color -O3  -isysroot /Applications/Xcode.app/Contents/Developer/Platforms/MacOSX.platform/Developer/SDKs/MacOSX10.13.sdk -mmacosx-version-min=10.9   -UNDEBUG  -fno-exceptions -fno-rtti -std=c++14 -MD -MT utils/TableGen/CMakeFiles/llvm-tblgen.dir/SearchableTableEmitter.cpp.o -MF utils/TableGen/CMakeFiles/llvm-tblgen.dir/SearchableTableEmitter.cpp.o.d -o utils/TableGen/CMakeFiles/llvm-tblgen.dir/SearchableTableEmitter.cpp.o -c /Users/buildslave/jenkins/workspace/clang-stage1-cmake-RA-expensive/llvm-project/llvm/utils/TableGen/SearchableTableEmitter.cpp
[186/4529] /Applications/Xcode.app/Contents/Developer/Toolchains/XcodeDefault.xctoolchain/usr/bin/c++  -DEXPENSIVE_CHECKS -DGTEST_HAS_RTTI=0 -D_DEBUG -D_GLIBCXX_DEBUG -D__STDC_CONSTANT_MACROS -D__STDC_FORMAT_MACROS -D__STDC_LIMIT_MACROS -Iutils/TableGen -I/Users/buildslave/jenkins/workspace/clang-stage1-cmake-RA-expensive/llvm-project/llvm/utils/TableGen -I/Applications/Xcode.app/Contents/Developer/Platforms/MacOSX.platform/Developer/SDKs/MacOSX10.13.sdk/usr/include/libxml2 -Iinclude -I/Users/buildslave/jenkins/workspace/clang-stage1-cmake-RA-expensive/llvm-project/llvm/include -fPIC -fvisibility-inlines-hidden -Werror=date-time -Werror=unguarded-availability-new -Wall -Wextra -Wno-unused-parameter -Wwrite-strings -Wcast-qual -Wmissing-field-initializers -pedantic -Wno-long-long -Wimplicit-fallthrough -Wcovered-switch-default -Wno-noexcept-type -Wnon-virtual-dtor -Wdelete-non-virtual-dtor -Wstring-conversion -fdiagnostics-color -O3  -isysroot /Applications/Xcode.app/Contents/Developer/Platforms/MacOSX.platform/Developer/SDKs/MacOSX10.13.sdk -mmacosx-version-min=10.9   -UNDEBUG  -fno-exceptions -fno-rtti -std=c++14 -MD -MT utils/TableGen/CMakeFiles/llvm-tblgen.dir/WebAssemblyDisassemblerEmitter.cpp.o -MF utils/TableGen/CMakeFiles/llvm-tblgen.dir/WebAssemblyDisassemblerEmitter.cpp.o.d -o utils/TableGen/CMakeFiles/llvm-tblgen.dir/WebAssemblyDisassemblerEmitter.cpp.o -c /Users/buildslave/jenkins/workspace/clang-stage1-cmake-RA-expensive/llvm-project/llvm/utils/TableGen/WebAssemblyDisassemblerEmitter.cpp
[187/4529] /Applications/Xcode.app/Contents/Developer/Toolchains/XcodeDefault.xctoolchain/usr/bin/c++  -DEXPENSIVE_CHECKS -DGTEST_HAS_RTTI=0 -D_DEBUG -D_GLIBCXX_DEBUG -D__STDC_CONSTANT_MACROS -D__STDC_FORMAT_MACROS -D__STDC_LIMIT_MACROS -Iutils/TableGen/GlobalISel -I/Users/buildslave/jenkins/workspace/clang-stage1-cmake-RA-expensive/llvm-project/llvm/utils/TableGen/GlobalISel -I/Applications/Xcode.app/Contents/Developer/Platforms/MacOSX.platform/Developer/SDKs/MacOSX10.13.sdk/usr/include/libxml2 -Iinclude -I/Users/buildslave/jenkins/workspace/clang-stage1-cmake-RA-expensive/llvm-project/llvm/include -fPIC -fvisibility-inlines-hidden -Werror=date-time -Werror=unguarded-availability-new -Wall -Wextra -Wno-unused-parameter -Wwrite-strings -Wcast-qual -Wmissing-field-initializers -pedantic -Wno-long-long -Wimplicit-fallthrough -Wcovered-switch-default -Wno-noexcept-type -Wnon-virtual-dtor -Wdelete-non-virtual-dtor -Wstring-conversion -fdiagnostics-color -O3  -isysroot /Applications/Xcode.app/Contents/Developer/Platforms/MacOSX.platform/Developer/SDKs/MacOSX10.13.sdk -mmacosx-version-min=10.9   -UNDEBUG  -fno-exceptions -fno-rtti -std=c++14 -MD -MT utils/TableGen/GlobalISel/CMakeFiles/LLVMTableGenGlobalISel.dir/GIMatchDagEdge.cpp.o -MF utils/TableGen/GlobalISel/CMakeFiles/LLVMTableGenGlobalISel.dir/GIMatchDagEdge.cpp.o.d -o utils/TableGen/GlobalISel/CMakeFiles/LLVMTableGenGlobalISel.dir/GIMatchDagEdge.cpp.o -c /Users/buildslave/jenkins/workspace/clang-stage1-cmake-RA-expensive/llvm-project/llvm/utils/TableGen/GlobalISel/GIMatchDagEdge.cpp
[188/4529] /Applications/Xcode.app/Contents/Developer/Toolchains/XcodeDefault.xctoolchain/usr/bin/c++  -DEXPENSIVE_CHECKS -DGTEST_HAS_RTTI=0 -D_DEBUG -D_GLIBCXX_DEBUG -D__STDC_CONSTANT_MACROS -D__STDC_FORMAT_MACROS -D__STDC_LIMIT_MACROS -Iutils/TableGen/GlobalISel -I/Users/buildslave/jenkins/workspace/clang-stage1-cmake-RA-expensive/llvm-project/llvm/utils/TableGen/GlobalISel -I/Applications/Xcode.app/Contents/Developer/Platforms/MacOSX.platform/Developer/SDKs/MacOSX10.13.sdk/usr/include/libxml2 -Iinclude -I/Users/buildslave/jenkins/workspace/clang-stage1-cmake-RA-expensive/llvm-project/llvm/include -fPIC -fvisibility-inlines-hidden -Werror=date-time -Werror=unguarded-availability-new -Wall -Wextra -Wno-unused-parameter -Wwrite-strings -Wcast-qual -Wmissing-field-initializers -pedantic -Wno-long-long -Wimplicit-fallthrough -Wcovered-switch-default -Wno-noexcept-type -Wnon-virtual-dtor -Wdelete-non-virtual-dtor -Wstring-conversion -fdiagnostics-color -O3  -isysroot /Applications/Xcode.app/Contents/Developer/Platforms/MacOSX.platform/Developer/SDKs/MacOSX10.13.sdk -mmacosx-version-min=10.9   -UNDEBUG  -fno-exceptions -fno-rtti -std=c++14 -MD -MT utils/TableGen/GlobalISel/CMakeFiles/LLVMTableGenGlobalISel.dir/CodeExpander.cpp.o -MF utils/TableGen/GlobalISel/CMakeFiles/LLVMTableGenGlobalISel.dir/CodeExpander.cpp.o.d -o utils/TableGen/GlobalISel/CMakeFiles/LLVMTableGenGlobalISel.dir/CodeExpander.cpp.o -c /Users/buildslave/jenkins/workspace/clang-stage1-cmake-RA-expensive/llvm-project/llvm/utils/TableGen/GlobalISel/CodeExpander.cpp
[189/4529] /Applications/Xcode.app/Contents/Developer/Toolchains/XcodeDefault.xctoolchain/usr/bin/c++  -DEXPENSIVE_CHECKS -DGTEST_HAS_RTTI=0 -D_DEBUG -D_GLIBCXX_DEBUG -D__STDC_CONSTANT_MACROS -D__STDC_FORMAT_MACROS -D__STDC_LIMIT_MACROS -Iutils/TableGen -I/Users/buildslave/jenkins/workspace/clang-stage1-cmake-RA-expensive/llvm-project/llvm/utils/TableGen -I/Applications/Xcode.app/Contents/Developer/Platforms/MacOSX.platform/Developer/SDKs/MacOSX10.13.sdk/usr/include/libxml2 -Iinclude -I/Users/buildslave/jenkins/workspace/clang-stage1-cmake-RA-expensive/llvm-project/llvm/include -fPIC -fvisibility-inlines-hidden -Werror=date-time -Werror=unguarded-availability-new -Wall -Wextra -Wno-unused-parameter -Wwrite-strings -Wcast-qual -Wmissing-field-initializers -pedantic -Wno-long-long -Wimplicit-fallthrough -Wcovered-switch-default -Wno-noexcept-type -Wnon-virtual-dtor -Wdelete-non-virtual-dtor -Wstring-conversion -fdiagnostics-color -O3  -isysroot /Applications/Xcode.app/Contents/Developer/Platforms/MacOSX.platform/Developer/SDKs/MacOSX10.13.sdk -mmacosx-version-min=10.9   -UNDEBUG  -fno-exceptions -fno-rtti -std=c++14 -MD -MT utils/TableGen/CMakeFiles/llvm-tblgen.dir/CTagsEmitter.cpp.o -MF utils/TableGen/CMakeFiles/llvm-tblgen.dir/CTagsEmitter.cpp.o.d -o utils/TableGen/CMakeFiles/llvm-tblgen.dir/CTagsEmitter.cpp.o -c /Users/buildslave/jenkins/workspace/clang-stage1-cmake-RA-expensive/llvm-project/llvm/utils/TableGen/CTagsEmitter.cpp
[190/4529] /Applications/Xcode.app/Contents/Developer/Toolchains/XcodeDefault.xctoolchain/usr/bin/c++  -DEXPENSIVE_CHECKS -DGTEST_HAS_RTTI=0 -D_DEBUG -D_GLIBCXX_DEBUG -D__STDC_CONSTANT_MACROS -D__STDC_FORMAT_MACROS -D__STDC_LIMIT_MACROS -Iutils/TableGen -I/Users/buildslave/jenkins/workspace/clang-stage1-cmake-RA-expensive/llvm-project/llvm/utils/TableGen -I/Applications/Xcode.app/Contents/Developer/Platforms/MacOSX.platform/Developer/SDKs/MacOSX10.13.sdk/usr/include/libxml2 -Iinclude -I/Users/buildslave/jenkins/workspace/clang-stage1-cmake-RA-expensive/llvm-project/llvm/include -fPIC -fvisibility-inlines-hidden -Werror=date-time -Werror=unguarded-availability-new -Wall -Wextra -Wno-unused-parameter -Wwrite-strings -Wcast-qual -Wmissing-field-initializers -pedantic -Wno-long-long -Wimplicit-fallthrough -Wcovered-switch-default -Wno-noexcept-type -Wnon-virtual-dtor -Wdelete-non-virtual-dtor -Wstring-conversion -fdiagnostics-color -O3  -isysroot /Applications/Xcode.app/Contents/Developer/Platforms/MacOSX.platform/Developer/SDKs/MacOSX10.13.sdk -mmacosx-version-min=10.9   -UNDEBUG  -fno-exceptions -fno-rtti -std=c++14 -MD -MT utils/TableGen/CMakeFiles/llvm-tblgen.dir/X86RecognizableInstr.cpp.o -MF utils/TableGen/CMakeFiles/llvm-tblgen.dir/X86RecognizableInstr.cpp.o.d -o utils/TableGen/CMakeFiles/llvm-tblgen.dir/X86RecognizableInstr.cpp.o -c /Users/buildslave/jenkins/workspace/clang-stage1-cmake-RA-expensive/llvm-project/llvm/utils/TableGen/X86RecognizableInstr.cpp
[191/4529] /Applications/Xcode.app/Contents/Developer/Toolchains/XcodeDefault.xctoolchain/usr/bin/c++  -DEXPENSIVE_CHECKS -DGTEST_HAS_RTTI=0 -D_DEBUG -D_GLIBCXX_DEBUG -D__STDC_CONSTANT_MACROS -D__STDC_FORMAT_MACROS -D__STDC_LIMIT_MACROS -Iutils/TableGen -I/Users/buildslave/jenkins/workspace/clang-stage1-cmake-RA-expensive/llvm-project/llvm/utils/TableGen -I/Applications/Xcode.app/Contents/Developer/Platforms/MacOSX.platform/Developer/SDKs/MacOSX10.13.sdk/usr/include/libxml2 -Iinclude -I/Users/buildslave/jenkins/workspace/clang-stage1-cmake-RA-expensive/llvm-project/llvm/include -fPIC -fvisibility-inlines-hidden -Werror=date-time -Werror=unguarded-availability-new -Wall -Wextra -Wno-unused-parameter -Wwrite-strings -Wcast-qual -Wmissing-field-initializers -pedantic -Wno-long-long -Wimplicit-fallthrough -Wcovered-switch-default -Wno-noexcept-type -Wnon-virtual-dtor -Wdelete-non-virtual-dtor -Wstring-conversion -fdiagnostics-color -O3  -isysroot /Applications/Xcode.app/Contents/Developer/Platforms/MacOSX.platform/Developer/SDKs/MacOSX10.13.sdk -mmacosx-version-min=10.9   -UNDEBUG  -fno-exceptions -fno-rtti -std=c++14 -MD -MT utils/TableGen/CMakeFiles/llvm-tblgen.dir/X86FoldTablesEmitter.cpp.o -MF utils/TableGen/CMakeFiles/llvm-tblgen.dir/X86FoldTablesEmitter.cpp.o.d -o utils/TableGen/CMakeFiles/llvm-tblgen.dir/X86FoldTablesEmitter.cpp.o -c /Users/buildslave/jenkins/workspace/clang-stage1-cmake-RA-expensive/llvm-project/llvm/utils/TableGen/X86FoldTablesEmitter.cpp
[192/4529] cd /Users/buildslave/jenkins/workspace/clang-stage1-cmake-RA-expensive/clang-build/include/llvm/Support && /usr/local/Cellar/cmake/3.13.1/bin/cmake -DNAMES=LLVM -DLLVM_SOURCE_DIR=/Users/buildslave/jenkins/workspace/clang-stage1-cmake-RA-expensive/llvm-project/llvm -DHEADER_FILE=/Users/buildslave/jenkins/workspace/clang-stage1-cmake-RA-expensive/clang-build/include/llvm/Support/VCSRevision.h -P /Users/buildslave/jenkins/workspace/clang-stage1-cmake-RA-expensive/llvm-project/llvm/cmake/modules/GenerateVersionFromVCS.cmake
-- Found Git: /usr/bin/git (found version "2.15.2 (Apple Git-101.1)") 
[193/4529] /Applications/Xcode.app/Contents/Developer/Toolchains/XcodeDefault.xctoolchain/usr/bin/c++  -DEXPENSIVE_CHECKS -DGTEST_HAS_RTTI=0 -D_DEBUG -D_GLIBCXX_DEBUG -D__STDC_CONSTANT_MACROS -D__STDC_FORMAT_MACROS -D__STDC_LIMIT_MACROS -Iutils/TableGen/GlobalISel -I/Users/buildslave/jenkins/workspace/clang-stage1-cmake-RA-expensive/llvm-project/llvm/utils/TableGen/GlobalISel -I/Applications/Xcode.app/Contents/Developer/Platforms/MacOSX.platform/Developer/SDKs/MacOSX10.13.sdk/usr/include/libxml2 -Iinclude -I/Users/buildslave/jenkins/workspace/clang-stage1-cmake-RA-expensive/llvm-project/llvm/include -fPIC -fvisibility-inlines-hidden -Werror=date-time -Werror=unguarded-availability-new -Wall -Wextra -Wno-unused-parameter -Wwrite-strings -Wcast-qual -Wmissing-field-initializers -pedantic -Wno-long-long -Wimplicit-fallthrough -Wcovered-switch-default -Wno-noexcept-type -Wnon-virtual-dtor -Wdelete-non-virtual-dtor -Wstring-conversion -fdiagnostics-color -O3  -isysroot /Applications/Xcode.app/Contents/Developer/Platforms/MacOSX.platform/Developer/SDKs/MacOSX10.13.sdk -mmacosx-version-min=10.9   -UNDEBUG  -fno-exceptions -fno-rtti -std=c++14 -MD -MT utils/TableGen/GlobalISel/CMakeFiles/LLVMTableGenGlobalISel.dir/GIMatchDag.cpp.o -MF utils/TableGen/GlobalISel/CMakeFiles/LLVMTableGenGlobalISel.dir/GIMatchDag.cpp.o.d -o utils/TableGen/GlobalISel/CMakeFiles/LLVMTableGenGlobalISel.dir/GIMatchDag.cpp.o -c /Users/buildslave/jenkins/workspace/clang-stage1-cmake-RA-expensive/llvm-project/llvm/utils/TableGen/GlobalISel/GIMatchDag.cpp
[194/4529] /Applications/Xcode.app/Contents/Developer/Toolchains/XcodeDefault.xctoolchain/usr/bin/c++  -DEXPENSIVE_CHECKS -DGTEST_HAS_RTTI=0 -D_DEBUG -D_GLIBCXX_DEBUG -D__STDC_CONSTANT_MACROS -D__STDC_FORMAT_MACROS -D__STDC_LIMIT_MACROS -Iutils/TableGen/GlobalISel -I/Users/buildslave/jenkins/workspace/clang-stage1-cmake-RA-expensive/llvm-project/llvm/utils/TableGen/GlobalISel -I/Applications/Xcode.app/Contents/Developer/Platforms/MacOSX.platform/Developer/SDKs/MacOSX10.13.sdk/usr/include/libxml2 -Iinclude -I/Users/buildslave/jenkins/workspace/clang-stage1-cmake-RA-expensive/llvm-project/llvm/include -fPIC -fvisibility-inlines-hidden -Werror=date-time -Werror=unguarded-availability-new -Wall -Wextra -Wno-unused-parameter -Wwrite-strings -Wcast-qual -Wmissing-field-initializers -pedantic -Wno-long-long -Wimplicit-fallthrough -Wcovered-switch-default -Wno-noexcept-type -Wnon-virtual-dtor -Wdelete-non-virtual-dtor -Wstring-conversion -fdiagnostics-color -O3  -isysroot /Applications/Xcode.app/Contents/Developer/Platforms/MacOSX.platform/Developer/SDKs/MacOSX10.13.sdk -mmacosx-version-min=10.9   -UNDEBUG  -fno-exceptions -fno-rtti -std=c++14 -MD -MT utils/TableGen/GlobalISel/CMakeFiles/LLVMTableGenGlobalISel.dir/GIMatchDagPredicateDependencyEdge.cpp.o -MF utils/TableGen/GlobalISel/CMakeFiles/LLVMTableGenGlobalISel.dir/GIMatchDagPredicateDependencyEdge.cpp.o.d -o utils/TableGen/GlobalISel/CMakeFiles/LLVMTableGenGlobalISel.dir/GIMatchDagPredicateDependencyEdge.cpp.o -c /Users/buildslave/jenkins/workspace/clang-stage1-cmake-RA-expensive/llvm-project/llvm/utils/TableGen/GlobalISel/GIMatchDagPredicateDependencyEdge.cpp
[195/4529] /Applications/Xcode.app/Contents/Developer/Toolchains/XcodeDefault.xctoolchain/usr/bin/c++  -DEXPENSIVE_CHECKS -DGTEST_HAS_RTTI=0 -D_DEBUG -D_GLIBCXX_DEBUG -D__STDC_CONSTANT_MACROS -D__STDC_FORMAT_MACROS -D__STDC_LIMIT_MACROS -Iutils/TableGen/GlobalISel -I/Users/buildslave/jenkins/workspace/clang-stage1-cmake-RA-expensive/llvm-project/llvm/utils/TableGen/GlobalISel -I/Applications/Xcode.app/Contents/Developer/Platforms/MacOSX.platform/Developer/SDKs/MacOSX10.13.sdk/usr/include/libxml2 -Iinclude -I/Users/buildslave/jenkins/workspace/clang-stage1-cmake-RA-expensive/llvm-project/llvm/include -fPIC -fvisibility-inlines-hidden -Werror=date-time -Werror=unguarded-availability-new -Wall -Wextra -Wno-unused-parameter -Wwrite-strings -Wcast-qual -Wmissing-field-initializers -pedantic -Wno-long-long -Wimplicit-fallthrough -Wcovered-switch-default -Wno-noexcept-type -Wnon-virtual-dtor -Wdelete-non-virtual-dtor -Wstring-conversion -fdiagnostics-color -O3  -isysroot /Applications/Xcode.app/Contents/Developer/Platforms/MacOSX.platform/Developer/SDKs/MacOSX10.13.sdk -mmacosx-version-min=10.9   -UNDEBUG  -fno-exceptions -fno-rtti -std=c++14 -MD -MT utils/TableGen/GlobalISel/CMakeFiles/LLVMTableGenGlobalISel.dir/GIMatchDagOperands.cpp.o -MF utils/TableGen/GlobalISel/CMakeFiles/LLVMTableGenGlobalISel.dir/GIMatchDagOperands.cpp.o.d -o utils/TableGen/GlobalISel/CMakeFiles/LLVMTableGenGlobalISel.dir/GIMatchDagOperands.cpp.o -c /Users/buildslave/jenkins/workspace/clang-stage1-cmake-RA-expensive/llvm-project/llvm/utils/TableGen/GlobalISel/GIMatchDagOperands.cpp
[196/4529] /Applications/Xcode.app/Contents/Developer/Toolchains/XcodeDefault.xctoolchain/usr/bin/c++  -DEXPENSIVE_CHECKS -DGTEST_HAS_RTTI=0 -D_DEBUG -D_GLIBCXX_DEBUG -D__STDC_CONSTANT_MACROS -D__STDC_FORMAT_MACROS -D__STDC_LIMIT_MACROS -Iutils/TableGen/GlobalISel -I/Users/buildslave/jenkins/workspace/clang-stage1-cmake-RA-expensive/llvm-project/llvm/utils/TableGen/GlobalISel -I/Applications/Xcode.app/Contents/Developer/Platforms/MacOSX.platform/Developer/SDKs/MacOSX10.13.sdk/usr/include/libxml2 -Iinclude -I/Users/buildslave/jenkins/workspace/clang-stage1-cmake-RA-expensive/llvm-project/llvm/include -fPIC -fvisibility-inlines-hidden -Werror=date-time -Werror=unguarded-availability-new -Wall -Wextra -Wno-unused-parameter -Wwrite-strings -Wcast-qual -Wmissing-field-initializers -pedantic -Wno-long-long -Wimplicit-fallthrough -Wcovered-switch-default -Wno-noexcept-type -Wnon-virtual-dtor -Wdelete-non-virtual-dtor -Wstring-conversion -fdiagnostics-color -O3  -isysroot /Applications/Xcode.app/Contents/Developer/Platforms/MacOSX.platform/Developer/SDKs/MacOSX10.13.sdk -mmacosx-version-min=10.9   -UNDEBUG  -fno-exceptions -fno-rtti -std=c++14 -MD -MT utils/TableGen/GlobalISel/CMakeFiles/LLVMTableGenGlobalISel.dir/GIMatchDagPredicate.cpp.o -MF utils/TableGen/GlobalISel/CMakeFiles/LLVMTableGenGlobalISel.dir/GIMatchDagPredicate.cpp.o.d -o utils/TableGen/GlobalISel/CMakeFiles/LLVMTableGenGlobalISel.dir/GIMatchDagPredicate.cpp.o -c /Users/buildslave/jenkins/workspace/clang-stage1-cmake-RA-expensive/llvm-project/llvm/utils/TableGen/GlobalISel/GIMatchDagPredicate.cpp
[197/4529] /Applications/Xcode.app/Contents/Developer/Toolchains/XcodeDefault.xctoolchain/usr/bin/c++  -DEXPENSIVE_CHECKS -DGTEST_HAS_RTTI=0 -D_DEBUG -D_GLIBCXX_DEBUG -D__STDC_CONSTANT_MACROS -D__STDC_FORMAT_MACROS -D__STDC_LIMIT_MACROS -Iutils/TableGen/GlobalISel -I/Users/buildslave/jenkins/workspace/clang-stage1-cmake-RA-expensive/llvm-project/llvm/utils/TableGen/GlobalISel -I/Applications/Xcode.app/Contents/Developer/Platforms/MacOSX.platform/Developer/SDKs/MacOSX10.13.sdk/usr/include/libxml2 -Iinclude -I/Users/buildslave/jenkins/workspace/clang-stage1-cmake-RA-expensive/llvm-project/llvm/include -fPIC -fvisibility-inlines-hidden -Werror=date-time -Werror=unguarded-availability-new -Wall -Wextra -Wno-unused-parameter -Wwrite-strings -Wcast-qual -Wmissing-field-initializers -pedantic -Wno-long-long -Wimplicit-fallthrough -Wcovered-switch-default -Wno-noexcept-type -Wnon-virtual-dtor -Wdelete-non-virtual-dtor -Wstring-conversion -fdiagnostics-color -O3  -isysroot /Applications/Xcode.app/Contents/Developer/Platforms/MacOSX.platform/Developer/SDKs/MacOSX10.13.sdk -mmacosx-version-min=10.9   -UNDEBUG  -fno-exceptions -fno-rtti -std=c++14 -MD -MT utils/TableGen/GlobalISel/CMakeFiles/LLVMTableGenGlobalISel.dir/GIMatchDagInstr.cpp.o -MF utils/TableGen/GlobalISel/CMakeFiles/LLVMTableGenGlobalISel.dir/GIMatchDagInstr.cpp.o.d -o utils/TableGen/GlobalISel/CMakeFiles/LLVMTableGenGlobalISel.dir/GIMatchDagInstr.cpp.o -c /Users/buildslave/jenkins/workspace/clang-stage1-cmake-RA-expensive/llvm-project/llvm/utils/TableGen/GlobalISel/GIMatchDagInstr.cpp
[198/4529] : && "/Applications/Xcode.app/Contents/Developer/Toolchains/XcodeDefault.xctoolchain/usr/bin/libtool" -static -no_warning_for_no_symbols -o lib/libLLVMTableGenGlobalISel.a  utils/TableGen/GlobalISel/CMakeFiles/LLVMTableGenGlobalISel.dir/CodeExpander.cpp.o utils/TableGen/GlobalISel/CMakeFiles/LLVMTableGenGlobalISel.dir/GIMatchDag.cpp.o utils/TableGen/GlobalISel/CMakeFiles/LLVMTableGenGlobalISel.dir/GIMatchDagEdge.cpp.o utils/TableGen/GlobalISel/CMakeFiles/LLVMTableGenGlobalISel.dir/GIMatchDagInstr.cpp.o utils/TableGen/GlobalISel/CMakeFiles/LLVMTableGenGlobalISel.dir/GIMatchDagOperands.cpp.o utils/TableGen/GlobalISel/CMakeFiles/LLVMTableGenGlobalISel.dir/GIMatchDagPredicate.cpp.o utils/TableGen/GlobalISel/CMakeFiles/LLVMTableGenGlobalISel.dir/GIMatchDagPredicateDependencyEdge.cpp.o && :
[199/4529] /Applications/Xcode.app/Contents/Developer/Toolchains/XcodeDefault.xctoolchain/usr/bin/c++  -DEXPENSIVE_CHECKS -DGTEST_HAS_RTTI=0 -D_DEBUG -D_GLIBCXX_DEBUG -D__STDC_CONSTANT_MACROS -D__STDC_FORMAT_MACROS -D__STDC_LIMIT_MACROS -Ilib/LineEditor -I/Users/buildslave/jenkins/workspace/clang-stage1-cmake-RA-expensive/llvm-project/llvm/lib/LineEditor -I/Applications/Xcode.app/Contents/Developer/Platforms/MacOSX.platform/Developer/SDKs/MacOSX10.13.sdk/usr/include/libxml2 -Iinclude -I/Users/buildslave/jenkins/workspace/clang-stage1-cmake-RA-expensive/llvm-project/llvm/include -fPIC -fvisibility-inlines-hidden -Werror=date-time -Werror=unguarded-availability-new -Wall -Wextra -Wno-unused-parameter -Wwrite-strings -Wcast-qual -Wmissing-field-initializers -pedantic -Wno-long-long -Wimplicit-fallthrough -Wcovered-switch-default -Wno-noexcept-type -Wnon-virtual-dtor -Wdelete-non-virtual-dtor -Wstring-conversion -fdiagnostics-color -O3  -isysroot /Applications/Xcode.app/Contents/Developer/Platforms/MacOSX.platform/Developer/SDKs/MacOSX10.13.sdk -mmacosx-version-min=10.9   -UNDEBUG  -fno-exceptions -fno-rtti -std=c++14 -MD -MT lib/LineEditor/CMakeFiles/LLVMLineEditor.dir/LineEditor.cpp.o -MF lib/LineEditor/CMakeFiles/LLVMLineEditor.dir/LineEditor.cpp.o.d -o lib/LineEditor/CMakeFiles/LLVMLineEditor.dir/LineEditor.cpp.o -c /Users/buildslave/jenkins/workspace/clang-stage1-cmake-RA-expensive/llvm-project/llvm/lib/LineEditor/LineEditor.cpp
[200/4529] : && "/Applications/Xcode.app/Contents/Developer/Toolchains/XcodeDefault.xctoolchain/usr/bin/libtool" -static -no_warning_for_no_symbols -o lib/libLLVMLineEditor.a  lib/LineEditor/CMakeFiles/LLVMLineEditor.dir/LineEditor.cpp.o && :
[201/4529] /Applications/Xcode.app/Contents/Developer/Toolchains/XcodeDefault.xctoolchain/usr/bin/c++  -DEXPENSIVE_CHECKS -DGTEST_HAS_RTTI=0 -D_DEBUG -D_GLIBCXX_DEBUG -D__STDC_CONSTANT_MACROS -D__STDC_FORMAT_MACROS -D__STDC_LIMIT_MACROS -Ilib/TextAPI -I/Users/buildslave/jenkins/workspace/clang-stage1-cmake-RA-expensive/llvm-project/llvm/lib/TextAPI -I/Applications/Xcode.app/Contents/Developer/Platforms/MacOSX.platform/Developer/SDKs/MacOSX10.13.sdk/usr/include/libxml2 -Iinclude -I/Users/buildslave/jenkins/workspace/clang-stage1-cmake-RA-expensive/llvm-project/llvm/include -fPIC -fvisibility-inlines-hidden -Werror=date-time -Werror=unguarded-availability-new -Wall -Wextra -Wno-unused-parameter -Wwrite-strings -Wcast-qual -Wmissing-field-initializers -pedantic -Wno-long-long -Wimplicit-fallthrough -Wcovered-switch-default -Wno-noexcept-type -Wnon-virtual-dtor -Wdelete-non-virtual-dtor -Wstring-conversion -fdiagnostics-color -O3  -isysroot /Applications/Xcode.app/Contents/Developer/Platforms/MacOSX.platform/Developer/SDKs/MacOSX10.13.sdk -mmacosx-version-min=10.9   -UNDEBUG  -fno-exceptions -fno-rtti -std=c++14 -MD -MT lib/TextAPI/CMakeFiles/LLVMTextAPI.dir/ELF/ELFStub.cpp.o -MF lib/TextAPI/CMakeFiles/LLVMTextAPI.dir/ELF/ELFStub.cpp.o.d -o lib/TextAPI/CMakeFiles/LLVMTextAPI.dir/ELF/ELFStub.cpp.o -c /Users/buildslave/jenkins/workspace/clang-stage1-cmake-RA-expensive/llvm-project/llvm/lib/TextAPI/ELF/ELFStub.cpp
[202/4529] /Applications/Xcode.app/Contents/Developer/Toolchains/XcodeDefault.xctoolchain/usr/bin/c++  -DEXPENSIVE_CHECKS -DGTEST_HAS_RTTI=0 -D_DEBUG -D_GLIBCXX_DEBUG -D__STDC_CONSTANT_MACROS -D__STDC_FORMAT_MACROS -D__STDC_LIMIT_MACROS -Ilib/TextAPI -I/Users/buildslave/jenkins/workspace/clang-stage1-cmake-RA-expensive/llvm-project/llvm/lib/TextAPI -I/Applications/Xcode.app/Contents/Developer/Platforms/MacOSX.platform/Developer/SDKs/MacOSX10.13.sdk/usr/include/libxml2 -Iinclude -I/Users/buildslave/jenkins/workspace/clang-stage1-cmake-RA-expensive/llvm-project/llvm/include -fPIC -fvisibility-inlines-hidden -Werror=date-time -Werror=unguarded-availability-new -Wall -Wextra -Wno-unused-parameter -Wwrite-strings -Wcast-qual -Wmissing-field-initializers -pedantic -Wno-long-long -Wimplicit-fallthrough -Wcovered-switch-default -Wno-noexcept-type -Wnon-virtual-dtor -Wdelete-non-virtual-dtor -Wstring-conversion -fdiagnostics-color -O3  -isysroot /Applications/Xcode.app/Contents/Developer/Platforms/MacOSX.platform/Developer/SDKs/MacOSX10.13.sdk -mmacosx-version-min=10.9   -UNDEBUG  -fno-exceptions -fno-rtti -std=c++14 -MD -MT lib/TextAPI/CMakeFiles/LLVMTextAPI.dir/MachO/Architecture.cpp.o -MF lib/TextAPI/CMakeFiles/LLVMTextAPI.dir/MachO/Architecture.cpp.o.d -o lib/TextAPI/CMakeFiles/LLVMTextAPI.dir/MachO/Architecture.cpp.o -c /Users/buildslave/jenkins/workspace/clang-stage1-cmake-RA-expensive/llvm-project/llvm/lib/TextAPI/MachO/Architecture.cpp
[203/4529] /Applications/Xcode.app/Contents/Developer/Toolchains/XcodeDefault.xctoolchain/usr/bin/c++  -DEXPENSIVE_CHECKS -DGTEST_HAS_RTTI=0 -D_DEBUG -D_GLIBCXX_DEBUG -D__STDC_CONSTANT_MACROS -D__STDC_FORMAT_MACROS -D__STDC_LIMIT_MACROS -Ilib/TextAPI -I/Users/buildslave/jenkins/workspace/clang-stage1-cmake-RA-expensive/llvm-project/llvm/lib/TextAPI -I/Applications/Xcode.app/Contents/Developer/Platforms/MacOSX.platform/Developer/SDKs/MacOSX10.13.sdk/usr/include/libxml2 -Iinclude -I/Users/buildslave/jenkins/workspace/clang-stage1-cmake-RA-expensive/llvm-project/llvm/include -fPIC -fvisibility-inlines-hidden -Werror=date-time -Werror=unguarded-availability-new -Wall -Wextra -Wno-unused-parameter -Wwrite-strings -Wcast-qual -Wmissing-field-initializers -pedantic -Wno-long-long -Wimplicit-fallthrough -Wcovered-switch-default -Wno-noexcept-type -Wnon-virtual-dtor -Wdelete-non-virtual-dtor -Wstring-conversion -fdiagnostics-color -O3  -isysroot /Applications/Xcode.app/Contents/Developer/Platforms/MacOSX.platform/Developer/SDKs/MacOSX10.13.sdk -mmacosx-version-min=10.9   -UNDEBUG  -fno-exceptions -fno-rtti -std=c++14 -MD -MT lib/TextAPI/CMakeFiles/LLVMTextAPI.dir/MachO/ArchitectureSet.cpp.o -MF lib/TextAPI/CMakeFiles/LLVMTextAPI.dir/MachO/ArchitectureSet.cpp.o.d -o lib/TextAPI/CMakeFiles/LLVMTextAPI.dir/MachO/ArchitectureSet.cpp.o -c /Users/buildslave/jenkins/workspace/clang-stage1-cmake-RA-expensive/llvm-project/llvm/lib/TextAPI/MachO/ArchitectureSet.cpp
[204/4529] /Applications/Xcode.app/Contents/Developer/Toolchains/XcodeDefault.xctoolchain/usr/bin/c++  -DEXPENSIVE_CHECKS -DGTEST_HAS_RTTI=0 -D_DEBUG -D_GLIBCXX_DEBUG -D__STDC_CONSTANT_MACROS -D__STDC_FORMAT_MACROS -D__STDC_LIMIT_MACROS -Iutils/TableGen -I/Users/buildslave/jenkins/workspace/clang-stage1-cmake-RA-expensive/llvm-project/llvm/utils/TableGen -I/Applications/Xcode.app/Contents/Developer/Platforms/MacOSX.platform/Developer/SDKs/MacOSX10.13.sdk/usr/include/libxml2 -Iinclude -I/Users/buildslave/jenkins/workspace/clang-stage1-cmake-RA-expensive/llvm-project/llvm/include -fPIC -fvisibility-inlines-hidden -Werror=date-time -Werror=unguarded-availability-new -Wall -Wextra -Wno-unused-parameter -Wwrite-strings -Wcast-qual -Wmissing-field-initializers -pedantic -Wno-long-long -Wimplicit-fallthrough -Wcovered-switch-default -Wno-noexcept-type -Wnon-virtual-dtor -Wdelete-non-virtual-dtor -Wstring-conversion -fdiagnostics-color -O3  -isysroot /Applications/Xcode.app/Contents/Developer/Platforms/MacOSX.platform/Developer/SDKs/MacOSX10.13.sdk -mmacosx-version-min=10.9   -UNDEBUG  -fno-exceptions -fno-rtti -std=c++14 -MD -MT utils/TableGen/CMakeFiles/llvm-tblgen.dir/SubtargetEmitter.cpp.o -MF utils/TableGen/CMakeFiles/llvm-tblgen.dir/SubtargetEmitter.cpp.o.d -o utils/TableGen/CMakeFiles/llvm-tblgen.dir/SubtargetEmitter.cpp.o -c /Users/buildslave/jenkins/workspace/clang-stage1-cmake-RA-expensive/llvm-project/llvm/utils/TableGen/SubtargetEmitter.cpp
[205/4529] /Applications/Xcode.app/Contents/Developer/Toolchains/XcodeDefault.xctoolchain/usr/bin/c++  -DEXPENSIVE_CHECKS -DGTEST_HAS_RTTI=0 -D_DEBUG -D_GLIBCXX_DEBUG -D__STDC_CONSTANT_MACROS -D__STDC_FORMAT_MACROS -D__STDC_LIMIT_MACROS -Ilib/TextAPI -I/Users/buildslave/jenkins/workspace/clang-stage1-cmake-RA-expensive/llvm-project/llvm/lib/TextAPI -I/Applications/Xcode.app/Contents/Developer/Platforms/MacOSX.platform/Developer/SDKs/MacOSX10.13.sdk/usr/include/libxml2 -Iinclude -I/Users/buildslave/jenkins/workspace/clang-stage1-cmake-RA-expensive/llvm-project/llvm/include -fPIC -fvisibility-inlines-hidden -Werror=date-time -Werror=unguarded-availability-new -Wall -Wextra -Wno-unused-parameter -Wwrite-strings -Wcast-qual -Wmissing-field-initializers -pedantic -Wno-long-long -Wimplicit-fallthrough -Wcovered-switch-default -Wno-noexcept-type -Wnon-virtual-dtor -Wdelete-non-virtual-dtor -Wstring-conversion -fdiagnostics-color -O3  -isysroot /Applications/Xcode.app/Contents/Developer/Platforms/MacOSX.platform/Developer/SDKs/MacOSX10.13.sdk -mmacosx-version-min=10.9   -UNDEBUG  -fno-exceptions -fno-rtti -std=c++14 -MD -MT lib/TextAPI/CMakeFiles/LLVMTextAPI.dir/MachO/PackedVersion.cpp.o -MF lib/TextAPI/CMakeFiles/LLVMTextAPI.dir/MachO/PackedVersion.cpp.o.d -o lib/TextAPI/CMakeFiles/LLVMTextAPI.dir/MachO/PackedVersion.cpp.o -c /Users/buildslave/jenkins/workspace/clang-stage1-cmake-RA-expensive/llvm-project/llvm/lib/TextAPI/MachO/PackedVersion.cpp
[206/4529] /Applications/Xcode.app/Contents/Developer/Toolchains/XcodeDefault.xctoolchain/usr/bin/c++  -DEXPENSIVE_CHECKS -DGTEST_HAS_RTTI=0 -D_DEBUG -D_GLIBCXX_DEBUG -D__STDC_CONSTANT_MACROS -D__STDC_FORMAT_MACROS -D__STDC_LIMIT_MACROS -Ilib/TextAPI -I/Users/buildslave/jenkins/workspace/clang-stage1-cmake-RA-expensive/llvm-project/llvm/lib/TextAPI -I/Applications/Xcode.app/Contents/Developer/Platforms/MacOSX.platform/Developer/SDKs/MacOSX10.13.sdk/usr/include/libxml2 -Iinclude -I/Users/buildslave/jenkins/workspace/clang-stage1-cmake-RA-expensive/llvm-project/llvm/include -fPIC -fvisibility-inlines-hidden -Werror=date-time -Werror=unguarded-availability-new -Wall -Wextra -Wno-unused-parameter -Wwrite-strings -Wcast-qual -Wmissing-field-initializers -pedantic -Wno-long-long -Wimplicit-fallthrough -Wcovered-switch-default -Wno-noexcept-type -Wnon-virtual-dtor -Wdelete-non-virtual-dtor -Wstring-conversion -fdiagnostics-color -O3  -isysroot /Applications/Xcode.app/Contents/Developer/Platforms/MacOSX.platform/Developer/SDKs/MacOSX10.13.sdk -mmacosx-version-min=10.9   -UNDEBUG  -fno-exceptions -fno-rtti -std=c++14 -MD -MT lib/TextAPI/CMakeFiles/LLVMTextAPI.dir/MachO/Platform.cpp.o -MF lib/TextAPI/CMakeFiles/LLVMTextAPI.dir/MachO/Platform.cpp.o.d -o lib/TextAPI/CMakeFiles/LLVMTextAPI.dir/MachO/Platform.cpp.o -c /Users/buildslave/jenkins/workspace/clang-stage1-cmake-RA-expensive/llvm-project/llvm/lib/TextAPI/MachO/Platform.cpp
[207/4529] /Applications/Xcode.app/Contents/Developer/Toolchains/XcodeDefault.xctoolchain/usr/bin/c++  -DEXPENSIVE_CHECKS -DGTEST_HAS_RTTI=0 -D_DEBUG -D_GLIBCXX_DEBUG -D__STDC_CONSTANT_MACROS -D__STDC_FORMAT_MACROS -D__STDC_LIMIT_MACROS -Ilib/TextAPI -I/Users/buildslave/jenkins/workspace/clang-stage1-cmake-RA-expensive/llvm-project/llvm/lib/TextAPI -I/Applications/Xcode.app/Contents/Developer/Platforms/MacOSX.platform/Developer/SDKs/MacOSX10.13.sdk/usr/include/libxml2 -Iinclude -I/Users/buildslave/jenkins/workspace/clang-stage1-cmake-RA-expensive/llvm-project/llvm/include -fPIC -fvisibility-inlines-hidden -Werror=date-time -Werror=unguarded-availability-new -Wall -Wextra -Wno-unused-parameter -Wwrite-strings -Wcast-qual -Wmissing-field-initializers -pedantic -Wno-long-long -Wimplicit-fallthrough -Wcovered-switch-default -Wno-noexcept-type -Wnon-virtual-dtor -Wdelete-non-virtual-dtor -Wstring-conversion -fdiagnostics-color -O3  -isysroot /Applications/Xcode.app/Contents/Developer/Platforms/MacOSX.platform/Developer/SDKs/MacOSX10.13.sdk -mmacosx-version-min=10.9   -UNDEBUG  -fno-exceptions -fno-rtti -std=c++14 -MD -MT lib/TextAPI/CMakeFiles/LLVMTextAPI.dir/ELF/TBEHandler.cpp.o -MF lib/TextAPI/CMakeFiles/LLVMTextAPI.dir/ELF/TBEHandler.cpp.o.d -o lib/TextAPI/CMakeFiles/LLVMTextAPI.dir/ELF/TBEHandler.cpp.o -c /Users/buildslave/jenkins/workspace/clang-stage1-cmake-RA-expensive/llvm-project/llvm/lib/TextAPI/ELF/TBEHandler.cpp
[208/4529] /Applications/Xcode.app/Contents/Developer/Toolchains/XcodeDefault.xctoolchain/usr/bin/c++  -DEXPENSIVE_CHECKS -DGTEST_HAS_RTTI=0 -D_DEBUG -D_GLIBCXX_DEBUG -D__STDC_CONSTANT_MACROS -D__STDC_FORMAT_MACROS -D__STDC_LIMIT_MACROS -Ilib/TextAPI -I/Users/buildslave/jenkins/workspace/clang-stage1-cmake-RA-expensive/llvm-project/llvm/lib/TextAPI -I/Applications/Xcode.app/Contents/Developer/Platforms/MacOSX.platform/Developer/SDKs/MacOSX10.13.sdk/usr/include/libxml2 -Iinclude -I/Users/buildslave/jenkins/workspace/clang-stage1-cmake-RA-expensive/llvm-project/llvm/include -fPIC -fvisibility-inlines-hidden -Werror=date-time -Werror=unguarded-availability-new -Wall -Wextra -Wno-unused-parameter -Wwrite-strings -Wcast-qual -Wmissing-field-initializers -pedantic -Wno-long-long -Wimplicit-fallthrough -Wcovered-switch-default -Wno-noexcept-type -Wnon-virtual-dtor -Wdelete-non-virtual-dtor -Wstring-conversion -fdiagnostics-color -O3  -isysroot /Applications/Xcode.app/Contents/Developer/Platforms/MacOSX.platform/Developer/SDKs/MacOSX10.13.sdk -mmacosx-version-min=10.9   -UNDEBUG  -fno-exceptions -fno-rtti -std=c++14 -MD -MT lib/TextAPI/CMakeFiles/LLVMTextAPI.dir/MachO/Symbol.cpp.o -MF lib/TextAPI/CMakeFiles/LLVMTextAPI.dir/MachO/Symbol.cpp.o.d -o lib/TextAPI/CMakeFiles/LLVMTextAPI.dir/MachO/Symbol.cpp.o -c /Users/buildslave/jenkins/workspace/clang-stage1-cmake-RA-expensive/llvm-project/llvm/lib/TextAPI/MachO/Symbol.cpp
[209/4529] /Applications/Xcode.app/Contents/Developer/Toolchains/XcodeDefault.xctoolchain/usr/bin/c++  -DEXPENSIVE_CHECKS -DGTEST_HAS_RTTI=0 -D_DEBUG -D_GLIBCXX_DEBUG -D__STDC_CONSTANT_MACROS -D__STDC_FORMAT_MACROS -D__STDC_LIMIT_MACROS -Ilib/TextAPI -I/Users/buildslave/jenkins/workspace/clang-stage1-cmake-RA-expensive/llvm-project/llvm/lib/TextAPI -I/Applications/Xcode.app/Contents/Developer/Platforms/MacOSX.platform/Developer/SDKs/MacOSX10.13.sdk/usr/include/libxml2 -Iinclude -I/Users/buildslave/jenkins/workspace/clang-stage1-cmake-RA-expensive/llvm-project/llvm/include -fPIC -fvisibility-inlines-hidden -Werror=date-time -Werror=unguarded-availability-new -Wall -Wextra -Wno-unused-parameter -Wwrite-strings -Wcast-qual -Wmissing-field-initializers -pedantic -Wno-long-long -Wimplicit-fallthrough -Wcovered-switch-default -Wno-noexcept-type -Wnon-virtual-dtor -Wdelete-non-virtual-dtor -Wstring-conversion -fdiagnostics-color -O3  -isysroot /Applications/Xcode.app/Contents/Developer/Platforms/MacOSX.platform/Developer/SDKs/MacOSX10.13.sdk -mmacosx-version-min=10.9   -UNDEBUG  -fno-exceptions -fno-rtti -std=c++14 -MD -MT lib/TextAPI/CMakeFiles/LLVMTextAPI.dir/MachO/Target.cpp.o -MF lib/TextAPI/CMakeFiles/LLVMTextAPI.dir/MachO/Target.cpp.o.d -o lib/TextAPI/CMakeFiles/LLVMTextAPI.dir/MachO/Target.cpp.o -c /Users/buildslave/jenkins/workspace/clang-stage1-cmake-RA-expensive/llvm-project/llvm/lib/TextAPI/MachO/Target.cpp
[210/4529] /Applications/Xcode.app/Contents/Developer/Toolchains/XcodeDefault.xctoolchain/usr/bin/c++  -DEXPENSIVE_CHECKS -DGTEST_HAS_RTTI=0 -D_DEBUG -D_GLIBCXX_DEBUG -D__STDC_CONSTANT_MACROS -D__STDC_FORMAT_MACROS -D__STDC_LIMIT_MACROS -Iutils/TableGen -I/Users/buildslave/jenkins/workspace/clang-stage1-cmake-RA-expensive/llvm-project/llvm/utils/TableGen -I/Applications/Xcode.app/Contents/Developer/Platforms/MacOSX.platform/Developer/SDKs/MacOSX10.13.sdk/usr/include/libxml2 -Iinclude -I/Users/buildslave/jenkins/workspace/clang-stage1-cmake-RA-expensive/llvm-project/llvm/include -fPIC -fvisibility-inlines-hidden -Werror=date-time -Werror=unguarded-availability-new -Wall -Wextra -Wno-unused-parameter -Wwrite-strings -Wcast-qual -Wmissing-field-initializers -pedantic -Wno-long-long -Wimplicit-fallthrough -Wcovered-switch-default -Wno-noexcept-type -Wnon-virtual-dtor -Wdelete-non-virtual-dtor -Wstring-conversion -fdiagnostics-color -O3  -isysroot /Applications/Xcode.app/Contents/Developer/Platforms/MacOSX.platform/Developer/SDKs/MacOSX10.13.sdk -mmacosx-version-min=10.9   -UNDEBUG  -fno-exceptions -fno-rtti -std=c++14 -MD -MT utils/TableGen/CMakeFiles/llvm-tblgen.dir/RegisterInfoEmitter.cpp.o -MF utils/TableGen/CMakeFiles/llvm-tblgen.dir/RegisterInfoEmitter.cpp.o.d -o utils/TableGen/CMakeFiles/llvm-tblgen.dir/RegisterInfoEmitter.cpp.o -c /Users/buildslave/jenkins/workspace/clang-stage1-cmake-RA-expensive/llvm-project/llvm/utils/TableGen/RegisterInfoEmitter.cpp
[211/4529] /Applications/Xcode.app/Contents/Developer/Toolchains/XcodeDefault.xctoolchain/usr/bin/c++  -DEXPENSIVE_CHECKS -DGTEST_HAS_RTTI=0 -D_DEBUG -D_GLIBCXX_DEBUG -D__STDC_CONSTANT_MACROS -D__STDC_FORMAT_MACROS -D__STDC_LIMIT_MACROS -Ilib/XRay -I/Users/buildslave/jenkins/workspace/clang-stage1-cmake-RA-expensive/llvm-project/llvm/lib/XRay -I/Applications/Xcode.app/Contents/Developer/Platforms/MacOSX.platform/Developer/SDKs/MacOSX10.13.sdk/usr/include/libxml2 -Iinclude -I/Users/buildslave/jenkins/workspace/clang-stage1-cmake-RA-expensive/llvm-project/llvm/include -fPIC -fvisibility-inlines-hidden -Werror=date-time -Werror=unguarded-availability-new -Wall -Wextra -Wno-unused-parameter -Wwrite-strings -Wcast-qual -Wmissing-field-initializers -pedantic -Wno-long-long -Wimplicit-fallthrough -Wcovered-switch-default -Wno-noexcept-type -Wnon-virtual-dtor -Wdelete-non-virtual-dtor -Wstring-conversion -fdiagnostics-color -O3  -isysroot /Applications/Xcode.app/Contents/Developer/Platforms/MacOSX.platform/Developer/SDKs/MacOSX10.13.sdk -mmacosx-version-min=10.9   -UNDEBUG  -fno-exceptions -fno-rtti -std=c++14 -MD -MT lib/XRay/CMakeFiles/LLVMXRay.dir/BlockPrinter.cpp.o -MF lib/XRay/CMakeFiles/LLVMXRay.dir/BlockPrinter.cpp.o.d -o lib/XRay/CMakeFiles/LLVMXRay.dir/BlockPrinter.cpp.o -c /Users/buildslave/jenkins/workspace/clang-stage1-cmake-RA-expensive/llvm-project/llvm/lib/XRay/BlockPrinter.cpp
[212/4529] /Applications/Xcode.app/Contents/Developer/Toolchains/XcodeDefault.xctoolchain/usr/bin/c++  -DEXPENSIVE_CHECKS -DGTEST_HAS_RTTI=0 -D_DEBUG -D_GLIBCXX_DEBUG -D__STDC_CONSTANT_MACROS -D__STDC_FORMAT_MACROS -D__STDC_LIMIT_MACROS -Ilib/XRay -I/Users/buildslave/jenkins/workspace/clang-stage1-cmake-RA-expensive/llvm-project/llvm/lib/XRay -I/Applications/Xcode.app/Contents/Developer/Platforms/MacOSX.platform/Developer/SDKs/MacOSX10.13.sdk/usr/include/libxml2 -Iinclude -I/Users/buildslave/jenkins/workspace/clang-stage1-cmake-RA-expensive/llvm-project/llvm/include -fPIC -fvisibility-inlines-hidden -Werror=date-time -Werror=unguarded-availability-new -Wall -Wextra -Wno-unused-parameter -Wwrite-strings -Wcast-qual -Wmissing-field-initializers -pedantic -Wno-long-long -Wimplicit-fallthrough -Wcovered-switch-default -Wno-noexcept-type -Wnon-virtual-dtor -Wdelete-non-virtual-dtor -Wstring-conversion -fdiagnostics-color -O3  -isysroot /Applications/Xcode.app/Contents/Developer/Platforms/MacOSX.platform/Developer/SDKs/MacOSX10.13.sdk -mmacosx-version-min=10.9   -UNDEBUG  -fno-exceptions -fno-rtti -std=c++14 -MD -MT lib/XRay/CMakeFiles/LLVMXRay.dir/BlockIndexer.cpp.o -MF lib/XRay/CMakeFiles/LLVMXRay.dir/BlockIndexer.cpp.o.d -o lib/XRay/CMakeFiles/LLVMXRay.dir/BlockIndexer.cpp.o -c /Users/buildslave/jenkins/workspace/clang-stage1-cmake-RA-expensive/llvm-project/llvm/lib/XRay/BlockIndexer.cpp
[213/4529] /Applications/Xcode.app/Contents/Developer/Toolchains/XcodeDefault.xctoolchain/usr/bin/c++  -DEXPENSIVE_CHECKS -DGTEST_HAS_RTTI=0 -D_DEBUG -D_GLIBCXX_DEBUG -D__STDC_CONSTANT_MACROS -D__STDC_FORMAT_MACROS -D__STDC_LIMIT_MACROS -Ilib/TextAPI -I/Users/buildslave/jenkins/workspace/clang-stage1-cmake-RA-expensive/llvm-project/llvm/lib/TextAPI -I/Applications/Xcode.app/Contents/Developer/Platforms/MacOSX.platform/Developer/SDKs/MacOSX10.13.sdk/usr/include/libxml2 -Iinclude -I/Users/buildslave/jenkins/workspace/clang-stage1-cmake-RA-expensive/llvm-project/llvm/include -fPIC -fvisibility-inlines-hidden -Werror=date-time -Werror=unguarded-availability-new -Wall -Wextra -Wno-unused-parameter -Wwrite-strings -Wcast-qual -Wmissing-field-initializers -pedantic -Wno-long-long -Wimplicit-fallthrough -Wcovered-switch-default -Wno-noexcept-type -Wnon-virtual-dtor -Wdelete-non-virtual-dtor -Wstring-conversion -fdiagnostics-color -O3  -isysroot /Applications/Xcode.app/Contents/Developer/Platforms/MacOSX.platform/Developer/SDKs/MacOSX10.13.sdk -mmacosx-version-min=10.9   -UNDEBUG  -fno-exceptions -fno-rtti -std=c++14 -MD -MT lib/TextAPI/CMakeFiles/LLVMTextAPI.dir/MachO/InterfaceFile.cpp.o -MF lib/TextAPI/CMakeFiles/LLVMTextAPI.dir/MachO/InterfaceFile.cpp.o.d -o lib/TextAPI/CMakeFiles/LLVMTextAPI.dir/MachO/InterfaceFile.cpp.o -c /Users/buildslave/jenkins/workspace/clang-stage1-cmake-RA-expensive/llvm-project/llvm/lib/TextAPI/MachO/InterfaceFile.cpp
[214/4529] /Applications/Xcode.app/Contents/Developer/Toolchains/XcodeDefault.xctoolchain/usr/bin/c++  -DEXPENSIVE_CHECKS -DGTEST_HAS_RTTI=0 -D_DEBUG -D_GLIBCXX_DEBUG -D__STDC_CONSTANT_MACROS -D__STDC_FORMAT_MACROS -D__STDC_LIMIT_MACROS -Ilib/XRay -I/Users/buildslave/jenkins/workspace/clang-stage1-cmake-RA-expensive/llvm-project/llvm/lib/XRay -I/Applications/Xcode.app/Contents/Developer/Platforms/MacOSX.platform/Developer/SDKs/MacOSX10.13.sdk/usr/include/libxml2 -Iinclude -I/Users/buildslave/jenkins/workspace/clang-stage1-cmake-RA-expensive/llvm-project/llvm/include -fPIC -fvisibility-inlines-hidden -Werror=date-time -Werror=unguarded-availability-new -Wall -Wextra -Wno-unused-parameter -Wwrite-strings -Wcast-qual -Wmissing-field-initializers -pedantic -Wno-long-long -Wimplicit-fallthrough -Wcovered-switch-default -Wno-noexcept-type -Wnon-virtual-dtor -Wdelete-non-virtual-dtor -Wstring-conversion -fdiagnostics-color -O3  -isysroot /Applications/Xcode.app/Contents/Developer/Platforms/MacOSX.platform/Developer/SDKs/MacOSX10.13.sdk -mmacosx-version-min=10.9   -UNDEBUG  -fno-exceptions -fno-rtti -std=c++14 -MD -MT lib/XRay/CMakeFiles/LLVMXRay.dir/BlockVerifier.cpp.o -MF lib/XRay/CMakeFiles/LLVMXRay.dir/BlockVerifier.cpp.o.d -o lib/XRay/CMakeFiles/LLVMXRay.dir/BlockVerifier.cpp.o -c /Users/buildslave/jenkins/workspace/clang-stage1-cmake-RA-expensive/llvm-project/llvm/lib/XRay/BlockVerifier.cpp
[215/4529] /Applications/Xcode.app/Contents/Developer/Toolchains/XcodeDefault.xctoolchain/usr/bin/c++  -DEXPENSIVE_CHECKS -DGTEST_HAS_RTTI=0 -D_DEBUG -D_GLIBCXX_DEBUG -D__STDC_CONSTANT_MACROS -D__STDC_FORMAT_MACROS -D__STDC_LIMIT_MACROS -Ilib/TextAPI -I/Users/buildslave/jenkins/workspace/clang-stage1-cmake-RA-expensive/llvm-project/llvm/lib/TextAPI -I/Applications/Xcode.app/Contents/Developer/Platforms/MacOSX.platform/Developer/SDKs/MacOSX10.13.sdk/usr/include/libxml2 -Iinclude -I/Users/buildslave/jenkins/workspace/clang-stage1-cmake-RA-expensive/llvm-project/llvm/include -fPIC -fvisibility-inlines-hidden -Werror=date-time -Werror=unguarded-availability-new -Wall -Wextra -Wno-unused-parameter -Wwrite-strings -Wcast-qual -Wmissing-field-initializers -pedantic -Wno-long-long -Wimplicit-fallthrough -Wcovered-switch-default -Wno-noexcept-type -Wnon-virtual-dtor -Wdelete-non-virtual-dtor -Wstring-conversion -fdiagnostics-color -O3  -isysroot /Applications/Xcode.app/Contents/Developer/Platforms/MacOSX.platform/Developer/SDKs/MacOSX10.13.sdk -mmacosx-version-min=10.9   -UNDEBUG  -fno-exceptions -fno-rtti -std=c++14 -MD -MT lib/TextAPI/CMakeFiles/LLVMTextAPI.dir/MachO/TextStubCommon.cpp.o -MF lib/TextAPI/CMakeFiles/LLVMTextAPI.dir/MachO/TextStubCommon.cpp.o.d -o lib/TextAPI/CMakeFiles/LLVMTextAPI.dir/MachO/TextStubCommon.cpp.o -c /Users/buildslave/jenkins/workspace/clang-stage1-cmake-RA-expensive/llvm-project/llvm/lib/TextAPI/MachO/TextStubCommon.cpp
[216/4529] /Applications/Xcode.app/Contents/Developer/Toolchains/XcodeDefault.xctoolchain/usr/bin/c++  -DEXPENSIVE_CHECKS -DGTEST_HAS_RTTI=0 -D_DEBUG -D_GLIBCXX_DEBUG -D__STDC_CONSTANT_MACROS -D__STDC_FORMAT_MACROS -D__STDC_LIMIT_MACROS -Ilib/XRay -I/Users/buildslave/jenkins/workspace/clang-stage1-cmake-RA-expensive/llvm-project/llvm/lib/XRay -I/Applications/Xcode.app/Contents/Developer/Platforms/MacOSX.platform/Developer/SDKs/MacOSX10.13.sdk/usr/include/libxml2 -Iinclude -I/Users/buildslave/jenkins/workspace/clang-stage1-cmake-RA-expensive/llvm-project/llvm/include -fPIC -fvisibility-inlines-hidden -Werror=date-time -Werror=unguarded-availability-new -Wall -Wextra -Wno-unused-parameter -Wwrite-strings -Wcast-qual -Wmissing-field-initializers -pedantic -Wno-long-long -Wimplicit-fallthrough -Wcovered-switch-default -Wno-noexcept-type -Wnon-virtual-dtor -Wdelete-non-virtual-dtor -Wstring-conversion -fdiagnostics-color -O3  -isysroot /Applications/Xcode.app/Contents/Developer/Platforms/MacOSX.platform/Developer/SDKs/MacOSX10.13.sdk -mmacosx-version-min=10.9   -UNDEBUG  -fno-exceptions -fno-rtti -std=c++14 -MD -MT lib/XRay/CMakeFiles/LLVMXRay.dir/FDRRecords.cpp.o -MF lib/XRay/CMakeFiles/LLVMXRay.dir/FDRRecords.cpp.o.d -o lib/XRay/CMakeFiles/LLVMXRay.dir/FDRRecords.cpp.o -c /Users/buildslave/jenkins/workspace/clang-stage1-cmake-RA-expensive/llvm-project/llvm/lib/XRay/FDRRecords.cpp
[217/4529] /Applications/Xcode.app/Contents/Developer/Toolchains/XcodeDefault.xctoolchain/usr/bin/c++  -DEXPENSIVE_CHECKS -DGTEST_HAS_RTTI=0 -D_DEBUG -D_GLIBCXX_DEBUG -D__STDC_CONSTANT_MACROS -D__STDC_FORMAT_MACROS -D__STDC_LIMIT_MACROS -Ilib/XRay -I/Users/buildslave/jenkins/workspace/clang-stage1-cmake-RA-expensive/llvm-project/llvm/lib/XRay -I/Applications/Xcode.app/Contents/Developer/Platforms/MacOSX.platform/Developer/SDKs/MacOSX10.13.sdk/usr/include/libxml2 -Iinclude -I/Users/buildslave/jenkins/workspace/clang-stage1-cmake-RA-expensive/llvm-project/llvm/include -fPIC -fvisibility-inlines-hidden -Werror=date-time -Werror=unguarded-availability-new -Wall -Wextra -Wno-unused-parameter -Wwrite-strings -Wcast-qual -Wmissing-field-initializers -pedantic -Wno-long-long -Wimplicit-fallthrough -Wcovered-switch-default -Wno-noexcept-type -Wnon-virtual-dtor -Wdelete-non-virtual-dtor -Wstring-conversion -fdiagnostics-color -O3  -isysroot /Applications/Xcode.app/Contents/Developer/Platforms/MacOSX.platform/Developer/SDKs/MacOSX10.13.sdk -mmacosx-version-min=10.9   -UNDEBUG  -fno-exceptions -fno-rtti -std=c++14 -MD -MT lib/XRay/CMakeFiles/LLVMXRay.dir/FDRRecordProducer.cpp.o -MF lib/XRay/CMakeFiles/LLVMXRay.dir/FDRRecordProducer.cpp.o.d -o lib/XRay/CMakeFiles/LLVMXRay.dir/FDRRecordProducer.cpp.o -c /Users/buildslave/jenkins/workspace/clang-stage1-cmake-RA-expensive/llvm-project/llvm/lib/XRay/FDRRecordProducer.cpp
[218/4529] /Applications/Xcode.app/Contents/Developer/Toolchains/XcodeDefault.xctoolchain/usr/bin/c++  -DEXPENSIVE_CHECKS -DGTEST_HAS_RTTI=0 -D_DEBUG -D_GLIBCXX_DEBUG -D__STDC_CONSTANT_MACROS -D__STDC_FORMAT_MACROS -D__STDC_LIMIT_MACROS -Ilib/XRay -I/Users/buildslave/jenkins/workspace/clang-stage1-cmake-RA-expensive/llvm-project/llvm/lib/XRay -I/Applications/Xcode.app/Contents/Developer/Platforms/MacOSX.platform/Developer/SDKs/MacOSX10.13.sdk/usr/include/libxml2 -Iinclude -I/Users/buildslave/jenkins/workspace/clang-stage1-cmake-RA-expensive/llvm-project/llvm/include -fPIC -fvisibility-inlines-hidden -Werror=date-time -Werror=unguarded-availability-new -Wall -Wextra -Wno-unused-parameter -Wwrite-strings -Wcast-qual -Wmissing-field-initializers -pedantic -Wno-long-long -Wimplicit-fallthrough -Wcovered-switch-default -Wno-noexcept-type -Wnon-virtual-dtor -Wdelete-non-virtual-dtor -Wstring-conversion -fdiagnostics-color -O3  -isysroot /Applications/Xcode.app/Contents/Developer/Platforms/MacOSX.platform/Developer/SDKs/MacOSX10.13.sdk -mmacosx-version-min=10.9   -UNDEBUG  -fno-exceptions -fno-rtti -std=c++14 -MD -MT lib/XRay/CMakeFiles/LLVMXRay.dir/FDRTraceExpander.cpp.o -MF lib/XRay/CMakeFiles/LLVMXRay.dir/FDRTraceExpander.cpp.o.d -o lib/XRay/CMakeFiles/LLVMXRay.dir/FDRTraceExpander.cpp.o -c /Users/buildslave/jenkins/workspace/clang-stage1-cmake-RA-expensive/llvm-project/llvm/lib/XRay/FDRTraceExpander.cpp
[219/4529] /Applications/Xcode.app/Contents/Developer/Toolchains/XcodeDefault.xctoolchain/usr/bin/c++  -DEXPENSIVE_CHECKS -DGTEST_HAS_RTTI=0 -D_DEBUG -D_GLIBCXX_DEBUG -D__STDC_CONSTANT_MACROS -D__STDC_FORMAT_MACROS -D__STDC_LIMIT_MACROS -Ilib/XRay -I/Users/buildslave/jenkins/workspace/clang-stage1-cmake-RA-expensive/llvm-project/llvm/lib/XRay -I/Applications/Xcode.app/Contents/Developer/Platforms/MacOSX.platform/Developer/SDKs/MacOSX10.13.sdk/usr/include/libxml2 -Iinclude -I/Users/buildslave/jenkins/workspace/clang-stage1-cmake-RA-expensive/llvm-project/llvm/include -fPIC -fvisibility-inlines-hidden -Werror=date-time -Werror=unguarded-availability-new -Wall -Wextra -Wno-unused-parameter -Wwrite-strings -Wcast-qual -Wmissing-field-initializers -pedantic -Wno-long-long -Wimplicit-fallthrough -Wcovered-switch-default -Wno-noexcept-type -Wnon-virtual-dtor -Wdelete-non-virtual-dtor -Wstring-conversion -fdiagnostics-color -O3  -isysroot /Applications/Xcode.app/Contents/Developer/Platforms/MacOSX.platform/Developer/SDKs/MacOSX10.13.sdk -mmacosx-version-min=10.9   -UNDEBUG  -fno-exceptions -fno-rtti -std=c++14 -MD -MT lib/XRay/CMakeFiles/LLVMXRay.dir/FileHeaderReader.cpp.o -MF lib/XRay/CMakeFiles/LLVMXRay.dir/FileHeaderReader.cpp.o.d -o lib/XRay/CMakeFiles/LLVMXRay.dir/FileHeaderReader.cpp.o -c /Users/buildslave/jenkins/workspace/clang-stage1-cmake-RA-expensive/llvm-project/llvm/lib/XRay/FileHeaderReader.cpp
[220/4529] /Applications/Xcode.app/Contents/Developer/Toolchains/XcodeDefault.xctoolchain/usr/bin/c++  -DEXPENSIVE_CHECKS -DGTEST_HAS_RTTI=0 -D_DEBUG -D_GLIBCXX_DEBUG -D__STDC_CONSTANT_MACROS -D__STDC_FORMAT_MACROS -D__STDC_LIMIT_MACROS -Ilib/XRay -I/Users/buildslave/jenkins/workspace/clang-stage1-cmake-RA-expensive/llvm-project/llvm/lib/XRay -I/Applications/Xcode.app/Contents/Developer/Platforms/MacOSX.platform/Developer/SDKs/MacOSX10.13.sdk/usr/include/libxml2 -Iinclude -I/Users/buildslave/jenkins/workspace/clang-stage1-cmake-RA-expensive/llvm-project/llvm/include -fPIC -fvisibility-inlines-hidden -Werror=date-time -Werror=unguarded-availability-new -Wall -Wextra -Wno-unused-parameter -Wwrite-strings -Wcast-qual -Wmissing-field-initializers -pedantic -Wno-long-long -Wimplicit-fallthrough -Wcovered-switch-default -Wno-noexcept-type -Wnon-virtual-dtor -Wdelete-non-virtual-dtor -Wstring-conversion -fdiagnostics-color -O3  -isysroot /Applications/Xcode.app/Contents/Developer/Platforms/MacOSX.platform/Developer/SDKs/MacOSX10.13.sdk -mmacosx-version-min=10.9   -UNDEBUG  -fno-exceptions -fno-rtti -std=c++14 -MD -MT lib/XRay/CMakeFiles/LLVMXRay.dir/FDRTraceWriter.cpp.o -MF lib/XRay/CMakeFiles/LLVMXRay.dir/FDRTraceWriter.cpp.o.d -o lib/XRay/CMakeFiles/LLVMXRay.dir/FDRTraceWriter.cpp.o -c /Users/buildslave/jenkins/workspace/clang-stage1-cmake-RA-expensive/llvm-project/llvm/lib/XRay/FDRTraceWriter.cpp
[221/4529] /Applications/Xcode.app/Contents/Developer/Toolchains/XcodeDefault.xctoolchain/usr/bin/c++  -DEXPENSIVE_CHECKS -DGTEST_HAS_RTTI=0 -D_DEBUG -D_GLIBCXX_DEBUG -D__STDC_CONSTANT_MACROS -D__STDC_FORMAT_MACROS -D__STDC_LIMIT_MACROS -Ilib/XRay -I/Users/buildslave/jenkins/workspace/clang-stage1-cmake-RA-expensive/llvm-project/llvm/lib/XRay -I/Applications/Xcode.app/Contents/Developer/Platforms/MacOSX.platform/Developer/SDKs/MacOSX10.13.sdk/usr/include/libxml2 -Iinclude -I/Users/buildslave/jenkins/workspace/clang-stage1-cmake-RA-expensive/llvm-project/llvm/include -fPIC -fvisibility-inlines-hidden -Werror=date-time -Werror=unguarded-availability-new -Wall -Wextra -Wno-unused-parameter -Wwrite-strings -Wcast-qual -Wmissing-field-initializers -pedantic -Wno-long-long -Wimplicit-fallthrough -Wcovered-switch-default -Wno-noexcept-type -Wnon-virtual-dtor -Wdelete-non-virtual-dtor -Wstring-conversion -fdiagnostics-color -O3  -isysroot /Applications/Xcode.app/Contents/Developer/Platforms/MacOSX.platform/Developer/SDKs/MacOSX10.13.sdk -mmacosx-version-min=10.9   -UNDEBUG  -fno-exceptions -fno-rtti -std=c++14 -MD -MT lib/XRay/CMakeFiles/LLVMXRay.dir/LogBuilderConsumer.cpp.o -MF lib/XRay/CMakeFiles/LLVMXRay.dir/LogBuilderConsumer.cpp.o.d -o lib/XRay/CMakeFiles/LLVMXRay.dir/LogBuilderConsumer.cpp.o -c /Users/buildslave/jenkins/workspace/clang-stage1-cmake-RA-expensive/llvm-project/llvm/lib/XRay/LogBuilderConsumer.cpp
[222/4529] /Applications/Xcode.app/Contents/Developer/Toolchains/XcodeDefault.xctoolchain/usr/bin/c++  -DEXPENSIVE_CHECKS -DGTEST_HAS_RTTI=0 -D_DEBUG -D_GLIBCXX_DEBUG -D__STDC_CONSTANT_MACROS -D__STDC_FORMAT_MACROS -D__STDC_LIMIT_MACROS -Ilib/XRay -I/Users/buildslave/jenkins/workspace/clang-stage1-cmake-RA-expensive/llvm-project/llvm/lib/XRay -I/Applications/Xcode.app/Contents/Developer/Platforms/MacOSX.platform/Developer/SDKs/MacOSX10.13.sdk/usr/include/libxml2 -Iinclude -I/Users/buildslave/jenkins/workspace/clang-stage1-cmake-RA-expensive/llvm-project/llvm/include -fPIC -fvisibility-inlines-hidden -Werror=date-time -Werror=unguarded-availability-new -Wall -Wextra -Wno-unused-parameter -Wwrite-strings -Wcast-qual -Wmissing-field-initializers -pedantic -Wno-long-long -Wimplicit-fallthrough -Wcovered-switch-default -Wno-noexcept-type -Wnon-virtual-dtor -Wdelete-non-virtual-dtor -Wstring-conversion -fdiagnostics-color -O3  -isysroot /Applications/Xcode.app/Contents/Developer/Platforms/MacOSX.platform/Developer/SDKs/MacOSX10.13.sdk -mmacosx-version-min=10.9   -UNDEBUG  -fno-exceptions -fno-rtti -std=c++14 -MD -MT lib/XRay/CMakeFiles/LLVMXRay.dir/RecordInitializer.cpp.o -MF lib/XRay/CMakeFiles/LLVMXRay.dir/RecordInitializer.cpp.o.d -o lib/XRay/CMakeFiles/LLVMXRay.dir/RecordInitializer.cpp.o -c /Users/buildslave/jenkins/workspace/clang-stage1-cmake-RA-expensive/llvm-project/llvm/lib/XRay/RecordInitializer.cpp
[223/4529] /Applications/Xcode.app/Contents/Developer/Toolchains/XcodeDefault.xctoolchain/usr/bin/c++  -DEXPENSIVE_CHECKS -DGTEST_HAS_RTTI=0 -DGTEST_HAS_TR1_TUPLE=0 -DGTEST_LANG_CXX11=1 -D_DEBUG -D_GLIBCXX_DEBUG -D__STDC_CONSTANT_MACROS -D__STDC_FORMAT_MACROS -D__STDC_LIMIT_MACROS -Ilib/Testing/Support -I/Users/buildslave/jenkins/workspace/clang-stage1-cmake-RA-expensive/llvm-project/llvm/lib/Testing/Support -I/Applications/Xcode.app/Contents/Developer/Platforms/MacOSX.platform/Developer/SDKs/MacOSX10.13.sdk/usr/include/libxml2 -Iinclude -I/Users/buildslave/jenkins/workspace/clang-stage1-cmake-RA-expensive/llvm-project/llvm/include -I/Users/buildslave/jenkins/workspace/clang-stage1-cmake-RA-expensive/llvm-project/llvm/utils/unittest/googletest/include -I/Users/buildslave/jenkins/workspace/clang-stage1-cmake-RA-expensive/llvm-project/llvm/utils/unittest/googlemock/include -fPIC -fvisibility-inlines-hidden -Werror=date-time -Werror=unguarded-availability-new -Wall -Wextra -Wno-unused-parameter -Wwrite-strings -Wcast-qual -Wmissing-field-initializers -pedantic -Wno-long-long -Wimplicit-fallthrough -Wcovered-switch-default -Wno-noexcept-type -Wnon-virtual-dtor -Wdelete-non-virtual-dtor -Wstring-conversion -fdiagnostics-color -O3  -isysroot /Applications/Xcode.app/Contents/Developer/Platforms/MacOSX.platform/Developer/SDKs/MacOSX10.13.sdk -mmacosx-version-min=10.9   -UNDEBUG  -fno-exceptions -fno-rtti -std=c++14 -MD -MT lib/Testing/Support/CMakeFiles/LLVMTestingSupport.dir/Annotations.cpp.o -MF lib/Testing/Support/CMakeFiles/LLVMTestingSupport.dir/Annotations.cpp.o.d -o lib/Testing/Support/CMakeFiles/LLVMTestingSupport.dir/Annotations.cpp.o -c /Users/buildslave/jenkins/workspace/clang-stage1-cmake-RA-expensive/llvm-project/llvm/lib/Testing/Support/Annotations.cpp
[224/4529] /Applications/Xcode.app/Contents/Developer/Toolchains/XcodeDefault.xctoolchain/usr/bin/c++  -DEXPENSIVE_CHECKS -DGTEST_HAS_RTTI=0 -D_DEBUG -D_GLIBCXX_DEBUG -D__STDC_CONSTANT_MACROS -D__STDC_FORMAT_MACROS -D__STDC_LIMIT_MACROS -Ilib/XRay -I/Users/buildslave/jenkins/workspace/clang-stage1-cmake-RA-expensive/llvm-project/llvm/lib/XRay -I/Applications/Xcode.app/Contents/Developer/Platforms/MacOSX.platform/Developer/SDKs/MacOSX10.13.sdk/usr/include/libxml2 -Iinclude -I/Users/buildslave/jenkins/workspace/clang-stage1-cmake-RA-expensive/llvm-project/llvm/include -fPIC -fvisibility-inlines-hidden -Werror=date-time -Werror=unguarded-availability-new -Wall -Wextra -Wno-unused-parameter -Wwrite-strings -Wcast-qual -Wmissing-field-initializers -pedantic -Wno-long-long -Wimplicit-fallthrough -Wcovered-switch-default -Wno-noexcept-type -Wnon-virtual-dtor -Wdelete-non-virtual-dtor -Wstring-conversion -fdiagnostics-color -O3  -isysroot /Applications/Xcode.app/Contents/Developer/Platforms/MacOSX.platform/Developer/SDKs/MacOSX10.13.sdk -mmacosx-version-min=10.9   -UNDEBUG  -fno-exceptions -fno-rtti -std=c++14 -MD -MT lib/XRay/CMakeFiles/LLVMXRay.dir/RecordPrinter.cpp.o -MF lib/XRay/CMakeFiles/LLVMXRay.dir/RecordPrinter.cpp.o.d -o lib/XRay/CMakeFiles/LLVMXRay.dir/RecordPrinter.cpp.o -c /Users/buildslave/jenkins/workspace/clang-stage1-cmake-RA-expensive/llvm-project/llvm/lib/XRay/RecordPrinter.cpp
[225/4529] /Applications/Xcode.app/Contents/Developer/Toolchains/XcodeDefault.xctoolchain/usr/bin/c++  -DEXPENSIVE_CHECKS -DGTEST_HAS_RTTI=0 -D_DEBUG -D_GLIBCXX_DEBUG -D__STDC_CONSTANT_MACROS -D__STDC_FORMAT_MACROS -D__STDC_LIMIT_MACROS -Iutils/TableGen -I/Users/buildslave/jenkins/workspace/clang-stage1-cmake-RA-expensive/llvm-project/llvm/utils/TableGen -I/Applications/Xcode.app/Contents/Developer/Platforms/MacOSX.platform/Developer/SDKs/MacOSX10.13.sdk/usr/include/libxml2 -Iinclude -I/Users/buildslave/jenkins/workspace/clang-stage1-cmake-RA-expensive/llvm-project/llvm/include -fPIC -fvisibility-inlines-hidden -Werror=date-time -Werror=unguarded-availability-new -Wall -Wextra -Wno-unused-parameter -Wwrite-strings -Wcast-qual -Wmissing-field-initializers -pedantic -Wno-long-long -Wimplicit-fallthrough -Wcovered-switch-default -Wno-noexcept-type -Wnon-virtual-dtor -Wdelete-non-virtual-dtor -Wstring-conversion -fdiagnostics-color -O3  -isysroot /Applications/Xcode.app/Contents/Developer/Platforms/MacOSX.platform/Developer/SDKs/MacOSX10.13.sdk -mmacosx-version-min=10.9   -UNDEBUG  -fno-exceptions -fno-rtti -std=c++14 -MD -MT utils/TableGen/CMakeFiles/llvm-tblgen.dir/GlobalISelEmitter.cpp.o -MF utils/TableGen/CMakeFiles/llvm-tblgen.dir/GlobalISelEmitter.cpp.o.d -o utils/TableGen/CMakeFiles/llvm-tblgen.dir/GlobalISelEmitter.cpp.o -c /Users/buildslave/jenkins/workspace/clang-stage1-cmake-RA-expensive/llvm-project/llvm/utils/TableGen/GlobalISelEmitter.cpp
[226/4529] /Applications/Xcode.app/Contents/Developer/Toolchains/XcodeDefault.xctoolchain/usr/bin/c++  -DEXPENSIVE_CHECKS -DGTEST_HAS_RTTI=0 -DGTEST_HAS_TR1_TUPLE=0 -DGTEST_LANG_CXX11=1 -D_DEBUG -D_GLIBCXX_DEBUG -D__STDC_CONSTANT_MACROS -D__STDC_FORMAT_MACROS -D__STDC_LIMIT_MACROS -Ilib/Testing/Support -I/Users/buildslave/jenkins/workspace/clang-stage1-cmake-RA-expensive/llvm-project/llvm/lib/Testing/Support -I/Applications/Xcode.app/Contents/Developer/Platforms/MacOSX.platform/Developer/SDKs/MacOSX10.13.sdk/usr/include/libxml2 -Iinclude -I/Users/buildslave/jenkins/workspace/clang-stage1-cmake-RA-expensive/llvm-project/llvm/include -I/Users/buildslave/jenkins/workspace/clang-stage1-cmake-RA-expensive/llvm-project/llvm/utils/unittest/googletest/include -I/Users/buildslave/jenkins/workspace/clang-stage1-cmake-RA-expensive/llvm-project/llvm/utils/unittest/googlemock/include -fPIC -fvisibility-inlines-hidden -Werror=date-time -Werror=unguarded-availability-new -Wall -Wextra -Wno-unused-parameter -Wwrite-strings -Wcast-qual -Wmissing-field-initializers -pedantic -Wno-long-long -Wimplicit-fallthrough -Wcovered-switch-default -Wno-noexcept-type -Wnon-virtual-dtor -Wdelete-non-virtual-dtor -Wstring-conversion -fdiagnostics-color -O3  -isysroot /Applications/Xcode.app/Contents/Developer/Platforms/MacOSX.platform/Developer/SDKs/MacOSX10.13.sdk -mmacosx-version-min=10.9   -UNDEBUG  -fno-exceptions -fno-rtti -std=c++14 -MD -MT lib/Testing/Support/CMakeFiles/LLVMTestingSupport.dir/Error.cpp.o -MF lib/Testing/Support/CMakeFiles/LLVMTestingSupport.dir/Error.cpp.o.d -o lib/Testing/Support/CMakeFiles/LLVMTestingSupport.dir/Error.cpp.o -c /Users/buildslave/jenkins/workspace/clang-stage1-cmake-RA-expensive/llvm-project/llvm/lib/Testing/Support/Error.cpp
[227/4529] /Applications/Xcode.app/Contents/Developer/Toolchains/XcodeDefault.xctoolchain/usr/bin/cc -DEXPENSIVE_CHECKS -DGTEST_HAS_RTTI=0 -D_DEBUG -D_GLIBCXX_DEBUG -D__STDC_CONSTANT_MACROS -D__STDC_FORMAT_MACROS -D__STDC_LIMIT_MACROS -Iutils/count -I/Users/buildslave/jenkins/workspace/clang-stage1-cmake-RA-expensive/llvm-project/llvm/utils/count -I/Applications/Xcode.app/Contents/Developer/Platforms/MacOSX.platform/Developer/SDKs/MacOSX10.13.sdk/usr/include/libxml2 -Iinclude -I/Users/buildslave/jenkins/workspace/clang-stage1-cmake-RA-expensive/llvm-project/llvm/include -fPIC -Werror=date-time -Werror=unguarded-availability-new -Wall -Wextra -Wno-unused-parameter -Wwrite-strings -Wmissing-field-initializers -pedantic -Wno-long-long -Wimplicit-fallthrough -Wcovered-switch-default -Wdelete-non-virtual-dtor -Wstring-conversion -fdiagnostics-color -O3  -isysroot /Applications/Xcode.app/Contents/Developer/Platforms/MacOSX.platform/Developer/SDKs/MacOSX10.13.sdk -mmacosx-version-min=10.9   -UNDEBUG -MD -MT utils/count/CMakeFiles/count.dir/count.c.o -MF utils/count/CMakeFiles/count.dir/count.c.o.d -o utils/count/CMakeFiles/count.dir/count.c.o   -c /Users/buildslave/jenkins/workspace/clang-stage1-cmake-RA-expensive/llvm-project/llvm/utils/count/count.c
[228/4529] : && /Applications/Xcode.app/Contents/Developer/Toolchains/XcodeDefault.xctoolchain/usr/bin/c++  -fPIC -fvisibility-inlines-hidden -Werror=date-time -Werror=unguarded-availability-new -Wall -Wextra -Wno-unused-parameter -Wwrite-strings -Wcast-qual -Wmissing-field-initializers -pedantic -Wno-long-long -Wimplicit-fallthrough -Wcovered-switch-default -Wno-noexcept-type -Wnon-virtual-dtor -Wdelete-non-virtual-dtor -Wstring-conversion -fdiagnostics-color -O3  -isysroot /Applications/Xcode.app/Contents/Developer/Platforms/MacOSX.platform/Developer/SDKs/MacOSX10.13.sdk -mmacosx-version-min=10.9 -Wl,-search_paths_first -Wl,-headerpad_max_install_names -Wl,-dead_strip utils/TableGen/CMakeFiles/llvm-tblgen.dir/AsmMatcherEmitter.cpp.o utils/TableGen/CMakeFiles/llvm-tblgen.dir/AsmWriterEmitter.cpp.o utils/TableGen/CMakeFiles/llvm-tblgen.dir/AsmWriterInst.cpp.o utils/TableGen/CMakeFiles/llvm-tblgen.dir/Attributes.cpp.o utils/TableGen/CMakeFiles/llvm-tblgen.dir/CallingConvEmitter.cpp.o utils/TableGen/CMakeFiles/llvm-tblgen.dir/CodeEmitterGen.cpp.o utils/TableGen/CMakeFiles/llvm-tblgen.dir/CodeGenDAGPatterns.cpp.o utils/TableGen/CMakeFiles/llvm-tblgen.dir/CodeGenHwModes.cpp.o utils/TableGen/CMakeFiles/llvm-tblgen.dir/CodeGenInstruction.cpp.o utils/TableGen/CMakeFiles/llvm-tblgen.dir/CodeGenMapTable.cpp.o utils/TableGen/CMakeFiles/llvm-tblgen.dir/CodeGenRegisters.cpp.o utils/TableGen/CMakeFiles/llvm-tblgen.dir/CodeGenSchedule.cpp.o utils/TableGen/CMakeFiles/llvm-tblgen.dir/CodeGenTarget.cpp.o utils/TableGen/CMakeFiles/llvm-tblgen.dir/DAGISelEmitter.cpp.o utils/TableGen/CMakeFiles/llvm-tblgen.dir/DAGISelMatcherEmitter.cpp.o utils/TableGen/CMakeFiles/llvm-tblgen.dir/DAGISelMatcherGen.cpp.o utils/TableGen/CMakeFiles/llvm-tblgen.dir/DAGISelMatcherOpt.cpp.o utils/TableGen/CMakeFiles/llvm-tblgen.dir/DAGISelMatcher.cpp.o utils/TableGen/CMakeFiles/llvm-tblgen.dir/DFAEmitter.cpp.o utils/TableGen/CMakeFiles/llvm-tblgen.dir/DFAPacketizerEmitter.cpp.o utils/TableGen/CMakeFiles/llvm-tblgen.dir/DisassemblerEmitter.cpp.o utils/TableGen/CMakeFiles/llvm-tblgen.dir/ExegesisEmitter.cpp.o utils/TableGen/CMakeFiles/llvm-tblgen.dir/FastISelEmitter.cpp.o utils/TableGen/CMakeFiles/llvm-tblgen.dir/FixedLenDecoderEmitter.cpp.o utils/TableGen/CMakeFiles/llvm-tblgen.dir/GICombinerEmitter.cpp.o utils/TableGen/CMakeFiles/llvm-tblgen.dir/GlobalISelEmitter.cpp.o utils/TableGen/CMakeFiles/llvm-tblgen.dir/InfoByHwMode.cpp.o utils/TableGen/CMakeFiles/llvm-tblgen.dir/InstrInfoEmitter.cpp.o utils/TableGen/CMakeFiles/llvm-tblgen.dir/InstrDocsEmitter.cpp.o utils/TableGen/CMakeFiles/llvm-tblgen.dir/IntrinsicEmitter.cpp.o utils/TableGen/CMakeFiles/llvm-tblgen.dir/OptEmitter.cpp.o utils/TableGen/CMakeFiles/llvm-tblgen.dir/OptParserEmitter.cpp.o utils/TableGen/CMakeFiles/llvm-tblgen.dir/OptRSTEmitter.cpp.o utils/TableGen/CMakeFiles/llvm-tblgen.dir/PredicateExpander.cpp.o utils/TableGen/CMakeFiles/llvm-tblgen.dir/PseudoLoweringEmitter.cpp.o utils/TableGen/CMakeFiles/llvm-tblgen.dir/RISCVCompressInstEmitter.cpp.o utils/TableGen/CMakeFiles/llvm-tblgen.dir/RegisterBankEmitter.cpp.o utils/TableGen/CMakeFiles/llvm-tblgen.dir/RegisterInfoEmitter.cpp.o utils/TableGen/CMakeFiles/llvm-tblgen.dir/SDNodeProperties.cpp.o utils/TableGen/CMakeFiles/llvm-tblgen.dir/SearchableTableEmitter.cpp.o utils/TableGen/CMakeFiles/llvm-tblgen.dir/SubtargetEmitter.cpp.o utils/TableGen/CMakeFiles/llvm-tblgen.dir/SubtargetFeatureInfo.cpp.o utils/TableGen/CMakeFiles/llvm-tblgen.dir/TableGen.cpp.o utils/TableGen/CMakeFiles/llvm-tblgen.dir/Types.cpp.o utils/TableGen/CMakeFiles/llvm-tblgen.dir/X86DisassemblerTables.cpp.o utils/TableGen/CMakeFiles/llvm-tblgen.dir/X86EVEX2VEXTablesEmitter.cpp.o utils/TableGen/CMakeFiles/llvm-tblgen.dir/X86FoldTablesEmitter.cpp.o utils/TableGen/CMakeFiles/llvm-tblgen.dir/X86ModRMFilters.cpp.o utils/TableGen/CMakeFiles/llvm-tblgen.dir/X86RecognizableInstr.cpp.o utils/TableGen/CMakeFiles/llvm-tblgen.dir/WebAssemblyDisassemblerEmitter.cpp.o utils/TableGen/CMakeFiles/llvm-tblgen.dir/CTagsEmitter.cpp.o  -o bin/llvm-tblgen  -Wl,-rpath,@loader_path/../lib lib/libLLVMSupport.a lib/libLLVMTableGen.a lib/libLLVMTableGenGlobalISel.a lib/libLLVMSupport.a -lz -lcurses -lm lib/libLLVMDemangle.a && :
[229/4529] : && /Applications/Xcode.app/Contents/Developer/Toolchains/XcodeDefault.xctoolchain/usr/bin/cc -fPIC -Werror=date-time -Werror=unguarded-availability-new -Wall -Wextra -Wno-unused-parameter -Wwrite-strings -Wmissing-field-initializers -pedantic -Wno-long-long -Wimplicit-fallthrough -Wcovered-switch-default -Wdelete-non-virtual-dtor -Wstring-conversion -fdiagnostics-color -O3  -isysroot /Applications/Xcode.app/Contents/Developer/Platforms/MacOSX.platform/Developer/SDKs/MacOSX10.13.sdk -mmacosx-version-min=10.9 -Wl,-search_paths_first -Wl,-headerpad_max_install_names -Wl,-dead_strip utils/count/CMakeFiles/count.dir/count.c.o  -o bin/count  -Wl,-rpath,@loader_path/../lib && :
[230/4529] /Applications/Xcode.app/Contents/Developer/Toolchains/XcodeDefault.xctoolchain/usr/bin/c++  -DEXPENSIVE_CHECKS -DGTEST_HAS_RTTI=0 -D_DEBUG -D_GLIBCXX_DEBUG -D__STDC_CONSTANT_MACROS -D__STDC_FORMAT_MACROS -D__STDC_LIMIT_MACROS -Iutils/PerfectShuffle -I/Users/buildslave/jenkins/workspace/clang-stage1-cmake-RA-expensive/llvm-project/llvm/utils/PerfectShuffle -I/Applications/Xcode.app/Contents/Developer/Platforms/MacOSX.platform/Developer/SDKs/MacOSX10.13.sdk/usr/include/libxml2 -Iinclude -I/Users/buildslave/jenkins/workspace/clang-stage1-cmake-RA-expensive/llvm-project/llvm/include -fPIC -fvisibility-inlines-hidden -Werror=date-time -Werror=unguarded-availability-new -Wall -Wextra -Wno-unused-parameter -Wwrite-strings -Wcast-qual -Wmissing-field-initializers -pedantic -Wno-long-long -Wimplicit-fallthrough -Wcovered-switch-default -Wno-noexcept-type -Wnon-virtual-dtor -Wdelete-non-virtual-dtor -Wstring-conversion -fdiagnostics-color -O3  -isysroot /Applications/Xcode.app/Contents/Developer/Platforms/MacOSX.platform/Developer/SDKs/MacOSX10.13.sdk -mmacosx-version-min=10.9   -UNDEBUG  -fno-exceptions -fno-rtti -std=c++14 -MD -MT utils/PerfectShuffle/CMakeFiles/llvm-PerfectShuffle.dir/PerfectShuffle.cpp.o -MF utils/PerfectShuffle/CMakeFiles/llvm-PerfectShuffle.dir/PerfectShuffle.cpp.o.d -o utils/PerfectShuffle/CMakeFiles/llvm-PerfectShuffle.dir/PerfectShuffle.cpp.o -c /Users/buildslave/jenkins/workspace/clang-stage1-cmake-RA-expensive/llvm-project/llvm/utils/PerfectShuffle/PerfectShuffle.cpp
[231/4529] cd /Users/buildslave/jenkins/workspace/clang-stage1-cmake-RA-expensive/clang-build && /Users/buildslave/jenkins/workspace/clang-stage1-cmake-RA-expensive/clang-build/bin/llvm-tblgen -gen-attrs -I /Users/buildslave/jenkins/workspace/clang-stage1-cmake-RA-expensive/llvm-project/llvm/include/llvm/IR -I /Users/buildslave/jenkins/workspace/clang-stage1-cmake-RA-expensive/llvm-project/llvm/include /Users/buildslave/jenkins/workspace/clang-stage1-cmake-RA-expensive/llvm-project/llvm/include/llvm/IR/Attributes.td --write-if-changed -o include/llvm/IR/Attributes.inc -d include/llvm/IR/Attributes.inc.d
[232/4529] /Applications/Xcode.app/Contents/Developer/Toolchains/XcodeDefault.xctoolchain/usr/bin/c++  -DEXPENSIVE_CHECKS -DGTEST_HAS_RTTI=0 -D_DEBUG -D_GLIBCXX_DEBUG -D__STDC_CONSTANT_MACROS -D__STDC_FORMAT_MACROS -D__STDC_LIMIT_MACROS -Ilib/XRay -I/Users/buildslave/jenkins/workspace/clang-stage1-cmake-RA-expensive/llvm-project/llvm/lib/XRay -I/Applications/Xcode.app/Contents/Developer/Platforms/MacOSX.platform/Developer/SDKs/MacOSX10.13.sdk/usr/include/libxml2 -Iinclude -I/Users/buildslave/jenkins/workspace/clang-stage1-cmake-RA-expensive/llvm-project/llvm/include -fPIC -fvisibility-inlines-hidden -Werror=date-time -Werror=unguarded-availability-new -Wall -Wextra -Wno-unused-parameter -Wwrite-strings -Wcast-qual -Wmissing-field-initializers -pedantic -Wno-long-long -Wimplicit-fallthrough -Wcovered-switch-default -Wno-noexcept-type -Wnon-virtual-dtor -Wdelete-non-virtual-dtor -Wstring-conversion -fdiagnostics-color -O3  -isysroot /Applications/Xcode.app/Contents/Developer/Platforms/MacOSX.platform/Developer/SDKs/MacOSX10.13.sdk -mmacosx-version-min=10.9   -UNDEBUG  -fno-exceptions -fno-rtti -std=c++14 -MD -MT lib/XRay/CMakeFiles/LLVMXRay.dir/InstrumentationMap.cpp.o -MF lib/XRay/CMakeFiles/LLVMXRay.dir/InstrumentationMap.cpp.o.d -o lib/XRay/CMakeFiles/LLVMXRay.dir/InstrumentationMap.cpp.o -c /Users/buildslave/jenkins/workspace/clang-stage1-cmake-RA-expensive/llvm-project/llvm/lib/XRay/InstrumentationMap.cpp
[233/4529] /Applications/Xcode.app/Contents/Developer/Toolchains/XcodeDefault.xctoolchain/usr/bin/c++  -DEXPENSIVE_CHECKS -DGTEST_HAS_RTTI=0 -D_DEBUG -D_GLIBCXX_DEBUG -D__STDC_CONSTANT_MACROS -D__STDC_FORMAT_MACROS -D__STDC_LIMIT_MACROS -Ilib/XRay -I/Users/buildslave/jenkins/workspace/clang-stage1-cmake-RA-expensive/llvm-project/llvm/lib/XRay -I/Applications/Xcode.app/Contents/Developer/Platforms/MacOSX.platform/Developer/SDKs/MacOSX10.13.sdk/usr/include/libxml2 -Iinclude -I/Users/buildslave/jenkins/workspace/clang-stage1-cmake-RA-expensive/llvm-project/llvm/include -fPIC -fvisibility-inlines-hidden -Werror=date-time -Werror=unguarded-availability-new -Wall -Wextra -Wno-unused-parameter -Wwrite-strings -Wcast-qual -Wmissing-field-initializers -pedantic -Wno-long-long -Wimplicit-fallthrough -Wcovered-switch-default -Wno-noexcept-type -Wnon-virtual-dtor -Wdelete-non-virtual-dtor -Wstring-conversion -fdiagnostics-color -O3  -isysroot /Applications/Xcode.app/Contents/Developer/Platforms/MacOSX.platform/Developer/SDKs/MacOSX10.13.sdk -mmacosx-version-min=10.9   -UNDEBUG  -fno-exceptions -fno-rtti -std=c++14 -MD -MT lib/XRay/CMakeFiles/LLVMXRay.dir/Profile.cpp.o -MF lib/XRay/CMakeFiles/LLVMXRay.dir/Profile.cpp.o.d -o lib/XRay/CMakeFiles/LLVMXRay.dir/Profile.cpp.o -c /Users/buildslave/jenkins/workspace/clang-stage1-cmake-RA-expensive/llvm-project/llvm/lib/XRay/Profile.cpp
[234/4529] cd /Users/buildslave/jenkins/workspace/clang-stage1-cmake-RA-expensive/clang-build && /Users/buildslave/jenkins/workspace/clang-stage1-cmake-RA-expensive/clang-build/bin/llvm-tblgen -gen-intrinsic-enums -I /Users/buildslave/jenkins/workspace/clang-stage1-cmake-RA-expensive/llvm-project/llvm/include/llvm/IR -I /Users/buildslave/jenkins/workspace/clang-stage1-cmake-RA-expensive/llvm-project/llvm/include /Users/buildslave/jenkins/workspace/clang-stage1-cmake-RA-expensive/llvm-project/llvm/include/llvm/IR/Intrinsics.td --write-if-changed -o include/llvm/IR/IntrinsicEnums.inc -d include/llvm/IR/IntrinsicEnums.inc.d
[235/4529] cd /Users/buildslave/jenkins/workspace/clang-stage1-cmake-RA-expensive/clang-build && /Users/buildslave/jenkins/workspace/clang-stage1-cmake-RA-expensive/clang-build/bin/llvm-tblgen -gen-intrinsic-enums -intrinsic-prefix=xcore -I /Users/buildslave/jenkins/workspace/clang-stage1-cmake-RA-expensive/llvm-project/llvm/include/llvm/IR -I /Users/buildslave/jenkins/workspace/clang-stage1-cmake-RA-expensive/llvm-project/llvm/include /Users/buildslave/jenkins/workspace/clang-stage1-cmake-RA-expensive/llvm-project/llvm/include/llvm/IR/Intrinsics.td --write-if-changed -o include/llvm/IR/IntrinsicsXCore.h -d include/llvm/IR/IntrinsicsXCore.h.d
[236/4529] /Applications/Xcode.app/Contents/Developer/Toolchains/XcodeDefault.xctoolchain/usr/bin/c++  -DEXPENSIVE_CHECKS -DGTEST_HAS_RTTI=0 -DGTEST_HAS_TR1_TUPLE=0 -DGTEST_LANG_CXX11=1 -D_DEBUG -D_GLIBCXX_DEBUG -D__STDC_CONSTANT_MACROS -D__STDC_FORMAT_MACROS -D__STDC_LIMIT_MACROS -Ilib/Testing/Support -I/Users/buildslave/jenkins/workspace/clang-stage1-cmake-RA-expensive/llvm-project/llvm/lib/Testing/Support -I/Applications/Xcode.app/Contents/Developer/Platforms/MacOSX.platform/Developer/SDKs/MacOSX10.13.sdk/usr/include/libxml2 -Iinclude -I/Users/buildslave/jenkins/workspace/clang-stage1-cmake-RA-expensive/llvm-project/llvm/include -I/Users/buildslave/jenkins/workspace/clang-stage1-cmake-RA-expensive/llvm-project/llvm/utils/unittest/googletest/include -I/Users/buildslave/jenkins/workspace/clang-stage1-cmake-RA-expensive/llvm-project/llvm/utils/unittest/googlemock/include -fPIC -fvisibility-inlines-hidden -Werror=date-time -Werror=unguarded-availability-new -Wall -Wextra -Wno-unused-parameter -Wwrite-strings -Wcast-qual -Wmissing-field-initializers -pedantic -Wno-long-long -Wimplicit-fallthrough -Wcovered-switch-default -Wno-noexcept-type -Wnon-virtual-dtor -Wdelete-non-virtual-dtor -Wstring-conversion -fdiagnostics-color -O3  -isysroot /Applications/Xcode.app/Contents/Developer/Platforms/MacOSX.platform/Developer/SDKs/MacOSX10.13.sdk -mmacosx-version-min=10.9   -UNDEBUG  -fno-exceptions -fno-rtti -std=c++14 -MD -MT lib/Testing/Support/CMakeFiles/LLVMTestingSupport.dir/SupportHelpers.cpp.o -MF lib/Testing/Support/CMakeFiles/LLVMTestingSupport.dir/SupportHelpers.cpp.o.d -o lib/Testing/Support/CMakeFiles/LLVMTestingSupport.dir/SupportHelpers.cpp.o -c /Users/buildslave/jenkins/workspace/clang-stage1-cmake-RA-expensive/llvm-project/llvm/lib/Testing/Support/SupportHelpers.cpp
[237/4529] cd /Users/buildslave/jenkins/workspace/clang-stage1-cmake-RA-expensive/clang-build && /Users/buildslave/jenkins/workspace/clang-stage1-cmake-RA-expensive/clang-build/bin/llvm-tblgen -gen-intrinsic-impl -I /Users/buildslave/jenkins/workspace/clang-stage1-cmake-RA-expensive/llvm-project/llvm/include/llvm/IR -I /Users/buildslave/jenkins/workspace/clang-stage1-cmake-RA-expensive/llvm-project/llvm/include /Users/buildslave/jenkins/workspace/clang-stage1-cmake-RA-expensive/llvm-project/llvm/include/llvm/IR/Intrinsics.td --write-if-changed -o include/llvm/IR/IntrinsicImpl.inc -d include/llvm/IR/IntrinsicImpl.inc.d
[238/4529] cd /Users/buildslave/jenkins/workspace/clang-stage1-cmake-RA-expensive/clang-build && /Users/buildslave/jenkins/workspace/clang-stage1-cmake-RA-expensive/clang-build/bin/llvm-tblgen -gen-intrinsic-enums -intrinsic-prefix=bpf -I /Users/buildslave/jenkins/workspace/clang-stage1-cmake-RA-expensive/llvm-project/llvm/include/llvm/IR -I /Users/buildslave/jenkins/workspace/clang-stage1-cmake-RA-expensive/llvm-project/llvm/include /Users/buildslave/jenkins/workspace/clang-stage1-cmake-RA-expensive/llvm-project/llvm/include/llvm/IR/Intrinsics.td --write-if-changed -o include/llvm/IR/IntrinsicsBPF.h -d include/llvm/IR/IntrinsicsBPF.h.d
[239/4529] cd /Users/buildslave/jenkins/workspace/clang-stage1-cmake-RA-expensive/clang-build && /Users/buildslave/jenkins/workspace/clang-stage1-cmake-RA-expensive/clang-build/bin/llvm-tblgen -gen-intrinsic-enums -intrinsic-prefix=aarch64 -I /Users/buildslave/jenkins/workspace/clang-stage1-cmake-RA-expensive/llvm-project/llvm/include/llvm/IR -I /Users/buildslave/jenkins/workspace/clang-stage1-cmake-RA-expensive/llvm-project/llvm/include /Users/buildslave/jenkins/workspace/clang-stage1-cmake-RA-expensive/llvm-project/llvm/include/llvm/IR/Intrinsics.td --write-if-changed -o include/llvm/IR/IntrinsicsAArch64.h -d include/llvm/IR/IntrinsicsAArch64.h.d
[240/4529] cd /Users/buildslave/jenkins/workspace/clang-stage1-cmake-RA-expensive/clang-build && /Users/buildslave/jenkins/workspace/clang-stage1-cmake-RA-expensive/clang-build/bin/llvm-tblgen -gen-intrinsic-enums -intrinsic-prefix=amdgcn -I /Users/buildslave/jenkins/workspace/clang-stage1-cmake-RA-expensive/llvm-project/llvm/include/llvm/IR -I /Users/buildslave/jenkins/workspace/clang-stage1-cmake-RA-expensive/llvm-project/llvm/include /Users/buildslave/jenkins/workspace/clang-stage1-cmake-RA-expensive/llvm-project/llvm/include/llvm/IR/Intrinsics.td --write-if-changed -o include/llvm/IR/IntrinsicsAMDGPU.h -d include/llvm/IR/IntrinsicsAMDGPU.h.d
[241/4529] cd /Users/buildslave/jenkins/workspace/clang-stage1-cmake-RA-expensive/clang-build && /Users/buildslave/jenkins/workspace/clang-stage1-cmake-RA-expensive/clang-build/bin/llvm-tblgen -gen-intrinsic-enums -intrinsic-prefix=arm -I /Users/buildslave/jenkins/workspace/clang-stage1-cmake-RA-expensive/llvm-project/llvm/include/llvm/IR -I /Users/buildslave/jenkins/workspace/clang-stage1-cmake-RA-expensive/llvm-project/llvm/include /Users/buildslave/jenkins/workspace/clang-stage1-cmake-RA-expensive/llvm-project/llvm/include/llvm/IR/Intrinsics.td --write-if-changed -o include/llvm/IR/IntrinsicsARM.h -d include/llvm/IR/IntrinsicsARM.h.d
[242/4529] cd /Users/buildslave/jenkins/workspace/clang-stage1-cmake-RA-expensive/clang-build && /Users/buildslave/jenkins/workspace/clang-stage1-cmake-RA-expensive/clang-build/bin/llvm-tblgen -gen-intrinsic-enums -intrinsic-prefix=hexagon -I /Users/buildslave/jenkins/workspace/clang-stage1-cmake-RA-expensive/llvm-project/llvm/include/llvm/IR -I /Users/buildslave/jenkins/workspace/clang-stage1-cmake-RA-expensive/llvm-project/llvm/include /Users/buildslave/jenkins/workspace/clang-stage1-cmake-RA-expensive/llvm-project/llvm/include/llvm/IR/Intrinsics.td --write-if-changed -o include/llvm/IR/IntrinsicsHexagon.h -d include/llvm/IR/IntrinsicsHexagon.h.d
[243/4529] cd /Users/buildslave/jenkins/workspace/clang-stage1-cmake-RA-expensive/clang-build && /Users/buildslave/jenkins/workspace/clang-stage1-cmake-RA-expensive/clang-build/bin/llvm-tblgen -gen-intrinsic-enums -intrinsic-prefix=mips -I /Users/buildslave/jenkins/workspace/clang-stage1-cmake-RA-expensive/llvm-project/llvm/include/llvm/IR -I /Users/buildslave/jenkins/workspace/clang-stage1-cmake-RA-expensive/llvm-project/llvm/include /Users/buildslave/jenkins/workspace/clang-stage1-cmake-RA-expensive/llvm-project/llvm/include/llvm/IR/Intrinsics.td --write-if-changed -o include/llvm/IR/IntrinsicsMips.h -d include/llvm/IR/IntrinsicsMips.h.d
[244/4529] cd /Users/buildslave/jenkins/workspace/clang-stage1-cmake-RA-expensive/clang-build && /Users/buildslave/jenkins/workspace/clang-stage1-cmake-RA-expensive/clang-build/bin/llvm-tblgen -gen-intrinsic-enums -intrinsic-prefix=ppc -I /Users/buildslave/jenkins/workspace/clang-stage1-cmake-RA-expensive/llvm-project/llvm/include/llvm/IR -I /Users/buildslave/jenkins/workspace/clang-stage1-cmake-RA-expensive/llvm-project/llvm/include /Users/buildslave/jenkins/workspace/clang-stage1-cmake-RA-expensive/llvm-project/llvm/include/llvm/IR/Intrinsics.td --write-if-changed -o include/llvm/IR/IntrinsicsPowerPC.h -d include/llvm/IR/IntrinsicsPowerPC.h.d
[245/4529] cd /Users/buildslave/jenkins/workspace/clang-stage1-cmake-RA-expensive/clang-build && /Users/buildslave/jenkins/workspace/clang-stage1-cmake-RA-expensive/clang-build/bin/llvm-tblgen -gen-intrinsic-enums -intrinsic-prefix=nvvm -I /Users/buildslave/jenkins/workspace/clang-stage1-cmake-RA-expensive/llvm-project/llvm/include/llvm/IR -I /Users/buildslave/jenkins/workspace/clang-stage1-cmake-RA-expensive/llvm-project/llvm/include /Users/buildslave/jenkins/workspace/clang-stage1-cmake-RA-expensive/llvm-project/llvm/include/llvm/IR/Intrinsics.td --write-if-changed -o include/llvm/IR/IntrinsicsNVPTX.h -d include/llvm/IR/IntrinsicsNVPTX.h.d
[246/4529] cd /Users/buildslave/jenkins/workspace/clang-stage1-cmake-RA-expensive/clang-build && /Users/buildslave/jenkins/workspace/clang-stage1-cmake-RA-expensive/clang-build/bin/llvm-tblgen -gen-opt-parser-defs -I /Users/buildslave/jenkins/workspace/clang-stage1-cmake-RA-expensive/llvm-project/llvm/lib/ToolDrivers/llvm-dlltool -I /Users/buildslave/jenkins/workspace/clang-stage1-cmake-RA-expensive/llvm-project/llvm/include /Users/buildslave/jenkins/workspace/clang-stage1-cmake-RA-expensive/llvm-project/llvm/lib/ToolDrivers/llvm-dlltool/Options.td --write-if-changed -o lib/ToolDrivers/llvm-dlltool/Options.inc -d lib/ToolDrivers/llvm-dlltool/Options.inc.d
[247/4529] cd /Users/buildslave/jenkins/workspace/clang-stage1-cmake-RA-expensive/clang-build && /Users/buildslave/jenkins/workspace/clang-stage1-cmake-RA-expensive/clang-build/bin/llvm-tblgen -gen-intrinsic-enums -intrinsic-prefix=r600 -I /Users/buildslave/jenkins/workspace/clang-stage1-cmake-RA-expensive/llvm-project/llvm/include/llvm/IR -I /Users/buildslave/jenkins/workspace/clang-stage1-cmake-RA-expensive/llvm-project/llvm/include /Users/buildslave/jenkins/workspace/clang-stage1-cmake-RA-expensive/llvm-project/llvm/include/llvm/IR/Intrinsics.td --write-if-changed -o include/llvm/IR/IntrinsicsR600.h -d include/llvm/IR/IntrinsicsR600.h.d
[248/4529] cd /Users/buildslave/jenkins/workspace/clang-stage1-cmake-RA-expensive/clang-build && /Users/buildslave/jenkins/workspace/clang-stage1-cmake-RA-expensive/clang-build/bin/llvm-tblgen -gen-intrinsic-enums -intrinsic-prefix=riscv -I /Users/buildslave/jenkins/workspace/clang-stage1-cmake-RA-expensive/llvm-project/llvm/include/llvm/IR -I /Users/buildslave/jenkins/workspace/clang-stage1-cmake-RA-expensive/llvm-project/llvm/include /Users/buildslave/jenkins/workspace/clang-stage1-cmake-RA-expensive/llvm-project/llvm/include/llvm/IR/Intrinsics.td --write-if-changed -o include/llvm/IR/IntrinsicsRISCV.h -d include/llvm/IR/IntrinsicsRISCV.h.d
[249/4529] cd /Users/buildslave/jenkins/workspace/clang-stage1-cmake-RA-expensive/clang-build && /Users/buildslave/jenkins/workspace/clang-stage1-cmake-RA-expensive/clang-build/bin/llvm-tblgen -gen-opt-parser-defs -I /Users/buildslave/jenkins/workspace/clang-stage1-cmake-RA-expensive/llvm-project/llvm/lib/ToolDrivers/llvm-lib -I /Users/buildslave/jenkins/workspace/clang-stage1-cmake-RA-expensive/llvm-project/llvm/include /Users/buildslave/jenkins/workspace/clang-stage1-cmake-RA-expensive/llvm-project/llvm/lib/ToolDrivers/llvm-lib/Options.td --write-if-changed -o lib/ToolDrivers/llvm-lib/Options.inc -d lib/ToolDrivers/llvm-lib/Options.inc.d
[250/4529] : && /Applications/Xcode.app/Contents/Developer/Toolchains/XcodeDefault.xctoolchain/usr/bin/c++  -fPIC -fvisibility-inlines-hidden -Werror=date-time -Werror=unguarded-availability-new -Wall -Wextra -Wno-unused-parameter -Wwrite-strings -Wcast-qual -Wmissing-field-initializers -pedantic -Wno-long-long -Wimplicit-fallthrough -Wcovered-switch-default -Wno-noexcept-type -Wnon-virtual-dtor -Wdelete-non-virtual-dtor -Wstring-conversion -fdiagnostics-color -O3  -isysroot /Applications/Xcode.app/Contents/Developer/Platforms/MacOSX.platform/Developer/SDKs/MacOSX10.13.sdk -mmacosx-version-min=10.9 -Wl,-search_paths_first -Wl,-headerpad_max_install_names -Wl,-dead_strip utils/PerfectShuffle/CMakeFiles/llvm-PerfectShuffle.dir/PerfectShuffle.cpp.o  -o bin/llvm-PerfectShuffle  -Wl,-rpath,@loader_path/../lib && :
[251/4529] cd /Users/buildslave/jenkins/workspace/clang-stage1-cmake-RA-expensive/clang-build && /Users/buildslave/jenkins/workspace/clang-stage1-cmake-RA-expensive/clang-build/bin/llvm-tblgen -gen-intrinsic-enums -intrinsic-prefix=s390 -I /Users/buildslave/jenkins/workspace/clang-stage1-cmake-RA-expensive/llvm-project/llvm/include/llvm/IR -I /Users/buildslave/jenkins/workspace/clang-stage1-cmake-RA-expensive/llvm-project/llvm/include /Users/buildslave/jenkins/workspace/clang-stage1-cmake-RA-expensive/llvm-project/llvm/include/llvm/IR/Intrinsics.td --write-if-changed -o include/llvm/IR/IntrinsicsS390.h -d include/llvm/IR/IntrinsicsS390.h.d
[252/4529] cd /Users/buildslave/jenkins/workspace/clang-stage1-cmake-RA-expensive/clang-build/projects/libcxx && /usr/local/Cellar/cmake/3.13.1/bin/cmake -E copy_if_different /Users/buildslave/jenkins/workspace/clang-stage1-cmake-RA-expensive/llvm-project/libcxxabi/include/cxxabi.h /Users/buildslave/jenkins/workspace/clang-stage1-cmake-RA-expensive/clang-build/projects/libcxx/include/c++build//cxxabi.h
[253/4529] cd /Users/buildslave/jenkins/workspace/clang-stage1-cmake-RA-expensive/clang-build/projects/libcxx && /usr/local/Cellar/cmake/3.13.1/bin/cmake -E copy_if_different /Users/buildslave/jenkins/workspace/clang-stage1-cmake-RA-expensive/llvm-project/libcxxabi/include/cxxabi.h /Users/buildslave/jenkins/workspace/clang-stage1-cmake-RA-expensive/clang-build/include/c++/v1//cxxabi.h
[254/4529] /Applications/Xcode.app/Contents/Developer/Toolchains/XcodeDefault.xctoolchain/usr/bin/c++  -DEXPENSIVE_CHECKS -DGTEST_HAS_RTTI=0 -D_DEBUG -D_GLIBCXX_DEBUG -D__STDC_CONSTANT_MACROS -D__STDC_FORMAT_MACROS -D__STDC_LIMIT_MACROS -Ilib/WindowsManifest -I/Users/buildslave/jenkins/workspace/clang-stage1-cmake-RA-expensive/llvm-project/llvm/lib/WindowsManifest -I/Applications/Xcode.app/Contents/Developer/Platforms/MacOSX.platform/Developer/SDKs/MacOSX10.13.sdk/usr/include/libxml2 -Iinclude -I/Users/buildslave/jenkins/workspace/clang-stage1-cmake-RA-expensive/llvm-project/llvm/include -fPIC -fvisibility-inlines-hidden -Werror=date-time -Werror=unguarded-availability-new -Wall -Wextra -Wno-unused-parameter -Wwrite-strings -Wcast-qual -Wmissing-field-initializers -pedantic -Wno-long-long -Wimplicit-fallthrough -Wcovered-switch-default -Wno-noexcept-type -Wnon-virtual-dtor -Wdelete-non-virtual-dtor -Wstring-conversion -fdiagnostics-color -O3  -isysroot /Applications/Xcode.app/Contents/Developer/Platforms/MacOSX.platform/Developer/SDKs/MacOSX10.13.sdk -mmacosx-version-min=10.9   -UNDEBUG  -fno-exceptions -fno-rtti -std=c++14 -MD -MT lib/WindowsManifest/CMakeFiles/LLVMWindowsManifest.dir/WindowsManifestMerger.cpp.o -MF lib/WindowsManifest/CMakeFiles/LLVMWindowsManifest.dir/WindowsManifestMerger.cpp.o.d -o lib/WindowsManifest/CMakeFiles/LLVMWindowsManifest.dir/WindowsManifestMerger.cpp.o -c /Users/buildslave/jenkins/workspace/clang-stage1-cmake-RA-expensive/llvm-project/llvm/lib/WindowsManifest/WindowsManifestMerger.cpp
[255/4529] cd /Users/buildslave/jenkins/workspace/clang-stage1-cmake-RA-expensive/clang-build/projects/libcxx && /usr/local/Cellar/cmake/3.13.1/bin/cmake -E copy_if_different /Users/buildslave/jenkins/workspace/clang-stage1-cmake-RA-expensive/llvm-project/libcxxabi/include/__cxxabi_config.h /Users/buildslave/jenkins/workspace/clang-stage1-cmake-RA-expensive/clang-build/include/c++/v1//__cxxabi_config.h
[256/4529] : && "/Applications/Xcode.app/Contents/Developer/Toolchains/XcodeDefault.xctoolchain/usr/bin/libtool" -static -no_warning_for_no_symbols -o lib/libLLVMWindowsManifest.a  lib/WindowsManifest/CMakeFiles/LLVMWindowsManifest.dir/WindowsManifestMerger.cpp.o && :
[257/4529] cd /Users/buildslave/jenkins/workspace/clang-stage1-cmake-RA-expensive/clang-build/projects/libcxx && /usr/local/Cellar/cmake/3.13.1/bin/cmake -E copy_if_different /Users/buildslave/jenkins/workspace/clang-stage1-cmake-RA-expensive/llvm-project/libcxxabi/include/__cxxabi_config.h /Users/buildslave/jenkins/workspace/clang-stage1-cmake-RA-expensive/clang-build/projects/libcxx/include/c++build//__cxxabi_config.h
[258/4529] cd /Users/buildslave/jenkins/workspace/clang-stage1-cmake-RA-expensive/clang-build && /Users/buildslave/jenkins/workspace/clang-stage1-cmake-RA-expensive/clang-build/bin/llvm-tblgen -gen-attrs -I /Users/buildslave/jenkins/workspace/clang-stage1-cmake-RA-expensive/llvm-project/llvm/lib/IR -I /Users/buildslave/jenkins/workspace/clang-stage1-cmake-RA-expensive/llvm-project/llvm/include /Users/buildslave/jenkins/workspace/clang-stage1-cmake-RA-expensive/llvm-project/llvm/lib/IR/AttributesCompatFunc.td --write-if-changed -o lib/IR/AttributesCompatFunc.inc -d lib/IR/AttributesCompatFunc.inc.d
[259/4529] cd /Users/buildslave/jenkins/workspace/clang-stage1-cmake-RA-expensive/clang-build/projects/libcxx/include && /usr/local/Cellar/cmake/3.13.1/bin/cmake -E copy_if_different /Users/buildslave/jenkins/workspace/clang-stage1-cmake-RA-expensive/llvm-project/libcxx/include/__debug /Users/buildslave/jenkins/workspace/clang-stage1-cmake-RA-expensive/clang-build/include/c++/v1/__debug
[260/4529] cd /Users/buildslave/jenkins/workspace/clang-stage1-cmake-RA-expensive/clang-build/projects/libcxx/include && /usr/local/Cellar/cmake/3.13.1/bin/cmake -E copy_if_different /Users/buildslave/jenkins/workspace/clang-stage1-cmake-RA-expensive/llvm-project/libcxx/include/__bit_reference /Users/buildslave/jenkins/workspace/clang-stage1-cmake-RA-expensive/clang-build/include/c++/v1/__bit_reference
[261/4529] cd /Users/buildslave/jenkins/workspace/clang-stage1-cmake-RA-expensive/clang-build/projects/libcxx/include && /usr/local/Cellar/cmake/3.13.1/bin/cmake -E copy_if_different /Users/buildslave/jenkins/workspace/clang-stage1-cmake-RA-expensive/llvm-project/libcxx/include/__functional_base /Users/buildslave/jenkins/workspace/clang-stage1-cmake-RA-expensive/clang-build/include/c++/v1/__functional_base
[262/4529] cd /Users/buildslave/jenkins/workspace/clang-stage1-cmake-RA-expensive/clang-build/projects/libcxx/include && /usr/local/Cellar/cmake/3.13.1/bin/cmake -E copy_if_different /Users/buildslave/jenkins/workspace/clang-stage1-cmake-RA-expensive/llvm-project/libcxx/include/__hash_table /Users/buildslave/jenkins/workspace/clang-stage1-cmake-RA-expensive/clang-build/include/c++/v1/__hash_table
[263/4529] cd /Users/buildslave/jenkins/workspace/clang-stage1-cmake-RA-expensive/clang-build/projects/libcxx/include && /usr/local/Cellar/cmake/3.13.1/bin/cmake -E copy_if_different /Users/buildslave/jenkins/workspace/clang-stage1-cmake-RA-expensive/llvm-project/libcxx/include/__functional_base_03 /Users/buildslave/jenkins/workspace/clang-stage1-cmake-RA-expensive/clang-build/include/c++/v1/__functional_base_03
[264/4529] cd /Users/buildslave/jenkins/workspace/clang-stage1-cmake-RA-expensive/clang-build/projects/libcxx/include && /usr/local/Cellar/cmake/3.13.1/bin/cmake -E copy_if_different /Users/buildslave/jenkins/workspace/clang-stage1-cmake-RA-expensive/llvm-project/libcxx/include/__locale /Users/buildslave/jenkins/workspace/clang-stage1-cmake-RA-expensive/clang-build/include/c++/v1/__locale
[265/4529] cd /Users/buildslave/jenkins/workspace/clang-stage1-cmake-RA-expensive/clang-build/projects/libcxx/include && /usr/local/Cellar/cmake/3.13.1/bin/cmake -E copy_if_different /Users/buildslave/jenkins/workspace/clang-stage1-cmake-RA-expensive/llvm-project/libcxx/include/bitset /Users/buildslave/jenkins/workspace/clang-stage1-cmake-RA-expensive/clang-build/include/c++/v1/bitset
[266/4529] cd /Users/buildslave/jenkins/workspace/clang-stage1-cmake-RA-expensive/clang-build/projects/libcxx/include && /usr/local/Cellar/cmake/3.13.1/bin/cmake -E copy_if_different /Users/buildslave/jenkins/workspace/clang-stage1-cmake-RA-expensive/llvm-project/libcxx/include/__mutex_base /Users/buildslave/jenkins/workspace/clang-stage1-cmake-RA-expensive/clang-build/include/c++/v1/__mutex_base
[267/4529] cd /Users/buildslave/jenkins/workspace/clang-stage1-cmake-RA-expensive/clang-build && /Users/buildslave/jenkins/workspace/clang-stage1-cmake-RA-expensive/clang-build/bin/llvm-tblgen -gen-intrinsic-enums -intrinsic-prefix=wasm -I /Users/buildslave/jenkins/workspace/clang-stage1-cmake-RA-expensive/llvm-project/llvm/include/llvm/IR -I /Users/buildslave/jenkins/workspace/clang-stage1-cmake-RA-expensive/llvm-project/llvm/include /Users/buildslave/jenkins/workspace/clang-stage1-cmake-RA-expensive/llvm-project/llvm/include/llvm/IR/Intrinsics.td --write-if-changed -o include/llvm/IR/IntrinsicsWebAssembly.h -d include/llvm/IR/IntrinsicsWebAssembly.h.d
[268/4529] cd /Users/buildslave/jenkins/workspace/clang-stage1-cmake-RA-expensive/clang-build && /Users/buildslave/jenkins/workspace/clang-stage1-cmake-RA-expensive/clang-build/bin/llvm-tblgen -gen-intrinsic-enums -intrinsic-prefix=x86 -I /Users/buildslave/jenkins/workspace/clang-stage1-cmake-RA-expensive/llvm-project/llvm/include/llvm/IR -I /Users/buildslave/jenkins/workspace/clang-stage1-cmake-RA-expensive/llvm-project/llvm/include /Users/buildslave/jenkins/workspace/clang-stage1-cmake-RA-expensive/llvm-project/llvm/include/llvm/IR/Intrinsics.td --write-if-changed -o include/llvm/IR/IntrinsicsX86.h -d include/llvm/IR/IntrinsicsX86.h.d
[269/4529] cd /Users/buildslave/jenkins/workspace/clang-stage1-cmake-RA-expensive/clang-build/projects/libcxx/include && /usr/local/Cellar/cmake/3.13.1/bin/cmake -E copy_if_different /Users/buildslave/jenkins/workspace/clang-stage1-cmake-RA-expensive/llvm-project/libcxx/include/__libcpp_version /Users/buildslave/jenkins/workspace/clang-stage1-cmake-RA-expensive/clang-build/include/c++/v1/__libcpp_version
[270/4529] cd /Users/buildslave/jenkins/workspace/clang-stage1-cmake-RA-expensive/clang-build/projects/libcxx/include && /usr/local/Cellar/cmake/3.13.1/bin/cmake -E copy_if_different /Users/buildslave/jenkins/workspace/clang-stage1-cmake-RA-expensive/llvm-project/libcxx/include/__bsd_locale_fallbacks.h /Users/buildslave/jenkins/workspace/clang-stage1-cmake-RA-expensive/clang-build/include/c++/v1/__bsd_locale_fallbacks.h
[271/4529] cd /Users/buildslave/jenkins/workspace/clang-stage1-cmake-RA-expensive/clang-build/projects/libcxx/include && /usr/local/Cellar/cmake/3.13.1/bin/cmake -E copy_if_different /Users/buildslave/jenkins/workspace/clang-stage1-cmake-RA-expensive/llvm-project/libcxx/include/__bsd_locale_defaults.h /Users/buildslave/jenkins/workspace/clang-stage1-cmake-RA-expensive/clang-build/include/c++/v1/__bsd_locale_defaults.h
[272/4529] cd /Users/buildslave/jenkins/workspace/clang-stage1-cmake-RA-expensive/clang-build && /Users/buildslave/jenkins/workspace/clang-stage1-cmake-RA-expensive/clang-build/bin/llvm-tblgen -gen-asm-writer -I /Users/buildslave/jenkins/workspace/clang-stage1-cmake-RA-expensive/llvm-project/llvm/lib/Target/WebAssembly -I /Users/buildslave/jenkins/workspace/clang-stage1-cmake-RA-expensive/llvm-project/llvm/include -I /Users/buildslave/jenkins/workspace/clang-stage1-cmake-RA-expensive/llvm-project/llvm/lib/Target /Users/buildslave/jenkins/workspace/clang-stage1-cmake-RA-expensive/llvm-project/llvm/lib/Target/WebAssembly/WebAssembly.td --write-if-changed -o lib/Target/WebAssembly/WebAssemblyGenAsmWriter.inc -d lib/Target/WebAssembly/WebAssemblyGenAsmWriter.inc.d
[273/4529] cd /Users/buildslave/jenkins/workspace/clang-stage1-cmake-RA-expensive/clang-build && /Users/buildslave/jenkins/workspace/clang-stage1-cmake-RA-expensive/clang-build/bin/llvm-tblgen -gen-subtarget -I /Users/buildslave/jenkins/workspace/clang-stage1-cmake-RA-expensive/llvm-project/llvm/lib/Target/WebAssembly -I /Users/buildslave/jenkins/workspace/clang-stage1-cmake-RA-expensive/llvm-project/llvm/include -I /Users/buildslave/jenkins/workspace/clang-stage1-cmake-RA-expensive/llvm-project/llvm/lib/Target /Users/buildslave/jenkins/workspace/clang-stage1-cmake-RA-expensive/llvm-project/llvm/lib/Target/WebAssembly/WebAssembly.td --write-if-changed -o lib/Target/WebAssembly/WebAssemblyGenSubtargetInfo.inc -d lib/Target/WebAssembly/WebAssemblyGenSubtargetInfo.inc.d
[274/4529] /Applications/Xcode.app/Contents/Developer/Toolchains/XcodeDefault.xctoolchain/usr/bin/c++  -DEXPENSIVE_CHECKS -DGTEST_HAS_RTTI=0 -D_DEBUG -D_GLIBCXX_DEBUG -D__STDC_CONSTANT_MACROS -D__STDC_FORMAT_MACROS -D__STDC_LIMIT_MACROS -Ilib/XRay -I/Users/buildslave/jenkins/workspace/clang-stage1-cmake-RA-expensive/llvm-project/llvm/lib/XRay -I/Applications/Xcode.app/Contents/Developer/Platforms/MacOSX.platform/Developer/SDKs/MacOSX10.13.sdk/usr/include/libxml2 -Iinclude -I/Users/buildslave/jenkins/workspace/clang-stage1-cmake-RA-expensive/llvm-project/llvm/include -fPIC -fvisibility-inlines-hidden -Werror=date-time -Werror=unguarded-availability-new -Wall -Wextra -Wno-unused-parameter -Wwrite-strings -Wcast-qual -Wmissing-field-initializers -pedantic -Wno-long-long -Wimplicit-fallthrough -Wcovered-switch-default -Wno-noexcept-type -Wnon-virtual-dtor -Wdelete-non-virtual-dtor -Wstring-conversion -fdiagnostics-color -O3  -isysroot /Applications/Xcode.app/Contents/Developer/Platforms/MacOSX.platform/Developer/SDKs/MacOSX10.13.sdk -mmacosx-version-min=10.9   -UNDEBUG  -fno-exceptions -fno-rtti -std=c++14 -MD -MT lib/XRay/CMakeFiles/LLVMXRay.dir/Trace.cpp.o -MF lib/XRay/CMakeFiles/LLVMXRay.dir/Trace.cpp.o.d -o lib/XRay/CMakeFiles/LLVMXRay.dir/Trace.cpp.o -c /Users/buildslave/jenkins/workspace/clang-stage1-cmake-RA-expensive/llvm-project/llvm/lib/XRay/Trace.cpp
[275/4529] cd /Users/buildslave/jenkins/workspace/clang-stage1-cmake-RA-expensive/clang-build && /Users/buildslave/jenkins/workspace/clang-stage1-cmake-RA-expensive/clang-build/bin/llvm-tblgen -gen-asm-matcher -I /Users/buildslave/jenkins/workspace/clang-stage1-cmake-RA-expensive/llvm-project/llvm/lib/Target/WebAssembly -I /Users/buildslave/jenkins/workspace/clang-stage1-cmake-RA-expensive/llvm-project/llvm/include -I /Users/buildslave/jenkins/workspace/clang-stage1-cmake-RA-expensive/llvm-project/llvm/lib/Target /Users/buildslave/jenkins/workspace/clang-stage1-cmake-RA-expensive/llvm-project/llvm/lib/Target/WebAssembly/WebAssembly.td --write-if-changed -o lib/Target/WebAssembly/WebAssemblyGenAsmMatcher.inc -d lib/Target/WebAssembly/WebAssemblyGenAsmMatcher.inc.d
[276/4529] cd /Users/buildslave/jenkins/workspace/clang-stage1-cmake-RA-expensive/clang-build && /Users/buildslave/jenkins/workspace/clang-stage1-cmake-RA-expensive/clang-build/bin/llvm-tblgen -gen-fast-isel -I /Users/buildslave/jenkins/workspace/clang-stage1-cmake-RA-expensive/llvm-project/llvm/lib/Target/WebAssembly -I /Users/buildslave/jenkins/workspace/clang-stage1-cmake-RA-expensive/llvm-project/llvm/include -I /Users/buildslave/jenkins/workspace/clang-stage1-cmake-RA-expensive/llvm-project/llvm/lib/Target /Users/buildslave/jenkins/workspace/clang-stage1-cmake-RA-expensive/llvm-project/llvm/lib/Target/WebAssembly/WebAssembly.td --write-if-changed -o lib/Target/WebAssembly/WebAssemblyGenFastISel.inc -d lib/Target/WebAssembly/WebAssemblyGenFastISel.inc.d
[277/4529] cd /Users/buildslave/jenkins/workspace/clang-stage1-cmake-RA-expensive/clang-build && /Users/buildslave/jenkins/workspace/clang-stage1-cmake-RA-expensive/clang-build/bin/llvm-tblgen -gen-disassembler -I /Users/buildslave/jenkins/workspace/clang-stage1-cmake-RA-expensive/llvm-project/llvm/lib/Target/WebAssembly -I /Users/buildslave/jenkins/workspace/clang-stage1-cmake-RA-expensive/llvm-project/llvm/include -I /Users/buildslave/jenkins/workspace/clang-stage1-cmake-RA-expensive/llvm-project/llvm/lib/Target /Users/buildslave/jenkins/workspace/clang-stage1-cmake-RA-expensive/llvm-project/llvm/lib/Target/WebAssembly/WebAssembly.td --write-if-changed -o lib/Target/WebAssembly/WebAssemblyGenDisassemblerTables.inc -d lib/Target/WebAssembly/WebAssemblyGenDisassemblerTables.inc.d
[278/4529] cd /Users/buildslave/jenkins/workspace/clang-stage1-cmake-RA-expensive/clang-build && /Users/buildslave/jenkins/workspace/clang-stage1-cmake-RA-expensive/clang-build/bin/llvm-tblgen -gen-emitter -I /Users/buildslave/jenkins/workspace/clang-stage1-cmake-RA-expensive/llvm-project/llvm/lib/Target/WebAssembly -I /Users/buildslave/jenkins/workspace/clang-stage1-cmake-RA-expensive/llvm-project/llvm/include -I /Users/buildslave/jenkins/workspace/clang-stage1-cmake-RA-expensive/llvm-project/llvm/lib/Target /Users/buildslave/jenkins/workspace/clang-stage1-cmake-RA-expensive/llvm-project/llvm/lib/Target/WebAssembly/WebAssembly.td --write-if-changed -o lib/Target/WebAssembly/WebAssemblyGenMCCodeEmitter.inc -d lib/Target/WebAssembly/WebAssemblyGenMCCodeEmitter.inc.d
[279/4529] cd /Users/buildslave/jenkins/workspace/clang-stage1-cmake-RA-expensive/clang-build && /Users/buildslave/jenkins/workspace/clang-stage1-cmake-RA-expensive/clang-build/bin/llvm-tblgen -gen-register-info -I /Users/buildslave/jenkins/workspace/clang-stage1-cmake-RA-expensive/llvm-project/llvm/lib/Target/WebAssembly -I /Users/buildslave/jenkins/workspace/clang-stage1-cmake-RA-expensive/llvm-project/llvm/include -I /Users/buildslave/jenkins/workspace/clang-stage1-cmake-RA-expensive/llvm-project/llvm/lib/Target /Users/buildslave/jenkins/workspace/clang-stage1-cmake-RA-expensive/llvm-project/llvm/lib/Target/WebAssembly/WebAssembly.td --write-if-changed -o lib/Target/WebAssembly/WebAssemblyGenRegisterInfo.inc -d lib/Target/WebAssembly/WebAssemblyGenRegisterInfo.inc.d
[280/4529] cd /Users/buildslave/jenkins/workspace/clang-stage1-cmake-RA-expensive/clang-build && /Users/buildslave/jenkins/workspace/clang-stage1-cmake-RA-expensive/clang-build/bin/llvm-tblgen -gen-dag-isel -I /Users/buildslave/jenkins/workspace/clang-stage1-cmake-RA-expensive/llvm-project/llvm/lib/Target/WebAssembly -I /Users/buildslave/jenkins/workspace/clang-stage1-cmake-RA-expensive/llvm-project/llvm/include -I /Users/buildslave/jenkins/workspace/clang-stage1-cmake-RA-expensive/llvm-project/llvm/lib/Target /Users/buildslave/jenkins/workspace/clang-stage1-cmake-RA-expensive/llvm-project/llvm/lib/Target/WebAssembly/WebAssembly.td --write-if-changed -o lib/Target/WebAssembly/WebAssemblyGenDAGISel.inc -d lib/Target/WebAssembly/WebAssemblyGenDAGISel.inc.d
[281/4529] cd /Users/buildslave/jenkins/workspace/clang-stage1-cmake-RA-expensive/clang-build && /Users/buildslave/jenkins/workspace/clang-stage1-cmake-RA-expensive/clang-build/bin/llvm-tblgen -gen-instr-info -I /Users/buildslave/jenkins/workspace/clang-stage1-cmake-RA-expensive/llvm-project/llvm/lib/Target/WebAssembly -I /Users/buildslave/jenkins/workspace/clang-stage1-cmake-RA-expensive/llvm-project/llvm/include -I /Users/buildslave/jenkins/workspace/clang-stage1-cmake-RA-expensive/llvm-project/llvm/lib/Target /Users/buildslave/jenkins/workspace/clang-stage1-cmake-RA-expensive/llvm-project/llvm/lib/Target/WebAssembly/WebAssembly.td --write-if-changed -o lib/Target/WebAssembly/WebAssemblyGenInstrInfo.inc -d lib/Target/WebAssembly/WebAssemblyGenInstrInfo.inc.d
[282/4529] /Applications/Xcode.app/Contents/Developer/Toolchains/XcodeDefault.xctoolchain/usr/bin/c++  -DEXPENSIVE_CHECKS -DGTEST_HAS_RTTI=0 -D_DEBUG -D_GLIBCXX_DEBUG -D__STDC_CONSTANT_MACROS -D__STDC_FORMAT_MACROS -D__STDC_LIMIT_MACROS -Ilib/TextAPI -I/Users/buildslave/jenkins/workspace/clang-stage1-cmake-RA-expensive/llvm-project/llvm/lib/TextAPI -I/Applications/Xcode.app/Contents/Developer/Platforms/MacOSX.platform/Developer/SDKs/MacOSX10.13.sdk/usr/include/libxml2 -Iinclude -I/Users/buildslave/jenkins/workspace/clang-stage1-cmake-RA-expensive/llvm-project/llvm/include -fPIC -fvisibility-inlines-hidden -Werror=date-time -Werror=unguarded-availability-new -Wall -Wextra -Wno-unused-parameter -Wwrite-strings -Wcast-qual -Wmissing-field-initializers -pedantic -Wno-long-long -Wimplicit-fallthrough -Wcovered-switch-default -Wno-noexcept-type -Wnon-virtual-dtor -Wdelete-non-virtual-dtor -Wstring-conversion -fdiagnostics-color -O3  -isysroot /Applications/Xcode.app/Contents/Developer/Platforms/MacOSX.platform/Developer/SDKs/MacOSX10.13.sdk -mmacosx-version-min=10.9   -UNDEBUG  -fno-exceptions -fno-rtti -std=c++14 -MD -MT lib/TextAPI/CMakeFiles/LLVMTextAPI.dir/MachO/TextStub.cpp.o -MF lib/TextAPI/CMakeFiles/LLVMTextAPI.dir/MachO/TextStub.cpp.o.d -o lib/TextAPI/CMakeFiles/LLVMTextAPI.dir/MachO/TextStub.cpp.o -c /Users/buildslave/jenkins/workspace/clang-stage1-cmake-RA-expensive/llvm-project/llvm/lib/TextAPI/MachO/TextStub.cpp
[283/4529] /Applications/Xcode.app/Contents/Developer/Toolchains/XcodeDefault.xctoolchain/usr/bin/c++  -DEXPENSIVE_CHECKS -DGTEST_HAS_RTTI=0 -D_DEBUG -D_GLIBCXX_DEBUG -D__STDC_CONSTANT_MACROS -D__STDC_FORMAT_MACROS -D__STDC_LIMIT_MACROS -Iutils/not -I/Users/buildslave/jenkins/workspace/clang-stage1-cmake-RA-expensive/llvm-project/llvm/utils/not -I/Applications/Xcode.app/Contents/Developer/Platforms/MacOSX.platform/Developer/SDKs/MacOSX10.13.sdk/usr/include/libxml2 -Iinclude -I/Users/buildslave/jenkins/workspace/clang-stage1-cmake-RA-expensive/llvm-project/llvm/include -fPIC -fvisibility-inlines-hidden -Werror=date-time -Werror=unguarded-availability-new -Wall -Wextra -Wno-unused-parameter -Wwrite-strings -Wcast-qual -Wmissing-field-initializers -pedantic -Wno-long-long -Wimplicit-fallthrough -Wcovered-switch-default -Wno-noexcept-type -Wnon-virtual-dtor -Wdelete-non-virtual-dtor -Wstring-conversion -fdiagnostics-color -O3  -isysroot /Applications/Xcode.app/Contents/Developer/Platforms/MacOSX.platform/Developer/SDKs/MacOSX10.13.sdk -mmacosx-version-min=10.9   -UNDEBUG  -fno-exceptions -fno-rtti -std=c++14 -MD -MT utils/not/CMakeFiles/not.dir/not.cpp.o -MF utils/not/CMakeFiles/not.dir/not.cpp.o.d -o utils/not/CMakeFiles/not.dir/not.cpp.o -c /Users/buildslave/jenkins/workspace/clang-stage1-cmake-RA-expensive/llvm-project/llvm/utils/not/not.cpp
[284/4529] /Applications/Xcode.app/Contents/Developer/Toolchains/XcodeDefault.xctoolchain/usr/bin/c++  -DEXPENSIVE_CHECKS -DGTEST_HAS_RTTI=0 -D_DEBUG -D_GLIBCXX_DEBUG -D__STDC_CONSTANT_MACROS -D__STDC_FORMAT_MACROS -D__STDC_LIMIT_MACROS -Ilib/ToolDrivers/llvm-dlltool -I/Users/buildslave/jenkins/workspace/clang-stage1-cmake-RA-expensive/llvm-project/llvm/lib/ToolDrivers/llvm-dlltool -I/Applications/Xcode.app/Contents/Developer/Platforms/MacOSX.platform/Developer/SDKs/MacOSX10.13.sdk/usr/include/libxml2 -Iinclude -I/Users/buildslave/jenkins/workspace/clang-stage1-cmake-RA-expensive/llvm-project/llvm/include -fPIC -fvisibility-inlines-hidden -Werror=date-time -Werror=unguarded-availability-new -Wall -Wextra -Wno-unused-parameter -Wwrite-strings -Wcast-qual -Wmissing-field-initializers -pedantic -Wno-long-long -Wimplicit-fallthrough -Wcovered-switch-default -Wno-noexcept-type -Wnon-virtual-dtor -Wdelete-non-virtual-dtor -Wstring-conversion -fdiagnostics-color -O3  -isysroot /Applications/Xcode.app/Contents/Developer/Platforms/MacOSX.platform/Developer/SDKs/MacOSX10.13.sdk -mmacosx-version-min=10.9   -UNDEBUG  -fno-exceptions -fno-rtti -std=c++14 -MD -MT lib/ToolDrivers/llvm-dlltool/CMakeFiles/LLVMDlltoolDriver.dir/DlltoolDriver.cpp.o -MF lib/ToolDrivers/llvm-dlltool/CMakeFiles/LLVMDlltoolDriver.dir/DlltoolDriver.cpp.o.d -o lib/ToolDrivers/llvm-dlltool/CMakeFiles/LLVMDlltoolDriver.dir/DlltoolDriver.cpp.o -c /Users/buildslave/jenkins/workspace/clang-stage1-cmake-RA-expensive/llvm-project/llvm/lib/ToolDrivers/llvm-dlltool/DlltoolDriver.cpp
[285/4529] /Applications/Xcode.app/Contents/Developer/Toolchains/XcodeDefault.xctoolchain/usr/bin/c++  -DEXPENSIVE_CHECKS -DGTEST_HAS_RTTI=0 -D_DEBUG -D_GLIBCXX_DEBUG -D__STDC_CONSTANT_MACROS -D__STDC_FORMAT_MACROS -D__STDC_LIMIT_MACROS -Iutils/FileCheck -I/Users/buildslave/jenkins/workspace/clang-stage1-cmake-RA-expensive/llvm-project/llvm/utils/FileCheck -I/Applications/Xcode.app/Contents/Developer/Platforms/MacOSX.platform/Developer/SDKs/MacOSX10.13.sdk/usr/include/libxml2 -Iinclude -I/Users/buildslave/jenkins/workspace/clang-stage1-cmake-RA-expensive/llvm-project/llvm/include -fPIC -fvisibility-inlines-hidden -Werror=date-time -Werror=unguarded-availability-new -Wall -Wextra -Wno-unused-parameter -Wwrite-strings -Wcast-qual -Wmissing-field-initializers -pedantic -Wno-long-long -Wimplicit-fallthrough -Wcovered-switch-default -Wno-noexcept-type -Wnon-virtual-dtor -Wdelete-non-virtual-dtor -Wstring-conversion -fdiagnostics-color -O3  -isysroot /Applications/Xcode.app/Contents/Developer/Platforms/MacOSX.platform/Developer/SDKs/MacOSX10.13.sdk -mmacosx-version-min=10.9   -UNDEBUG  -fno-exceptions -fno-rtti -std=c++14 -MD -MT utils/FileCheck/CMakeFiles/FileCheck.dir/FileCheck.cpp.o -MF utils/FileCheck/CMakeFiles/FileCheck.dir/FileCheck.cpp.o.d -o utils/FileCheck/CMakeFiles/FileCheck.dir/FileCheck.cpp.o -c /Users/buildslave/jenkins/workspace/clang-stage1-cmake-RA-expensive/llvm-project/llvm/utils/FileCheck/FileCheck.cpp
[286/4529] cd /Users/buildslave/jenkins/workspace/clang-stage1-cmake-RA-expensive/clang-build && /Users/buildslave/jenkins/workspace/clang-stage1-cmake-RA-expensive/clang-build/bin/llvm-tblgen -gen-callingconv -I /Users/buildslave/jenkins/workspace/clang-stage1-cmake-RA-expensive/llvm-project/llvm/lib/Target/X86 -I /Users/buildslave/jenkins/workspace/clang-stage1-cmake-RA-expensive/llvm-project/llvm/include -I /Users/buildslave/jenkins/workspace/clang-stage1-cmake-RA-expensive/llvm-project/llvm/lib/Target /Users/buildslave/jenkins/workspace/clang-stage1-cmake-RA-expensive/llvm-project/llvm/lib/Target/X86/X86.td --write-if-changed -o lib/Target/X86/X86GenCallingConv.inc -d lib/Target/X86/X86GenCallingConv.inc.d
[287/4529] /Applications/Xcode.app/Contents/Developer/Toolchains/XcodeDefault.xctoolchain/usr/bin/c++  -DEXPENSIVE_CHECKS -DGTEST_HAS_RTTI=0 -D_DEBUG -D_GLIBCXX_DEBUG -D__STDC_CONSTANT_MACROS -D__STDC_FORMAT_MACROS -D__STDC_LIMIT_MACROS -Iutils/yaml-bench -I/Users/buildslave/jenkins/workspace/clang-stage1-cmake-RA-expensive/llvm-project/llvm/utils/yaml-bench -I/Applications/Xcode.app/Contents/Developer/Platforms/MacOSX.platform/Developer/SDKs/MacOSX10.13.sdk/usr/include/libxml2 -Iinclude -I/Users/buildslave/jenkins/workspace/clang-stage1-cmake-RA-expensive/llvm-project/llvm/include -fPIC -fvisibility-inlines-hidden -Werror=date-time -Werror=unguarded-availability-new -Wall -Wextra -Wno-unused-parameter -Wwrite-strings -Wcast-qual -Wmissing-field-initializers -pedantic -Wno-long-long -Wimplicit-fallthrough -Wcovered-switch-default -Wno-noexcept-type -Wnon-virtual-dtor -Wdelete-non-virtual-dtor -Wstring-conversion -fdiagnostics-color -O3  -isysroot /Applications/Xcode.app/Contents/Developer/Platforms/MacOSX.platform/Developer/SDKs/MacOSX10.13.sdk -mmacosx-version-min=10.9   -UNDEBUG  -fno-exceptions -fno-rtti -std=c++14 -MD -MT utils/yaml-bench/CMakeFiles/yaml-bench.dir/YAMLBench.cpp.o -MF utils/yaml-bench/CMakeFiles/yaml-bench.dir/YAMLBench.cpp.o.d -o utils/yaml-bench/CMakeFiles/yaml-bench.dir/YAMLBench.cpp.o -c /Users/buildslave/jenkins/workspace/clang-stage1-cmake-RA-expensive/llvm-project/llvm/utils/yaml-bench/YAMLBench.cpp
[288/4529] cd /Users/buildslave/jenkins/workspace/clang-stage1-cmake-RA-expensive/clang-build && /Users/buildslave/jenkins/workspace/clang-stage1-cmake-RA-expensive/clang-build/bin/llvm-tblgen -gen-asm-writer -I /Users/buildslave/jenkins/workspace/clang-stage1-cmake-RA-expensive/llvm-project/llvm/lib/Target/X86 -I /Users/buildslave/jenkins/workspace/clang-stage1-cmake-RA-expensive/llvm-project/llvm/include -I /Users/buildslave/jenkins/workspace/clang-stage1-cmake-RA-expensive/llvm-project/llvm/lib/Target /Users/buildslave/jenkins/workspace/clang-stage1-cmake-RA-expensive/llvm-project/llvm/lib/Target/X86/X86.td --write-if-changed -o lib/Target/X86/X86GenAsmWriter.inc -d lib/Target/X86/X86GenAsmWriter.inc.d
[289/4529] cd /Users/buildslave/jenkins/workspace/clang-stage1-cmake-RA-expensive/clang-build && /Users/buildslave/jenkins/workspace/clang-stage1-cmake-RA-expensive/clang-build/bin/llvm-tblgen -gen-asm-writer -asmwriternum=1 -I /Users/buildslave/jenkins/workspace/clang-stage1-cmake-RA-expensive/llvm-project/llvm/lib/Target/X86 -I /Users/buildslave/jenkins/workspace/clang-stage1-cmake-RA-expensive/llvm-project/llvm/include -I /Users/buildslave/jenkins/workspace/clang-stage1-cmake-RA-expensive/llvm-project/llvm/lib/Target /Users/buildslave/jenkins/workspace/clang-stage1-cmake-RA-expensive/llvm-project/llvm/lib/Target/X86/X86.td --write-if-changed -o lib/Target/X86/X86GenAsmWriter1.inc -d lib/Target/X86/X86GenAsmWriter1.inc.d
[290/4529] cd /Users/buildslave/jenkins/workspace/clang-stage1-cmake-RA-expensive/clang-build && /Users/buildslave/jenkins/workspace/clang-stage1-cmake-RA-expensive/clang-build/bin/llvm-tblgen -gen-x86-EVEX2VEX-tables -I /Users/buildslave/jenkins/workspace/clang-stage1-cmake-RA-expensive/llvm-project/llvm/lib/Target/X86 -I /Users/buildslave/jenkins/workspace/clang-stage1-cmake-RA-expensive/llvm-project/llvm/include -I /Users/buildslave/jenkins/workspace/clang-stage1-cmake-RA-expensive/llvm-project/llvm/lib/Target /Users/buildslave/jenkins/workspace/clang-stage1-cmake-RA-expensive/llvm-project/llvm/lib/Target/X86/X86.td --write-if-changed -o lib/Target/X86/X86GenEVEX2VEXTables.inc -d lib/Target/X86/X86GenEVEX2VEXTables.inc.d
[291/4529] cd /Users/buildslave/jenkins/workspace/clang-stage1-cmake-RA-expensive/clang-build && /Users/buildslave/jenkins/workspace/clang-stage1-cmake-RA-expensive/clang-build/bin/llvm-tblgen -gen-exegesis -I /Users/buildslave/jenkins/workspace/clang-stage1-cmake-RA-expensive/llvm-project/llvm/lib/Target/X86 -I /Users/buildslave/jenkins/workspace/clang-stage1-cmake-RA-expensive/llvm-project/llvm/include -I /Users/buildslave/jenkins/workspace/clang-stage1-cmake-RA-expensive/llvm-project/llvm/lib/Target /Users/buildslave/jenkins/workspace/clang-stage1-cmake-RA-expensive/llvm-project/llvm/lib/Target/X86/X86.td --write-if-changed -o lib/Target/X86/X86GenExegesis.inc -d lib/Target/X86/X86GenExegesis.inc.d
[292/4529] cd /Users/buildslave/jenkins/workspace/clang-stage1-cmake-RA-expensive/clang-build && /Users/buildslave/jenkins/workspace/clang-stage1-cmake-RA-expensive/clang-build/bin/llvm-tblgen -gen-disassembler -I /Users/buildslave/jenkins/workspace/clang-stage1-cmake-RA-expensive/llvm-project/llvm/lib/Target/X86 -I /Users/buildslave/jenkins/workspace/clang-stage1-cmake-RA-expensive/llvm-project/llvm/include -I /Users/buildslave/jenkins/workspace/clang-stage1-cmake-RA-expensive/llvm-project/llvm/lib/Target /Users/buildslave/jenkins/workspace/clang-stage1-cmake-RA-expensive/llvm-project/llvm/lib/Target/X86/X86.td --write-if-changed -o lib/Target/X86/X86GenDisassemblerTables.inc -d lib/Target/X86/X86GenDisassemblerTables.inc.d
[293/4529] cd /Users/buildslave/jenkins/workspace/clang-stage1-cmake-RA-expensive/clang-build && /Users/buildslave/jenkins/workspace/clang-stage1-cmake-RA-expensive/clang-build/bin/llvm-tblgen -gen-asm-writer -I /Users/buildslave/jenkins/workspace/clang-stage1-cmake-RA-expensive/llvm-project/llvm/lib/Target/XCore -I /Users/buildslave/jenkins/workspace/clang-stage1-cmake-RA-expensive/llvm-project/llvm/include -I /Users/buildslave/jenkins/workspace/clang-stage1-cmake-RA-expensive/llvm-project/llvm/lib/Target /Users/buildslave/jenkins/workspace/clang-stage1-cmake-RA-expensive/llvm-project/llvm/lib/Target/XCore/XCore.td --write-if-changed -o lib/Target/XCore/XCoreGenAsmWriter.inc -d lib/Target/XCore/XCoreGenAsmWriter.inc.d
[294/4529] cd /Users/buildslave/jenkins/workspace/clang-stage1-cmake-RA-expensive/clang-build && /Users/buildslave/jenkins/workspace/clang-stage1-cmake-RA-expensive/clang-build/bin/llvm-tblgen -gen-callingconv -I /Users/buildslave/jenkins/workspace/clang-stage1-cmake-RA-expensive/llvm-project/llvm/lib/Target/XCore -I /Users/buildslave/jenkins/workspace/clang-stage1-cmake-RA-expensive/llvm-project/llvm/include -I /Users/buildslave/jenkins/workspace/clang-stage1-cmake-RA-expensive/llvm-project/llvm/lib/Target /Users/buildslave/jenkins/workspace/clang-stage1-cmake-RA-expensive/llvm-project/llvm/lib/Target/XCore/XCore.td --write-if-changed -o lib/Target/XCore/XCoreGenCallingConv.inc -d lib/Target/XCore/XCoreGenCallingConv.inc.d
[295/4529] cd /Users/buildslave/jenkins/workspace/clang-stage1-cmake-RA-expensive/clang-build && /Users/buildslave/jenkins/workspace/clang-stage1-cmake-RA-expensive/clang-build/bin/llvm-tblgen -gen-disassembler -I /Users/buildslave/jenkins/workspace/clang-stage1-cmake-RA-expensive/llvm-project/llvm/lib/Target/XCore -I /Users/buildslave/jenkins/workspace/clang-stage1-cmake-RA-expensive/llvm-project/llvm/include -I /Users/buildslave/jenkins/workspace/clang-stage1-cmake-RA-expensive/llvm-project/llvm/lib/Target /Users/buildslave/jenkins/workspace/clang-stage1-cmake-RA-expensive/llvm-project/llvm/lib/Target/XCore/XCore.td --write-if-changed -o lib/Target/XCore/XCoreGenDisassemblerTables.inc -d lib/Target/XCore/XCoreGenDisassemblerTables.inc.d
[296/4529] cd /Users/buildslave/jenkins/workspace/clang-stage1-cmake-RA-expensive/clang-build && /Users/buildslave/jenkins/workspace/clang-stage1-cmake-RA-expensive/clang-build/bin/llvm-tblgen -gen-dag-isel -I /Users/buildslave/jenkins/workspace/clang-stage1-cmake-RA-expensive/llvm-project/llvm/lib/Target/XCore -I /Users/buildslave/jenkins/workspace/clang-stage1-cmake-RA-expensive/llvm-project/llvm/include -I /Users/buildslave/jenkins/workspace/clang-stage1-cmake-RA-expensive/llvm-project/llvm/lib/Target /Users/buildslave/jenkins/workspace/clang-stage1-cmake-RA-expensive/llvm-project/llvm/lib/Target/XCore/XCore.td --write-if-changed -o lib/Target/XCore/XCoreGenDAGISel.inc -d lib/Target/XCore/XCoreGenDAGISel.inc.d
[297/4529] cd /Users/buildslave/jenkins/workspace/clang-stage1-cmake-RA-expensive/clang-build && /Users/buildslave/jenkins/workspace/clang-stage1-cmake-RA-expensive/clang-build/bin/llvm-tblgen -gen-register-bank -I /Users/buildslave/jenkins/workspace/clang-stage1-cmake-RA-expensive/llvm-project/llvm/lib/Target/X86 -I /Users/buildslave/jenkins/workspace/clang-stage1-cmake-RA-expensive/llvm-project/llvm/include -I /Users/buildslave/jenkins/workspace/clang-stage1-cmake-RA-expensive/llvm-project/llvm/lib/Target /Users/buildslave/jenkins/workspace/clang-stage1-cmake-RA-expensive/llvm-project/llvm/lib/Target/X86/X86.td --write-if-changed -o lib/Target/X86/X86GenRegisterBank.inc -d lib/Target/X86/X86GenRegisterBank.inc.d
[298/4529] cd /Users/buildslave/jenkins/workspace/clang-stage1-cmake-RA-expensive/clang-build && /Users/buildslave/jenkins/workspace/clang-stage1-cmake-RA-expensive/clang-build/bin/llvm-tblgen -gen-register-info -I /Users/buildslave/jenkins/workspace/clang-stage1-cmake-RA-expensive/llvm-project/llvm/lib/Target/XCore -I /Users/buildslave/jenkins/workspace/clang-stage1-cmake-RA-expensive/llvm-project/llvm/include -I /Users/buildslave/jenkins/workspace/clang-stage1-cmake-RA-expensive/llvm-project/llvm/lib/Target /Users/buildslave/jenkins/workspace/clang-stage1-cmake-RA-expensive/llvm-project/llvm/lib/Target/XCore/XCore.td --write-if-changed -o lib/Target/XCore/XCoreGenRegisterInfo.inc -d lib/Target/XCore/XCoreGenRegisterInfo.inc.d
[299/4529] cd /Users/buildslave/jenkins/workspace/clang-stage1-cmake-RA-expensive/clang-build && /Users/buildslave/jenkins/workspace/clang-stage1-cmake-RA-expensive/clang-build/bin/llvm-tblgen -gen-register-info -I /Users/buildslave/jenkins/workspace/clang-stage1-cmake-RA-expensive/llvm-project/llvm/lib/Target/X86 -I /Users/buildslave/jenkins/workspace/clang-stage1-cmake-RA-expensive/llvm-project/llvm/include -I /Users/buildslave/jenkins/workspace/clang-stage1-cmake-RA-expensive/llvm-project/llvm/lib/Target /Users/buildslave/jenkins/workspace/clang-stage1-cmake-RA-expensive/llvm-project/llvm/lib/Target/X86/X86.td --write-if-changed -o lib/Target/X86/X86GenRegisterInfo.inc -d lib/Target/X86/X86GenRegisterInfo.inc.d
[300/4529] cd /Users/buildslave/jenkins/workspace/clang-stage1-cmake-RA-expensive/clang-build && /Users/buildslave/jenkins/workspace/clang-stage1-cmake-RA-expensive/clang-build/bin/llvm-tblgen -gen-instr-info -I /Users/buildslave/jenkins/workspace/clang-stage1-cmake-RA-expensive/llvm-project/llvm/lib/Target/XCore -I /Users/buildslave/jenkins/workspace/clang-stage1-cmake-RA-expensive/llvm-project/llvm/include -I /Users/buildslave/jenkins/workspace/clang-stage1-cmake-RA-expensive/llvm-project/llvm/lib/Target /Users/buildslave/jenkins/workspace/clang-stage1-cmake-RA-expensive/llvm-project/llvm/lib/Target/XCore/XCore.td --write-if-changed -o lib/Target/XCore/XCoreGenInstrInfo.inc -d lib/Target/XCore/XCoreGenInstrInfo.inc.d
[301/4529] cd /Users/buildslave/jenkins/workspace/clang-stage1-cmake-RA-expensive/clang-build && /Users/buildslave/jenkins/workspace/clang-stage1-cmake-RA-expensive/clang-build/bin/llvm-tblgen -gen-subtarget -I /Users/buildslave/jenkins/workspace/clang-stage1-cmake-RA-expensive/llvm-project/llvm/lib/Target/XCore -I /Users/buildslave/jenkins/workspace/clang-stage1-cmake-RA-expensive/llvm-project/llvm/include -I /Users/buildslave/jenkins/workspace/clang-stage1-cmake-RA-expensive/llvm-project/llvm/lib/Target /Users/buildslave/jenkins/workspace/clang-stage1-cmake-RA-expensive/llvm-project/llvm/lib/Target/XCore/XCore.td --write-if-changed -o lib/Target/XCore/XCoreGenSubtargetInfo.inc -d lib/Target/XCore/XCoreGenSubtargetInfo.inc.d
[302/4529] cd /Users/buildslave/jenkins/workspace/clang-stage1-cmake-RA-expensive/clang-build && /Users/buildslave/jenkins/workspace/clang-stage1-cmake-RA-expensive/clang-build/bin/llvm-tblgen -gen-subtarget -I /Users/buildslave/jenkins/workspace/clang-stage1-cmake-RA-expensive/llvm-project/llvm/lib/Target/X86 -I /Users/buildslave/jenkins/workspace/clang-stage1-cmake-RA-expensive/llvm-project/llvm/include -I /Users/buildslave/jenkins/workspace/clang-stage1-cmake-RA-expensive/llvm-project/llvm/lib/Target /Users/buildslave/jenkins/workspace/clang-stage1-cmake-RA-expensive/llvm-project/llvm/lib/Target/X86/X86.td --write-if-changed -o lib/Target/X86/X86GenSubtargetInfo.inc -d lib/Target/X86/X86GenSubtargetInfo.inc.d
[303/4529] /Applications/Xcode.app/Contents/Developer/Toolchains/XcodeDefault.xctoolchain/usr/bin/c++  -DEXPENSIVE_CHECKS -DGTEST_HAS_RTTI=0 -D_DEBUG -D_GLIBCXX_DEBUG -D__STDC_CONSTANT_MACROS -D__STDC_FORMAT_MACROS -D__STDC_LIMIT_MACROS -Ilib/AsmParser -I/Users/buildslave/jenkins/workspace/clang-stage1-cmake-RA-expensive/llvm-project/llvm/lib/AsmParser -I/Applications/Xcode.app/Contents/Developer/Platforms/MacOSX.platform/Developer/SDKs/MacOSX10.13.sdk/usr/include/libxml2 -Iinclude -I/Users/buildslave/jenkins/workspace/clang-stage1-cmake-RA-expensive/llvm-project/llvm/include -fPIC -fvisibility-inlines-hidden -Werror=date-time -Werror=unguarded-availability-new -Wall -Wextra -Wno-unused-parameter -Wwrite-strings -Wcast-qual -Wmissing-field-initializers -pedantic -Wno-long-long -Wimplicit-fallthrough -Wcovered-switch-default -Wno-noexcept-type -Wnon-virtual-dtor -Wdelete-non-virtual-dtor -Wstring-conversion -fdiagnostics-color -O3  -isysroot /Applications/Xcode.app/Contents/Developer/Platforms/MacOSX.platform/Developer/SDKs/MacOSX10.13.sdk -mmacosx-version-min=10.9   -UNDEBUG  -fno-exceptions -fno-rtti -std=c++14 -MD -MT lib/AsmParser/CMakeFiles/LLVMAsmParser.dir/LLLexer.cpp.o -MF lib/AsmParser/CMakeFiles/LLVMAsmParser.dir/LLLexer.cpp.o.d -o lib/AsmParser/CMakeFiles/LLVMAsmParser.dir/LLLexer.cpp.o -c /Users/buildslave/jenkins/workspace/clang-stage1-cmake-RA-expensive/llvm-project/llvm/lib/AsmParser/LLLexer.cpp
[304/4529] /Applications/Xcode.app/Contents/Developer/Toolchains/XcodeDefault.xctoolchain/usr/bin/c++  -DEXPENSIVE_CHECKS -DGTEST_HAS_RTTI=0 -D_DEBUG -D_GLIBCXX_DEBUG -D__STDC_CONSTANT_MACROS -D__STDC_FORMAT_MACROS -D__STDC_LIMIT_MACROS -Ilib/AsmParser -I/Users/buildslave/jenkins/workspace/clang-stage1-cmake-RA-expensive/llvm-project/llvm/lib/AsmParser -I/Applications/Xcode.app/Contents/Developer/Platforms/MacOSX.platform/Developer/SDKs/MacOSX10.13.sdk/usr/include/libxml2 -Iinclude -I/Users/buildslave/jenkins/workspace/clang-stage1-cmake-RA-expensive/llvm-project/llvm/include -fPIC -fvisibility-inlines-hidden -Werror=date-time -Werror=unguarded-availability-new -Wall -Wextra -Wno-unused-parameter -Wwrite-strings -Wcast-qual -Wmissing-field-initializers -pedantic -Wno-long-long -Wimplicit-fallthrough -Wcovered-switch-default -Wno-noexcept-type -Wnon-virtual-dtor -Wdelete-non-virtual-dtor -Wstring-conversion -fdiagnostics-color -O3  -isysroot /Applications/Xcode.app/Contents/Developer/Platforms/MacOSX.platform/Developer/SDKs/MacOSX10.13.sdk -mmacosx-version-min=10.9   -UNDEBUG  -fno-exceptions -fno-rtti -std=c++14 -MD -MT lib/AsmParser/CMakeFiles/LLVMAsmParser.dir/Parser.cpp.o -MF lib/AsmParser/CMakeFiles/LLVMAsmParser.dir/Parser.cpp.o.d -o lib/AsmParser/CMakeFiles/LLVMAsmParser.dir/Parser.cpp.o -c /Users/buildslave/jenkins/workspace/clang-stage1-cmake-RA-expensive/llvm-project/llvm/lib/AsmParser/Parser.cpp
[305/4529] cd /Users/buildslave/jenkins/workspace/clang-stage1-cmake-RA-expensive/clang-build && /Users/buildslave/jenkins/workspace/clang-stage1-cmake-RA-expensive/clang-build/bin/llvm-tblgen -gen-fast-isel -I /Users/buildslave/jenkins/workspace/clang-stage1-cmake-RA-expensive/llvm-project/llvm/lib/Target/X86 -I /Users/buildslave/jenkins/workspace/clang-stage1-cmake-RA-expensive/llvm-project/llvm/include -I /Users/buildslave/jenkins/workspace/clang-stage1-cmake-RA-expensive/llvm-project/llvm/lib/Target /Users/buildslave/jenkins/workspace/clang-stage1-cmake-RA-expensive/llvm-project/llvm/lib/Target/X86/X86.td --write-if-changed -o lib/Target/X86/X86GenFastISel.inc -d lib/Target/X86/X86GenFastISel.inc.d
[306/4529] cd /Users/buildslave/jenkins/workspace/clang-stage1-cmake-RA-expensive/clang-build && /Users/buildslave/jenkins/workspace/clang-stage1-cmake-RA-expensive/clang-build/bin/llvm-tblgen -gen-global-isel -I /Users/buildslave/jenkins/workspace/clang-stage1-cmake-RA-expensive/llvm-project/llvm/lib/Target/X86 -I /Users/buildslave/jenkins/workspace/clang-stage1-cmake-RA-expensive/llvm-project/llvm/include -I /Users/buildslave/jenkins/workspace/clang-stage1-cmake-RA-expensive/llvm-project/llvm/lib/Target /Users/buildslave/jenkins/workspace/clang-stage1-cmake-RA-expensive/llvm-project/llvm/lib/Target/X86/X86.td --write-if-changed -o lib/Target/X86/X86GenGlobalISel.inc -d lib/Target/X86/X86GenGlobalISel.inc.d
[307/4529] /Applications/Xcode.app/Contents/Developer/Toolchains/XcodeDefault.xctoolchain/usr/bin/c++  -DEXPENSIVE_CHECKS -DGTEST_HAS_RTTI=0 -D_DEBUG -D_GLIBCXX_DEBUG -D__STDC_CONSTANT_MACROS -D__STDC_FORMAT_MACROS -D__STDC_LIMIT_MACROS -Ilib/Target/XCore -I/Users/buildslave/jenkins/workspace/clang-stage1-cmake-RA-expensive/llvm-project/llvm/lib/Target/XCore -I/Applications/Xcode.app/Contents/Developer/Platforms/MacOSX.platform/Developer/SDKs/MacOSX10.13.sdk/usr/include/libxml2 -Iinclude -I/Users/buildslave/jenkins/workspace/clang-stage1-cmake-RA-expensive/llvm-project/llvm/include -fPIC -fvisibility-inlines-hidden -Werror=date-time -Werror=unguarded-availability-new -Wall -Wextra -Wno-unused-parameter -Wwrite-strings -Wcast-qual -Wmissing-field-initializers -pedantic -Wno-long-long -Wimplicit-fallthrough -Wcovered-switch-default -Wno-noexcept-type -Wnon-virtual-dtor -Wdelete-non-virtual-dtor -Wstring-conversion -fdiagnostics-color -O3  -isysroot /Applications/Xcode.app/Contents/Developer/Platforms/MacOSX.platform/Developer/SDKs/MacOSX10.13.sdk -mmacosx-version-min=10.9   -UNDEBUG  -fno-exceptions -fno-rtti -std=c++14 -MD -MT lib/Target/XCore/CMakeFiles/LLVMXCoreCodeGen.dir/XCoreAsmPrinter.cpp.o -MF lib/Target/XCore/CMakeFiles/LLVMXCoreCodeGen.dir/XCoreAsmPrinter.cpp.o.d -o lib/Target/XCore/CMakeFiles/LLVMXCoreCodeGen.dir/XCoreAsmPrinter.cpp.o -c /Users/buildslave/jenkins/workspace/clang-stage1-cmake-RA-expensive/llvm-project/llvm/lib/Target/XCore/XCoreAsmPrinter.cpp
[308/4529] cd /Users/buildslave/jenkins/workspace/clang-stage1-cmake-RA-expensive/clang-build && /Users/buildslave/jenkins/workspace/clang-stage1-cmake-RA-expensive/clang-build/bin/llvm-tblgen -gen-instr-info -I /Users/buildslave/jenkins/workspace/clang-stage1-cmake-RA-expensive/llvm-project/llvm/lib/Target/X86 -I /Users/buildslave/jenkins/workspace/clang-stage1-cmake-RA-expensive/llvm-project/llvm/include -I /Users/buildslave/jenkins/workspace/clang-stage1-cmake-RA-expensive/llvm-project/llvm/lib/Target /Users/buildslave/jenkins/workspace/clang-stage1-cmake-RA-expensive/llvm-project/llvm/lib/Target/X86/X86.td --write-if-changed -o lib/Target/X86/X86GenInstrInfo.inc -d lib/Target/X86/X86GenInstrInfo.inc.d
[309/4529] /Applications/Xcode.app/Contents/Developer/Toolchains/XcodeDefault.xctoolchain/usr/bin/c++  -DEXPENSIVE_CHECKS -DGTEST_HAS_RTTI=0 -D_DEBUG -D_GLIBCXX_DEBUG -D__STDC_CONSTANT_MACROS -D__STDC_FORMAT_MACROS -D__STDC_LIMIT_MACROS -Ilib/Target/XCore -I/Users/buildslave/jenkins/workspace/clang-stage1-cmake-RA-expensive/llvm-project/llvm/lib/Target/XCore -I/Applications/Xcode.app/Contents/Developer/Platforms/MacOSX.platform/Developer/SDKs/MacOSX10.13.sdk/usr/include/libxml2 -Iinclude -I/Users/buildslave/jenkins/workspace/clang-stage1-cmake-RA-expensive/llvm-project/llvm/include -fPIC -fvisibility-inlines-hidden -Werror=date-time -Werror=unguarded-availability-new -Wall -Wextra -Wno-unused-parameter -Wwrite-strings -Wcast-qual -Wmissing-field-initializers -pedantic -Wno-long-long -Wimplicit-fallthrough -Wcovered-switch-default -Wno-noexcept-type -Wnon-virtual-dtor -Wdelete-non-virtual-dtor -Wstring-conversion -fdiagnostics-color -O3  -isysroot /Applications/Xcode.app/Contents/Developer/Platforms/MacOSX.platform/Developer/SDKs/MacOSX10.13.sdk -mmacosx-version-min=10.9   -UNDEBUG  -fno-exceptions -fno-rtti -std=c++14 -MD -MT lib/Target/XCore/CMakeFiles/LLVMXCoreCodeGen.dir/XCoreInstrInfo.cpp.o -MF lib/Target/XCore/CMakeFiles/LLVMXCoreCodeGen.dir/XCoreInstrInfo.cpp.o.d -o lib/Target/XCore/CMakeFiles/LLVMXCoreCodeGen.dir/XCoreInstrInfo.cpp.o -c /Users/buildslave/jenkins/workspace/clang-stage1-cmake-RA-expensive/llvm-project/llvm/lib/Target/XCore/XCoreInstrInfo.cpp
FATAL: command execution failed
java.io.IOException
	at hudson.remoting.Channel.close(Channel.java:1449)
	at hudson.remoting.Channel.close(Channel.java:1405)
	at hudson.slaves.SlaveComputer.closeChannel(SlaveComputer.java:844)
	at hudson.slaves.SlaveComputer.kill(SlaveComputer.java:811)
	at hudson.model.AbstractCIBase.killComputer(AbstractCIBase.java:89)
	at jenkins.model.Jenkins.access$2100(Jenkins.java:309)
	at jenkins.model.Jenkins$19.run(Jenkins.java:3425)
	at hudson.model.Queue._withLock(Queue.java:1379)
	at hudson.model.Queue.withLock(Queue.java:1256)
	at jenkins.model.Jenkins._cleanUpDisconnectComputers(Jenkins.java:3419)
	at jenkins.model.Jenkins.cleanUp(Jenkins.java:3297)
	at hudson.WebAppMain.contextDestroyed(WebAppMain.java:379)
	at org.eclipse.jetty.server.handler.ContextHandler.callContextDestroyed(ContextHandler.java:965)
	at org.eclipse.jetty.servlet.ServletContextHandler.callContextDestroyed(ServletContextHandler.java:566)
	at org.eclipse.jetty.server.handler.ContextHandler.stopContext(ContextHandler.java:942)
	at org.eclipse.jetty.servlet.ServletContextHandler.stopContext(ServletContextHandler.java:376)
	at org.eclipse.jetty.webapp.WebAppContext.stopWebapp(WebAppContext.java:1503)
	at org.eclipse.jetty.webapp.WebAppContext.stopContext(WebAppContext.java:1467)
	at org.eclipse.jetty.server.handler.ContextHandler.doStop(ContextHandler.java:1009)
	at org.eclipse.jetty.servlet.ServletContextHandler.doStop(ServletContextHandler.java:288)
	at org.eclipse.jetty.webapp.WebAppContext.doStop(WebAppContext.java:569)
	at org.eclipse.jetty.util.component.AbstractLifeCycle.stop(AbstractLifeCycle.java:89)
	at org.eclipse.jetty.util.component.ContainerLifeCycle.stop(ContainerLifeCycle.java:149)
	at org.eclipse.jetty.util.component.ContainerLifeCycle.doStop(ContainerLifeCycle.java:170)
	at org.eclipse.jetty.server.handler.AbstractHandler.doStop(AbstractHandler.java:124)
	at org.eclipse.jetty.server.Server.doStop(Server.java:461)
	at org.eclipse.jetty.util.component.AbstractLifeCycle.stop(AbstractLifeCycle.java:89)
	at winstone.Launcher.shutdown(Launcher.java:310)
	at winstone.ShutdownHook.run(ShutdownHook.java:25)
Caused: hudson.remoting.ChannelClosedException: Channel "unknown": Remote call on green-dragon-02 failed. The channel is closing down or has closed down
	at hudson.remoting.Channel.call(Channel.java:950)
	at hudson.remoting.RemoteInvocationHandler.invoke(RemoteInvocationHandler.java:283)
	at com.sun.proxy.$Proxy103.isAlive(Unknown Source)
	at hudson.Launcher$RemoteLauncher$ProcImpl.isAlive(Launcher.java:1150)
	at hudson.Launcher$RemoteLauncher$ProcImpl.join(Launcher.java:1142)
	at hudson.tasks.CommandInterpreter.join(CommandInterpreter.java:155)
	at hudson.tasks.CommandInterpreter.perform(CommandInterpreter.java:109)
	at hudson.tasks.CommandInterpreter.perform(CommandInterpreter.java:66)
	at hudson.tasks.BuildStepMonitor$1.perform(BuildStepMonitor.java:20)
	at hudson.model.AbstractBuild$AbstractBuildExecution.perform(AbstractBuild.java:741)
	at hudson.model.Build$BuildExecution.build(Build.java:206)
	at hudson.model.Build$BuildExecution.doRun(Build.java:163)
	at hudson.model.AbstractBuild$AbstractBuildExecution.run(AbstractBuild.java:504)
	at hudson.model.Run.execute(Run.java:1818)
	at hudson.model.FreeStyleBuild.run(FreeStyleBuild.java:43)
	at hudson.model.ResourceController.execute(ResourceController.java:97)
	at hudson.model.Executor.run(Executor.java:429)
FATAL: Unable to delete script file /var/folders/9t/lrs73ptj6lv644zvh1fk2_gc0000gn/T/jenkins1214981996341636613.sh
java.io.IOException
	at hudson.remoting.Channel.close(Channel.java:1449)
	at hudson.remoting.Channel.close(Channel.java:1405)
	at hudson.slaves.SlaveComputer.closeChannel(SlaveComputer.java:844)
	at hudson.slaves.SlaveComputer.kill(SlaveComputer.java:811)
	at hudson.model.AbstractCIBase.killComputer(AbstractCIBase.java:89)
	at jenkins.model.Jenkins.access$2100(Jenkins.java:309)
	at jenkins.model.Jenkins$19.run(Jenkins.java:3425)
	at hudson.model.Queue._withLock(Queue.java:1379)
	at hudson.model.Queue.withLock(Queue.java:1256)
	at jenkins.model.Jenkins._cleanUpDisconnectComputers(Jenkins.java:3419)
	at jenkins.model.Jenkins.cleanUp(Jenkins.java:3297)
	at hudson.WebAppMain.contextDestroyed(WebAppMain.java:379)
	at org.eclipse.jetty.server.handler.ContextHandler.callContextDestroyed(ContextHandler.java:965)
	at org.eclipse.jetty.servlet.ServletContextHandler.callContextDestroyed(ServletContextHandler.java:566)
	at org.eclipse.jetty.server.handler.ContextHandler.stopContext(ContextHandler.java:942)
	at org.eclipse.jetty.servlet.ServletContextHandler.stopContext(ServletContextHandler.java:376)
	at org.eclipse.jetty.webapp.WebAppContext.stopWebapp(WebAppContext.java:1503)
	at org.eclipse.jetty.webapp.WebAppContext.stopContext(WebAppContext.java:1467)
	at org.eclipse.jetty.server.handler.ContextHandler.doStop(ContextHandler.java:1009)
	at org.eclipse.jetty.servlet.ServletContextHandler.doStop(ServletContextHandler.java:288)
	at org.eclipse.jetty.webapp.WebAppContext.doStop(WebAppContext.java:569)
	at org.eclipse.jetty.util.component.AbstractLifeCycle.stop(AbstractLifeCycle.java:89)
	at org.eclipse.jetty.util.component.ContainerLifeCycle.stop(ContainerLifeCycle.java:149)
	at org.eclipse.jetty.util.component.ContainerLifeCycle.doStop(ContainerLifeCycle.java:170)
	at org.eclipse.jetty.server.handler.AbstractHandler.doStop(AbstractHandler.java:124)
	at org.eclipse.jetty.server.Server.doStop(Server.java:461)
	at org.eclipse.jetty.util.component.AbstractLifeCycle.stop(AbstractLifeCycle.java:89)
	at winstone.Launcher.shutdown(Launcher.java:310)
	at winstone.ShutdownHook.run(ShutdownHook.java:25)
Caused: hudson.remoting.ChannelClosedException: Channel "unknown": Remote call on green-dragon-02 failed. The channel is closing down or has closed down
	at hudson.remoting.Channel.call(Channel.java:950)
	at hudson.FilePath.act(FilePath.java:1070)
	at hudson.FilePath.act(FilePath.java:1059)
	at hudson.FilePath.delete(FilePath.java:1540)
	at hudson.tasks.CommandInterpreter.perform(CommandInterpreter.java:123)
	at hudson.tasks.CommandInterpreter.perform(CommandInterpreter.java:66)
	at hudson.tasks.BuildStepMonitor$1.perform(BuildStepMonitor.java:20)
	at hudson.model.AbstractBuild$AbstractBuildExecution.perform(AbstractBuild.java:741)
	at hudson.model.Build$BuildExecution.build(Build.java:206)
	at hudson.model.Build$BuildExecution.doRun(Build.java:163)
	at hudson.model.AbstractBuild$AbstractBuildExecution.run(AbstractBuild.java:504)
	at hudson.model.Run.execute(Run.java:1818)
	at hudson.model.FreeStyleBuild.run(FreeStyleBuild.java:43)
	at hudson.model.ResourceController.execute(ResourceController.java:97)
	at hudson.model.Executor.run(Executor.java:429)
Build step 'Execute shell' marked build as failure
ERROR: Step ‘Publish JUnit test result report’ failed: no workspace for clang-stage1-cmake-RA-expensive #15302
[BFA] Scanning build for known causes...
[BFA] No failure causes found
[BFA] Done. 0s
No emails were triggered.
Finished: FAILURE