AbortedConsole Output

Skipping 23,811 KB.. Full Log
/Users/buildslave/jenkins/workspace/lldb-cmake-matrix/test/logs'
Command invoked: /Users/buildslave/jenkins/workspace/lldb-cmake-matrix/llvm-project/lldb/test/API/dotest.py --arch x86_64 -s /Users/buildslave/jenkins/workspace/lldb-cmake-matrix/lldb-build/lldb-test-traces -S nm -u CXXFLAGS -u CFLAGS --codesign-identity lldb_codesign --server /Users/buildslave/jenkins/workspace/lldb-cmake-matrix/lldb-build/./bin/debugserver --arch x86_64 --build-dir /Users/buildslave/jenkins/workspace/lldb-cmake-matrix/lldb-build/lldb-test-build.noindex -s=/Users/buildslave/jenkins/workspace/lldb-cmake-matrix/test/logs -t --env TERM=vt100 --skip-category gmodules --skip-category watchpoint --arch=x86_64 --dwarf-version=5 --env LLVM_LIBS_DIR=/Users/buildslave/jenkins/workspace/lldb-cmake-matrix/lldb-build/./lib --build-dir /Users/buildslave/jenkins/workspace/lldb-cmake-matrix/lldb-build/lldb-test-build.noindex --lldb-module-cache-dir /Users/buildslave/jenkins/workspace/lldb-cmake-matrix/lldb-build/lldb-test-build.noindex/module-cache-lldb/lldb-api --clang-module-cache-dir /Users/buildslave/jenkins/workspace/lldb-cmake-matrix/lldb-build/lldb-test-build.noindex/module-cache-clang/lldb-api --executable /Users/buildslave/jenkins/workspace/lldb-cmake-matrix/lldb-build/./bin/lldb --compiler /Users/buildslave/jenkins/workspace/lldb-cmake-matrix/lldb-build/./bin/clang --dsymutil /Users/buildslave/jenkins/workspace/lldb-cmake-matrix/lldb-build/./bin/dsymutil --filecheck /Users/buildslave/jenkins/workspace/lldb-cmake-matrix/lldb-build/./bin/FileCheck /Users/buildslave/jenkins/workspace/lldb-cmake-matrix/llvm-project/lldb/packages/Python/lldbsuite/test/functionalities/data-formatter/nsdictionarysynth -p TestNSDictionarySynthetic.py
Change dir to: /Users/buildslave/jenkins/workspace/lldb-cmake-matrix/llvm-project/lldb/packages/Python/lldbsuite/test/functionalities/data-formatter/nsdictionarysynth
runCmd: settings set symbols.enable-external-lookup false
output: 

Hide Details

runCmd: settings set plugin.process.gdb-remote.packet-timeout 60 output:

Hide Details

runCmd: settings set symbols.clang-modules-cache-path "/Users/buildslave/jenkins/workspace/lldb-cmake-matrix/lldb-build/lldb-test-build.noindex/module-cache-lldb/lldb-api" output:

Hide Details

runCmd: settings set use-color false output:

Hide Details

runCmd: file /Users/buildslave/jenkins/workspace/lldb-cmake-matrix/lldb-build/lldb-test-build.noindex/functionalities/data-formatter/nsdictionarysynth/TestNSDictionarySynthetic.test_rdar11988289_with_run_command_dsym/a.out output: Current executable set to '/Users/buildslave/jenkins/workspace/lldb-cmake-matrix/lldb-build/lldb-test-build.noindex/functionalities/data-formatter/nsdictionarysynth/TestNSDictionarySynthetic.test_rdar11988289_with_run_command_dsym/a.out' (x86_64).

Hide Details

Hide Details

runCmd: breakpoint set -f "main.m" -l 26 output: Breakpoint 1: no locations (pending). WARNING: Unable to resolve breakpoint to any actual locations.

Hide Details

Hide Details

Expecting pattern: ^Breakpoint (?P<bpno>[0-9]+): (?P<num_locations>[0-9]+) locations\.$ Not matched

Hide Details

Expecting pattern: ^Breakpoint (?P<bpno>[0-9]+): (?P<num_locations>no) locations \(pending\)\. Matched

Hide Details

FAIL: LLDB (/Users/buildslave/jenkins/workspace/lldb-cmake-matrix/lldb-build/bin/clang-11-x86_64) :: test_rdar11988289_with_run_command_dsym (TestNSDictionarySynthetic.NSDictionarySyntheticTestCase) runCmd: settings set symbols.enable-external-lookup false output:

Hide Details

runCmd: settings set plugin.process.gdb-remote.packet-timeout 60 output:

Hide Details

runCmd: settings set symbols.clang-modules-cache-path "/Users/buildslave/jenkins/workspace/lldb-cmake-matrix/lldb-build/lldb-test-build.noindex/module-cache-lldb/lldb-api" output:

Hide Details

runCmd: settings set use-color false output:

Hide Details

runCmd: file /Users/buildslave/jenkins/workspace/lldb-cmake-matrix/lldb-build/lldb-test-build.noindex/functionalities/data-formatter/nsdictionarysynth/TestNSDictionarySynthetic.test_rdar11988289_with_run_command_dwarf/a.out output: Current executable set to '/Users/buildslave/jenkins/workspace/lldb-cmake-matrix/lldb-build/lldb-test-build.noindex/functionalities/data-formatter/nsdictionarysynth/TestNSDictionarySynthetic.test_rdar11988289_with_run_command_dwarf/a.out' (x86_64).

Hide Details

Hide Details

runCmd: breakpoint set -f "main.m" -l 26 output: Breakpoint 1: no locations (pending). WARNING: Unable to resolve breakpoint to any actual locations.

Hide Details

Hide Details

Expecting pattern: ^Breakpoint (?P<bpno>[0-9]+): (?P<num_locations>[0-9]+) locations\.$ Not matched

Hide Details

Expecting pattern: ^Breakpoint (?P<bpno>[0-9]+): (?P<num_locations>no) locations \(pending\)\. Matched

Hide Details

FAIL: LLDB (/Users/buildslave/jenkins/workspace/lldb-cmake-matrix/lldb-build/bin/clang-11-x86_64) :: test_rdar11988289_with_run_command_dwarf (TestNSDictionarySynthetic.NSDictionarySyntheticTestCase) UNSUPPORTED: LLDB (/Users/buildslave/jenkins/workspace/lldb-cmake-matrix/lldb-build/bin/clang-11-x86_64) :: test_rdar11988289_with_run_command_dwo (TestNSDictionarySynthetic.NSDictionarySyntheticTestCase) (test case does not fall in any category of interest for this run) UNSUPPORTED: LLDB (/Users/buildslave/jenkins/workspace/lldb-cmake-matrix/lldb-build/bin/clang-11-x86_64) :: test_rdar11988289_with_run_command_gmodules (TestNSDictionarySynthetic.NSDictionarySyntheticTestCase) (test case does not fall in any category of interest for this run) Restore dir to: /Users/buildslave/jenkins/workspace/lldb-cmake-matrix/lldb-build/tools/lldb/test ====================================================================== FAIL: test_rdar11988289_with_run_command_dsym (TestNSDictionarySynthetic.NSDictionarySyntheticTestCase) Test that NSDictionary reports its synthetic children properly. ---------------------------------------------------------------------- Traceback (most recent call last): File "/Users/buildslave/jenkins/workspace/lldb-cmake-matrix/llvm-project/lldb/packages/Python/lldbsuite/test/lldbtest.py", line 1732, in test_method return attrvalue(self) File "/Users/buildslave/jenkins/workspace/lldb-cmake-matrix/llvm-project/lldb/packages/Python/lldbsuite/test/functionalities/data-formatter/nsdictionarysynth/TestNSDictionarySynthetic.py", line 30, in test_rdar11988289_with_run_command self, "main.m", self.line, num_expected_locations=1, loc_exact=True) File "/Users/buildslave/jenkins/workspace/lldb-cmake-matrix/llvm-project/lldb/packages/Python/lldbsuite/test/lldbutil.py", line 384, in run_break_set_by_file_and_line module_name=module_name) File "/Users/buildslave/jenkins/workspace/lldb-cmake-matrix/llvm-project/lldb/packages/Python/lldbsuite/test/lldbutil.py", line 585, in check_breakpoint_result out_num_locations)) AssertionError: False is not True : Expecting 1 locations, got 0. Config=x86_64-/Users/buildslave/jenkins/workspace/lldb-cmake-matrix/lldb-build/bin/clang-11 ====================================================================== FAIL: test_rdar11988289_with_run_command_dwarf (TestNSDictionarySynthetic.NSDictionarySyntheticTestCase) Test that NSDictionary reports its synthetic children properly. ---------------------------------------------------------------------- Traceback (most recent call last): File "/Users/buildslave/jenkins/workspace/lldb-cmake-matrix/llvm-project/lldb/packages/Python/lldbsuite/test/lldbtest.py", line 1732, in test_method return attrvalue(self) File "/Users/buildslave/jenkins/workspace/lldb-cmake-matrix/llvm-project/lldb/packages/Python/lldbsuite/test/functionalities/data-formatter/nsdictionarysynth/TestNSDictionarySynthetic.py", line 30, in test_rdar11988289_with_run_command self, "main.m", self.line, num_expected_locations=1, loc_exact=True) File "/Users/buildslave/jenkins/workspace/lldb-cmake-matrix/llvm-project/lldb/packages/Python/lldbsuite/test/lldbutil.py", line 384, in run_break_set_by_file_and_line module_name=module_name) File "/Users/buildslave/jenkins/workspace/lldb-cmake-matrix/llvm-project/lldb/packages/Python/lldbsuite/test/lldbutil.py", line 585, in check_breakpoint_result out_num_locations)) AssertionError: False is not True : Expecting 1 locations, got 0. Config=x86_64-/Users/buildslave/jenkins/workspace/lldb-cmake-matrix/lldb-build/bin/clang-11 ---------------------------------------------------------------------- Ran 4 tests in 6.683s

Hide Details

RESULT: FAILED (0 passes, 2 failures, 0 errors, 2 skipped, 0 expected failures, 0 unexpected successes)

Hide Details

******************** FAIL: lldb-api :: functionalities/data-formatter/synthcapping/TestSyntheticCapping.py (717 of 1914) ******************** TEST 'lldb-api :: functionalities/data-formatter/synthcapping/TestSyntheticCapping.py' FAILED ******************** lldb version 11.0.99 clang revision 020041d99b508ed5f207c0896a19b3e85c942ee7 llvm revision 020041d99b508ed5f207c0896a19b3e85c942ee7 LLDB library dir: /Users/buildslave/jenkins/workspace/lldb-cmake-matrix/lldb-build/bin LLDB import library dir: /Users/buildslave/jenkins/workspace/lldb-cmake-matrix/lldb-build/bin libstdcxx tests will not be run because: Don't know how to build with libstdcxx on macosx Skipping following debug info categories: ['dwo'] setting set target.prefer-dynamic-value no-dynamic-values warning: (x86_64) /Users/buildslave/jenkins/workspace/lldb-cmake-matrix/lldb-build/lldb-test-build.noindex/functionalities/data-formatter/synthcapping/TestSyntheticCapping.test_with_run_command_dsym/a.out empty dSYM file detected, dSYM was created with an executable with no debug info.

Hide Details

Session logs for test failures/errors/unexpected successes will go into directory '/Users/buildslave/jenkins/workspace/lldb-cmake-matrix/test/logs' Command invoked: /Users/buildslave/jenkins/workspace/lldb-cmake-matrix/llvm-project/lldb/test/API/dotest.py --arch x86_64 -s /Users/buildslave/jenkins/workspace/lldb-cmake-matrix/lldb-build/lldb-test-traces -S nm -u CXXFLAGS -u CFLAGS --codesign-identity lldb_codesign --server /Users/buildslave/jenkins/workspace/lldb-cmake-matrix/lldb-build/./bin/debugserver --arch x86_64 --build-dir /Users/buildslave/jenkins/workspace/lldb-cmake-matrix/lldb-build/lldb-test-build.noindex -s=/Users/buildslave/jenkins/workspace/lldb-cmake-matrix/test/logs -t --env TERM=vt100 --skip-category gmodules --skip-category watchpoint --arch=x86_64 --dwarf-version=5 --env LLVM_LIBS_DIR=/Users/buildslave/jenkins/workspace/lldb-cmake-matrix/lldb-build/./lib --build-dir /Users/buildslave/jenkins/workspace/lldb-cmake-matrix/lldb-build/lldb-test-build.noindex --lldb-module-cache-dir /Users/buildslave/jenkins/workspace/lldb-cmake-matrix/lldb-build/lldb-test-build.noindex/module-cache-lldb/lldb-api --clang-module-cache-dir /Users/buildslave/jenkins/workspace/lldb-cmake-matrix/lldb-build/lldb-test-build.noindex/module-cache-clang/lldb-api --executable /Users/buildslave/jenkins/workspace/lldb-cmake-matrix/lldb-build/./bin/lldb --compiler /Users/buildslave/jenkins/workspace/lldb-cmake-matrix/lldb-build/./bin/clang --dsymutil /Users/buildslave/jenkins/workspace/lldb-cmake-matrix/lldb-build/./bin/dsymutil --filecheck /Users/buildslave/jenkins/workspace/lldb-cmake-matrix/lldb-build/./bin/FileCheck /Users/buildslave/jenkins/workspace/lldb-cmake-matrix/llvm-project/lldb/packages/Python/lldbsuite/test/functionalities/data-formatter/synthcapping -p TestSyntheticCapping.py Change dir to: /Users/buildslave/jenkins/workspace/lldb-cmake-matrix/llvm-project/lldb/packages/Python/lldbsuite/test/functionalities/data-formatter/synthcapping runCmd: settings set symbols.enable-external-lookup false output:

Hide Details

runCmd: settings set plugin.process.gdb-remote.packet-timeout 60 output:

Hide Details

runCmd: settings set symbols.clang-modules-cache-path "/Users/buildslave/jenkins/workspace/lldb-cmake-matrix/lldb-build/lldb-test-build.noindex/module-cache-lldb/lldb-api" output:

Hide Details

runCmd: settings set use-color false output:

Hide Details

runCmd: file /Users/buildslave/jenkins/workspace/lldb-cmake-matrix/lldb-build/lldb-test-build.noindex/functionalities/data-formatter/synthcapping/TestSyntheticCapping.test_with_run_command_dsym/a.out output: Current executable set to '/Users/buildslave/jenkins/workspace/lldb-cmake-matrix/lldb-build/lldb-test-build.noindex/functionalities/data-formatter/synthcapping/TestSyntheticCapping.test_with_run_command_dsym/a.out' (x86_64).

Hide Details

Hide Details

runCmd: breakpoint set -f "main.cpp" -l 54 output: Breakpoint 1: no locations (pending). WARNING: Unable to resolve breakpoint to any actual locations.

Hide Details

Hide Details

Expecting pattern: ^Breakpoint (?P<bpno>[0-9]+): (?P<num_locations>[0-9]+) locations\.$ Not matched

Hide Details

Expecting pattern: ^Breakpoint (?P<bpno>[0-9]+): (?P<num_locations>no) locations \(pending\)\. Matched

Hide Details

FAIL: LLDB (/Users/buildslave/jenkins/workspace/lldb-cmake-matrix/lldb-build/bin/clang-11-x86_64) :: test_with_run_command_dsym (TestSyntheticCapping.SyntheticCappingTestCase) runCmd: settings set symbols.enable-external-lookup false output:

Hide Details

runCmd: settings set plugin.process.gdb-remote.packet-timeout 60 output:

Hide Details

runCmd: settings set symbols.clang-modules-cache-path "/Users/buildslave/jenkins/workspace/lldb-cmake-matrix/lldb-build/lldb-test-build.noindex/module-cache-lldb/lldb-api" output:

Hide Details

runCmd: settings set use-color false output:

Hide Details

runCmd: file /Users/buildslave/jenkins/workspace/lldb-cmake-matrix/lldb-build/lldb-test-build.noindex/functionalities/data-formatter/synthcapping/TestSyntheticCapping.test_with_run_command_dwarf/a.out output: Current executable set to '/Users/buildslave/jenkins/workspace/lldb-cmake-matrix/lldb-build/lldb-test-build.noindex/functionalities/data-formatter/synthcapping/TestSyntheticCapping.test_with_run_command_dwarf/a.out' (x86_64).

Hide Details

Hide Details

runCmd: breakpoint set -f "main.cpp" -l 54 output: Breakpoint 1: no locations (pending). WARNING: Unable to resolve breakpoint to any actual locations.

Hide Details

Hide Details

Expecting pattern: ^Breakpoint (?P<bpno>[0-9]+): (?P<num_locations>[0-9]+) locations\.$ Not matched

Hide Details

Expecting pattern: ^Breakpoint (?P<bpno>[0-9]+): (?P<num_locations>no) locations \(pending\)\. Matched

Hide Details

FAIL: LLDB (/Users/buildslave/jenkins/workspace/lldb-cmake-matrix/lldb-build/bin/clang-11-x86_64) :: test_with_run_command_dwarf (TestSyntheticCapping.SyntheticCappingTestCase) UNSUPPORTED: LLDB (/Users/buildslave/jenkins/workspace/lldb-cmake-matrix/lldb-build/bin/clang-11-x86_64) :: test_with_run_command_dwo (TestSyntheticCapping.SyntheticCappingTestCase) (test case does not fall in any category of interest for this run) UNSUPPORTED: LLDB (/Users/buildslave/jenkins/workspace/lldb-cmake-matrix/lldb-build/bin/clang-11-x86_64) :: test_with_run_command_gmodules (TestSyntheticCapping.SyntheticCappingTestCase) (test case does not fall in any category of interest for this run) Restore dir to: /Users/buildslave/jenkins/workspace/lldb-cmake-matrix/lldb-build/tools/lldb/test ====================================================================== FAIL: test_with_run_command_dsym (TestSyntheticCapping.SyntheticCappingTestCase) Check for an issue where capping does not work because the Target pointer appears to be changing behind our backs. ---------------------------------------------------------------------- Traceback (most recent call last): File "/Users/buildslave/jenkins/workspace/lldb-cmake-matrix/llvm-project/lldb/packages/Python/lldbsuite/test/lldbtest.py", line 1732, in test_method return attrvalue(self) File "/Users/buildslave/jenkins/workspace/lldb-cmake-matrix/llvm-project/lldb/packages/Python/lldbsuite/test/functionalities/data-formatter/synthcapping/TestSyntheticCapping.py", line 29, in test_with_run_command self, "main.cpp", self.line, num_expected_locations=1, loc_exact=True) File "/Users/buildslave/jenkins/workspace/lldb-cmake-matrix/llvm-project/lldb/packages/Python/lldbsuite/test/lldbutil.py", line 384, in run_break_set_by_file_and_line module_name=module_name) File "/Users/buildslave/jenkins/workspace/lldb-cmake-matrix/llvm-project/lldb/packages/Python/lldbsuite/test/lldbutil.py", line 585, in check_breakpoint_result out_num_locations)) AssertionError: False is not True : Expecting 1 locations, got 0. Config=x86_64-/Users/buildslave/jenkins/workspace/lldb-cmake-matrix/lldb-build/bin/clang-11 ====================================================================== FAIL: test_with_run_command_dwarf (TestSyntheticCapping.SyntheticCappingTestCase) Check for an issue where capping does not work because the Target pointer appears to be changing behind our backs. ---------------------------------------------------------------------- Traceback (most recent call last): File "/Users/buildslave/jenkins/workspace/lldb-cmake-matrix/llvm-project/lldb/packages/Python/lldbsuite/test/lldbtest.py", line 1732, in test_method return attrvalue(self) File "/Users/buildslave/jenkins/workspace/lldb-cmake-matrix/llvm-project/lldb/packages/Python/lldbsuite/test/functionalities/data-formatter/synthcapping/TestSyntheticCapping.py", line 29, in test_with_run_command self, "main.cpp", self.line, num_expected_locations=1, loc_exact=True) File "/Users/buildslave/jenkins/workspace/lldb-cmake-matrix/llvm-project/lldb/packages/Python/lldbsuite/test/lldbutil.py", line 384, in run_break_set_by_file_and_line module_name=module_name) File "/Users/buildslave/jenkins/workspace/lldb-cmake-matrix/llvm-project/lldb/packages/Python/lldbsuite/test/lldbutil.py", line 585, in check_breakpoint_result out_num_locations)) AssertionError: False is not True : Expecting 1 locations, got 0. Config=x86_64-/Users/buildslave/jenkins/workspace/lldb-cmake-matrix/lldb-build/bin/clang-11 ---------------------------------------------------------------------- Ran 4 tests in 0.888s

Hide Details

RESULT: FAILED (0 passes, 2 failures, 0 errors, 2 skipped, 0 expected failures, 0 unexpected successes)

Hide Details

******************** PASS: lldb-unit :: Utility/./UtilityTests/StringLexerTest.GetUnlexed (718 of 1914) FAIL: lldb-api :: types/TestIntegerTypeExpr.py (719 of 1914) ******************** TEST 'lldb-api :: types/TestIntegerTypeExpr.py' FAILED ******************** lldb version 11.0.99 clang revision 020041d99b508ed5f207c0896a19b3e85c942ee7 llvm revision 020041d99b508ed5f207c0896a19b3e85c942ee7 LLDB library dir: /Users/buildslave/jenkins/workspace/lldb-cmake-matrix/lldb-build/bin LLDB import library dir: /Users/buildslave/jenkins/workspace/lldb-cmake-matrix/lldb-build/bin libstdcxx tests will not be run because: Don't know how to build with libstdcxx on macosx Skipping following debug info categories: ['dwo'] setting set target.prefer-dynamic-value no-dynamic-values warning: (x86_64) /Users/buildslave/jenkins/workspace/lldb-cmake-matrix/lldb-build/lldb-test-build.noindex/types/TestIntegerTypeExpr.test_int_type_dsym/test_int_type_dsym empty dSYM file detected, dSYM was created with an executable with no debug info. warning: (x86_64) /Users/buildslave/jenkins/workspace/lldb-cmake-matrix/lldb-build/lldb-test-build.noindex/types/TestIntegerTypeExpr.test_int_type_from_block_dsym/test_int_type_from_block_dsym empty dSYM file detected, dSYM was created with an executable with no debug info. warning: (x86_64) /Users/buildslave/jenkins/workspace/lldb-cmake-matrix/lldb-build/lldb-test-build.noindex/types/TestIntegerTypeExpr.test_unsigned_int_type_dsym/test_unsigned_int_type_dsym empty dSYM file detected, dSYM was created with an executable with no debug info.

Hide Details

Session logs for test failures/errors/unexpected successes will go into directory '/Users/buildslave/jenkins/workspace/lldb-cmake-matrix/test/logs' Command invoked: /Users/buildslave/jenkins/workspace/lldb-cmake-matrix/llvm-project/lldb/test/API/dotest.py --arch x86_64 -s /Users/buildslave/jenkins/workspace/lldb-cmake-matrix/lldb-build/lldb-test-traces -S nm -u CXXFLAGS -u CFLAGS --codesign-identity lldb_codesign --server /Users/buildslave/jenkins/workspace/lldb-cmake-matrix/lldb-build/./bin/debugserver --arch x86_64 --build-dir /Users/buildslave/jenkins/workspace/lldb-cmake-matrix/lldb-build/lldb-test-build.noindex -s=/Users/buildslave/jenkins/workspace/lldb-cmake-matrix/test/logs -t --env TERM=vt100 --skip-category gmodules --skip-category watchpoint --arch=x86_64 --dwarf-version=5 --env LLVM_LIBS_DIR=/Users/buildslave/jenkins/workspace/lldb-cmake-matrix/lldb-build/./lib --build-dir /Users/buildslave/jenkins/workspace/lldb-cmake-matrix/lldb-build/lldb-test-build.noindex --lldb-module-cache-dir /Users/buildslave/jenkins/workspace/lldb-cmake-matrix/lldb-build/lldb-test-build.noindex/module-cache-lldb/lldb-api --clang-module-cache-dir /Users/buildslave/jenkins/workspace/lldb-cmake-matrix/lldb-build/lldb-test-build.noindex/module-cache-clang/lldb-api --executable /Users/buildslave/jenkins/workspace/lldb-cmake-matrix/lldb-build/./bin/lldb --compiler /Users/buildslave/jenkins/workspace/lldb-cmake-matrix/lldb-build/./bin/clang --dsymutil /Users/buildslave/jenkins/workspace/lldb-cmake-matrix/lldb-build/./bin/dsymutil --filecheck /Users/buildslave/jenkins/workspace/lldb-cmake-matrix/lldb-build/./bin/FileCheck /Users/buildslave/jenkins/workspace/lldb-cmake-matrix/llvm-project/lldb/packages/Python/lldbsuite/test/types -p TestIntegerTypeExpr.py Change dir to: /Users/buildslave/jenkins/workspace/lldb-cmake-matrix/llvm-project/lldb/packages/Python/lldbsuite/test/types runCmd: settings set symbols.enable-external-lookup false output:

Hide Details

runCmd: settings set plugin.process.gdb-remote.packet-timeout 60 output:

Hide Details

runCmd: settings set symbols.clang-modules-cache-path "/Users/buildslave/jenkins/workspace/lldb-cmake-matrix/lldb-build/lldb-test-build.noindex/module-cache-lldb/lldb-api" output:

Hide Details

runCmd: settings set use-color false output:

Hide Details

runCmd: file /Users/buildslave/jenkins/workspace/lldb-cmake-matrix/lldb-build/lldb-test-build.noindex/types/TestIntegerTypeExpr.test_int_type_dsym/test_int_type_dsym output: Current executable set to '/Users/buildslave/jenkins/workspace/lldb-cmake-matrix/lldb-build/lldb-test-build.noindex/types/TestIntegerTypeExpr.test_int_type_dsym/test_int_type_dsym' (x86_64).

Hide Details

Hide Details

runCmd: process launch -o "/Users/buildslave/jenkins/workspace/lldb-cmake-matrix/lldb-build/lldb-test-build.noindex/types/TestIntegerTypeExpr.test_int_type_dsym/golden-output.txt" output: Process 26667 exited with status = 0 (0x00000000)

Hide Details

Process 26667 launched: '/Users/buildslave/jenkins/workspace/lldb-cmake-matrix/lldb-build/lldb-test-build.noindex/types/TestIntegerTypeExpr.test_int_type_dsym/test_int_type_dsym' (x86_64)

Hide Details

Hide Details

runCmd: settings set target.inline-breakpoint-strategy always output:

Hide Details

Adding tearDown hook: self.addTearDownHook(lambda: self.runCmd( "settings set target.inline-breakpoint-strategy headers"))

Hide Details

Hide Details

runCmd: breakpoint set -f "basic_type.cpp" -l 185 output: Breakpoint 1: no locations (pending). WARNING: Unable to resolve breakpoint to any actual locations.

Hide Details

Hide Details

Expecting pattern: ^Breakpoint (?P<bpno>[0-9]+): (?P<num_locations>[0-9]+) locations\.$ Not matched

Hide Details

Expecting pattern: ^Breakpoint (?P<bpno>[0-9]+): (?P<num_locations>no) locations \(pending\)\. Matched

Hide Details

FAIL: LLDB (/Users/buildslave/jenkins/workspace/lldb-cmake-matrix/lldb-build/bin/clang-11-x86_64) :: test_int_type_dsym (TestIntegerTypeExpr.IntegerTypeExprTestCase) <bound method SBProcess.Kill of <lldb.SBProcess; proxy of <Swig Object of type 'lldb::SBProcess *' at 0x116295db0> >>: success

Hide Details

Executing tearDown hook: self.addTearDownHook(lambda: self.runCmd( "settings set target.inline-breakpoint-strategy headers"))

Hide Details

Hide Details

runCmd: settings set target.inline-breakpoint-strategy headers output:

Hide Details

runCmd: settings set symbols.enable-external-lookup false output:

Hide Details

runCmd: settings set plugin.process.gdb-remote.packet-timeout 60 output:

Hide Details

runCmd: settings set symbols.clang-modules-cache-path "/Users/buildslave/jenkins/workspace/lldb-cmake-matrix/lldb-build/lldb-test-build.noindex/module-cache-lldb/lldb-api" output:

Hide Details

runCmd: settings set use-color false output:

Hide Details

runCmd: file /Users/buildslave/jenkins/workspace/lldb-cmake-matrix/lldb-build/lldb-test-build.noindex/types/TestIntegerTypeExpr.test_int_type_dwarf/test_int_type_dwarf output: Current executable set to '/Users/buildslave/jenkins/workspace/lldb-cmake-matrix/lldb-build/lldb-test-build.noindex/types/TestIntegerTypeExpr.test_int_type_dwarf/test_int_type_dwarf' (x86_64).

Hide Details

Hide Details

runCmd: process launch -o "/Users/buildslave/jenkins/workspace/lldb-cmake-matrix/lldb-build/lldb-test-build.noindex/types/TestIntegerTypeExpr.test_int_type_dwarf/golden-output.txt" output: Process 27070 exited with status = 0 (0x00000000)

Hide Details

Process 27070 launched: '/Users/buildslave/jenkins/workspace/lldb-cmake-matrix/lldb-build/lldb-test-build.noindex/types/TestIntegerTypeExpr.test_int_type_dwarf/test_int_type_dwarf' (x86_64)

Hide Details

Hide Details

runCmd: settings set target.inline-breakpoint-strategy always output:

Hide Details

Adding tearDown hook: self.addTearDownHook(lambda: self.runCmd( "settings set target.inline-breakpoint-strategy headers"))

Hide Details

Hide Details

runCmd: breakpoint set -f "basic_type.cpp" -l 185 output: Breakpoint 1: no locations (pending). WARNING: Unable to resolve breakpoint to any actual locations.

Hide Details

Hide Details

Expecting pattern: ^Breakpoint (?P<bpno>[0-9]+): (?P<num_locations>[0-9]+) locations\.$ Not matched

Hide Details

Expecting pattern: ^Breakpoint (?P<bpno>[0-9]+): (?P<num_locations>no) locations \(pending\)\. Matched

Hide Details

FAIL: LLDB (/Users/buildslave/jenkins/workspace/lldb-cmake-matrix/lldb-build/bin/clang-11-x86_64) :: test_int_type_dwarf (TestIntegerTypeExpr.IntegerTypeExprTestCase) <bound method SBProcess.Kill of <lldb.SBProcess; proxy of <Swig Object of type 'lldb::SBProcess *' at 0x10f14c660> >>: success

Hide Details

Executing tearDown hook: self.addTearDownHook(lambda: self.runCmd( "settings set target.inline-breakpoint-strategy headers"))

Hide Details

Hide Details

runCmd: settings set target.inline-breakpoint-strategy headers output:

Hide Details

UNSUPPORTED: LLDB (/Users/buildslave/jenkins/workspace/lldb-cmake-matrix/lldb-build/bin/clang-11-x86_64) :: test_int_type_dwo (TestIntegerTypeExpr.IntegerTypeExprTestCase) (test case does not fall in any category of interest for this run) runCmd: settings set symbols.enable-external-lookup false output:

Hide Details

runCmd: settings set plugin.process.gdb-remote.packet-timeout 60 output:

Hide Details

runCmd: settings set symbols.clang-modules-cache-path "/Users/buildslave/jenkins/workspace/lldb-cmake-matrix/lldb-build/lldb-test-build.noindex/module-cache-lldb/lldb-api" output:

Hide Details

runCmd: settings set use-color false output:

Hide Details

runCmd: file /Users/buildslave/jenkins/workspace/lldb-cmake-matrix/lldb-build/lldb-test-build.noindex/types/TestIntegerTypeExpr.test_int_type_from_block_dsym/test_int_type_from_block_dsym output: Current executable set to '/Users/buildslave/jenkins/workspace/lldb-cmake-matrix/lldb-build/lldb-test-build.noindex/types/TestIntegerTypeExpr.test_int_type_from_block_dsym/test_int_type_from_block_dsym' (x86_64).

Hide Details

Hide Details

runCmd: process launch -o "/Users/buildslave/jenkins/workspace/lldb-cmake-matrix/lldb-build/lldb-test-build.noindex/types/TestIntegerTypeExpr.test_int_type_from_block_dsym/golden-output.txt" output: Process 27676 exited with status = 0 (0x00000000)

Hide Details

Process 27676 launched: '/Users/buildslave/jenkins/workspace/lldb-cmake-matrix/lldb-build/lldb-test-build.noindex/types/TestIntegerTypeExpr.test_int_type_from_block_dsym/test_int_type_from_block_dsym' (x86_64)

Hide Details

Hide Details

runCmd: settings set target.inline-breakpoint-strategy always output:

Hide Details

Adding tearDown hook: self.addTearDownHook(lambda: self.runCmd( "settings set target.inline-breakpoint-strategy headers"))

Hide Details

Hide Details

runCmd: breakpoint set -f "basic_type.cpp" -l 185 output: Breakpoint 1: no locations (pending). WARNING: Unable to resolve breakpoint to any actual locations.

Hide Details

warning: (x86_64) /Users/buildslave/jenkins/workspace/lldb-cmake-matrix/lldb-build/lldb-test-build.noindex/types/TestIntegerTypeExpr.test_unsigned_int_type_from_block_dsym/test_unsigned_int_type_from_block_dsym empty dSYM file detected, dSYM was created with an executable with no debug info. warning: (x86_64) /Users/buildslave/jenkins/workspace/lldb-cmake-matrix/lldb-build/lldb-test-build.noindex/types/TestIntegerTypeExpr.test_unsigned_short_type_from_block_dsym/test_unsigned_short_type_from_block_dsym empty dSYM file detected, dSYM was created with an executable with no debug info.

Hide Details

Expecting pattern: ^Breakpoint (?P<bpno>[0-9]+): (?P<num_locations>[0-9]+) locations\.$ Not matched

Hide Details

Expecting pattern: ^Breakpoint (?P<bpno>[0-9]+): (?P<num_locations>no) locations \(pending\)\. Matched

Hide Details

FAIL: LLDB (/Users/buildslave/jenkins/workspace/lldb-cmake-matrix/lldb-build/bin/clang-11-x86_64) :: test_int_type_from_block_dsym (TestIntegerTypeExpr.IntegerTypeExprTestCase) <bound method SBProcess.Kill of <lldb.SBProcess; proxy of <Swig Object of type 'lldb::SBProcess *' at 0x116295bd0> >>: success

Hide Details

Executing tearDown hook: self.addTearDownHook(lambda: self.runCmd( "settings set target.inline-breakpoint-strategy headers"))

Hide Details

Hide Details

runCmd: settings set target.inline-breakpoint-strategy headers output:

Hide Details

runCmd: settings set symbols.enable-external-lookup false output:

Hide Details

runCmd: settings set plugin.process.gdb-remote.packet-timeout 60 output:

Hide Details

runCmd: settings set symbols.clang-modules-cache-path "/Users/buildslave/jenkins/workspace/lldb-cmake-matrix/lldb-build/lldb-test-build.noindex/module-cache-lldb/lldb-api" output:

Hide Details

runCmd: settings set use-color false output:

Hide Details

runCmd: file /Users/buildslave/jenkins/workspace/lldb-cmake-matrix/lldb-build/lldb-test-build.noindex/types/TestIntegerTypeExpr.test_int_type_from_block_dwarf/test_int_type_from_block_dwarf output: Current executable set to '/Users/buildslave/jenkins/workspace/lldb-cmake-matrix/lldb-build/lldb-test-build.noindex/types/TestIntegerTypeExpr.test_int_type_from_block_dwarf/test_int_type_from_block_dwarf' (x86_64).

Hide Details

Hide Details

runCmd: process launch -o "/Users/buildslave/jenkins/workspace/lldb-cmake-matrix/lldb-build/lldb-test-build.noindex/types/TestIntegerTypeExpr.test_int_type_from_block_dwarf/golden-output.txt" output: Process 27970 exited with status = 0 (0x00000000)

Hide Details

Process 27970 launched: '/Users/buildslave/jenkins/workspace/lldb-cmake-matrix/lldb-build/lldb-test-build.noindex/types/TestIntegerTypeExpr.test_int_type_from_block_dwarf/test_int_type_from_block_dwarf' (x86_64)

Hide Details

Hide Details

runCmd: settings set target.inline-breakpoint-strategy always output:

Hide Details

Adding tearDown hook: self.addTearDownHook(lambda: self.runCmd( "settings set target.inline-breakpoint-strategy headers"))

Hide Details

Hide Details

runCmd: breakpoint set -f "basic_type.cpp" -l 185 output: Breakpoint 1: no locations (pending). WARNING: Unable to resolve breakpoint to any actual locations.

Hide Details

Hide Details

Expecting pattern: ^Breakpoint (?P<bpno>[0-9]+): (?P<num_locations>[0-9]+) locations\.$ Not matched

Hide Details

Expecting pattern: ^Breakpoint (?P<bpno>[0-9]+): (?P<num_locations>no) locations \(pending\)\. Matched

Hide Details

FAIL: LLDB (/Users/buildslave/jenkins/workspace/lldb-cmake-matrix/lldb-build/bin/clang-11-x86_64) :: test_int_type_from_block_dwarf (TestIntegerTypeExpr.IntegerTypeExprTestCase) <bound method SBProcess.Kill of <lldb.SBProcess; proxy of <Swig Object of type 'lldb::SBProcess *' at 0x115ca05d0> >>: success

Hide Details

Executing tearDown hook: self.addTearDownHook(lambda: self.runCmd( "settings set target.inline-breakpoint-strategy headers"))

Hide Details

Hide Details

runCmd: settings set target.inline-breakpoint-strategy headers output:

Hide Details

UNSUPPORTED: LLDB (/Users/buildslave/jenkins/workspace/lldb-cmake-matrix/lldb-build/bin/clang-11-x86_64) :: test_int_type_from_block_dwo (TestIntegerTypeExpr.IntegerTypeExprTestCase) (test case does not fall in any category of interest for this run) UNSUPPORTED: LLDB (/Users/buildslave/jenkins/workspace/lldb-cmake-matrix/lldb-build/bin/clang-11-x86_64) :: test_int_type_from_block_gmodules (TestIntegerTypeExpr.IntegerTypeExprTestCase) (test case does not fall in any category of interest for this run) UNSUPPORTED: LLDB (/Users/buildslave/jenkins/workspace/lldb-cmake-matrix/lldb-build/bin/clang-11-x86_64) :: test_int_type_gmodules (TestIntegerTypeExpr.IntegerTypeExprTestCase) (test case does not fall in any category of interest for this run) runCmd: settings set symbols.enable-external-lookup false output:

Hide Details

runCmd: settings set plugin.process.gdb-remote.packet-timeout 60 output:

Hide Details

runCmd: settings set symbols.clang-modules-cache-path "/Users/buildslave/jenkins/workspace/lldb-cmake-matrix/lldb-build/lldb-test-build.noindex/module-cache-lldb/lldb-api" output:

Hide Details

runCmd: settings set use-color false output:

Hide Details

runCmd: file /Users/buildslave/jenkins/workspace/lldb-cmake-matrix/lldb-build/lldb-test-build.noindex/types/TestIntegerTypeExpr.test_unsigned_int_type_dsym/test_unsigned_int_type_dsym output: Current executable set to '/Users/buildslave/jenkins/workspace/lldb-cmake-matrix/lldb-build/lldb-test-build.noindex/types/TestIntegerTypeExpr.test_unsigned_int_type_dsym/test_unsigned_int_type_dsym' (x86_64).

Hide Details

Hide Details

runCmd: process launch -o "/Users/buildslave/jenkins/workspace/lldb-cmake-matrix/lldb-build/lldb-test-build.noindex/types/TestIntegerTypeExpr.test_unsigned_int_type_dsym/golden-output.txt" output: Process 28425 exited with status = 0 (0x00000000)

Hide Details

Process 28425 launched: '/Users/buildslave/jenkins/workspace/lldb-cmake-matrix/lldb-build/lldb-test-build.noindex/types/TestIntegerTypeExpr.test_unsigned_int_type_dsym/test_unsigned_int_type_dsym' (x86_64)

Hide Details

Hide Details

runCmd: settings set target.inline-breakpoint-strategy always output:

Hide Details

Adding tearDown hook: self.addTearDownHook(lambda: self.runCmd( "settings set target.inline-breakpoint-strategy headers"))

Hide Details

Hide Details

runCmd: breakpoint set -f "basic_type.cpp" -l 185 output: Breakpoint 1: no locations (pending). WARNING: Unable to resolve breakpoint to any actual locations.

Hide Details

Hide Details

Expecting pattern: ^Breakpoint (?P<bpno>[0-9]+): (?P<num_locations>[0-9]+) locations\.$ Not matched

Hide Details

Expecting pattern: ^Breakpoint (?P<bpno>[0-9]+): (?P<num_locations>no) locations \(pending\)\. Matched

Hide Details

FAIL: LLDB (/Users/buildslave/jenkins/workspace/lldb-cmake-matrix/lldb-build/bin/clang-11-x86_64) :: test_unsigned_int_type_dsym (TestIntegerTypeExpr.IntegerTypeExprTestCase) <bound method SBProcess.Kill of <lldb.SBProcess; proxy of <Swig Object of type 'lldb::SBProcess *' at 0x10f14cb40> >>: success

Hide Details

Executing tearDown hook: self.addTearDownHook(lambda: self.runCmd( "settings set target.inline-breakpoint-strategy headers"))

Hide Details

Hide Details

runCmd: settings set target.inline-breakpoint-strategy headers output:

Hide Details

runCmd: settings set symbols.enable-external-lookup false output:

Hide Details

runCmd: settings set plugin.process.gdb-remote.packet-timeout 60 output:

Hide Details

runCmd: settings set symbols.clang-modules-cache-path "/Users/buildslave/jenkins/workspace/lldb-cmake-matrix/lldb-build/lldb-test-build.noindex/module-cache-lldb/lldb-api" output:

Hide Details

runCmd: settings set use-color false output:

Hide Details

runCmd: file /Users/buildslave/jenkins/workspace/lldb-cmake-matrix/lldb-build/lldb-test-build.noindex/types/TestIntegerTypeExpr.test_unsigned_int_type_dwarf/test_unsigned_int_type_dwarf output: Current executable set to '/Users/buildslave/jenkins/workspace/lldb-cmake-matrix/lldb-build/lldb-test-build.noindex/types/TestIntegerTypeExpr.test_unsigned_int_type_dwarf/test_unsigned_int_type_dwarf' (x86_64).

Hide Details

Hide Details

runCmd: process launch -o "/Users/buildslave/jenkins/workspace/lldb-cmake-matrix/lldb-build/lldb-test-build.noindex/types/TestIntegerTypeExpr.test_unsigned_int_type_dwarf/golden-output.txt" output: Process 28732 exited with status = 0 (0x00000000)

Hide Details

Process 28732 launched: '/Users/buildslave/jenkins/workspace/lldb-cmake-matrix/lldb-build/lldb-test-build.noindex/types/TestIntegerTypeExpr.test_unsigned_int_type_dwarf/test_unsigned_int_type_dwarf' (x86_64)

Hide Details

Hide Details

runCmd: settings set target.inline-breakpoint-strategy always output:

Hide Details

Adding tearDown hook: self.addTearDownHook(lambda: self.runCmd( "settings set target.inline-breakpoint-strategy headers"))

Hide Details

Hide Details

runCmd: breakpoint set -f "basic_type.cpp" -l 185 output: Breakpoint 1: no locations (pending). WARNING: Unable to resolve breakpoint to any actual locations.

Hide Details

Hide Details

Expecting pattern: ^Breakpoint (?P<bpno>[0-9]+): (?P<num_locations>[0-9]+) locations\.$ Not matched

Hide Details

Expecting pattern: ^Breakpoint (?P<bpno>[0-9]+): (?P<num_locations>no) locations \(pending\)\. Matched

Hide Details

FAIL: LLDB (/Users/buildslave/jenkins/workspace/lldb-cmake-matrix/lldb-build/bin/clang-11-x86_64) :: test_unsigned_int_type_dwarf (TestIntegerTypeExpr.IntegerTypeExprTestCase) <bound method SBProcess.Kill of <lldb.SBProcess; proxy of <Swig Object of type 'lldb::SBProcess *' at 0x115ca05d0> >>: success

Hide Details

Executing tearDown hook: self.addTearDownHook(lambda: self.runCmd( "settings set target.inline-breakpoint-strategy headers"))

Hide Details

Hide Details

runCmd: settings set target.inline-breakpoint-strategy headers output:

Hide Details

UNSUPPORTED: LLDB (/Users/buildslave/jenkins/workspace/lldb-cmake-matrix/lldb-build/bin/clang-11-x86_64) :: test_unsigned_int_type_dwo (TestIntegerTypeExpr.IntegerTypeExprTestCase) (test case does not fall in any category of interest for this run) runCmd: settings set symbols.enable-external-lookup false output:

Hide Details

runCmd: settings set plugin.process.gdb-remote.packet-timeout 60 output:

Hide Details

runCmd: settings set symbols.clang-modules-cache-path "/Users/buildslave/jenkins/workspace/lldb-cmake-matrix/lldb-build/lldb-test-build.noindex/module-cache-lldb/lldb-api" output:

Hide Details

runCmd: settings set use-color false output:

Hide Details

runCmd: file /Users/buildslave/jenkins/workspace/lldb-cmake-matrix/lldb-build/lldb-test-build.noindex/types/TestIntegerTypeExpr.test_unsigned_int_type_from_block_dsym/test_unsigned_int_type_from_block_dsym output: Current executable set to '/Users/buildslave/jenkins/workspace/lldb-cmake-matrix/lldb-build/lldb-test-build.noindex/types/TestIntegerTypeExpr.test_unsigned_int_type_from_block_dsym/test_unsigned_int_type_from_block_dsym' (x86_64).

Hide Details

Hide Details

runCmd: process launch -o "/Users/buildslave/jenkins/workspace/lldb-cmake-matrix/lldb-build/lldb-test-build.noindex/types/TestIntegerTypeExpr.test_unsigned_int_type_from_block_dsym/golden-output.txt" output: Process 29134 exited with status = 0 (0x00000000)

Hide Details

Process 29134 launched: '/Users/buildslave/jenkins/workspace/lldb-cmake-matrix/lldb-build/lldb-test-build.noindex/types/TestIntegerTypeExpr.test_unsigned_int_type_from_block_dsym/test_unsigned_int_type_from_block_dsym' (x86_64)

Hide Details

Hide Details

runCmd: settings set target.inline-breakpoint-strategy always output:

Hide Details

Adding tearDown hook: self.addTearDownHook(lambda: self.runCmd( "settings set target.inline-breakpoint-strategy headers"))

Hide Details

Hide Details

runCmd: breakpoint set -f "basic_type.cpp" -l 215 output: Breakpoint 1: no locations (pending). WARNING: Unable to resolve breakpoint to any actual locations.

Hide Details

Hide Details

Expecting pattern: ^Breakpoint (?P<bpno>[0-9]+): (?P<num_locations>[0-9]+) locations\.$ Not matched

Hide Details

Expecting pattern: ^Breakpoint (?P<bpno>[0-9]+): (?P<num_locations>no) locations \(pending\)\. Matched

Hide Details

FAIL: LLDB (/Users/buildslave/jenkins/workspace/lldb-cmake-matrix/lldb-build/bin/clang-11-x86_64) :: test_unsigned_int_type_from_block_dsym (TestIntegerTypeExpr.IntegerTypeExprTestCase) <bound method SBProcess.Kill of <lldb.SBProcess; proxy of <Swig Object of type 'lldb::SBProcess *' at 0x10f14cb40> >>: success

Hide Details

Executing tearDown hook: self.addTearDownHook(lambda: self.runCmd( "settings set target.inline-breakpoint-strategy headers"))

Hide Details

Hide Details

runCmd: settings set target.inline-breakpoint-strategy headers output:

Hide Details

runCmd: settings set symbols.enable-external-lookup false output:

Hide Details

runCmd: settings set plugin.process.gdb-remote.packet-timeout 60 output:

Hide Details

runCmd: settings set symbols.clang-modules-cache-path "/Users/buildslave/jenkins/workspace/lldb-cmake-matrix/lldb-build/lldb-test-build.noindex/module-cache-lldb/lldb-api" output:

Hide Details

runCmd: settings set use-color false output:

Hide Details

runCmd: file /Users/buildslave/jenkins/workspace/lldb-cmake-matrix/lldb-build/lldb-test-build.noindex/types/TestIntegerTypeExpr.test_unsigned_int_type_from_block_dwarf/test_unsigned_int_type_from_block_dwarf output: Current executable set to '/Users/buildslave/jenkins/workspace/lldb-cmake-matrix/lldb-build/lldb-test-build.noindex/types/TestIntegerTypeExpr.test_unsigned_int_type_from_block_dwarf/test_unsigned_int_type_from_block_dwarf' (x86_64).

Hide Details

Hide Details

runCmd: process launch -o "/Users/buildslave/jenkins/workspace/lldb-cmake-matrix/lldb-build/lldb-test-build.noindex/types/TestIntegerTypeExpr.test_unsigned_int_type_from_block_dwarf/golden-output.txt" output: Process 29538 exited with status = 0 (0x00000000)

Hide Details

Process 29538 launched: '/Users/buildslave/jenkins/workspace/lldb-cmake-matrix/lldb-build/lldb-test-build.noindex/types/TestIntegerTypeExpr.test_unsigned_int_type_from_block_dwarf/test_unsigned_int_type_from_block_dwarf' (x86_64)

Hide Details

Hide Details

runCmd: settings set target.inline-breakpoint-strategy always output:

Hide Details

Adding tearDown hook: self.addTearDownHook(lambda: self.runCmd( "settings set target.inline-breakpoint-strategy headers"))

Hide Details

Hide Details

runCmd: breakpoint set -f "basic_type.cpp" -l 215 output: Breakpoint 1: no locations (pending). WARNING: Unable to resolve breakpoint to any actual locations.

Hide Details

Hide Details

Expecting pattern: ^Breakpoint (?P<bpno>[0-9]+): (?P<num_locations>[0-9]+) locations\.$ Not matched

Hide Details

Expecting pattern: ^Breakpoint (?P<bpno>[0-9]+): (?P<num_locations>no) locations \(pending\)\. Matched

Hide Details

FAIL: LLDB (/Users/buildslave/jenkins/workspace/lldb-cmake-matrix/lldb-build/bin/clang-11-x86_64) :: test_unsigned_int_type_from_block_dwarf (TestIntegerTypeExpr.IntegerTypeExprTestCase) <bound method SBProcess.Kill of <lldb.SBProcess; proxy of <Swig Object of type 'lldb::SBProcess *' at 0x115ca05d0> >>: success

Hide Details

Executing tearDown hook: self.addTearDownHook(lambda: self.runCmd( "settings set target.inline-breakpoint-strategy headers"))

Hide Details

Hide Details

runCmd: settings set target.inline-breakpoint-strategy headers output:

Hide Details

UNSUPPORTED: LLDB (/Users/buildslave/jenkins/workspace/lldb-cmake-matrix/lldb-build/bin/clang-11-x86_64) :: test_unsigned_int_type_from_block_dwo (TestIntegerTypeExpr.IntegerTypeExprTestCase) (test case does not fall in any category of interest for this run) UNSUPPORTED: LLDB (/Users/buildslave/jenkins/workspace/lldb-cmake-matrix/lldb-build/bin/clang-11-x86_64) :: test_unsigned_int_type_from_block_gmodules (TestIntegerTypeExpr.IntegerTypeExprTestCase) (test case does not fall in any category of interest for this run) UNSUPPORTED: LLDB (/Users/buildslave/jenkins/workspace/lldb-cmake-matrix/lldb-build/bin/clang-11-x86_64) :: test_unsigned_int_type_gmodules (TestIntegerTypeExpr.IntegerTypeExprTestCase) (test case does not fall in any category of interest for this run) runCmd: settings set symbols.enable-external-lookup false output:

Hide Details

runCmd: settings set plugin.process.gdb-remote.packet-timeout 60 output:

Hide Details

runCmd: settings set symbols.clang-modules-cache-path "/Users/buildslave/jenkins/workspace/lldb-cmake-matrix/lldb-build/lldb-test-build.noindex/module-cache-lldb/lldb-api" output:

Hide Details

runCmd: settings set use-color false output:

Hide Details

runCmd: file /Users/buildslave/jenkins/workspace/lldb-cmake-matrix/lldb-build/lldb-test-build.noindex/types/TestIntegerTypeExpr.test_unsigned_short_type_from_block_dsym/test_unsigned_short_type_from_block_dsym output: Current executable set to '/Users/buildslave/jenkins/workspace/lldb-cmake-matrix/lldb-build/lldb-test-build.noindex/types/TestIntegerTypeExpr.test_unsigned_short_type_from_block_dsym/test_unsigned_short_type_from_block_dsym' (x86_64).

Hide Details

Hide Details

runCmd: process launch -o "/Users/buildslave/jenkins/workspace/lldb-cmake-matrix/lldb-build/lldb-test-build.noindex/types/TestIntegerTypeExpr.test_unsigned_short_type_from_block_dsym/golden-output.txt" output: Process 29907 exited with status = 0 (0x00000000)

Hide Details

Process 29907 launched: '/Users/buildslave/jenkins/workspace/lldb-cmake-matrix/lldb-build/lldb-test-build.noindex/types/TestIntegerTypeExpr.test_unsigned_short_type_from_block_dsym/test_unsigned_short_type_from_block_dsym' (x86_64)

Hide Details

Hide Details

runCmd: settings set target.inline-breakpoint-strategy always output:

Hide Details

Adding tearDown hook: self.addTearDownHook(lambda: self.runCmd( "settings set target.inline-breakpoint-strategy headers"))

Hide Details

Hide Details

runCmd: breakpoint set -f "basic_type.cpp" -l 215 output: Breakpoint 1: no locations (pending). WARNING: Unable to resolve breakpoint to any actual locations.

Hide Details

Hide Details

Expecting pattern: ^Breakpoint (?P<bpno>[0-9]+): (?P<num_locations>[0-9]+) locations\.$ Not matched

Hide Details

Expecting pattern: ^Breakpoint (?P<bpno>[0-9]+): (?P<num_locations>no) locations \(pending\)\. Matched

Hide Details

FAIL: LLDB (/Users/buildslave/jenkins/workspace/lldb-cmake-matrix/lldb-build/bin/clang-11-x86_64) :: test_unsigned_short_type_from_block_dsym (TestIntegerTypeExpr.IntegerTypeExprTestCase) <bound method SBProcess.Kill of <lldb.SBProcess; proxy of <Swig Object of type 'lldb::SBProcess *' at 0x10f14cb40> >>: success

Hide Details

Executing tearDown hook: self.addTearDownHook(lambda: self.runCmd( "settings set target.inline-breakpoint-strategy headers"))

Hide Details

Hide Details

runCmd: settings set target.inline-breakpoint-strategy headers output:

Hide Details

runCmd: settings set symbols.enable-external-lookup false output:

Hide Details

runCmd: settings set plugin.process.gdb-remote.packet-timeout 60 output:

Hide Details

runCmd: settings set symbols.clang-modules-cache-path "/Users/buildslave/jenkins/workspace/lldb-cmake-matrix/lldb-build/lldb-test-build.noindex/module-cache-lldb/lldb-api" output:

Hide Details

runCmd: settings set use-color false output:

Hide Details

runCmd: file /Users/buildslave/jenkins/workspace/lldb-cmake-matrix/lldb-build/lldb-test-build.noindex/types/TestIntegerTypeExpr.test_unsigned_short_type_from_block_dwarf/test_unsigned_short_type_from_block_dwarf output: Current executable set to '/Users/buildslave/jenkins/workspace/lldb-cmake-matrix/lldb-build/lldb-test-build.noindex/types/TestIntegerTypeExpr.test_unsigned_short_type_from_block_dwarf/test_unsigned_short_type_from_block_dwarf' (x86_64).

Hide Details

Hide Details

runCmd: process launch -o "/Users/buildslave/jenkins/workspace/lldb-cmake-matrix/lldb-build/lldb-test-build.noindex/types/TestIntegerTypeExpr.test_unsigned_short_type_from_block_dwarf/golden-output.txt" output: Process 30260 exited with status = 0 (0x00000000)

Hide Details

Process 30260 launched: '/Users/buildslave/jenkins/workspace/lldb-cmake-matrix/lldb-build/lldb-test-build.noindex/types/TestIntegerTypeExpr.test_unsigned_short_type_from_block_dwarf/test_unsigned_short_type_from_block_dwarf' (x86_64)

Hide Details

Hide Details

runCmd: settings set target.inline-breakpoint-strategy always output:

Hide Details

Adding tearDown hook: self.addTearDownHook(lambda: self.runCmd( "settings set target.inline-breakpoint-strategy headers"))

Hide Details

Hide Details

runCmd: breakpoint set -f "basic_type.cpp" -l 215 output: Breakpoint 1: no locations (pending). WARNING: Unable to resolve breakpoint to any actual locations.

Hide Details

Hide Details

Expecting pattern: ^Breakpoint (?P<bpno>[0-9]+): (?P<num_locations>[0-9]+) locations\.$ Not matched

Hide Details

Expecting pattern: ^Breakpoint (?P<bpno>[0-9]+): (?P<num_locations>no) locations \(pending\)\. Matched

Hide Details

FAIL: LLDB (/Users/buildslave/jenkins/workspace/lldb-cmake-matrix/lldb-build/bin/clang-11-x86_64) :: test_unsigned_short_type_from_block_dwarf (TestIntegerTypeExpr.IntegerTypeExprTestCase) <bound method SBProcess.Kill of <lldb.SBProcess; proxy of <Swig Object of type 'lldb::SBProcess *' at 0x115ca05d0> >>: success

Hide Details

Executing tearDown hook: self.addTearDownHook(lambda: self.runCmd( "settings set target.inline-breakpoint-strategy headers"))

Hide Details

Hide Details

runCmd: settings set target.inline-breakpoint-strategy headers output:

Hide Details

UNSUPPORTED: LLDB (/Users/buildslave/jenkins/workspace/lldb-cmake-matrix/lldb-build/bin/clang-11-x86_64) :: test_unsigned_short_type_from_block_dwo (TestIntegerTypeExpr.IntegerTypeExprTestCase) (test case does not fall in any category of interest for this run) UNSUPPORTED: LLDB (/Users/buildslave/jenkins/workspace/lldb-cmake-matrix/lldb-build/bin/clang-11-x86_64) :: test_unsigned_short_type_from_block_gmodules (TestIntegerTypeExpr.IntegerTypeExprTestCase) (test case does not fall in any category of interest for this run) Restore dir to: /Users/buildslave/jenkins/workspace/lldb-cmake-matrix/lldb-build/tools/lldb/test ====================================================================== FAIL: test_int_type_dsym (TestIntegerTypeExpr.IntegerTypeExprTestCase) Test that int-type variable expressions are evaluated correctly. ---------------------------------------------------------------------- Traceback (most recent call last): File "/Users/buildslave/jenkins/workspace/lldb-cmake-matrix/llvm-project/lldb/packages/Python/lldbsuite/test/lldbtest.py", line 1732, in test_method return attrvalue(self) File "/Users/buildslave/jenkins/workspace/lldb-cmake-matrix/llvm-project/lldb/packages/Python/lldbsuite/test/types/TestIntegerTypeExpr.py", line 22, in test_int_type self.build_and_run_expr('int.cpp', set(['int'])) File "/Users/buildslave/jenkins/workspace/lldb-cmake-matrix/llvm-project/lldb/packages/Python/lldbsuite/test/types/AbstractBase.py", line 69, in build_and_run_expr source, atoms, expr=True, bc=bc, qd=qd) File "/Users/buildslave/jenkins/workspace/lldb-cmake-matrix/llvm-project/lldb/packages/Python/lldbsuite/test/types/AbstractBase.py", line 83, in build_and_run_with_source_atoms_expr self.exe_name, atoms, blockCaptured=bc, quotedDisplay=qd) File "/Users/buildslave/jenkins/workspace/lldb-cmake-matrix/llvm-project/lldb/packages/Python/lldbsuite/test/types/AbstractBase.py", line 262, in generic_type_expr_tester loc_exact=True) File "/Users/buildslave/jenkins/workspace/lldb-cmake-matrix/llvm-project/lldb/packages/Python/lldbsuite/test/lldbutil.py", line 384, in run_break_set_by_file_and_line module_name=module_name) File "/Users/buildslave/jenkins/workspace/lldb-cmake-matrix/llvm-project/lldb/packages/Python/lldbsuite/test/lldbutil.py", line 585, in check_breakpoint_result out_num_locations)) AssertionError: False is not True : Expecting 1 locations, got 0. Config=x86_64-/Users/buildslave/jenkins/workspace/lldb-cmake-matrix/lldb-build/bin/clang-11 ====================================================================== FAIL: test_int_type_dwarf (TestIntegerTypeExpr.IntegerTypeExprTestCase) Test that int-type variable expressions are evaluated correctly. ---------------------------------------------------------------------- Traceback (most recent call last): File "/Users/buildslave/jenkins/workspace/lldb-cmake-matrix/llvm-project/lldb/packages/Python/lldbsuite/test/lldbtest.py", line 1732, in test_method return attrvalue(self) File "/Users/buildslave/jenkins/workspace/lldb-cmake-matrix/llvm-project/lldb/packages/Python/lldbsuite/test/types/TestIntegerTypeExpr.py", line 22, in test_int_type self.build_and_run_expr('int.cpp', set(['int'])) File "/Users/buildslave/jenkins/workspace/lldb-cmake-matrix/llvm-project/lldb/packages/Python/lldbsuite/test/types/AbstractBase.py", line 69, in build_and_run_expr source, atoms, expr=True, bc=bc, qd=qd) File "/Users/buildslave/jenkins/workspace/lldb-cmake-matrix/llvm-project/lldb/packages/Python/lldbsuite/test/types/AbstractBase.py", line 83, in build_and_run_with_source_atoms_expr self.exe_name, atoms, blockCaptured=bc, quotedDisplay=qd) File "/Users/buildslave/jenkins/workspace/lldb-cmake-matrix/llvm-project/lldb/packages/Python/lldbsuite/test/types/AbstractBase.py", line 262, in generic_type_expr_tester loc_exact=True) File "/Users/buildslave/jenkins/workspace/lldb-cmake-matrix/llvm-project/lldb/packages/Python/lldbsuite/test/lldbutil.py", line 384, in run_break_set_by_file_and_line module_name=module_name) File "/Users/buildslave/jenkins/workspace/lldb-cmake-matrix/llvm-project/lldb/packages/Python/lldbsuite/test/lldbutil.py", line 585, in check_breakpoint_result out_num_locations)) AssertionError: False is not True : Expecting 1 locations, got 0. Config=x86_64-/Users/buildslave/jenkins/workspace/lldb-cmake-matrix/lldb-build/bin/clang-11 ====================================================================== FAIL: test_int_type_from_block_dsym (TestIntegerTypeExpr.IntegerTypeExprTestCase) Test that int-type variables are displayed correctly from a block. ---------------------------------------------------------------------- Traceback (most recent call last): File "/Users/buildslave/jenkins/workspace/lldb-cmake-matrix/llvm-project/lldb/packages/Python/lldbsuite/test/lldbtest.py", line 1732, in test_method return attrvalue(self) File "/Users/buildslave/jenkins/workspace/lldb-cmake-matrix/llvm-project/lldb/packages/Python/lldbsuite/test/types/TestIntegerTypeExpr.py", line 27, in test_int_type_from_block self.build_and_run_expr('int.cpp', set(['int'])) File "/Users/buildslave/jenkins/workspace/lldb-cmake-matrix/llvm-project/lldb/packages/Python/lldbsuite/test/types/AbstractBase.py", line 69, in build_and_run_expr source, atoms, expr=True, bc=bc, qd=qd) File "/Users/buildslave/jenkins/workspace/lldb-cmake-matrix/llvm-project/lldb/packages/Python/lldbsuite/test/types/AbstractBase.py", line 83, in build_and_run_with_source_atoms_expr self.exe_name, atoms, blockCaptured=bc, quotedDisplay=qd) File "/Users/buildslave/jenkins/workspace/lldb-cmake-matrix/llvm-project/lldb/packages/Python/lldbsuite/test/types/AbstractBase.py", line 262, in generic_type_expr_tester loc_exact=True) File "/Users/buildslave/jenkins/workspace/lldb-cmake-matrix/llvm-project/lldb/packages/Python/lldbsuite/test/lldbutil.py", line 384, in run_break_set_by_file_and_line module_name=module_name) File "/Users/buildslave/jenkins/workspace/lldb-cmake-matrix/llvm-project/lldb/packages/Python/lldbsuite/test/lldbutil.py", line 585, in check_breakpoint_result out_num_locations)) AssertionError: False is not True : Expecting 1 locations, got 0. Config=x86_64-/Users/buildslave/jenkins/workspace/lldb-cmake-matrix/lldb-build/bin/clang-11 ====================================================================== FAIL: test_int_type_from_block_dwarf (TestIntegerTypeExpr.IntegerTypeExprTestCase) Test that int-type variables are displayed correctly from a block. ---------------------------------------------------------------------- Traceback (most recent call last): File "/Users/buildslave/jenkins/workspace/lldb-cmake-matrix/llvm-project/lldb/packages/Python/lldbsuite/test/lldbtest.py", line 1732, in test_method return attrvalue(self) File "/Users/buildslave/jenkins/workspace/lldb-cmake-matrix/llvm-project/lldb/packages/Python/lldbsuite/test/types/TestIntegerTypeExpr.py", line 27, in test_int_type_from_block self.build_and_run_expr('int.cpp', set(['int'])) File "/Users/buildslave/jenkins/workspace/lldb-cmake-matrix/llvm-project/lldb/packages/Python/lldbsuite/test/types/AbstractBase.py", line 69, in build_and_run_expr source, atoms, expr=True, bc=bc, qd=qd) File "/Users/buildslave/jenkins/workspace/lldb-cmake-matrix/llvm-project/lldb/packages/Python/lldbsuite/test/types/AbstractBase.py", line 83, in build_and_run_with_source_atoms_expr self.exe_name, atoms, blockCaptured=bc, quotedDisplay=qd) File "/Users/buildslave/jenkins/workspace/lldb-cmake-matrix/llvm-project/lldb/packages/Python/lldbsuite/test/types/AbstractBase.py", line 262, in generic_type_expr_tester loc_exact=True) File "/Users/buildslave/jenkins/workspace/lldb-cmake-matrix/llvm-project/lldb/packages/Python/lldbsuite/test/lldbutil.py", line 384, in run_break_set_by_file_and_line module_name=module_name) File "/Users/buildslave/jenkins/workspace/lldb-cmake-matrix/llvm-project/lldb/packages/Python/lldbsuite/test/lldbutil.py", line 585, in check_breakpoint_result out_num_locations)) AssertionError: False is not True : Expecting 1 locations, got 0. Config=x86_64-/Users/buildslave/jenkins/workspace/lldb-cmake-matrix/lldb-build/bin/clang-11 ====================================================================== FAIL: test_unsigned_int_type_dsym (TestIntegerTypeExpr.IntegerTypeExprTestCase) Test that 'unsigned_int'-type variable expressions are evaluated correctly. ---------------------------------------------------------------------- Traceback (most recent call last): File "/Users/buildslave/jenkins/workspace/lldb-cmake-matrix/llvm-project/lldb/packages/Python/lldbsuite/test/lldbtest.py", line 1732, in test_method return attrvalue(self) File "/Users/buildslave/jenkins/workspace/lldb-cmake-matrix/llvm-project/lldb/packages/Python/lldbsuite/test/types/TestIntegerTypeExpr.py", line 31, in test_unsigned_int_type self.build_and_run_expr('unsigned_int.cpp', set(['unsigned', 'int'])) File "/Users/buildslave/jenkins/workspace/lldb-cmake-matrix/llvm-project/lldb/packages/Python/lldbsuite/test/types/AbstractBase.py", line 69, in build_and_run_expr source, atoms, expr=True, bc=bc, qd=qd) File "/Users/buildslave/jenkins/workspace/lldb-cmake-matrix/llvm-project/lldb/packages/Python/lldbsuite/test/types/AbstractBase.py", line 83, in build_and_run_with_source_atoms_expr self.exe_name, atoms, blockCaptured=bc, quotedDisplay=qd) File "/Users/buildslave/jenkins/workspace/lldb-cmake-matrix/llvm-project/lldb/packages/Python/lldbsuite/test/types/AbstractBase.py", line 262, in generic_type_expr_tester loc_exact=True) File "/Users/buildslave/jenkins/workspace/lldb-cmake-matrix/llvm-project/lldb/packages/Python/lldbsuite/test/lldbutil.py", line 384, in run_break_set_by_file_and_line module_name=module_name) File "/Users/buildslave/jenkins/workspace/lldb-cmake-matrix/llvm-project/lldb/packages/Python/lldbsuite/test/lldbutil.py", line 585, in check_breakpoint_result out_num_locations)) AssertionError: False is not True : Expecting 1 locations, got 0. Config=x86_64-/Users/buildslave/jenkins/workspace/lldb-cmake-matrix/lldb-build/bin/clang-11 ====================================================================== FAIL: test_unsigned_int_type_dwarf (TestIntegerTypeExpr.IntegerTypeExprTestCase) Test that 'unsigned_int'-type variable expressions are evaluated correctly. ---------------------------------------------------------------------- Traceback (most recent call last): File "/Users/buildslave/jenkins/workspace/lldb-cmake-matrix/llvm-project/lldb/packages/Python/lldbsuite/test/lldbtest.py", line 1732, in test_method return attrvalue(self) File "/Users/buildslave/jenkins/workspace/lldb-cmake-matrix/llvm-project/lldb/packages/Python/lldbsuite/test/types/TestIntegerTypeExpr.py", line 31, in test_unsigned_int_type self.build_and_run_expr('unsigned_int.cpp', set(['unsigned', 'int'])) File "/Users/buildslave/jenkins/workspace/lldb-cmake-matrix/llvm-project/lldb/packages/Python/lldbsuite/test/types/AbstractBase.py", line 69, in build_and_run_expr source, atoms, expr=True, bc=bc, qd=qd) File "/Users/buildslave/jenkins/workspace/lldb-cmake-matrix/llvm-project/lldb/packages/Python/lldbsuite/test/types/AbstractBase.py", line 83, in build_and_run_with_source_atoms_expr self.exe_name, atoms, blockCaptured=bc, quotedDisplay=qd) File "/Users/buildslave/jenkins/workspace/lldb-cmake-matrix/llvm-project/lldb/packages/Python/lldbsuite/test/types/AbstractBase.py", line 262, in generic_type_expr_tester loc_exact=True) File "/Users/buildslave/jenkins/workspace/lldb-cmake-matrix/llvm-project/lldb/packages/Python/lldbsuite/test/lldbutil.py", line 384, in run_break_set_by_file_and_line module_name=module_name) File "/Users/buildslave/jenkins/workspace/lldb-cmake-matrix/llvm-project/lldb/packages/Python/lldbsuite/test/lldbutil.py", line 585, in check_breakpoint_result out_num_locations)) AssertionError: False is not True : Expecting 1 locations, got 0. Config=x86_64-/Users/buildslave/jenkins/workspace/lldb-cmake-matrix/lldb-build/bin/clang-11 ====================================================================== FAIL: test_unsigned_int_type_from_block_dsym (TestIntegerTypeExpr.IntegerTypeExprTestCase) Test that 'unsigned int'-type variables are displayed correctly from a block. ---------------------------------------------------------------------- Traceback (most recent call last): File "/Users/buildslave/jenkins/workspace/lldb-cmake-matrix/llvm-project/lldb/packages/Python/lldbsuite/test/lldbtest.py", line 1732, in test_method return attrvalue(self) File "/Users/buildslave/jenkins/workspace/lldb-cmake-matrix/llvm-project/lldb/packages/Python/lldbsuite/test/types/TestIntegerTypeExpr.py", line 37, in test_unsigned_int_type_from_block 'unsigned_int.cpp', set(['unsigned', 'int']), bc=True) File "/Users/buildslave/jenkins/workspace/lldb-cmake-matrix/llvm-project/lldb/packages/Python/lldbsuite/test/types/AbstractBase.py", line 69, in build_and_run_expr source, atoms, expr=True, bc=bc, qd=qd) File "/Users/buildslave/jenkins/workspace/lldb-cmake-matrix/llvm-project/lldb/packages/Python/lldbsuite/test/types/AbstractBase.py", line 83, in build_and_run_with_source_atoms_expr self.exe_name, atoms, blockCaptured=bc, quotedDisplay=qd) File "/Users/buildslave/jenkins/workspace/lldb-cmake-matrix/llvm-project/lldb/packages/Python/lldbsuite/test/types/AbstractBase.py", line 262, in generic_type_expr_tester loc_exact=True) File "/Users/buildslave/jenkins/workspace/lldb-cmake-matrix/llvm-project/lldb/packages/Python/lldbsuite/test/lldbutil.py", line 384, in run_break_set_by_file_and_line module_name=module_name) File "/Users/buildslave/jenkins/workspace/lldb-cmake-matrix/llvm-project/lldb/packages/Python/lldbsuite/test/lldbutil.py", line 585, in check_breakpoint_result out_num_locations)) AssertionError: False is not True : Expecting 1 locations, got 0. Config=x86_64-/Users/buildslave/jenkins/workspace/lldb-cmake-matrix/lldb-build/bin/clang-11 ====================================================================== FAIL: test_unsigned_int_type_from_block_dwarf (TestIntegerTypeExpr.IntegerTypeExprTestCase) Test that 'unsigned int'-type variables are displayed correctly from a block. ---------------------------------------------------------------------- Traceback (most recent call last): File "/Users/buildslave/jenkins/workspace/lldb-cmake-matrix/llvm-project/lldb/packages/Python/lldbsuite/test/lldbtest.py", line 1732, in test_method return attrvalue(self) File "/Users/buildslave/jenkins/workspace/lldb-cmake-matrix/llvm-project/lldb/packages/Python/lldbsuite/test/types/TestIntegerTypeExpr.py", line 37, in test_unsigned_int_type_from_block 'unsigned_int.cpp', set(['unsigned', 'int']), bc=True) File "/Users/buildslave/jenkins/workspace/lldb-cmake-matrix/llvm-project/lldb/packages/Python/lldbsuite/test/types/AbstractBase.py", line 69, in build_and_run_expr source, atoms, expr=True, bc=bc, qd=qd) File "/Users/buildslave/jenkins/workspace/lldb-cmake-matrix/llvm-project/lldb/packages/Python/lldbsuite/test/types/AbstractBase.py", line 83, in build_and_run_with_source_atoms_expr self.exe_name, atoms, blockCaptured=bc, quotedDisplay=qd) File "/Users/buildslave/jenkins/workspace/lldb-cmake-matrix/llvm-project/lldb/packages/Python/lldbsuite/test/types/AbstractBase.py", line 262, in generic_type_expr_tester loc_exact=True) File "/Users/buildslave/jenkins/workspace/lldb-cmake-matrix/llvm-project/lldb/packages/Python/lldbsuite/test/lldbutil.py", line 384, in run_break_set_by_file_and_line module_name=module_name) File "/Users/buildslave/jenkins/workspace/lldb-cmake-matrix/llvm-project/lldb/packages/Python/lldbsuite/test/lldbutil.py", line 585, in check_breakpoint_result out_num_locations)) AssertionError: False is not True : Expecting 1 locations, got 0. Config=x86_64-/Users/buildslave/jenkins/workspace/lldb-cmake-matrix/lldb-build/bin/clang-11 ====================================================================== FAIL: test_unsigned_short_type_from_block_dsym (TestIntegerTypeExpr.IntegerTypeExprTestCase) Test that 'unsigned short'-type variables are displayed correctly from a block. ---------------------------------------------------------------------- Traceback (most recent call last): File "/Users/buildslave/jenkins/workspace/lldb-cmake-matrix/llvm-project/lldb/packages/Python/lldbsuite/test/lldbtest.py", line 1732, in test_method return attrvalue(self) File "/Users/buildslave/jenkins/workspace/lldb-cmake-matrix/llvm-project/lldb/packages/Python/lldbsuite/test/types/TestIntegerTypeExpr.py", line 18, in test_unsigned_short_type_from_block 'unsigned_short.cpp', set(['unsigned', 'short']), bc=True) File "/Users/buildslave/jenkins/workspace/lldb-cmake-matrix/llvm-project/lldb/packages/Python/lldbsuite/test/types/AbstractBase.py", line 69, in build_and_run_expr source, atoms, expr=True, bc=bc, qd=qd) File "/Users/buildslave/jenkins/workspace/lldb-cmake-matrix/llvm-project/lldb/packages/Python/lldbsuite/test/types/AbstractBase.py", line 83, in build_and_run_with_source_atoms_expr self.exe_name, atoms, blockCaptured=bc, quotedDisplay=qd) File "/Users/buildslave/jenkins/workspace/lldb-cmake-matrix/llvm-project/lldb/packages/Python/lldbsuite/test/types/AbstractBase.py", line 262, in generic_type_expr_tester loc_exact=True) File "/Users/buildslave/jenkins/workspace/lldb-cmake-matrix/llvm-project/lldb/packages/Python/lldbsuite/test/lldbutil.py", line 384, in run_break_set_by_file_and_line module_name=module_name) File "/Users/buildslave/jenkins/workspace/lldb-cmake-matrix/llvm-project/lldb/packages/Python/lldbsuite/test/lldbutil.py", line 585, in check_breakpoint_result out_num_locations)) AssertionError: False is not True : Expecting 1 locations, got 0. Config=x86_64-/Users/buildslave/jenkins/workspace/lldb-cmake-matrix/lldb-build/bin/clang-11 ====================================================================== FAIL: test_unsigned_short_type_from_block_dwarf (TestIntegerTypeExpr.IntegerTypeExprTestCase) Test that 'unsigned short'-type variables are displayed correctly from a block. ---------------------------------------------------------------------- Traceback (most recent call last): File "/Users/buildslave/jenkins/workspace/lldb-cmake-matrix/llvm-project/lldb/packages/Python/lldbsuite/test/lldbtest.py", line 1732, in test_method return attrvalue(self) File "/Users/buildslave/jenkins/workspace/lldb-cmake-matrix/llvm-project/lldb/packages/Python/lldbsuite/test/types/TestIntegerTypeExpr.py", line 18, in test_unsigned_short_type_from_block 'unsigned_short.cpp', set(['unsigned', 'short']), bc=True) File "/Users/buildslave/jenkins/workspace/lldb-cmake-matrix/llvm-project/lldb/packages/Python/lldbsuite/test/types/AbstractBase.py", line 69, in build_and_run_expr source, atoms, expr=True, bc=bc, qd=qd) File "/Users/buildslave/jenkins/workspace/lldb-cmake-matrix/llvm-project/lldb/packages/Python/lldbsuite/test/types/AbstractBase.py", line 83, in build_and_run_with_source_atoms_expr self.exe_name, atoms, blockCaptured=bc, quotedDisplay=qd) File "/Users/buildslave/jenkins/workspace/lldb-cmake-matrix/llvm-project/lldb/packages/Python/lldbsuite/test/types/AbstractBase.py", line 262, in generic_type_expr_tester loc_exact=True) File "/Users/buildslave/jenkins/workspace/lldb-cmake-matrix/llvm-project/lldb/packages/Python/lldbsuite/test/lldbutil.py", line 384, in run_break_set_by_file_and_line module_name=module_name) File "/Users/buildslave/jenkins/workspace/lldb-cmake-matrix/llvm-project/lldb/packages/Python/lldbsuite/test/lldbutil.py", line 585, in check_breakpoint_result out_num_locations)) AssertionError: False is not True : Expecting 1 locations, got 0. Config=x86_64-/Users/buildslave/jenkins/workspace/lldb-cmake-matrix/lldb-build/bin/clang-11 ---------------------------------------------------------------------- Ran 20 tests in 10.842s

Hide Details

RESULT: FAILED (0 passes, 10 failures, 0 errors, 10 skipped, 0 expected failures, 0 unexpected successes)

Hide Details

******************** PASS: lldb-unit :: Symbol/./SymbolTests/TestClangASTContext.TestGetBasicTypeFromName (720 of 1914) PASS: lldb-unit :: Symbol/./SymbolTests/TestClangASTContext.TestGetTypeClassNested (721 of 1914) FAIL: lldb-api :: functionalities/data-formatter/data-formatter-stl/libcxx/set/TestDataFormatterLibcxxSet.py (722 of 1914) ******************** TEST 'lldb-api :: functionalities/data-formatter/data-formatter-stl/libcxx/set/TestDataFormatterLibcxxSet.py' FAILED ******************** lldb version 11.0.99 clang revision 020041d99b508ed5f207c0896a19b3e85c942ee7 llvm revision 020041d99b508ed5f207c0896a19b3e85c942ee7 LLDB library dir: /Users/buildslave/jenkins/workspace/lldb-cmake-matrix/lldb-build/bin LLDB import library dir: /Users/buildslave/jenkins/workspace/lldb-cmake-matrix/lldb-build/bin libstdcxx tests will not be run because: Don't know how to build with libstdcxx on macosx Skipping following debug info categories: ['dwo'] setting set target.prefer-dynamic-value no-dynamic-values warning: (x86_64) /Users/buildslave/jenkins/workspace/lldb-cmake-matrix/lldb-build/lldb-test-build.noindex/functionalities/data-formatter/data-formatter-stl/libcxx/set/TestDataFormatterLibcxxSet.test_ref_and_ptr_dsym/a.out empty dSYM file detected, dSYM was created with an executable with no debug info. warning: (x86_64) /Users/buildslave/jenkins/workspace/lldb-cmake-matrix/lldb-build/lldb-test-build.noindex/functionalities/data-formatter/data-formatter-stl/libcxx/set/TestDataFormatterLibcxxSet.test_with_run_command_dsym/a.out empty dSYM file detected, dSYM was created with an executable with no debug info.

Hide Details

Session logs for test failures/errors/unexpected successes will go into directory '/Users/buildslave/jenkins/workspace/lldb-cmake-matrix/test/logs' Command invoked: /Users/buildslave/jenkins/workspace/lldb-cmake-matrix/llvm-project/lldb/test/API/dotest.py --arch x86_64 -s /Users/buildslave/jenkins/workspace/lldb-cmake-matrix/lldb-build/lldb-test-traces -S nm -u CXXFLAGS -u CFLAGS --codesign-identity lldb_codesign --server /Users/buildslave/jenkins/workspace/lldb-cmake-matrix/lldb-build/./bin/debugserver --arch x86_64 --build-dir /Users/buildslave/jenkins/workspace/lldb-cmake-matrix/lldb-build/lldb-test-build.noindex -s=/Users/buildslave/jenkins/workspace/lldb-cmake-matrix/test/logs -t --env TERM=vt100 --skip-category gmodules --skip-category watchpoint --arch=x86_64 --dwarf-version=5 --env LLVM_LIBS_DIR=/Users/buildslave/jenkins/workspace/lldb-cmake-matrix/lldb-build/./lib --build-dir /Users/buildslave/jenkins/workspace/lldb-cmake-matrix/lldb-build/lldb-test-build.noindex --lldb-module-cache-dir /Users/buildslave/jenkins/workspace/lldb-cmake-matrix/lldb-build/lldb-test-build.noindex/module-cache-lldb/lldb-api --clang-module-cache-dir /Users/buildslave/jenkins/workspace/lldb-cmake-matrix/lldb-build/lldb-test-build.noindex/module-cache-clang/lldb-api --executable /Users/buildslave/jenkins/workspace/lldb-cmake-matrix/lldb-build/./bin/lldb --compiler /Users/buildslave/jenkins/workspace/lldb-cmake-matrix/lldb-build/./bin/clang --dsymutil /Users/buildslave/jenkins/workspace/lldb-cmake-matrix/lldb-build/./bin/dsymutil --filecheck /Users/buildslave/jenkins/workspace/lldb-cmake-matrix/lldb-build/./bin/FileCheck /Users/buildslave/jenkins/workspace/lldb-cmake-matrix/llvm-project/lldb/packages/Python/lldbsuite/test/functionalities/data-formatter/data-formatter-stl/libcxx/set -p TestDataFormatterLibcxxSet.py Change dir to: /Users/buildslave/jenkins/workspace/lldb-cmake-matrix/llvm-project/lldb/packages/Python/lldbsuite/test/functionalities/data-formatter/data-formatter-stl/libcxx/set runCmd: settings set symbols.enable-external-lookup false output:

Hide Details

runCmd: settings set plugin.process.gdb-remote.packet-timeout 60 output:

Hide Details

runCmd: settings set symbols.clang-modules-cache-path "/Users/buildslave/jenkins/workspace/lldb-cmake-matrix/lldb-build/lldb-test-build.noindex/module-cache-lldb/lldb-api" output:

Hide Details

runCmd: settings set use-color false output:

Hide Details

FAIL: LLDB (/Users/buildslave/jenkins/workspace/lldb-cmake-matrix/lldb-build/bin/clang-11-x86_64) :: test_ref_and_ptr_dsym (TestDataFormatterLibcxxSet.LibcxxSetDataFormatterTestCase) runCmd: settings set symbols.enable-external-lookup false output:

Hide Details

runCmd: settings set plugin.process.gdb-remote.packet-timeout 60 output:

Hide Details

runCmd: settings set symbols.clang-modules-cache-path "/Users/buildslave/jenkins/workspace/lldb-cmake-matrix/lldb-build/lldb-test-build.noindex/module-cache-lldb/lldb-api" output:

Hide Details

runCmd: settings set use-color false output:

Hide Details

FAIL: LLDB (/Users/buildslave/jenkins/workspace/lldb-cmake-matrix/lldb-build/bin/clang-11-x86_64) :: test_ref_and_ptr_dwarf (TestDataFormatterLibcxxSet.LibcxxSetDataFormatterTestCase) UNSUPPORTED: LLDB (/Users/buildslave/jenkins/workspace/lldb-cmake-matrix/lldb-build/bin/clang-11-x86_64) :: test_ref_and_ptr_dwo (TestDataFormatterLibcxxSet.LibcxxSetDataFormatterTestCase) (test case does not fall in any category of interest for this run) UNSUPPORTED: LLDB (/Users/buildslave/jenkins/workspace/lldb-cmake-matrix/lldb-build/bin/clang-11-x86_64) :: test_ref_and_ptr_gmodules (TestDataFormatterLibcxxSet.LibcxxSetDataFormatterTestCase) (test case does not fall in any category of interest for this run) runCmd: settings set symbols.enable-external-lookup false output:

Hide Details

runCmd: settings set plugin.process.gdb-remote.packet-timeout 60 output:

Hide Details

runCmd: settings set symbols.clang-modules-cache-path "/Users/buildslave/jenkins/workspace/lldb-cmake-matrix/lldb-build/lldb-test-build.noindex/module-cache-lldb/lldb-api" output:

Hide Details

runCmd: settings set use-color false output:

Hide Details

FAIL: LLDB (/Users/buildslave/jenkins/workspace/lldb-cmake-matrix/lldb-build/bin/clang-11-x86_64) :: test_with_run_command_dsym (TestDataFormatterLibcxxSet.LibcxxSetDataFormatterTestCase) runCmd: settings set symbols.enable-external-lookup false output:

Hide Details

runCmd: settings set plugin.process.gdb-remote.packet-timeout 60 output:

Hide Details

runCmd: settings set symbols.clang-modules-cache-path "/Users/buildslave/jenkins/workspace/lldb-cmake-matrix/lldb-build/lldb-test-build.noindex/module-cache-lldb/lldb-api" output:

Hide Details

runCmd: settings set use-color false output:

Hide Details

FAIL: LLDB (/Users/buildslave/jenkins/workspace/lldb-cmake-matrix/lldb-build/bin/clang-11-x86_64) :: test_with_run_command_dwarf (TestDataFormatterLibcxxSet.LibcxxSetDataFormatterTestCase) UNSUPPORTED: LLDB (/Users/buildslave/jenkins/workspace/lldb-cmake-matrix/lldb-build/bin/clang-11-x86_64) :: test_with_run_command_dwo (TestDataFormatterLibcxxSet.LibcxxSetDataFormatterTestCase) (test case does not fall in any category of interest for this run) UNSUPPORTED: LLDB (/Users/buildslave/jenkins/workspace/lldb-cmake-matrix/lldb-build/bin/clang-11-x86_64) :: test_with_run_command_gmodules (TestDataFormatterLibcxxSet.LibcxxSetDataFormatterTestCase) (test case does not fall in any category of interest for this run) Restore dir to: /Users/buildslave/jenkins/workspace/lldb-cmake-matrix/lldb-build/tools/lldb/test ====================================================================== FAIL: test_ref_and_ptr_dsym (TestDataFormatterLibcxxSet.LibcxxSetDataFormatterTestCase) Test that the data formatters work on ref and ptr. ---------------------------------------------------------------------- Traceback (most recent call last): File "/Users/buildslave/jenkins/workspace/lldb-cmake-matrix/llvm-project/lldb/packages/Python/lldbsuite/test/lldbtest.py", line 1732, in test_method return attrvalue(self) File "/Users/buildslave/jenkins/workspace/lldb-cmake-matrix/llvm-project/lldb/packages/Python/lldbsuite/test/functionalities/data-formatter/data-formatter-stl/libcxx/set/TestDataFormatterLibcxxSet.py", line 131, in test_ref_and_ptr lldb.SBFileSpec("main.cpp", False)) File "/Users/buildslave/jenkins/workspace/lldb-cmake-matrix/llvm-project/lldb/packages/Python/lldbsuite/test/lldbutil.py", line 866, in run_to_source_breakpoint %(bkpt_pattern, source_spec.GetFilename(), source_spec.GetDirectory())) AssertionError: False is not True : No locations found for source breakpoint: "Stop here to check by ref and ptr.", file: "main.cpp", dir: "None" Config=x86_64-/Users/buildslave/jenkins/workspace/lldb-cmake-matrix/lldb-build/bin/clang-11 ====================================================================== FAIL: test_ref_and_ptr_dwarf (TestDataFormatterLibcxxSet.LibcxxSetDataFormatterTestCase) Test that the data formatters work on ref and ptr. ---------------------------------------------------------------------- Traceback (most recent call last): File "/Users/buildslave/jenkins/workspace/lldb-cmake-matrix/llvm-project/lldb/packages/Python/lldbsuite/test/lldbtest.py", line 1732, in test_method return attrvalue(self) File "/Users/buildslave/jenkins/workspace/lldb-cmake-matrix/llvm-project/lldb/packages/Python/lldbsuite/test/functionalities/data-formatter/data-formatter-stl/libcxx/set/TestDataFormatterLibcxxSet.py", line 131, in test_ref_and_ptr lldb.SBFileSpec("main.cpp", False)) File "/Users/buildslave/jenkins/workspace/lldb-cmake-matrix/llvm-project/lldb/packages/Python/lldbsuite/test/lldbutil.py", line 866, in run_to_source_breakpoint %(bkpt_pattern, source_spec.GetFilename(), source_spec.GetDirectory())) AssertionError: False is not True : No locations found for source breakpoint: "Stop here to check by ref and ptr.", file: "main.cpp", dir: "None" Config=x86_64-/Users/buildslave/jenkins/workspace/lldb-cmake-matrix/lldb-build/bin/clang-11 ====================================================================== FAIL: test_with_run_command_dsym (TestDataFormatterLibcxxSet.LibcxxSetDataFormatterTestCase) Test that that file and class static variables display correctly. ---------------------------------------------------------------------- Traceback (most recent call last): File "/Users/buildslave/jenkins/workspace/lldb-cmake-matrix/llvm-project/lldb/packages/Python/lldbsuite/test/lldbtest.py", line 1732, in test_method return attrvalue(self) File "/Users/buildslave/jenkins/workspace/lldb-cmake-matrix/llvm-project/lldb/packages/Python/lldbsuite/test/functionalities/data-formatter/data-formatter-stl/libcxx/set/TestDataFormatterLibcxxSet.py", line 51, in test_with_run_command self, "Set break point at this line.", lldb.SBFileSpec("main.cpp", False)) File "/Users/buildslave/jenkins/workspace/lldb-cmake-matrix/llvm-project/lldb/packages/Python/lldbsuite/test/lldbutil.py", line 866, in run_to_source_breakpoint %(bkpt_pattern, source_spec.GetFilename(), source_spec.GetDirectory())) AssertionError: False is not True : No locations found for source breakpoint: "Set break point at this line.", file: "main.cpp", dir: "None" Config=x86_64-/Users/buildslave/jenkins/workspace/lldb-cmake-matrix/lldb-build/bin/clang-11 ====================================================================== FAIL: test_with_run_command_dwarf (TestDataFormatterLibcxxSet.LibcxxSetDataFormatterTestCase) Test that that file and class static variables display correctly. ---------------------------------------------------------------------- Traceback (most recent call last): File "/Users/buildslave/jenkins/workspace/lldb-cmake-matrix/llvm-project/lldb/packages/Python/lldbsuite/test/lldbtest.py", line 1732, in test_method return attrvalue(self) File "/Users/buildslave/jenkins/workspace/lldb-cmake-matrix/llvm-project/lldb/packages/Python/lldbsuite/test/functionalities/data-formatter/data-formatter-stl/libcxx/set/TestDataFormatterLibcxxSet.py", line 51, in test_with_run_command self, "Set break point at this line.", lldb.SBFileSpec("main.cpp", False)) File "/Users/buildslave/jenkins/workspace/lldb-cmake-matrix/llvm-project/lldb/packages/Python/lldbsuite/test/lldbutil.py", line 866, in run_to_source_breakpoint %(bkpt_pattern, source_spec.GetFilename(), source_spec.GetDirectory())) AssertionError: False is not True : No locations found for source breakpoint: "Set break point at this line.", file: "main.cpp", dir: "None" Config=x86_64-/Users/buildslave/jenkins/workspace/lldb-cmake-matrix/lldb-build/bin/clang-11 ---------------------------------------------------------------------- Ran 8 tests in 7.370s

Hide Details

RESULT: FAILED (0 passes, 4 failures, 0 errors, 4 skipped, 0 expected failures, 0 unexpected successes)

Hide Details

******************** PASS: lldb-unit :: Process/minidump/./LLDBMinidumpTests/MinidumpParserTest.GetThreadsAndGetThreadContext (723 of 1914) PASS: lldb-unit :: Utility/./UtilityTests/FileSpecTest.FormatFileSpec (724 of 1914) FAIL: lldb-api :: commands/expression/weak_symbols/TestWeakSymbols.py (725 of 1914) ******************** TEST 'lldb-api :: commands/expression/weak_symbols/TestWeakSymbols.py' FAILED ******************** lldb version 11.0.99 clang revision 020041d99b508ed5f207c0896a19b3e85c942ee7 llvm revision 020041d99b508ed5f207c0896a19b3e85c942ee7 LLDB library dir: /Users/buildslave/jenkins/workspace/lldb-cmake-matrix/lldb-build/bin LLDB import library dir: /Users/buildslave/jenkins/workspace/lldb-cmake-matrix/lldb-build/bin libstdcxx tests will not be run because: Don't know how to build with libstdcxx on macosx Skipping following debug info categories: ['dwo'] setting set target.prefer-dynamic-value no-dynamic-values warning: (x86_64) /Users/buildslave/jenkins/workspace/lldb-cmake-matrix/lldb-build/lldb-test-build.noindex/commands/expression/weak_symbols/TestWeakSymbols.test_weak_symbol_in_expr/libdylib.dylib empty dSYM file detected, dSYM was created with an executable with no debug info.

Hide Details

Session logs for test failures/errors/unexpected successes will go into directory '/Users/buildslave/jenkins/workspace/lldb-cmake-matrix/test/logs' Command invoked: /Users/buildslave/jenkins/workspace/lldb-cmake-matrix/llvm-project/lldb/test/API/dotest.py --arch x86_64 -s /Users/buildslave/jenkins/workspace/lldb-cmake-matrix/lldb-build/lldb-test-traces -S nm -u CXXFLAGS -u CFLAGS --codesign-identity lldb_codesign --server /Users/buildslave/jenkins/workspace/lldb-cmake-matrix/lldb-build/./bin/debugserver --arch x86_64 --build-dir /Users/buildslave/jenkins/workspace/lldb-cmake-matrix/lldb-build/lldb-test-build.noindex -s=/Users/buildslave/jenkins/workspace/lldb-cmake-matrix/test/logs -t --env TERM=vt100 --skip-category gmodules --skip-category watchpoint --arch=x86_64 --dwarf-version=5 --env LLVM_LIBS_DIR=/Users/buildslave/jenkins/workspace/lldb-cmake-matrix/lldb-build/./lib --build-dir /Users/buildslave/jenkins/workspace/lldb-cmake-matrix/lldb-build/lldb-test-build.noindex --lldb-module-cache-dir /Users/buildslave/jenkins/workspace/lldb-cmake-matrix/lldb-build/lldb-test-build.noindex/module-cache-lldb/lldb-api --clang-module-cache-dir /Users/buildslave/jenkins/workspace/lldb-cmake-matrix/lldb-build/lldb-test-build.noindex/module-cache-clang/lldb-api --executable /Users/buildslave/jenkins/workspace/lldb-cmake-matrix/lldb-build/./bin/lldb --compiler /Users/buildslave/jenkins/workspace/lldb-cmake-matrix/lldb-build/./bin/clang --dsymutil /Users/buildslave/jenkins/workspace/lldb-cmake-matrix/lldb-build/./bin/dsymutil --filecheck /Users/buildslave/jenkins/workspace/lldb-cmake-matrix/lldb-build/./bin/FileCheck /Users/buildslave/jenkins/workspace/lldb-cmake-matrix/llvm-project/lldb/packages/Python/lldbsuite/test/commands/expression/weak_symbols -p TestWeakSymbols.py Change dir to: /Users/buildslave/jenkins/workspace/lldb-cmake-matrix/llvm-project/lldb/packages/Python/lldbsuite/test/commands/expression/weak_symbols runCmd: settings set symbols.enable-external-lookup false output:

Hide Details

runCmd: settings set plugin.process.gdb-remote.packet-timeout 60 output:

Hide Details

runCmd: settings set symbols.clang-modules-cache-path "/Users/buildslave/jenkins/workspace/lldb-cmake-matrix/lldb-build/lldb-test-build.noindex/module-cache-lldb/lldb-api" output:

Hide Details

runCmd: settings set use-color false output:

Hide Details

FAIL: LLDB (/Users/buildslave/jenkins/workspace/lldb-cmake-matrix/lldb-build/bin/clang-11-x86_64) :: test_weak_symbol_in_expr (TestWeakSymbols.TestWeakSymbolsInExpressions) Restore dir to: /Users/buildslave/jenkins/workspace/lldb-cmake-matrix/lldb-build/tools/lldb/test ====================================================================== FAIL: test_weak_symbol_in_expr (TestWeakSymbols.TestWeakSymbolsInExpressions) Tests that we can refer to weak symbols in expressions. ---------------------------------------------------------------------- Traceback (most recent call last): File "/Users/buildslave/jenkins/workspace/lldb-cmake-matrix/llvm-project/lldb/packages/Python/lldbsuite/test/commands/expression/weak_symbols/TestWeakSymbols.py", line 26, in test_weak_symbol_in_expr self.do_test() File "/Users/buildslave/jenkins/workspace/lldb-cmake-matrix/llvm-project/lldb/packages/Python/lldbsuite/test/commands/expression/weak_symbols/TestWeakSymbols.py", line 60, in do_test extra_images = [hidden_dylib]) File "/Users/buildslave/jenkins/workspace/lldb-cmake-matrix/llvm-project/lldb/packages/Python/lldbsuite/test/lldbutil.py", line 866, in run_to_source_breakpoint %(bkpt_pattern, source_spec.GetFilename(), source_spec.GetDirectory())) AssertionError: False is not True : No locations found for source breakpoint: "Set a breakpoint here", file: "main.c", dir: "/Users/buildslave/jenkins/workspace/lldb-cmake-matrix/llvm-project/lldb/packages/Python/lldbsuite/test/commands/expression/weak_symbols" Config=x86_64-/Users/buildslave/jenkins/workspace/lldb-cmake-matrix/lldb-build/bin/clang-11 ---------------------------------------------------------------------- Ran 1 test in 1.157s

Hide Details

RESULT: FAILED (0 passes, 1 failures, 0 errors, 0 skipped, 0 expected failures, 0 unexpected successes)

Hide Details

******************** PASS: lldb-unit :: Utility/./UtilityTests/StreamTest.PutRawBytesToBigEndian (726 of 1914) FAIL: lldb-api :: functionalities/thread/step_out/TestThreadStepOut.py (727 of 1914) ******************** TEST 'lldb-api :: functionalities/thread/step_out/TestThreadStepOut.py' FAILED ******************** lldb version 11.0.99 clang revision 020041d99b508ed5f207c0896a19b3e85c942ee7 llvm revision 020041d99b508ed5f207c0896a19b3e85c942ee7 LLDB library dir: /Users/buildslave/jenkins/workspace/lldb-cmake-matrix/lldb-build/bin LLDB import library dir: /Users/buildslave/jenkins/workspace/lldb-cmake-matrix/lldb-build/bin libstdcxx tests will not be run because: Don't know how to build with libstdcxx on macosx Skipping following debug info categories: ['dwo'] setting set target.prefer-dynamic-value no-dynamic-values warning: (x86_64) /Users/buildslave/jenkins/workspace/lldb-cmake-matrix/lldb-build/lldb-test-build.noindex/functionalities/thread/step_out/TestThreadStepOut.test_python_dsym/a.out empty dSYM file detected, dSYM was created with an executable with no debug info. warning: (x86_64) /Users/buildslave/jenkins/workspace/lldb-cmake-matrix/lldb-build/lldb-test-build.noindex/functionalities/thread/step_out/TestThreadStepOut.test_step_all_threads_dsym/a.out empty dSYM file detected, dSYM was created with an executable with no debug info. warning: (x86_64) /Users/buildslave/jenkins/workspace/lldb-cmake-matrix/lldb-build/lldb-test-build.noindex/functionalities/thread/step_out/TestThreadStepOut.test_step_single_thread_dsym/a.out empty dSYM file detected, dSYM was created with an executable with no debug info.

Hide Details

Session logs for test failures/errors/unexpected successes will go into directory '/Users/buildslave/jenkins/workspace/lldb-cmake-matrix/test/logs' Command invoked: /Users/buildslave/jenkins/workspace/lldb-cmake-matrix/llvm-project/lldb/test/API/dotest.py --arch x86_64 -s /Users/buildslave/jenkins/workspace/lldb-cmake-matrix/lldb-build/lldb-test-traces -S nm -u CXXFLAGS -u CFLAGS --codesign-identity lldb_codesign --server /Users/buildslave/jenkins/workspace/lldb-cmake-matrix/lldb-build/./bin/debugserver --arch x86_64 --build-dir /Users/buildslave/jenkins/workspace/lldb-cmake-matrix/lldb-build/lldb-test-build.noindex -s=/Users/buildslave/jenkins/workspace/lldb-cmake-matrix/test/logs -t --env TERM=vt100 --skip-category gmodules --skip-category watchpoint --arch=x86_64 --dwarf-version=5 --env LLVM_LIBS_DIR=/Users/buildslave/jenkins/workspace/lldb-cmake-matrix/lldb-build/./lib --build-dir /Users/buildslave/jenkins/workspace/lldb-cmake-matrix/lldb-build/lldb-test-build.noindex --lldb-module-cache-dir /Users/buildslave/jenkins/workspace/lldb-cmake-matrix/lldb-build/lldb-test-build.noindex/module-cache-lldb/lldb-api --clang-module-cache-dir /Users/buildslave/jenkins/workspace/lldb-cmake-matrix/lldb-build/lldb-test-build.noindex/module-cache-clang/lldb-api --executable /Users/buildslave/jenkins/workspace/lldb-cmake-matrix/lldb-build/./bin/lldb --compiler /Users/buildslave/jenkins/workspace/lldb-cmake-matrix/lldb-build/./bin/clang --dsymutil /Users/buildslave/jenkins/workspace/lldb-cmake-matrix/lldb-build/./bin/dsymutil --filecheck /Users/buildslave/jenkins/workspace/lldb-cmake-matrix/lldb-build/./bin/FileCheck /Users/buildslave/jenkins/workspace/lldb-cmake-matrix/llvm-project/lldb/packages/Python/lldbsuite/test/functionalities/thread/step_out -p TestThreadStepOut.py Change dir to: /Users/buildslave/jenkins/workspace/lldb-cmake-matrix/llvm-project/lldb/packages/Python/lldbsuite/test/functionalities/thread/step_out runCmd: settings set symbols.enable-external-lookup false output:

Hide Details

runCmd: settings set plugin.process.gdb-remote.packet-timeout 60 output:

Hide Details

runCmd: settings set symbols.clang-modules-cache-path "/Users/buildslave/jenkins/workspace/lldb-cmake-matrix/lldb-build/lldb-test-build.noindex/module-cache-lldb/lldb-api" output:

Hide Details

runCmd: settings set use-color false output:

Hide Details

FAIL: LLDB (/Users/buildslave/jenkins/workspace/lldb-cmake-matrix/lldb-build/bin/clang-11-x86_64) :: test_python_dsym (TestThreadStepOut.ThreadStepOutTestCase) runCmd: settings set symbols.enable-external-lookup false output:

Hide Details

runCmd: settings set plugin.process.gdb-remote.packet-timeout 60 output:

Hide Details

runCmd: settings set symbols.clang-modules-cache-path "/Users/buildslave/jenkins/workspace/lldb-cmake-matrix/lldb-build/lldb-test-build.noindex/module-cache-lldb/lldb-api" output:

Hide Details

runCmd: settings set use-color false output:

Hide Details

FAIL: LLDB (/Users/buildslave/jenkins/workspace/lldb-cmake-matrix/lldb-build/bin/clang-11-x86_64) :: test_python_dwarf (TestThreadStepOut.ThreadStepOutTestCase) UNSUPPORTED: LLDB (/Users/buildslave/jenkins/workspace/lldb-cmake-matrix/lldb-build/bin/clang-11-x86_64) :: test_python_dwo (TestThreadStepOut.ThreadStepOutTestCase) (test case does not fall in any category of interest for this run) UNSUPPORTED: LLDB (/Users/buildslave/jenkins/workspace/lldb-cmake-matrix/lldb-build/bin/clang-11-x86_64) :: test_python_gmodules (TestThreadStepOut.ThreadStepOutTestCase) (test case does not fall in any category of interest for this run) runCmd: settings set symbols.enable-external-lookup false output:

Hide Details

runCmd: settings set plugin.process.gdb-remote.packet-timeout 60 output:

Hide Details

runCmd: settings set symbols.clang-modules-cache-path "/Users/buildslave/jenkins/workspace/lldb-cmake-matrix/lldb-build/lldb-test-build.noindex/module-cache-lldb/lldb-api" output:

Hide Details

runCmd: settings set use-color false output:

Hide Details

FAIL: LLDB (/Users/buildslave/jenkins/workspace/lldb-cmake-matrix/lldb-build/bin/clang-11-x86_64) :: test_step_all_threads_dsym (TestThreadStepOut.ThreadStepOutTestCase) runCmd: settings set symbols.enable-external-lookup false output:

Hide Details

runCmd: settings set plugin.process.gdb-remote.packet-timeout 60 output:

Hide Details

runCmd: settings set symbols.clang-modules-cache-path "/Users/buildslave/jenkins/workspace/lldb-cmake-matrix/lldb-build/lldb-test-build.noindex/module-cache-lldb/lldb-api" output:

Hide Details

runCmd: settings set use-color false output:

Hide Details

FAIL: LLDB (/Users/buildslave/jenkins/workspace/lldb-cmake-matrix/lldb-build/bin/clang-11-x86_64) :: test_step_all_threads_dwarf (TestThreadStepOut.ThreadStepOutTestCase) UNSUPPORTED: LLDB (/Users/buildslave/jenkins/workspace/lldb-cmake-matrix/lldb-build/bin/clang-11-x86_64) :: test_step_all_threads_dwo (TestThreadStepOut.ThreadStepOutTestCase) (test case does not fall in any category of interest for this run) UNSUPPORTED: LLDB (/Users/buildslave/jenkins/workspace/lldb-cmake-matrix/lldb-build/bin/clang-11-x86_64) :: test_step_all_threads_gmodules (TestThreadStepOut.ThreadStepOutTestCase) (test case does not fall in any category of interest for this run) runCmd: settings set symbols.enable-external-lookup false output:

Hide Details

runCmd: settings set plugin.process.gdb-remote.packet-timeout 60 output:

Hide Details

runCmd: settings set symbols.clang-modules-cache-path "/Users/buildslave/jenkins/workspace/lldb-cmake-matrix/lldb-build/lldb-test-build.noindex/module-cache-lldb/lldb-api" output:

Hide Details

runCmd: settings set use-color false output:

Hide Details

FAIL: LLDB (/Users/buildslave/jenkins/workspace/lldb-cmake-matrix/lldb-build/bin/clang-11-x86_64) :: test_step_single_thread_dsym (TestThreadStepOut.ThreadStepOutTestCase) runCmd: settings set symbols.enable-external-lookup false output:

Hide Details

runCmd: settings set plugin.process.gdb-remote.packet-timeout 60 output:

Hide Details

runCmd: settings set symbols.clang-modules-cache-path "/Users/buildslave/jenkins/workspace/lldb-cmake-matrix/lldb-build/lldb-test-build.noindex/module-cache-lldb/lldb-api" output:

Hide Details

runCmd: settings set use-color false output:

Hide Details

FAIL: LLDB (/Users/buildslave/jenkins/workspace/lldb-cmake-matrix/lldb-build/bin/clang-11-x86_64) :: test_step_single_thread_dwarf (TestThreadStepOut.ThreadStepOutTestCase) UNSUPPORTED: LLDB (/Users/buildslave/jenkins/workspace/lldb-cmake-matrix/lldb-build/bin/clang-11-x86_64) :: test_step_single_thread_dwo (TestThreadStepOut.ThreadStepOutTestCase) (test case does not fall in any category of interest for this run) UNSUPPORTED: LLDB (/Users/buildslave/jenkins/workspace/lldb-cmake-matrix/lldb-build/bin/clang-11-x86_64) :: test_step_single_thread_gmodules (TestThreadStepOut.ThreadStepOutTestCase) (test case does not fall in any category of interest for this run) Restore dir to: /Users/buildslave/jenkins/workspace/lldb-cmake-matrix/lldb-build/tools/lldb/test ====================================================================== FAIL: test_python_dsym (TestThreadStepOut.ThreadStepOutTestCase) Test thread step out on one thread via Python API (dwarf). ---------------------------------------------------------------------- Traceback (most recent call last): File "/Users/buildslave/jenkins/workspace/lldb-cmake-matrix/llvm-project/lldb/packages/Python/lldbsuite/test/lldbtest.py", line 1732, in test_method return attrvalue(self) File "/Users/buildslave/jenkins/workspace/lldb-cmake-matrix/llvm-project/lldb/packages/Python/lldbsuite/test/decorators.py", line 110, in wrapper func(*args, **kwargs) File "/Users/buildslave/jenkins/workspace/lldb-cmake-matrix/llvm-project/lldb/packages/Python/lldbsuite/test/decorators.py", line 110, in wrapper func(*args, **kwargs) File "/Users/buildslave/jenkins/workspace/lldb-cmake-matrix/llvm-project/lldb/packages/Python/lldbsuite/test/decorators.py", line 110, in wrapper func(*args, **kwargs) File "/Users/buildslave/jenkins/workspace/lldb-cmake-matrix/llvm-project/lldb/packages/Python/lldbsuite/test/functionalities/thread/step_out/TestThreadStepOut.py", line 64, in test_python self.step_out_test(self.step_out_with_python) File "/Users/buildslave/jenkins/workspace/lldb-cmake-matrix/llvm-project/lldb/packages/Python/lldbsuite/test/functionalities/thread/step_out/TestThreadStepOut.py", line 134, in step_out_test self, self.bkpt_string, lldb.SBFileSpec('main.cpp'), only_one_thread = False) File "/Users/buildslave/jenkins/workspace/lldb-cmake-matrix/llvm-project/lldb/packages/Python/lldbsuite/test/lldbutil.py", line 866, in run_to_source_breakpoint %(bkpt_pattern, source_spec.GetFilename(), source_spec.GetDirectory())) AssertionError: False is not True : No locations found for source breakpoint: "// Set breakpoint here", file: "main.cpp", dir: "/Users/buildslave/jenkins/workspace/lldb-cmake-matrix/llvm-project/lldb/packages/Python/lldbsuite/test/functionalities/thread/step_out" Config=x86_64-/Users/buildslave/jenkins/workspace/lldb-cmake-matrix/lldb-build/bin/clang-11 ====================================================================== FAIL: test_python_dwarf (TestThreadStepOut.ThreadStepOutTestCase) Test thread step out on one thread via Python API (dwarf). ---------------------------------------------------------------------- Traceback (most recent call last): File "/Users/buildslave/jenkins/workspace/lldb-cmake-matrix/llvm-project/lldb/packages/Python/lldbsuite/test/lldbtest.py", line 1732, in test_method return attrvalue(self) File "/Users/buildslave/jenkins/workspace/lldb-cmake-matrix/llvm-project/lldb/packages/Python/lldbsuite/test/decorators.py", line 110, in wrapper func(*args, **kwargs) File "/Users/buildslave/jenkins/workspace/lldb-cmake-matrix/llvm-project/lldb/packages/Python/lldbsuite/test/decorators.py", line 110, in wrapper func(*args, **kwargs) File "/Users/buildslave/jenkins/workspace/lldb-cmake-matrix/llvm-project/lldb/packages/Python/lldbsuite/test/decorators.py", line 110, in wrapper func(*args, **kwargs) File "/Users/buildslave/jenkins/workspace/lldb-cmake-matrix/llvm-project/lldb/packages/Python/lldbsuite/test/functionalities/thread/step_out/TestThreadStepOut.py", line 64, in test_python self.step_out_test(self.step_out_with_python) File "/Users/buildslave/jenkins/workspace/lldb-cmake-matrix/llvm-project/lldb/packages/Python/lldbsuite/test/functionalities/thread/step_out/TestThreadStepOut.py", line 134, in step_out_test self, self.bkpt_string, lldb.SBFileSpec('main.cpp'), only_one_thread = False) File "/Users/buildslave/jenkins/workspace/lldb-cmake-matrix/llvm-project/lldb/packages/Python/lldbsuite/test/lldbutil.py", line 866, in run_to_source_breakpoint %(bkpt_pattern, source_spec.GetFilename(), source_spec.GetDirectory())) AssertionError: False is not True : No locations found for source breakpoint: "// Set breakpoint here", file: "main.cpp", dir: "/Users/buildslave/jenkins/workspace/lldb-cmake-matrix/llvm-project/lldb/packages/Python/lldbsuite/test/functionalities/thread/step_out" Config=x86_64-/Users/buildslave/jenkins/workspace/lldb-cmake-matrix/lldb-build/bin/clang-11 ====================================================================== FAIL: test_step_all_threads_dsym (TestThreadStepOut.ThreadStepOutTestCase) Test thread step out on all threads via command interpreter. ---------------------------------------------------------------------- Traceback (most recent call last): File "/Users/buildslave/jenkins/workspace/lldb-cmake-matrix/llvm-project/lldb/packages/Python/lldbsuite/test/lldbtest.py", line 1732, in test_method return attrvalue(self) File "/Users/buildslave/jenkins/workspace/lldb-cmake-matrix/llvm-project/lldb/packages/Python/lldbsuite/test/decorators.py", line 110, in wrapper func(*args, **kwargs) File "/Users/buildslave/jenkins/workspace/lldb-cmake-matrix/llvm-project/lldb/packages/Python/lldbsuite/test/decorators.py", line 110, in wrapper func(*args, **kwargs) File "/Users/buildslave/jenkins/workspace/lldb-cmake-matrix/llvm-project/lldb/packages/Python/lldbsuite/test/decorators.py", line 110, in wrapper func(*args, **kwargs) [Previous line repeated 1 more times] File "/Users/buildslave/jenkins/workspace/lldb-cmake-matrix/llvm-project/lldb/packages/Python/lldbsuite/test/functionalities/thread/step_out/TestThreadStepOut.py", line 48, in test_step_all_threads self.step_out_test(self.step_out_all_threads_with_cmd) File "/Users/buildslave/jenkins/workspace/lldb-cmake-matrix/llvm-project/lldb/packages/Python/lldbsuite/test/functionalities/thread/step_out/TestThreadStepOut.py", line 134, in step_out_test self, self.bkpt_string, lldb.SBFileSpec('main.cpp'), only_one_thread = False) File "/Users/buildslave/jenkins/workspace/lldb-cmake-matrix/llvm-project/lldb/packages/Python/lldbsuite/test/lldbutil.py", line 866, in run_to_source_breakpoint %(bkpt_pattern, source_spec.GetFilename(), source_spec.GetDirectory())) AssertionError: False is not True : No locations found for source breakpoint: "// Set breakpoint here", file: "main.cpp", dir: "/Users/buildslave/jenkins/workspace/lldb-cmake-matrix/llvm-project/lldb/packages/Python/lldbsuite/test/functionalities/thread/step_out" Config=x86_64-/Users/buildslave/jenkins/workspace/lldb-cmake-matrix/lldb-build/bin/clang-11 ====================================================================== FAIL: test_step_all_threads_dwarf (TestThreadStepOut.ThreadStepOutTestCase) Test thread step out on all threads via command interpreter. ---------------------------------------------------------------------- Traceback (most recent call last): File "/Users/buildslave/jenkins/workspace/lldb-cmake-matrix/llvm-project/lldb/packages/Python/lldbsuite/test/lldbtest.py", line 1732, in test_method return attrvalue(self) File "/Users/buildslave/jenkins/workspace/lldb-cmake-matrix/llvm-project/lldb/packages/Python/lldbsuite/test/decorators.py", line 110, in wrapper func(*args, **kwargs) File "/Users/buildslave/jenkins/workspace/lldb-cmake-matrix/llvm-project/lldb/packages/Python/lldbsuite/test/decorators.py", line 110, in wrapper func(*args, **kwargs) File "/Users/buildslave/jenkins/workspace/lldb-cmake-matrix/llvm-project/lldb/packages/Python/lldbsuite/test/decorators.py", line 110, in wrapper func(*args, **kwargs) [Previous line repeated 1 more times] File "/Users/buildslave/jenkins/workspace/lldb-cmake-matrix/llvm-project/lldb/packages/Python/lldbsuite/test/functionalities/thread/step_out/TestThreadStepOut.py", line 48, in test_step_all_threads self.step_out_test(self.step_out_all_threads_with_cmd) File "/Users/buildslave/jenkins/workspace/lldb-cmake-matrix/llvm-project/lldb/packages/Python/lldbsuite/test/functionalities/thread/step_out/TestThreadStepOut.py", line 134, in step_out_test self, self.bkpt_string, lldb.SBFileSpec('main.cpp'), only_one_thread = False) File "/Users/buildslave/jenkins/workspace/lldb-cmake-matrix/llvm-project/lldb/packages/Python/lldbsuite/test/lldbutil.py", line 866, in run_to_source_breakpoint %(bkpt_pattern, source_spec.GetFilename(), source_spec.GetDirectory())) AssertionError: False is not True : No locations found for source breakpoint: "// Set breakpoint here", file: "main.cpp", dir: "/Users/buildslave/jenkins/workspace/lldb-cmake-matrix/llvm-project/lldb/packages/Python/lldbsuite/test/functionalities/thread/step_out" Config=x86_64-/Users/buildslave/jenkins/workspace/lldb-cmake-matrix/lldb-build/bin/clang-11 ====================================================================== FAIL: test_step_single_thread_dsym (TestThreadStepOut.ThreadStepOutTestCase) Test thread step out on one thread via command interpreter. ---------------------------------------------------------------------- Traceback (most recent call last): File "/Users/buildslave/jenkins/workspace/lldb-cmake-matrix/llvm-project/lldb/packages/Python/lldbsuite/test/lldbtest.py", line 1732, in test_method return attrvalue(self) File "/Users/buildslave/jenkins/workspace/lldb-cmake-matrix/llvm-project/lldb/packages/Python/lldbsuite/test/decorators.py", line 110, in wrapper func(*args, **kwargs) File "/Users/buildslave/jenkins/workspace/lldb-cmake-matrix/llvm-project/lldb/packages/Python/lldbsuite/test/decorators.py", line 110, in wrapper func(*args, **kwargs) File "/Users/buildslave/jenkins/workspace/lldb-cmake-matrix/llvm-project/lldb/packages/Python/lldbsuite/test/decorators.py", line 110, in wrapper func(*args, **kwargs) File "/Users/buildslave/jenkins/workspace/lldb-cmake-matrix/llvm-project/lldb/packages/Python/lldbsuite/test/functionalities/thread/step_out/TestThreadStepOut.py", line 31, in test_step_single_thread self.step_out_test(self.step_out_single_thread_with_cmd) File "/Users/buildslave/jenkins/workspace/lldb-cmake-matrix/llvm-project/lldb/packages/Python/lldbsuite/test/functionalities/thread/step_out/TestThreadStepOut.py", line 134, in step_out_test self, self.bkpt_string, lldb.SBFileSpec('main.cpp'), only_one_thread = False) File "/Users/buildslave/jenkins/workspace/lldb-cmake-matrix/llvm-project/lldb/packages/Python/lldbsuite/test/lldbutil.py", line 866, in run_to_source_breakpoint %(bkpt_pattern, source_spec.GetFilename(), source_spec.GetDirectory())) AssertionError: False is not True : No locations found for source breakpoint: "// Set breakpoint here", file: "main.cpp", dir: "/Users/buildslave/jenkins/workspace/lldb-cmake-matrix/llvm-project/lldb/packages/Python/lldbsuite/test/functionalities/thread/step_out" Config=x86_64-/Users/buildslave/jenkins/workspace/lldb-cmake-matrix/lldb-build/bin/clang-11 ====================================================================== FAIL: test_step_single_thread_dwarf (TestThreadStepOut.ThreadStepOutTestCase) Test thread step out on one thread via command interpreter. ---------------------------------------------------------------------- Traceback (most recent call last): File "/Users/buildslave/jenkins/workspace/lldb-cmake-matrix/llvm-project/lldb/packages/Python/lldbsuite/test/lldbtest.py", line 1732, in test_method return attrvalue(self) File "/Users/buildslave/jenkins/workspace/lldb-cmake-matrix/llvm-project/lldb/packages/Python/lldbsuite/test/decorators.py", line 110, in wrapper func(*args, **kwargs) File "/Users/buildslave/jenkins/workspace/lldb-cmake-matrix/llvm-project/lldb/packages/Python/lldbsuite/test/decorators.py", line 110, in wrapper func(*args, **kwargs) File "/Users/buildslave/jenkins/workspace/lldb-cmake-matrix/llvm-project/lldb/packages/Python/lldbsuite/test/decorators.py", line 110, in wrapper func(*args, **kwargs) File "/Users/buildslave/jenkins/workspace/lldb-cmake-matrix/llvm-project/lldb/packages/Python/lldbsuite/test/functionalities/thread/step_out/TestThreadStepOut.py", line 31, in test_step_single_thread self.step_out_test(self.step_out_single_thread_with_cmd) File "/Users/buildslave/jenkins/workspace/lldb-cmake-matrix/llvm-project/lldb/packages/Python/lldbsuite/test/functionalities/thread/step_out/TestThreadStepOut.py", line 134, in step_out_test self, self.bkpt_string, lldb.SBFileSpec('main.cpp'), only_one_thread = False) File "/Users/buildslave/jenkins/workspace/lldb-cmake-matrix/llvm-project/lldb/packages/Python/lldbsuite/test/lldbutil.py", line 866, in run_to_source_breakpoint %(bkpt_pattern, source_spec.GetFilename(), source_spec.GetDirectory())) AssertionError: False is not True : No locations found for source breakpoint: "// Set breakpoint here", file: "main.cpp", dir: "/Users/buildslave/jenkins/workspace/lldb-cmake-matrix/llvm-project/lldb/packages/Python/lldbsuite/test/functionalities/thread/step_out" Config=x86_64-/Users/buildslave/jenkins/workspace/lldb-cmake-matrix/lldb-build/bin/clang-11 ---------------------------------------------------------------------- Ran 12 tests in 9.705s

Hide Details

RESULT: FAILED (0 passes, 6 failures, 0 errors, 6 skipped, 0 expected failures, 0 unexpected successes)

Hide Details

******************** UNSUPPORTED: lldb-shell :: SymbolFile/DWARF/dwarf5-index-is-used.cpp (728 of 1914) FAIL: lldb-api :: functionalities/rerun/TestRerun.py (729 of 1914) ******************** TEST 'lldb-api :: functionalities/rerun/TestRerun.py' FAILED ******************** lldb version 11.0.99 clang revision 020041d99b508ed5f207c0896a19b3e85c942ee7 llvm revision 020041d99b508ed5f207c0896a19b3e85c942ee7 LLDB library dir: /Users/buildslave/jenkins/workspace/lldb-cmake-matrix/lldb-build/bin LLDB import library dir: /Users/buildslave/jenkins/workspace/lldb-cmake-matrix/lldb-build/bin libstdcxx tests will not be run because: Don't know how to build with libstdcxx on macosx Skipping following debug info categories: ['dwo'] setting set target.prefer-dynamic-value no-dynamic-values warning: (x86_64) /Users/buildslave/jenkins/workspace/lldb-cmake-matrix/lldb-build/lldb-test-build.noindex/functionalities/rerun/TestRerun.test_dsym/a.out empty dSYM file detected, dSYM was created with an executable with no debug info.

Hide Details

Session logs for test failures/errors/unexpected successes will go into directory '/Users/buildslave/jenkins/workspace/lldb-cmake-matrix/test/logs' Command invoked: /Users/buildslave/jenkins/workspace/lldb-cmake-matrix/llvm-project/lldb/test/API/dotest.py --arch x86_64 -s /Users/buildslave/jenkins/workspace/lldb-cmake-matrix/lldb-build/lldb-test-traces -S nm -u CXXFLAGS -u CFLAGS --codesign-identity lldb_codesign --server /Users/buildslave/jenkins/workspace/lldb-cmake-matrix/lldb-build/./bin/debugserver --arch x86_64 --build-dir /Users/buildslave/jenkins/workspace/lldb-cmake-matrix/lldb-build/lldb-test-build.noindex -s=/Users/buildslave/jenkins/workspace/lldb-cmake-matrix/test/logs -t --env TERM=vt100 --skip-category gmodules --skip-category watchpoint --arch=x86_64 --dwarf-version=5 --env LLVM_LIBS_DIR=/Users/buildslave/jenkins/workspace/lldb-cmake-matrix/lldb-build/./lib --build-dir /Users/buildslave/jenkins/workspace/lldb-cmake-matrix/lldb-build/lldb-test-build.noindex --lldb-module-cache-dir /Users/buildslave/jenkins/workspace/lldb-cmake-matrix/lldb-build/lldb-test-build.noindex/module-cache-lldb/lldb-api --clang-module-cache-dir /Users/buildslave/jenkins/workspace/lldb-cmake-matrix/lldb-build/lldb-test-build.noindex/module-cache-clang/lldb-api --executable /Users/buildslave/jenkins/workspace/lldb-cmake-matrix/lldb-build/./bin/lldb --compiler /Users/buildslave/jenkins/workspace/lldb-cmake-matrix/lldb-build/./bin/clang --dsymutil /Users/buildslave/jenkins/workspace/lldb-cmake-matrix/lldb-build/./bin/dsymutil --filecheck /Users/buildslave/jenkins/workspace/lldb-cmake-matrix/lldb-build/./bin/FileCheck /Users/buildslave/jenkins/workspace/lldb-cmake-matrix/llvm-project/lldb/packages/Python/lldbsuite/test/functionalities/rerun -p TestRerun.py Change dir to: /Users/buildslave/jenkins/workspace/lldb-cmake-matrix/llvm-project/lldb/packages/Python/lldbsuite/test/functionalities/rerun runCmd: settings set symbols.enable-external-lookup false output:

Hide Details

runCmd: settings set plugin.process.gdb-remote.packet-timeout 60 output:

Hide Details

runCmd: settings set symbols.clang-modules-cache-path "/Users/buildslave/jenkins/workspace/lldb-cmake-matrix/lldb-build/lldb-test-build.noindex/module-cache-lldb/lldb-api" output:

Hide Details

runCmd: settings set use-color false output:

Hide Details

runCmd: file /Users/buildslave/jenkins/workspace/lldb-cmake-matrix/lldb-build/lldb-test-build.noindex/functionalities/rerun/TestRerun.test_dsym/a.out output: Current executable set to '/Users/buildslave/jenkins/workspace/lldb-cmake-matrix/lldb-build/lldb-test-build.noindex/functionalities/rerun/TestRerun.test_dsym/a.out' (x86_64).

Hide Details

Hide Details

runCmd: process launch 1 2 3 output: Process 30529 exited with status = 0 (0x00000000)

Hide Details

Process 30529 launched: '/Users/buildslave/jenkins/workspace/lldb-cmake-matrix/lldb-build/lldb-test-build.noindex/functionalities/rerun/TestRerun.test_dsym/a.out' (x86_64)

Hide Details

Hide Details

FAIL: LLDB (/Users/buildslave/jenkins/workspace/lldb-cmake-matrix/lldb-build/bin/clang-11-x86_64) :: test_dsym (TestRerun.TestRerun) <bound method SBProcess.Kill of <lldb.SBProcess; proxy of <Swig Object of type 'lldb::SBProcess *' at 0x10be0d540> >>: success

Hide Details

runCmd: settings set symbols.enable-external-lookup false output:

Hide Details

runCmd: settings set plugin.process.gdb-remote.packet-timeout 60 output:

Hide Details

runCmd: settings set symbols.clang-modules-cache-path "/Users/buildslave/jenkins/workspace/lldb-cmake-matrix/lldb-build/lldb-test-build.noindex/module-cache-lldb/lldb-api" output:

Hide Details

runCmd: settings set use-color false output:

Hide Details

runCmd: file /Users/buildslave/jenkins/workspace/lldb-cmake-matrix/lldb-build/lldb-test-build.noindex/functionalities/rerun/TestRerun.test_dwarf/a.out output: Current executable set to '/Users/buildslave/jenkins/workspace/lldb-cmake-matrix/lldb-build/lldb-test-build.noindex/functionalities/rerun/TestRerun.test_dwarf/a.out' (x86_64).

Hide Details

Hide Details

runCmd: process launch 1 2 3 output: Process 30776 exited with status = 0 (0x00000000)

Hide Details

Process 30776 launched: '/Users/buildslave/jenkins/workspace/lldb-cmake-matrix/lldb-build/lldb-test-build.noindex/functionalities/rerun/TestRerun.test_dwarf/a.out' (x86_64)

Hide Details

Hide Details

FAIL: LLDB (/Users/buildslave/jenkins/workspace/lldb-cmake-matrix/lldb-build/bin/clang-11-x86_64) :: test_dwarf (TestRerun.TestRerun) <bound method SBProcess.Kill of <lldb.SBProcess; proxy of <Swig Object of type 'lldb::SBProcess *' at 0x10c3a2180> >>: success

Hide Details

UNSUPPORTED: LLDB (/Users/buildslave/jenkins/workspace/lldb-cmake-matrix/lldb-build/bin/clang-11-x86_64) :: test_dwo (TestRerun.TestRerun) (test case does not fall in any category of interest for this run) UNSUPPORTED: LLDB (/Users/buildslave/jenkins/workspace/lldb-cmake-matrix/lldb-build/bin/clang-11-x86_64) :: test_gmodules (TestRerun.TestRerun) (test case does not fall in any category of interest for this run) Restore dir to: /Users/buildslave/jenkins/workspace/lldb-cmake-matrix/lldb-build/tools/lldb/test ====================================================================== FAIL: test_dsym (TestRerun.TestRerun) ---------------------------------------------------------------------- Traceback (most recent call last): File "/Users/buildslave/jenkins/workspace/lldb-cmake-matrix/llvm-project/lldb/packages/Python/lldbsuite/test/lldbtest.py", line 1732, in test_method return attrvalue(self) File "/Users/buildslave/jenkins/workspace/lldb-cmake-matrix/llvm-project/lldb/packages/Python/lldbsuite/test/functionalities/rerun/TestRerun.py", line 36, in test thread, "Process should be stopped at a breakpoint in main") AssertionError: unexpectedly None : Process should be stopped at a breakpoint in main Config=x86_64-/Users/buildslave/jenkins/workspace/lldb-cmake-matrix/lldb-build/bin/clang-11 ====================================================================== FAIL: test_dwarf (TestRerun.TestRerun) ---------------------------------------------------------------------- Traceback (most recent call last): File "/Users/buildslave/jenkins/workspace/lldb-cmake-matrix/llvm-project/lldb/packages/Python/lldbsuite/test/lldbtest.py", line 1732, in test_method return attrvalue(self) File "/Users/buildslave/jenkins/workspace/lldb-cmake-matrix/llvm-project/lldb/packages/Python/lldbsuite/test/functionalities/rerun/TestRerun.py", line 36, in test thread, "Process should be stopped at a breakpoint in main") AssertionError: unexpectedly None : Process should be stopped at a breakpoint in main Config=x86_64-/Users/buildslave/jenkins/workspace/lldb-cmake-matrix/lldb-build/bin/clang-11 ---------------------------------------------------------------------- Ran 4 tests in 1.597s

Hide Details

RESULT: FAILED (0 passes, 2 failures, 0 errors, 2 skipped, 0 expected failures, 0 unexpected successes)

Hide Details

******************** PASS: lldb-unit :: UnwindAssembly/x86/./UnwindAssemblyx86Tests/Testx86AssemblyInspectionEngine.TestPushESI (730 of 1914) PASS: lldb-unit :: Utility/./UtilityTests/ArgsTest.DoubleQuotedItem (731 of 1914) FAIL: lldb-api :: lang/cpp/auto/TestCPPAuto.py (732 of 1914) ******************** TEST 'lldb-api :: lang/cpp/auto/TestCPPAuto.py' FAILED ******************** lldb version 11.0.99 clang revision 020041d99b508ed5f207c0896a19b3e85c942ee7 llvm revision 020041d99b508ed5f207c0896a19b3e85c942ee7 LLDB library dir: /Users/buildslave/jenkins/workspace/lldb-cmake-matrix/lldb-build/bin LLDB import library dir: /Users/buildslave/jenkins/workspace/lldb-cmake-matrix/lldb-build/bin libstdcxx tests will not be run because: Don't know how to build with libstdcxx on macosx Skipping following debug info categories: ['dwo'] setting set target.prefer-dynamic-value no-dynamic-values warning: (x86_64) /Users/buildslave/jenkins/workspace/lldb-cmake-matrix/lldb-build/lldb-test-build.noindex/lang/cpp/auto/TestCPPAuto.test_with_run_command_dsym/a.out empty dSYM file detected, dSYM was created with an executable with no debug info.

Hide Details

Session logs for test failures/errors/unexpected successes will go into directory '/Users/buildslave/jenkins/workspace/lldb-cmake-matrix/test/logs' Command invoked: /Users/buildslave/jenkins/workspace/lldb-cmake-matrix/llvm-project/lldb/test/API/dotest.py --arch x86_64 -s /Users/buildslave/jenkins/workspace/lldb-cmake-matrix/lldb-build/lldb-test-traces -S nm -u CXXFLAGS -u CFLAGS --codesign-identity lldb_codesign --server /Users/buildslave/jenkins/workspace/lldb-cmake-matrix/lldb-build/./bin/debugserver --arch x86_64 --build-dir /Users/buildslave/jenkins/workspace/lldb-cmake-matrix/lldb-build/lldb-test-build.noindex -s=/Users/buildslave/jenkins/workspace/lldb-cmake-matrix/test/logs -t --env TERM=vt100 --skip-category gmodules --skip-category watchpoint --arch=x86_64 --dwarf-version=5 --env LLVM_LIBS_DIR=/Users/buildslave/jenkins/workspace/lldb-cmake-matrix/lldb-build/./lib --build-dir /Users/buildslave/jenkins/workspace/lldb-cmake-matrix/lldb-build/lldb-test-build.noindex --lldb-module-cache-dir /Users/buildslave/jenkins/workspace/lldb-cmake-matrix/lldb-build/lldb-test-build.noindex/module-cache-lldb/lldb-api --clang-module-cache-dir /Users/buildslave/jenkins/workspace/lldb-cmake-matrix/lldb-build/lldb-test-build.noindex/module-cache-clang/lldb-api --executable /Users/buildslave/jenkins/workspace/lldb-cmake-matrix/lldb-build/./bin/lldb --compiler /Users/buildslave/jenkins/workspace/lldb-cmake-matrix/lldb-build/./bin/clang --dsymutil /Users/buildslave/jenkins/workspace/lldb-cmake-matrix/lldb-build/./bin/dsymutil --filecheck /Users/buildslave/jenkins/workspace/lldb-cmake-matrix/lldb-build/./bin/FileCheck /Users/buildslave/jenkins/workspace/lldb-cmake-matrix/llvm-project/lldb/packages/Python/lldbsuite/test/lang/cpp/auto -p TestCPPAuto.py Change dir to: /Users/buildslave/jenkins/workspace/lldb-cmake-matrix/llvm-project/lldb/packages/Python/lldbsuite/test/lang/cpp/auto runCmd: settings set symbols.enable-external-lookup false output:

Hide Details

runCmd: settings set plugin.process.gdb-remote.packet-timeout 60 output:

Hide Details

runCmd: settings set symbols.clang-modules-cache-path "/Users/buildslave/jenkins/workspace/lldb-cmake-matrix/lldb-build/lldb-test-build.noindex/module-cache-lldb/lldb-api" output:

Hide Details

runCmd: settings set use-color false output:

Hide Details

runCmd: file /Users/buildslave/jenkins/workspace/lldb-cmake-matrix/lldb-build/lldb-test-build.noindex/lang/cpp/auto/TestCPPAuto.test_with_run_command_dsym/a.out output: Current executable set to '/Users/buildslave/jenkins/workspace/lldb-cmake-matrix/lldb-build/lldb-test-build.noindex/lang/cpp/auto/TestCPPAuto.test_with_run_command_dsym/a.out' (x86_64).

Hide Details

Hide Details

runCmd: breakpoint set -f "main.cpp" -l 19 output: Breakpoint 1: no locations (pending). WARNING: Unable to resolve breakpoint to any actual locations.

Hide Details

Hide Details

Expecting pattern: ^Breakpoint (?P<bpno>[0-9]+): (?P<num_locations>[0-9]+) locations\.$ Not matched

Hide Details

Expecting pattern: ^Breakpoint (?P<bpno>[0-9]+): (?P<num_locations>no) locations \(pending\)\. Matched

Hide Details

FAIL: LLDB (/Users/buildslave/jenkins/workspace/lldb-cmake-matrix/lldb-build/bin/clang-11-x86_64) :: test_with_run_command_dsym (TestCPPAuto.CPPAutoTestCase) runCmd: settings set symbols.enable-external-lookup false output:

Hide Details

runCmd: settings set plugin.process.gdb-remote.packet-timeout 60 output:

Hide Details

runCmd: settings set symbols.clang-modules-cache-path "/Users/buildslave/jenkins/workspace/lldb-cmake-matrix/lldb-build/lldb-test-build.noindex/module-cache-lldb/lldb-api" output:

Hide Details

runCmd: settings set use-color false output:

Hide Details

runCmd: file /Users/buildslave/jenkins/workspace/lldb-cmake-matrix/lldb-build/lldb-test-build.noindex/lang/cpp/auto/TestCPPAuto.test_with_run_command_dwarf/a.out output: Current executable set to '/Users/buildslave/jenkins/workspace/lldb-cmake-matrix/lldb-build/lldb-test-build.noindex/lang/cpp/auto/TestCPPAuto.test_with_run_command_dwarf/a.out' (x86_64).

Hide Details

Hide Details

runCmd: breakpoint set -f "main.cpp" -l 19 output: Breakpoint 1: no locations (pending). WARNING: Unable to resolve breakpoint to any actual locations.

Hide Details

Hide Details

Expecting pattern: ^Breakpoint (?P<bpno>[0-9]+): (?P<num_locations>[0-9]+) locations\.$ Not matched

Hide Details

Expecting pattern: ^Breakpoint (?P<bpno>[0-9]+): (?P<num_locations>no) locations \(pending\)\. Matched

Hide Details

FAIL: LLDB (/Users/buildslave/jenkins/workspace/lldb-cmake-matrix/lldb-build/bin/clang-11-x86_64) :: test_with_run_command_dwarf (TestCPPAuto.CPPAutoTestCase) UNSUPPORTED: LLDB (/Users/buildslave/jenkins/workspace/lldb-cmake-matrix/lldb-build/bin/clang-11-x86_64) :: test_with_run_command_dwo (TestCPPAuto.CPPAutoTestCase) (test case does not fall in any category of interest for this run) UNSUPPORTED: LLDB (/Users/buildslave/jenkins/workspace/lldb-cmake-matrix/lldb-build/bin/clang-11-x86_64) :: test_with_run_command_gmodules (TestCPPAuto.CPPAutoTestCase) (test case does not fall in any category of interest for this run) Restore dir to: /Users/buildslave/jenkins/workspace/lldb-cmake-matrix/lldb-build/tools/lldb/test ====================================================================== FAIL: test_with_run_command_dsym (TestCPPAuto.CPPAutoTestCase) Test that auto types work in the expression parser ---------------------------------------------------------------------- Traceback (most recent call last): File "/Users/buildslave/jenkins/workspace/lldb-cmake-matrix/llvm-project/lldb/packages/Python/lldbsuite/test/lldbtest.py", line 1732, in test_method return attrvalue(self) File "/Users/buildslave/jenkins/workspace/lldb-cmake-matrix/llvm-project/lldb/packages/Python/lldbsuite/test/decorators.py", line 110, in wrapper func(*args, **kwargs) File "/Users/buildslave/jenkins/workspace/lldb-cmake-matrix/llvm-project/lldb/packages/Python/lldbsuite/test/decorators.py", line 110, in wrapper func(*args, **kwargs) File "/Users/buildslave/jenkins/workspace/lldb-cmake-matrix/llvm-project/lldb/packages/Python/lldbsuite/test/decorators.py", line 110, in wrapper func(*args, **kwargs) File "/Users/buildslave/jenkins/workspace/lldb-cmake-matrix/llvm-project/lldb/packages/Python/lldbsuite/test/lang/cpp/auto/TestCPPAuto.py", line 26, in test_with_run_command self, "main.cpp", line, num_expected_locations=-1, loc_exact=False) File "/Users/buildslave/jenkins/workspace/lldb-cmake-matrix/llvm-project/lldb/packages/Python/lldbsuite/test/lldbutil.py", line 389, in run_break_set_by_file_and_line num_locations=num_expected_locations) File "/Users/buildslave/jenkins/workspace/lldb-cmake-matrix/llvm-project/lldb/packages/Python/lldbsuite/test/lldbutil.py", line 579, in check_breakpoint_result "Expecting one or more locations, got none.") AssertionError: False is not True : Expecting one or more locations, got none. Config=x86_64-/Users/buildslave/jenkins/workspace/lldb-cmake-matrix/lldb-build/bin/clang-11 ====================================================================== FAIL: test_with_run_command_dwarf (TestCPPAuto.CPPAutoTestCase) Test that auto types work in the expression parser ---------------------------------------------------------------------- Traceback (most recent call last): File "/Users/buildslave/jenkins/workspace/lldb-cmake-matrix/llvm-project/lldb/packages/Python/lldbsuite/test/lldbtest.py", line 1732, in test_method return attrvalue(self) File "/Users/buildslave/jenkins/workspace/lldb-cmake-matrix/llvm-project/lldb/packages/Python/lldbsuite/test/decorators.py", line 110, in wrapper func(*args, **kwargs) File "/Users/buildslave/jenkins/workspace/lldb-cmake-matrix/llvm-project/lldb/packages/Python/lldbsuite/test/decorators.py", line 110, in wrapper func(*args, **kwargs) File "/Users/buildslave/jenkins/workspace/lldb-cmake-matrix/llvm-project/lldb/packages/Python/lldbsuite/test/decorators.py", line 110, in wrapper func(*args, **kwargs) File "/Users/buildslave/jenkins/workspace/lldb-cmake-matrix/llvm-project/lldb/packages/Python/lldbsuite/test/lang/cpp/auto/TestCPPAuto.py", line 26, in test_with_run_command self, "main.cpp", line, num_expected_locations=-1, loc_exact=False) File "/Users/buildslave/jenkins/workspace/lldb-cmake-matrix/llvm-project/lldb/packages/Python/lldbsuite/test/lldbutil.py", line 389, in run_break_set_by_file_and_line num_locations=num_expected_locations) File "/Users/buildslave/jenkins/workspace/lldb-cmake-matrix/llvm-project/lldb/packages/Python/lldbsuite/test/lldbutil.py", line 579, in check_breakpoint_result "Expecting one or more locations, got none.") AssertionError: False is not True : Expecting one or more locations, got none. Config=x86_64-/Users/buildslave/jenkins/workspace/lldb-cmake-matrix/lldb-build/bin/clang-11 ---------------------------------------------------------------------- Ran 4 tests in 2.792s

Hide Details

RESULT: FAILED (0 passes, 2 failures, 0 errors, 2 skipped, 0 expected failures, 0 unexpected successes)

Hide Details

******************** PASS: lldb-unit :: Utility/./UtilityTests/ArgsTest.TestSingleQuotedArgWithSpace (733 of 1914) PASS: lldb-shell :: Breakpoint/split-dwarf5-debug-stroffsets.test (734 of 1914) UNSUPPORTED: lldb-shell :: Breakpoint/case-insensitive.test (735 of 1914) FAIL: lldb-api :: lang/objcxx/objcxx-ivar-vector/TestIvarVector.py (736 of 1914) ******************** TEST 'lldb-api :: lang/objcxx/objcxx-ivar-vector/TestIvarVector.py' FAILED ******************** lldb version 11.0.99 clang revision 020041d99b508ed5f207c0896a19b3e85c942ee7 llvm revision 020041d99b508ed5f207c0896a19b3e85c942ee7 LLDB library dir: /Users/buildslave/jenkins/workspace/lldb-cmake-matrix/lldb-build/bin LLDB import library dir: /Users/buildslave/jenkins/workspace/lldb-cmake-matrix/lldb-build/bin libstdcxx tests will not be run because: Don't know how to build with libstdcxx on macosx Skipping following debug info categories: ['dwo'] setting set target.prefer-dynamic-value no-dynamic-values warning: (x86_64) /Users/buildslave/jenkins/workspace/lldb-cmake-matrix/lldb-build/lldb-test-build.noindex/lang/objcxx/objcxx-ivar-vector/lldbsuite.test.lldbtest.test_dsym/a.out empty dSYM file detected, dSYM was created with an executable with no debug info.

Hide Details

Session logs for test failures/errors/unexpected successes will go into directory '/Users/buildslave/jenkins/workspace/lldb-cmake-matrix/test/logs' Command invoked: /Users/buildslave/jenkins/workspace/lldb-cmake-matrix/llvm-project/lldb/test/API/dotest.py --arch x86_64 -s /Users/buildslave/jenkins/workspace/lldb-cmake-matrix/lldb-build/lldb-test-traces -S nm -u CXXFLAGS -u CFLAGS --codesign-identity lldb_codesign --server /Users/buildslave/jenkins/workspace/lldb-cmake-matrix/lldb-build/./bin/debugserver --arch x86_64 --build-dir /Users/buildslave/jenkins/workspace/lldb-cmake-matrix/lldb-build/lldb-test-build.noindex -s=/Users/buildslave/jenkins/workspace/lldb-cmake-matrix/test/logs -t --env TERM=vt100 --skip-category gmodules --skip-category watchpoint --arch=x86_64 --dwarf-version=5 --env LLVM_LIBS_DIR=/Users/buildslave/jenkins/workspace/lldb-cmake-matrix/lldb-build/./lib --build-dir /Users/buildslave/jenkins/workspace/lldb-cmake-matrix/lldb-build/lldb-test-build.noindex --lldb-module-cache-dir /Users/buildslave/jenkins/workspace/lldb-cmake-matrix/lldb-build/lldb-test-build.noindex/module-cache-lldb/lldb-api --clang-module-cache-dir /Users/buildslave/jenkins/workspace/lldb-cmake-matrix/lldb-build/lldb-test-build.noindex/module-cache-clang/lldb-api --executable /Users/buildslave/jenkins/workspace/lldb-cmake-matrix/lldb-build/./bin/lldb --compiler /Users/buildslave/jenkins/workspace/lldb-cmake-matrix/lldb-build/./bin/clang --dsymutil /Users/buildslave/jenkins/workspace/lldb-cmake-matrix/lldb-build/./bin/dsymutil --filecheck /Users/buildslave/jenkins/workspace/lldb-cmake-matrix/lldb-build/./bin/FileCheck /Users/buildslave/jenkins/workspace/lldb-cmake-matrix/llvm-project/lldb/packages/Python/lldbsuite/test/lang/objcxx/objcxx-ivar-vector -p TestIvarVector.py Change dir to: /Users/buildslave/jenkins/workspace/lldb-cmake-matrix/llvm-project/lldb/packages/Python/lldbsuite/test/lang/objcxx/objcxx-ivar-vector runCmd: settings set symbols.enable-external-lookup false output:

Hide Details

runCmd: settings set plugin.process.gdb-remote.packet-timeout 60 output:

Hide Details

runCmd: settings set symbols.clang-modules-cache-path "/Users/buildslave/jenkins/workspace/lldb-cmake-matrix/lldb-build/lldb-test-build.noindex/module-cache-lldb/lldb-api" output:

Hide Details

runCmd: settings set use-color false output:

Hide Details

FAIL: LLDB (/Users/buildslave/jenkins/workspace/lldb-cmake-matrix/lldb-build/bin/clang-11-x86_64) :: test_dsym (lldbsuite.test.lldbtest.TestIvarVector) <bound method SBProcess.Kill of <lldb.SBProcess; proxy of <Swig Object of type 'lldb::SBProcess *' at 0x110b1cbd0> >>: success

Hide Details

runCmd: settings set symbols.enable-external-lookup false output:

Hide Details

runCmd: settings set plugin.process.gdb-remote.packet-timeout 60 output:

Hide Details

runCmd: settings set symbols.clang-modules-cache-path "/Users/buildslave/jenkins/workspace/lldb-cmake-matrix/lldb-build/lldb-test-build.noindex/module-cache-lldb/lldb-api" output:

Hide Details

runCmd: settings set use-color false output:

Hide Details

FAIL: LLDB (/Users/buildslave/jenkins/workspace/lldb-cmake-matrix/lldb-build/bin/clang-11-x86_64) :: test_dwarf (lldbsuite.test.lldbtest.TestIvarVector) <bound method SBProcess.Kill of <lldb.SBProcess; proxy of <Swig Object of type 'lldb::SBProcess *' at 0x109a1e660> >>: success

Hide Details

UNSUPPORTED: LLDB (/Users/buildslave/jenkins/workspace/lldb-cmake-matrix/lldb-build/bin/clang-11-x86_64) :: test_dwo (lldbsuite.test.lldbtest.TestIvarVector) (test case does not fall in any category of interest for this run) UNSUPPORTED: LLDB (/Users/buildslave/jenkins/workspace/lldb-cmake-matrix/lldb-build/bin/clang-11-x86_64) :: test_gmodules (lldbsuite.test.lldbtest.TestIvarVector) (test case does not fall in any category of interest for this run) Restore dir to: /Users/buildslave/jenkins/workspace/lldb-cmake-matrix/lldb-build/tools/lldb/test ====================================================================== FAIL: test_dsym (lldbsuite.test.lldbtest.TestIvarVector) ---------------------------------------------------------------------- Traceback (most recent call last): File "/Users/buildslave/jenkins/workspace/lldb-cmake-matrix/llvm-project/lldb/packages/Python/lldbsuite/test/lldbtest.py", line 1732, in test_method return attrvalue(self) File "/Users/buildslave/jenkins/workspace/lldb-cmake-matrix/llvm-project/lldb/packages/Python/lldbsuite/test/lldbinline.py", line 124, in _test self.do_test() File "/Users/buildslave/jenkins/workspace/lldb-cmake-matrix/llvm-project/lldb/packages/Python/lldbsuite/test/lldbinline.py", line 151, in do_test "inline test did not hit a single breakpoint") AssertionError: False is not True : inline test did not hit a single breakpoint Config=x86_64-/Users/buildslave/jenkins/workspace/lldb-cmake-matrix/lldb-build/bin/clang-11 ====================================================================== FAIL: test_dwarf (lldbsuite.test.lldbtest.TestIvarVector) ---------------------------------------------------------------------- Traceback (most recent call last): File "/Users/buildslave/jenkins/workspace/lldb-cmake-matrix/llvm-project/lldb/packages/Python/lldbsuite/test/lldbtest.py", line 1732, in test_method return attrvalue(self) File "/Users/buildslave/jenkins/workspace/lldb-cmake-matrix/llvm-project/lldb/packages/Python/lldbsuite/test/lldbinline.py", line 124, in _test self.do_test() File "/Users/buildslave/jenkins/workspace/lldb-cmake-matrix/llvm-project/lldb/packages/Python/lldbsuite/test/lldbinline.py", line 151, in do_test "inline test did not hit a single breakpoint") AssertionError: False is not True : inline test did not hit a single breakpoint Config=x86_64-/Users/buildslave/jenkins/workspace/lldb-cmake-matrix/lldb-build/bin/clang-11 ---------------------------------------------------------------------- Ran 4 tests in 9.812s

Hide Details

RESULT: FAILED (0 passes, 2 failures, 0 errors, 2 skipped, 0 expected failures, 0 unexpected successes)

Hide Details

******************** PASS: lldb-unit :: Utility/./UtilityTests/UriParserTest.SchemeHostSeparator3 (737 of 1914) UNSUPPORTED: lldb-shell :: ScriptInterpreter/Lua/persistent_state.test (738 of 1914) PASS: lldb-unit :: Host/./HostTests/NativeProcessProtocolTest.SetBreakpointFailWrite (739 of 1914) PASS: lldb-unit :: Utility/./UtilityTests/CompletionRequest.TryCompleteCurrentArgBad (740 of 1914) PASS: lldb-shell :: Commands/CommandScriptImmediateOutput/CommandScriptImmediateOutputFile.test (741 of 1914) PASS: lldb-unit :: ObjectFile/PECOFF/./ObjectFilePECOFFTests/PECallFrameInfoTest.Chained_eh (742 of 1914) PASS: lldb-unit :: Platform/./LLDBPlatformTests/PlatformDarwinTest.TestParseVersionBuildDir (743 of 1914) UNSUPPORTED: lldb-api :: functionalities/thread/concurrent_events/TestConcurrentCrashWithWatchpointBreakpointSignal.py (744 of 1914) Aborted by Adrian Prantl Sending interrupt signal to process FAIL: lldb-api :: functionalities/data-formatter/data-formatter-synthval/TestDataFormatterSynthVal.py (745 of 1914) ******************** TEST 'lldb-api :: functionalities/data-formatter/data-formatter-synthval/TestDataFormatterSynthVal.py' FAILED ******************** lldb version 11.0.99 clang revision 020041d99b508ed5f207c0896a19b3e85c942ee7 llvm revision 020041d99b508ed5f207c0896a19b3e85c942ee7 LLDB library dir: /Users/buildslave/jenkins/workspace/lldb-cmake-matrix/lldb-build/bin LLDB import library dir: /Users/buildslave/jenkins/workspace/lldb-cmake-matrix/lldb-build/bin libstdcxx tests will not be run because: Don't know how to build with libstdcxx on macosx Skipping following debug info categories: ['dwo'] setting set target.prefer-dynamic-value no-dynamic-values warning: (x86_64) /Users/buildslave/jenkins/workspace/lldb-cmake-matrix/lldb-build/lldb-test-build.noindex/functionalities/data-formatter/data-formatter-synthval/TestDataFormatterSynthVal.test_with_run_command_dsym/a.out empty dSYM file detected, dSYM was created with an executable with no debug info.

Hide Details

Session logs for test failures/errors/unexpected successes will go into directory '/Users/buildslave/jenkins/workspace/lldb-cmake-matrix/test/logs' Command invoked: /Users/buildslave/jenkins/workspace/lldb-cmake-matrix/llvm-project/lldb/test/API/dotest.py --arch x86_64 -s /Users/buildslave/jenkins/workspace/lldb-cmake-matrix/lldb-build/lldb-test-traces -S nm -u CXXFLAGS -u CFLAGS --codesign-identity lldb_codesign --server /Users/buildslave/jenkins/workspace/lldb-cmake-matrix/lldb-build/./bin/debugserver --arch x86_64 --build-dir /Users/buildslave/jenkins/workspace/lldb-cmake-matrix/lldb-build/lldb-test-build.noindex -s=/Users/buildslave/jenkins/workspace/lldb-cmake-matrix/test/logs -t --env TERM=vt100 --skip-category gmodules --skip-category watchpoint --arch=x86_64 --dwarf-version=5 --env LLVM_LIBS_DIR=/Users/buildslave/jenkins/workspace/lldb-cmake-matrix/lldb-build/./lib --build-dir /Users/buildslave/jenkins/workspace/lldb-cmake-matrix/lldb-build/lldb-test-build.noindex --lldb-module-cache-dir /Users/buildslave/jenkins/workspace/lldb-cmake-matrix/lldb-build/lldb-test-build.noindex/module-cache-lldb/lldb-api --clang-module-cache-dir /Users/buildslave/jenkins/workspace/lldb-cmake-matrix/lldb-build/lldb-test-build.noindex/module-cache-clang/lldb-api --executable /Users/buildslave/jenkins/workspace/lldb-cmake-matrix/lldb-build/./bin/lldb --compiler /Users/buildslave/jenkins/workspace/lldb-cmake-matrix/lldb-build/./bin/clang --dsymutil /Users/buildslave/jenkins/workspace/lldb-cmake-matrix/lldb-build/./bin/dsymutil --filecheck /Users/buildslave/jenkins/workspace/lldb-cmake-matrix/lldb-build/./bin/FileCheck /Users/buildslave/jenkins/workspace/lldb-cmake-matrix/llvm-project/lldb/packages/Python/lldbsuite/test/functionalities/data-formatter/data-formatter-synthval -p TestDataFormatterSynthVal.py Change dir to: /Users/buildslave/jenkins/workspace/lldb-cmake-matrix/llvm-project/lldb/packages/Python/lldbsuite/test/functionalities/data-formatter/data-formatter-synthval runCmd: settings set symbols.enable-external-lookup false output:

Hide Details

runCmd: settings set plugin.process.gdb-remote.packet-timeout 60 output:

Hide Details

runCmd: settings set symbols.clang-modules-cache-path "/Users/buildslave/jenkins/workspace/lldb-cmake-matrix/lldb-build/lldb-test-build.noindex/module-cache-lldb/lldb-api" output:

Hide Details

runCmd: settings set use-color false output:

Hide Details

runCmd: file /Users/buildslave/jenkins/workspace/lldb-cmake-matrix/lldb-build/lldb-test-build.noindex/functionalities/data-formatter/data-formatter-synthval/TestDataFormatterSynthVal.test_with_run_command_dsym/a.out output: Current executable set to '/Users/buildslave/jenkins/workspace/lldb-cmake-matrix/lldb-build/lldb-test-build.noindex/functionalities/data-formatter/data-formatter-synthval/TestDataFormatterSynthVal.test_with_run_command_dsym/a.out' (x86_64).

Hide Details

Hide Details

runCmd: breakpoint set -f "main.cpp" -l 40 output: Breakpoint 1: no locations (pending). WARNING: Unable to resolve breakpoint to any actual locations.

Hide Details

Hide Details

Expecting pattern: ^Breakpoint (?P<bpno>[0-9]+): (?P<num_locations>[0-9]+) locations\.$ Not matched

Hide Details

Expecting pattern: ^Breakpoint (?P<bpno>[0-9]+): (?P<num_locations>no) locations \(pending\)\. Matched

Hide Details

FAIL: LLDB (/Users/buildslave/jenkins/workspace/lldb-cmake-matrix/lldb-build/bin/clang-11-x86_64) :: test_with_run_command_dsym (TestDataFormatterSynthVal.DataFormatterSynthValueTestCase) runCmd: settings set symbols.enable-external-lookup false output:

Hide Details

runCmd: settings set plugin.process.gdb-remote.packet-timeout 60 output:

Hide Details

runCmd: settings set symbols.clang-modules-cache-path "/Users/buildslave/jenkins/workspace/lldb-cmake-matrix/lldb-build/lldb-test-build.noindex/module-cache-lldb/lldb-api" output:

Hide Details

runCmd: settings set use-color false output:

Hide Details

runCmd: file /Users/buildslave/jenkins/workspace/lldb-cmake-matrix/lldb-build/lldb-test-build.noindex/functionalities/data-formatter/data-formatter-synthval/TestDataFormatterSynthVal.test_with_run_command_dwarf/a.out output: Current executable set to '/Users/buildslave/jenkins/workspace/lldb-cmake-matrix/lldb-build/lldb-test-build.noindex/functionalities/data-formatter/data-formatter-synthval/TestDataFormatterSynthVal.test_with_run_command_dwarf/a.out' (x86_64).

Hide Details

Hide Details

runCmd: breakpoint set -f "main.cpp" -l 40 output: Breakpoint 1: no locations (pending). WARNING: Unable to resolve breakpoint to any actual locations.

Hide Details

Hide Details

Expecting pattern: ^Breakpoint (?P<bpno>[0-9]+): (?P<num_locations>[0-9]+) locations\.$ Not matched

Hide Details

Expecting pattern: ^Breakpoint (?P<bpno>[0-9]+): (?P<num_locations>no) locations \(pending\)\. Matched

Hide Details

FAIL: LLDB (/Users/buildslave/jenkins/workspace/lldb-cmake-matrix/lldb-build/bin/clang-11-x86_64) :: test_with_run_command_dwarf (TestDataFormatterSynthVal.DataFormatterSynthValueTestCase) UNSUPPORTED: LLDB (/Users/buildslave/jenkins/workspace/lldb-cmake-matrix/lldb-build/bin/clang-11-x86_64) :: test_with_run_command_dwo (TestDataFormatterSynthVal.DataFormatterSynthValueTestCase) (test case does not fall in any category of interest for this run) UNSUPPORTED: LLDB (/Users/buildslave/jenkins/workspace/lldb-cmake-matrix/lldb-build/bin/clang-11-x86_64) :: test_with_run_command_gmodules (TestDataFormatterSynthVal.DataFormatterSynthValueTestCase) (test case does not fall in any category of interest for this run) Restore dir to: /Users/buildslave/jenkins/workspace/lldb-cmake-matrix/lldb-build/tools/lldb/test ====================================================================== FAIL: test_with_run_command_dsym (TestDataFormatterSynthVal.DataFormatterSynthValueTestCase) Test using Python synthetic children provider to provide a value. ---------------------------------------------------------------------- Traceback (most recent call last): File "/Users/buildslave/jenkins/workspace/lldb-cmake-matrix/llvm-project/lldb/packages/Python/lldbsuite/test/lldbtest.py", line 1732, in test_method return attrvalue(self) File "/Users/buildslave/jenkins/workspace/lldb-cmake-matrix/llvm-project/lldb/packages/Python/lldbsuite/test/functionalities/data-formatter/data-formatter-synthval/TestDataFormatterSynthVal.py", line 31, in test_with_run_command self, "main.cpp", self.line, num_expected_locations=1, loc_exact=True) File "/Users/buildslave/jenkins/workspace/lldb-cmake-matrix/llvm-project/lldb/packages/Python/lldbsuite/test/lldbutil.py", line 384, in run_break_set_by_file_and_line module_name=module_name) File "/Users/buildslave/jenkins/workspace/lldb-cmake-matrix/llvm-project/lldb/packages/Python/lldbsuite/test/lldbutil.py", line 585, in check_breakpoint_result out_num_locations)) AssertionError: False is not True : Expecting 1 locations, got 0. Config=x86_64-/Users/buildslave/jenkins/workspace/lldb-cmake-matrix/lldb-build/bin/clang-11 ====================================================================== FAIL: test_with_run_command_dwarf (TestDataFormatterSynthVal.DataFormatterSynthValueTestCase) Test using Python synthetic children provider to provide a value. ---------------------------------------------------------------------- Traceback (most recent call last): File "/Users/buildslave/jenkins/workspace/lldb-cmake-matrix/llvm-project/lldb/packages/Python/lldbsuite/test/lldbtest.py", line 1732, in test_method return attrvalue(self) File "/Users/buildslave/jenkins/workspace/lldb-cmake-matrix/llvm-project/lldb/packages/Python/lldbsuite/test/functionalities/data-formatter/data-formatter-synthval/TestDataFormatterSynthVal.py", line 31, in test_with_run_command self, "main.cpp", self.line, num_expected_locations=1, loc_exact=True) File "/Users/buildslave/jenkins/workspace/lldb-cmake-matrix/llvm-project/lldb/packages/Python/lldbsuite/test/lldbutil.py", line 384, in run_break_set_by_file_and_line module_name=module_name) File "/Users/buildslave/jenkins/workspace/lldb-cmake-matrix/llvm-project/lldb/packages/Python/lldbsuite/test/lldbutil.py", line 585, in check_breakpoint_result out_num_locations)) AssertionError: False is not True : Expecting 1 locations, got 0. Config=x86_64-/Users/buildslave/jenkins/workspace/lldb-cmake-matrix/lldb-build/bin/clang-11 ---------------------------------------------------------------------- Ran 4 tests in 0.922s

Hide Details

RESULT: FAILED (0 passes, 2 failures, 0 errors, 2 skipped, 0 expected failures, 0 unexpected successes)

Hide Details

******************** UNRESOLVED: lldb-api :: python_api/value_var_update/TestValueVarUpdate.py (746 of 1914) ******************** TEST 'lldb-api :: python_api/value_var_update/TestValueVarUpdate.py' FAILED ******************** Unable to find 'RESULT: PASSED' in dotest output (exit code -15):

Hide Details

lldb version 11.0.99 clang revision 020041d99b508ed5f207c0896a19b3e85c942ee7 llvm revision 020041d99b508ed5f207c0896a19b3e85c942ee7

Hide Details

******************** ninja: build stopped: interrupted by user. script returned exit code 143
[Pipeline] } [Pipeline] // timeout [Pipeline] } [Pipeline] // stage [Pipeline] stage [Pipeline] { (Build Clang 5.0.2) Stage "Build Clang 5.0.2" skipped due to earlier failure(s) [Pipeline] } [Pipeline] // stage [Pipeline] stage [Pipeline] { (Test Clang 5.0.2) Stage "Test Clang 5.0.2" skipped due to earlier failure(s) [Pipeline] } [Pipeline] // stage [Pipeline] stage [Pipeline] { (Build Clang 7.0.1) Stage "Build Clang 7.0.1" skipped due to earlier failure(s) [Pipeline] } [Pipeline] // stage [Pipeline] stage [Pipeline] { (Test Clang 7.0.1) Stage "Test Clang 7.0.1" skipped due to earlier failure(s) [Pipeline] } [Pipeline] // stage [Pipeline] stage [Pipeline] { (Build Clang 9.0.0) Stage "Build Clang 9.0.0" skipped due to earlier failure(s) [Pipeline] } [Pipeline] // stage [Pipeline] stage [Pipeline] { (Test Clang 9.0.0) Stage "Test Clang 9.0.0" skipped due to earlier failure(s) [Pipeline] } [Pipeline] // stage [Pipeline] } [Pipeline] // withEnv [Pipeline] } sh: line 1: 91171 Terminated: 15 JENKINS_SERVER_COOKIE=$jsc '/bin/sh' -xe '/Users/buildslave/jenkins/workspace/lldb-cmake-matrix@tmp/durable-880e9aa4/script.sh' > '/Users/buildslave/jenkins/workspace/lldb-cmake-matrix@tmp/durable-880e9aa4/jenkins-log.txt' 2>&1 sh: line 1: 30769 Terminated: 15 sleep 3 [Pipeline] // node [Pipeline] End of Pipeline Finished: ABORTED