AbortedConsole Output

Skipping 4,125 KB.. Full Log
ref_typedef/TestPtrRef2Typedef.py (768 of 1915)
PASS: lldb-unit :: Utility/./UtilityTests/StreamTest.PutCharWhitespace (769 of 1915)
PASS: lldb-unit :: Utility/./UtilityTests/StringLexerTest.AdvanceIf (770 of 1915)
PASS: lldb-shell :: Reproducer/TestFileRepro.test (771 of 1915)
UNSUPPORTED: lldb-shell :: Register/x86-gp-read.test (772 of 1915)
UNSUPPORTED: lldb-shell :: SymbolFile/DWARF/dwarf5_locations.s (773 of 1915)
PASS: lldb-shell :: Settings/TestDisassemblyFormat.test (774 of 1915)
PASS: lldb-api :: functionalities/data-formatter/synthcapping/TestSyntheticCapping.py (775 of 1915)
UNSUPPORTED: lldb-api :: functionalities/thread/concurrent_events/TestConcurrentTwoWatchpointThreads.py (776 of 1915)
PASS: lldb-unit :: Utility/./UtilityTests/StreamTest.PutBytesAsRawHex8ToBigEndian (777 of 1915)
PASS: lldb-unit :: Host/./HostTests/NativeProcessProtocolTest.SetBreakpoint (778 of 1915)
PASS: lldb-unit :: ScriptInterpreter/Python/./ScriptInterpreterPythonTests/PythonDataObjectsTest.TestBorrowedReferences (779 of 1915)
PASS: lldb-unit :: Core/./LLDBCoreTests/RichManglingContextTest.FromCxxMethodName (780 of 1915)
PASS: lldb-api :: functionalities/gdb_remote_client/TestNoWatchpointSupportInfo.py (781 of 1915)
PASS: lldb-unit :: ObjectFile/ELF/./ObjectFileELFTests/ObjectFileELFTest.GetSymtab_NoSymEntryPointArmThumbAddressClass (782 of 1915)
PASS: lldb-api :: functionalities/postmortem/mach-core/TestMachCore.py (783 of 1915)
PASS: lldb-unit :: Utility/./UtilityTests/UriParserTest.BracketedHostnameWithColon (784 of 1915)
PASS: lldb-unit :: Utility/./UtilityTests/StringExtractorTest.InitEmpty (785 of 1915)
UNSUPPORTED: lldb-api :: commands/expression/import_builtin_fileid/TestImportBuiltinFileID.py (786 of 1915)
UNSUPPORTED: lldb-shell :: ScriptInterpreter/Lua/convenience_variables.test (787 of 1915)
UNRESOLVED: lldb-api :: functionalities/data-formatter/data-formatter-stl/libcxx/vector/TestDataFormatterLibcxxVector.py (788 of 1915)
******************** TEST 'lldb-api :: functionalities/data-formatter/data-formatter-stl/libcxx/vector/TestDataFormatterLibcxxVector.py' FAILED ********************
Unable to find 'RESULT: PASSED' in dotest output (exit code -11):

Hide Details

lldb version 11.0.99 clang revision e03ead6771fc97b11cb0c94b7f023142184ad25f llvm revision e03ead6771fc97b11cb0c94b7f023142184ad25f

Hide Details

******************** PASS: lldb-unit :: ScriptInterpreter/Python/./ScriptInterpreterPythonTests/PythonDataObjectsTest.TestPythonString (789 of 1915) UNSUPPORTED: lldb-api :: python_api/watchpoint/TestWatchpointIgnoreCount.py (790 of 1915) PASS: lldb-unit :: Utility/./UtilityTests/BinaryStreamTest.PutULEB128Zero (791 of 1915) PASS: lldb-unit :: Utility/./UtilityTests/UriParserTest.MinimalPortPath (792 of 1915) PASS: lldb-api :: lang/c/blocks/TestBlocks.py (793 of 1915) PASS: lldb-unit :: Utility/./UtilityTests/ArgsTest.ReplaceArgumentAtIndexFarOutOfRange (794 of 1915) PASS: lldb-api :: lang/cpp/global_operators/TestCppGlobalOperators.py (795 of 1915) PASS: lldb-shell :: SymbolFile/DWARF/debug-types-line-tables.s (796 of 1915) UNSUPPORTED: lldb-api :: commands/watchpoints/watchpoint_disable/TestWatchpointDisable.py (797 of 1915) PASS: lldb-api :: commands/log/invalid-args/TestInvalidArgsLog.py (798 of 1915) PASS: lldb-api :: commands/expression/class_template_specialization_empty_pack/TestClassTemplateSpecializationParametersHandling.py (799 of 1915) UNRESOLVED: lldb-api :: functionalities/data-formatter/data-formatter-stl/libcxx/optional/TestDataFormatterLibcxxOptional.py (800 of 1915) ******************** TEST 'lldb-api :: functionalities/data-formatter/data-formatter-stl/libcxx/optional/TestDataFormatterLibcxxOptional.py' FAILED ******************** Unable to find 'RESULT: PASSED' in dotest output (exit code -11):

Hide Details

lldb version 11.0.99 clang revision e03ead6771fc97b11cb0c94b7f023142184ad25f llvm revision e03ead6771fc97b11cb0c94b7f023142184ad25f

Hide Details

******************** PASS: lldb-unit :: Utility/./UtilityTests/StringExtractorTest.DecodeHexU8_Underflow2 (801 of 1915) PASS: lldb-api :: functionalities/archives/TestBSDArchives.py (802 of 1915) PASS: lldb-api :: macosx/DBGSourcePathRemapping/TestDSYMSourcePathRemapping.py (803 of 1915) PASS: lldb-api :: functionalities/multiword-commands/TestMultiWordCommands.py (804 of 1915) PASS: lldb-api :: functionalities/dynamic_value_child_count/TestDynamicValueChildCount.py (805 of 1915) PASS: lldb-unit :: Utility/./UtilityTests/UUIDTest.SetFromStringRef (806 of 1915) PASS: lldb-shell :: ScriptInterpreter/Python/crashlog.test (807 of 1915) PASS: lldb-unit :: ScriptInterpreter/Python/./ScriptInterpreterPythonTests/PythonDataObjectsTest.TestResetting (808 of 1915) UNSUPPORTED: lldb-shell :: SymbolFile/DWARF/dir-separator-windows.s (809 of 1915) PASS: lldb-unit :: Host/./HostTests/MainLoopTest.TerminatesImmediately (810 of 1915) PASS: lldb-api :: functionalities/thread/concurrent_events/TestConcurrentTwoBreakpointThreads.py (811 of 1915) PASS: lldb-api :: lang/c/register_variables/TestRegisterVariables.py (812 of 1915) PASS: lldb-unit :: Expression/./ExpressionTests/CppModuleConfigurationTest.Xcode (813 of 1915) PASS: lldb-api :: macosx/load-kext/TestLoadKext.py (814 of 1915) UNSUPPORTED: lldb-api :: functionalities/data-formatter/data-formatter-stl/libstdcpp/iterator/TestDataFormatterStdIterator.py (815 of 1915) PASS: lldb-api :: functionalities/thread/concurrent_events/TestConcurrentCrashWithSignal.py (816 of 1915) UNSUPPORTED: lldb-api :: functionalities/tsan/thread_leak/TestTsanThreadLeak.py (817 of 1915) UNSUPPORTED: lldb-api :: functionalities/darwin_log/filter/regex/activity-chain/TestDarwinLogFilterRegexActivityChain.py (818 of 1915) PASS: lldb-unit :: Symbol/./SymbolTests/TestClangASTImporter.ImportInvalidType (819 of 1915) PASS: lldb-unit :: Host/./HostTests/HostInfoTest.GetAugmentedArchSpec (820 of 1915) PASS: lldb-unit :: Language/Highlighting/./HighlighterTests/HighlighterTest.DefaultHighlighter (821 of 1915) UNSUPPORTED: lldb-api :: commands/watchpoints/step_over_watchpoint/TestStepOverWatchpoint.py (822 of 1915) PASS: lldb-unit :: Expression/./ExpressionTests/DiagnosticManagerTest.PutStringMultiple (823 of 1915) PASS: lldb-api :: lang/objc/objc-baseclass-sbtype/TestObjCBaseClassSBType.py (824 of 1915) PASS: lldb-unit :: Utility/./UtilityTests/StringExtractorTest.GetHexBytesAvail_OddPair (825 of 1915) UNSUPPORTED: lldb-api :: tools/lldb-server/TestGdbRemoteModuleInfo.py (826 of 1915) PASS: lldb-unit :: Symbol/./SymbolTests/SymbolsTest.TerminateLocateExecutableSymbolFileForUnknownExecutableAndUnknownSymbolFile (827 of 1915) PASS: lldb-shell :: SymbolFile/DWARF/anon_class_w_and_wo_export_symbols.ll (828 of 1915) PASS: lldb-api :: commands/version/TestVersion.py (829 of 1915) PASS: lldb-api :: lang/cpp/dynamic-value-same-basename/TestDynamicValueSameBase.py (830 of 1915) UNSUPPORTED: lldb-api :: functionalities/thread/concurrent_events/TestConcurrentDelayedCrashWithBreakpointWatchpoint.py (831 of 1915) PASS: lldb-unit :: Process/gdb-remote/./ProcessGdbRemoteTests/GDBRemoteClientBaseTest.SendContinueAndInterrupt (832 of 1915) PASS: lldb-unit :: Utility/./UtilityTests/StatusTest.ErrorConstructor (833 of 1915) UNSUPPORTED: lldb-api :: commands/watchpoints/multiple_hits/TestMultipleHits.py (834 of 1915) PASS: lldb-api :: functionalities/gdb_remote_client/TestGDBRemoteLoad.py (835 of 1915) UNSUPPORTED: lldb-shell :: SymbolFile/PDB/variables-locations.test (836 of 1915) PASS: lldb-unit :: Expression/./ExpressionTests/CppModuleConfigurationTest.Sysroot (837 of 1915) PASS: lldb-api :: commands/target/create-deps/TestTargetCreateDeps.py (838 of 1915) PASS: lldb-unit :: Utility/./UtilityTests/ArchSpecTest.TripleComponentsWereSpecified (839 of 1915) PASS: lldb-unit :: Utility/./UtilityTests/StreamTeeTest.AppendStream (840 of 1915) PASS: lldb-unit :: UnwindAssembly/x86/./UnwindAssemblyx86Tests/Testx86AssemblyInspectionEngine.TestLEAVE (841 of 1915) UNSUPPORTED: lldb-shell :: SymbolFile/DWARF/debug-line-basic.s (842 of 1915) PASS: lldb-unit :: UnwindAssembly/x86/./UnwindAssemblyx86Tests/Testx86AssemblyInspectionEngine.TestPushEBP (843 of 1915) PASS: lldb-unit :: Utility/./UtilityTests/UriParserTest.Empty (844 of 1915) PASS: lldb-unit :: UnwindAssembly/x86/./UnwindAssemblyx86Tests/Testx86AssemblyInspectionEngine.TestSubESP (845 of 1915) PASS: lldb-unit :: Host/./HostTests/SocketTest.TCPGetConnectURI (846 of 1915) PASS: lldb-unit :: Host/./HostTests/NativeProcessProtocolTest.ReadCStringFromMemory (847 of 1915) PASS: lldb-api :: functionalities/postmortem/elf-core/gcore/TestGCore.py (848 of 1915) UNSUPPORTED: lldb-shell :: SymbolFile/DWARF/find-basic-function.cpp (849 of 1915) PASS: lldb-shell :: Unwind/eh-frame-dwarf-unwind.test (850 of 1915) UNSUPPORTED: lldb-shell :: SymbolFile/DWARF/dir-separator-posix.s (851 of 1915) UNSUPPORTED: lldb-api :: linux/add-symbols/TestTargetSymbolsAddCommand.py (852 of 1915) UNSUPPORTED: lldb-shell :: Watchpoint/netbsd-nouserdbregs.test (853 of 1915) PASS: lldb-api :: commands/reproducer/invalid-args/TestInvalidArgsReproducer.py (854 of 1915) PASS: lldb-unit :: Utility/./UtilityTests/StreamTest.PutChar (855 of 1915) UNSUPPORTED: lldb-shell :: SymbolFile/PDB/expressions.test (856 of 1915) PASS: lldb-api :: functionalities/data-formatter/user-format-vs-summary/TestUserFormatVsSummary.py (857 of 1915) PASS: lldb-unit :: Utility/./UtilityTests/ArchSpecTest.TestParseMachCPUDashSubtypeTripleSimple (858 of 1915) UNRESOLVED: lldb-api :: functionalities/data-formatter/data-formatter-stl/libcxx/variant/TestDataFormatterLibcxxVariant.py (859 of 1915) ******************** TEST 'lldb-api :: functionalities/data-formatter/data-formatter-stl/libcxx/variant/TestDataFormatterLibcxxVariant.py' FAILED ******************** Unable to find 'RESULT: PASSED' in dotest output (exit code -11):

Hide Details

lldb version 11.0.99 clang revision e03ead6771fc97b11cb0c94b7f023142184ad25f llvm revision e03ead6771fc97b11cb0c94b7f023142184ad25f

Hide Details

******************** PASS: lldb-shell :: SymbolFile/DWARF/gnu-style-compression.cpp (860 of 1915) PASS: lldb-api :: tools/lldb-server/TestGdbRemoteKill.py (861 of 1915) PASS: lldb-unit :: Utility/./UtilityTests/StreamTest.PutBytesAsRawHex8ToLittleEndian (862 of 1915) PASS: lldb-unit :: Utility/./UtilityTests/ArgsTest.ReplaceArgumentAtIndexEqual (863 of 1915) UNSUPPORTED: lldb-api :: functionalities/thread/concurrent_events/TestConcurrentTwoWatchpointsOneDelayBreakpoint.py (864 of 1915) UNSUPPORTED: lldb-shell :: SymbolFile/DWARF/find-function-regex.cpp (865 of 1915) PASS: lldb-api :: functionalities/gdb_remote_client/TestGDBRemoteClient.py (866 of 1915) PASS: lldb-unit :: Utility/./UtilityTests/StreamTest.PutMaxHex64ByteOrderLittle (867 of 1915) PASS: lldb-api :: functionalities/thread/concurrent_events/TestConcurrentSignalDelayBreak.py (868 of 1915) PASS: lldb-api :: python_api/module_section/TestModuleAndSection.py (869 of 1915) PASS: lldb-api :: arm/emulation/TestEmulations.py (870 of 1915) PASS: lldb-api :: commands/frame/diagnose/dereference-argument/TestDiagnoseDereferenceArgument.py (871 of 1915) PASS: lldb-unit :: Utility/./UtilityTests/RangeTest.EqualInvalid (872 of 1915) PASS: lldb-api :: tools/lldb-vscode/breakpoint/TestVSCode_setExceptionBreakpoints.py (873 of 1915) PASS: lldb-api :: python_api/thread/TestThreadAPI.py (874 of 1915) PASS: lldb-shell :: SymbolFile/DWARF/compilercontext.ll (875 of 1915) PASS: lldb-unit :: Utility/./UtilityTests/DataExtractorTest.PeekData (876 of 1915) PASS: lldb-unit :: Expression/./ExpressionTests/ClangExpressionDeclMapTest.TestUnknownIdentifierLookup (877 of 1915) UNSUPPORTED: lldb-shell :: SymbolFile/NativePDB/tag-types.cpp (878 of 1915) PASS: lldb-unit :: Expression/./ExpressionTests/ClangExpressionDeclMapTest.TestPersistentDeclLookup (879 of 1915) PASS: lldb-unit :: Language/Highlighting/./HighlighterTests/HighlighterTest.ClangCursorOutOfBounds (880 of 1915) PASS: lldb-shell :: Process/TestEnvironment.test (881 of 1915) PASS: lldb-api :: functionalities/type_lookup/TestTypeLookup.py (882 of 1915) UNSUPPORTED: lldb-shell :: Register/x86-zmm-write.test (883 of 1915) PASS: lldb-unit :: Utility/./UtilityTests/BinaryStreamTest.PutSLEB128FiveBytes (884 of 1915) UNSUPPORTED: lldb-api :: commands/watchpoints/variable_out_of_scope/TestWatchedVarHitWhenInScope.py (885 of 1915) PASS: lldb-unit :: Host/./HostTests/FileSystemTest.Resolve (886 of 1915) PASS: lldb-unit :: SymbolFile/DWARF/./SymbolFileDWARFTests/SymbolFileDWARFTests.TestAbbrevOrder1Start5 (887 of 1915) PASS: lldb-unit :: Utility/./UtilityTests/ArchSpecTest.Compatibility (888 of 1915) PASS: lldb-api :: macosx/version_zero/TestGetVersionZeroVersion.py (889 of 1915) PASS: lldb-unit :: SymbolFile/DWARF/./SymbolFileDWARFTests/DWARFASTParserClangTests.EnsureAllDIEsInDeclContextHaveBeenParsedParsesOnlyMatchingEntries (890 of 1915) PASS: lldb-unit :: Symbol/./SymbolTests/TestClangASTImporter.DeportTypeTagDecl (891 of 1915) PASS: lldb-unit :: ScriptInterpreter/Python/./ScriptInterpreterPythonTests/PythonDataObjectsTest.TestExceptions (892 of 1915) PASS: lldb-api :: commands/expression/weak_symbols/TestWeakSymbols.py (893 of 1915) UNSUPPORTED: lldb-shell :: Register/x86-ymm-write.test (894 of 1915) PASS: lldb-unit :: Utility/./UtilityTests/StreamTest.AddressRangeInvalidRange (895 of 1915) PASS: lldb-unit :: Host/./HostTests/File.GetStreamFromDescriptor (896 of 1915) PASS: lldb-unit :: Utility/./UtilityTests/FileSpecTest.FormatFileSpec (897 of 1915) PASS: lldb-unit :: Utility/./UtilityTests/LogChannelEnabledTest.LLDB_LOG_ERROR (898 of 1915) PASS: lldb-shell :: ObjectFile/ELF/section-addresses.yaml (899 of 1915) PASS: lldb-api :: functionalities/memory/cache/TestMemoryCache.py (900 of 1915) PASS: lldb-unit :: Utility/./UtilityTests/StringLexerTest.NextIf (901 of 1915) PASS: lldb-unit :: Symbol/./SymbolTests/LineEntryTest.GetSameLineContiguousAddressRangeNoInlines (902 of 1915) PASS: lldb-unit :: Process/minidump/./LLDBMinidumpTests/RegisterContextMinidump.ConvertMinidumpContext_x86_32 (903 of 1915) PASS: lldb-api :: functionalities/return-value/TestReturnValue.py (904 of 1915) PASS: lldb-api :: commands/expression/persistent_ptr_update/TestPersistentPtrUpdate.py (905 of 1915) PASS: lldb-shell :: Reproducer/TestDump.test (906 of 1915) PASS: lldb-api :: functionalities/data-formatter/frameformat_smallstruct/TestFrameFormatSmallStruct.py (907 of 1915) PASS: lldb-api :: macosx/safe-to-func-call/TestSafeFuncCalls.py (908 of 1915) PASS: lldb-unit :: Language/Highlighting/./HighlighterTests/HighlighterTest.ClangTrailingBackslashMissingNewLine (909 of 1915) PASS: lldb-api :: python_api/debugger/TestDebuggerAPI.py (910 of 1915) PASS: lldb-unit :: SymbolFile/NativePDB/./SymbolFileNativePDBTests/PDBFPOProgramToDWARFExpressionTests.UnresolvedCyclicRegisterAssignmentReference (911 of 1915) PASS: lldb-api :: lang/cpp/char8_t/TestCxxChar8_t.py (912 of 1915) PASS: lldb-unit :: Host/./HostTests/SocketAddressTest.Set (913 of 1915) UNSUPPORTED: lldb-api :: python_api/watchpoint/watchlocation/TestSetWatchlocation.py (914 of 1915) PASS: lldb-shell :: ObjectFile/ELF/duplicate-section.yaml (915 of 1915) PASS: lldb-unit :: Utility/./UtilityTests/FileSpecTest.PrependPathComponent (916 of 1915) PASS: lldb-unit :: Utility/./UtilityTests/StringListTest.AppendStringMove (917 of 1915) PASS: lldb-unit :: Language/Highlighting/./HighlighterTests/HighlighterTest.ClangTrailingBackslashWithWhitespace (918 of 1915) PASS: lldb-api :: lang/cpp/virtual/TestVirtual.py (919 of 1915) PASS: lldb-unit :: Language/Highlighting/./HighlighterTests/HighlighterTest.ClangCommas (920 of 1915) PASS: lldb-shell :: Reproducer/TestCaptureEnvOverride.test (921 of 1915) PASS: lldb-unit :: UnwindAssembly/x86/./UnwindAssemblyx86Tests/Testx86AssemblyInspectionEngine.Testi386IgnoredRegisters (922 of 1915) PASS: lldb-shell :: Settings/TestSettingsWrite.test (923 of 1915) PASS: lldb-api :: lang/cpp/exceptions/TestCPPExceptionBreakpoints.py (924 of 1915) PASS: lldb-unit :: Editline/./EditlineTests/EditlineTestFixture.EditlineReceivesMultiLineText (925 of 1915) UNSUPPORTED: lldb-shell :: SymbolFile/PDB/pointers.test (926 of 1915) PASS: lldb-api :: commands/expression/static-initializers/TestStaticInitializers.py (927 of 1915) PASS: lldb-unit :: Utility/./UtilityTests/StringListTest.SplitIntoLinesEmpty (928 of 1915) PASS: lldb-unit :: Utility/./UtilityTests/EnvironmentTest.EnvpConstruction (929 of 1915) PASS: lldb-api :: python_api/class_members/TestSBTypeClassMembers.py (930 of 1915) PASS: lldb-unit :: ScriptInterpreter/Python/./ScriptInterpreterPythonTests/PythonDataObjectsTest.TestCallable (931 of 1915) PASS: lldb-api :: functionalities/load_unload/TestLoadUnload.py (932 of 1915) UNSUPPORTED: lldb-api :: lang/objc/bitfield_ivars/TestBitfieldIvars.py (933 of 1915) UNSUPPORTED: lldb-api :: commands/register/register/intel_xtended_registers/mpx_offset_intersection/TestMPXOffsetIntersection.py (934 of 1915) PASS: lldb-unit :: Expression/./ExpressionTests/CppModuleConfigurationTest.MissingLibCpp (935 of 1915) PASS: lldb-api :: functionalities/show_location/TestShowLocationDwarf5.py (936 of 1915) PASS: lldb-unit :: Utility/./UtilityTests/StringExtractorTest.GetHexBytesAvail (937 of 1915) PASS: lldb-api :: lang/c/stepping/TestThreadStepping.py (938 of 1915) PASS: lldb-unit :: Language/Highlighting/./HighlighterTests/HighlighterTest.HighlighterSelectionType (939 of 1915) PASS: lldb-unit :: Utility/./UtilityTests/StringListTest.LongestCommonPrefixSingleElement (940 of 1915) UNRESOLVED: lldb-api :: commands/expression/import-std-module/vector-basic/TestBasicVector.py (941 of 1915) ******************** TEST 'lldb-api :: commands/expression/import-std-module/vector-basic/TestBasicVector.py' FAILED ******************** Unable to find 'RESULT: PASSED' in dotest output (exit code -11):

Hide Details

lldb version 11.0.99 clang revision e03ead6771fc97b11cb0c94b7f023142184ad25f llvm revision e03ead6771fc97b11cb0c94b7f023142184ad25f

Hide Details

******************** PASS: lldb-api :: lang/cpp/class_types/TestClassTypesDisassembly.py (942 of 1915) UNSUPPORTED: lldb-api :: functionalities/data-formatter/data-formatter-stl/libstdcpp/vbool/TestDataFormatterStdVBool.py (943 of 1915) PASS: lldb-unit :: Utility/./UtilityTests/StringLexerTest.Peek (944 of 1915) PASS: lldb-unit :: Utility/./UtilityTests/SubsystemRAIITest.NormalSubsystem (945 of 1915) PASS: lldb-api :: commands/expression/call-function/TestCallUserDefinedFunction.py (946 of 1915) PASS: lldb-api :: python_api/lldbutil/TestSwigVersion.py (947 of 1915) UNRESOLVED: lldb-api :: lang/cpp/unique-types/TestUniqueTypes.py (948 of 1915) ******************** TEST 'lldb-api :: lang/cpp/unique-types/TestUniqueTypes.py' FAILED ******************** Unable to find 'RESULT: PASSED' in dotest output (exit code -11):

Hide Details

lldb version 11.0.99 clang revision e03ead6771fc97b11cb0c94b7f023142184ad25f llvm revision e03ead6771fc97b11cb0c94b7f023142184ad25f

Hide Details

******************** PASS: lldb-unit :: Utility/./UtilityTests/StringListTest.JoinSingle (949 of 1915) PASS: lldb-unit :: Process/gdb-remote/./ProcessGdbRemoteTests/GDBRemoteClientBaseTest.SendContinueAndLateInterrupt (950 of 1915) UNSUPPORTED: lldb-api :: android/platform/TestDefaultCacheLineSize.py (951 of 1915) PASS: lldb-shell :: SymbolFile/DWARF/clang-ast-from-dwarf-objc-property.m (952 of 1915) PASS: lldb-api :: types/TestCharTypeExpr.py (953 of 1915) PASS: lldb-unit :: Utility/./UtilityTests/RangeTest.DoesAdjoinOrIntersect (954 of 1915) PASS: lldb-unit :: Language/CPlusPlus/./LanguageCPlusPlusTests/CPlusPlusLanguage.FindAlternateFunctionManglings (955 of 1915) PASS: lldb-unit :: Core/./LLDBCoreTests/UniqueCStringMap.NoDefaultConstructor (956 of 1915) PASS: lldb-api :: lang/c/stepping/TestStepAndBreakpoints.py (957 of 1915) UNRESOLVED: lldb-api :: lang/cpp/auto/TestCPPAuto.py (958 of 1915) ******************** TEST 'lldb-api :: lang/cpp/auto/TestCPPAuto.py' FAILED ******************** Unable to find 'RESULT: PASSED' in dotest output (exit code -11):

Hide Details

lldb version 11.0.99 clang revision e03ead6771fc97b11cb0c94b7f023142184ad25f llvm revision e03ead6771fc97b11cb0c94b7f023142184ad25f

Hide Details

******************** UNSUPPORTED: lldb-api :: functionalities/darwin_log/filter/exact_match/message/TestDarwinLogFilterMatchMessage.py (959 of 1915) PASS: lldb-api :: lang/objc/objc_direct-methods/TestObjCDirectMethods.py (960 of 1915) UNSUPPORTED: lldb-api :: tools/lldb-server/TestGdbRemoteAuxvSupport.py (961 of 1915) PASS: lldb-api :: lang/cpp/namespace/TestNamespaceLookup.py (962 of 1915) PASS: lldb-shell :: SymbolFile/DWARF/debug_ranges.s (963 of 1915) UNSUPPORTED: lldb-api :: functionalities/darwin_log/filter/regex/subsystem/TestDarwinLogFilterRegexSubsystem.py (964 of 1915) PASS: lldb-api :: commands/disassemble/basic/TestDisassembleBreakpoint.py (965 of 1915) PASS: lldb-api :: iohandler/unicode/TestUnicode.py (966 of 1915) PASS: lldb-unit :: Process/gdb-remote/./ProcessGdbRemoteTests/GDBRemoteCommunicationClientTest.SendStopTracePacket (967 of 1915) PASS: lldb-unit :: Utility/./UtilityTests/StreamTest.PutHex32ByteOrderBig (968 of 1915) UNSUPPORTED: lldb-api :: functionalities/ubsan/basic/TestUbsanBasic.py (969 of 1915) PASS: lldb-shell :: Commands/command-regex-delete.test (970 of 1915) UNRESOLVED: lldb-api :: commands/expression/import-std-module/deque-dbg-info-content/TestDbgInfoContentDeque.py (971 of 1915) ******************** TEST 'lldb-api :: commands/expression/import-std-module/deque-dbg-info-content/TestDbgInfoContentDeque.py' FAILED ******************** Unable to find 'RESULT: PASSED' in dotest output (exit code -11):

Hide Details

lldb version 11.0.99 clang revision e03ead6771fc97b11cb0c94b7f023142184ad25f llvm revision e03ead6771fc97b11cb0c94b7f023142184ad25f

Hide Details

******************** PASS: lldb-unit :: Target/./TargetTests/ExecutionContextTest.GetByteOrder (972 of 1915) PASS: lldb-shell :: Minidump/breakpad-symbols.test (973 of 1915) PASS: lldb-api :: sanity/TestModuleCacheSanity.py (974 of 1915) PASS: lldb-api :: lang/objc/rdar-10967107/TestRdar10967107.py (975 of 1915) PASS: lldb-unit :: Utility/./UtilityTests/StreamTest.AddressRangeSize (976 of 1915) UNSUPPORTED: lldb-shell :: BuildScript/toolchain-clang-cl.test (977 of 1915) UNRESOLVED: lldb-api :: commands/expression/import-std-module/forward_list-basic/TestBasicForwardList.py (978 of 1915) ******************** TEST 'lldb-api :: commands/expression/import-std-module/forward_list-basic/TestBasicForwardList.py' FAILED ******************** Unable to find 'RESULT: PASSED' in dotest output (exit code -11):

Hide Details

lldb version 11.0.99 clang revision e03ead6771fc97b11cb0c94b7f023142184ad25f llvm revision e03ead6771fc97b11cb0c94b7f023142184ad25f

Hide Details

******************** PASS: lldb-api :: functionalities/stats_api/TestStatisticsAPI.py (979 of 1915) PASS: lldb-shell :: Minidump/Windows/arm-fp-unwind.test (980 of 1915) PASS: lldb-unit :: Utility/./UtilityTests/DataExtractorTest.GetCStr (981 of 1915) PASS: lldb-api :: types/TestDoubleTypes.py (982 of 1915) PASS: lldb-shell :: Reproducer/TestCrash.test (983 of 1915) PASS: lldb-unit :: ObjectFile/Breakpad/./ObjectFileBreakpadTests/InfoRecord.parse (984 of 1915) PASS: lldb-api :: functionalities/data-formatter/data-formatter-objc/TestDataFormatterObjCNSError.py (985 of 1915) UNSUPPORTED: lldb-api :: functionalities/longjmp/TestLongjmp.py (986 of 1915) PASS: lldb-unit :: Utility/./UtilityTests/ArgsTest.EscapeLLDBCommandArgument (987 of 1915) UNSUPPORTED: lldb-shell :: Register/x86-64-xmm16-read.test (988 of 1915) PASS: lldb-api :: functionalities/multidebugger_commands/TestMultipleDebuggersCommands.py (989 of 1915) UNSUPPORTED: lldb-shell :: Register/x86-64-ymm16-read.test (990 of 1915) PASS: lldb-api :: functionalities/data-formatter/data-formatter-objc/TestDataFormatterObjCPlain.py (991 of 1915) PASS: lldb-api :: functionalities/tail_call_frames/inlining_and_tail_calls/TestInliningAndTailCalls.py (992 of 1915) PASS: lldb-api :: commands/command/invalid-args/TestInvalidArgsCommand.py (993 of 1915) UNSUPPORTED: lldb-api :: commands/expression/call-restarts/TestCallThatRestarts.py (994 of 1915) PASS: lldb-api :: terminal/TestEditline.py (995 of 1915) PASS: lldb-unit :: Utility/./UtilityTests/StringLexerTest.NextIfList (996 of 1915) PASS: lldb-unit :: Utility/./UtilityTests/StreamTest.ChangingByteOrder (997 of 1915) PASS: lldb-unit :: SymbolFile/NativePDB/./SymbolFileNativePDBTests/PDBFPOProgramToDWARFExpressionTests.InvalidAssignmentSingle (998 of 1915) PASS: lldb-unit :: Host/./HostTests/MainLoopTest.DetectsEOF (999 of 1915) PASS: lldb-api :: functionalities/conditional_break/TestConditionalBreak.py (1000 of 1915) PASS: lldb-unit :: Utility/./UtilityTests/LogChannelEnabledTest.LogGetLogThread (1001 of 1915) PASS: lldb-shell :: Quit/TestQuitExitCode-30.test (1002 of 1915) PASS: lldb-api :: macosx/universal/TestUniversal.py (1003 of 1915) PASS: lldb-api :: functionalities/float-display/TestFloatDisplay.py (1004 of 1915) PASS: lldb-unit :: Utility/./UtilityTests/StreamTest.PutMaxHex64ByteOrderBig (1005 of 1915) PASS: lldb-unit :: ObjectFile/Breakpad/./ObjectFileBreakpadTests/LineRecord.parse (1006 of 1915) PASS: lldb-api :: commands/frame/diagnose/bad-reference/TestBadReference.py (1007 of 1915) PASS: lldb-unit :: Utility/./UtilityTests/ArgsTest.AppendArguments (1008 of 1915) PASS: lldb-unit :: Host/./HostTests/SocketTest.DecodeHostAndPort (1009 of 1915) UNSUPPORTED: lldb-api :: functionalities/darwin_log/format/TestDarwinLogMessageFormat.py (1010 of 1915) PASS: lldb-api :: macosx/indirect_symbol/TestIndirectSymbols.py (1011 of 1915) PASS: lldb-unit :: UnwindAssembly/x86/./UnwindAssemblyx86Tests/Testx86AssemblyInspectionEngine.TestPopR13 (1012 of 1915) PASS: lldb-unit :: UnwindAssembly/x86/./UnwindAssemblyx86Tests/Testx86AssemblyInspectionEngine.TestPopRBP (1013 of 1915) PASS: lldb-unit :: Utility/./UtilityTests/UUIDTest.Validity (1014 of 1915) PASS: lldb-api :: functionalities/data-formatter/format-propagation/TestFormatPropagation.py (1015 of 1915) PASS: lldb-api :: lang/cpp/diamond/TestDiamond.py (1016 of 1915) PASS: lldb-unit :: Utility/./UtilityTests/FileSpecTest.EqualDotsPosixRoot (1017 of 1915) PASS: lldb-api :: lang/cpp/namespace_conflicts/TestNamespaceConflicts.py (1018 of 1915) UNSUPPORTED: lldb-api :: linux/sepdebugsymlink/TestTargetSymbolsSepDebugSymlink.py (1019 of 1915) PASS: lldb-unit :: Utility/./UtilityTests/StringListTest.JoinEmpty (1020 of 1915) UNSUPPORTED: lldb-shell :: SymbolFile/DWARF/dwarf5-partial-index.cpp (1021 of 1915) PASS: lldb-unit :: UnwindAssembly/x86/./UnwindAssemblyx86Tests/Testx86AssemblyInspectionEngine.TestDisassemblyMidFunctionEpilogues (1022 of 1915) PASS: lldb-api :: commands/expression/calculator_mode/TestCalculatorMode.py (1023 of 1915) PASS: lldb-unit :: Symbol/./SymbolTests/Type.GetTypeScopeAndBasename (1024 of 1915) PASS: lldb-unit :: Host/./HostTests/NativeProcessProtocolTest.SetBreakpointFailVerify (1025 of 1915) PASS: lldb-shell :: SymbolFile/DWARF/split-dwarf-inlining.cpp (1026 of 1915) PASS: lldb-unit :: Utility/./UtilityTests/StringLexerTest.PutBack (1027 of 1915) PASS: lldb-unit :: ScriptInterpreter/Python/./ScriptInterpreterPythonTests/PythonDataObjectsTest.TestPythonByteArray (1028 of 1915) PASS: lldb-unit :: Utility/./UtilityTests/TimerTest.CategoryTimesNested (1029 of 1915) PASS: lldb-api :: functionalities/deleted-executable/TestDeletedExecutable.py (1030 of 1915) PASS: lldb-api :: commands/apropos/basic/TestApropos.py (1031 of 1915) PASS: lldb-unit :: Expression/./ExpressionTests/CppModuleConfigurationTest.IgnoreLibStdCpp (1032 of 1915) PASS: lldb-unit :: Utility/./UtilityTests/ScalarTest.RightShiftOperator (1033 of 1915) PASS: lldb-api :: lang/c/conflicting-symbol/TestConflictingSymbol.py (1034 of 1915) PASS: lldb-unit :: Target/./TargetTests/MemoryRegionInfoTest.Formatv (1035 of 1915) PASS: lldb-unit :: Process/gdb-remote/./ProcessGdbRemoteTests/GDBRemoteCommunicationClientTest.SendStartTracePacket (1036 of 1915) UNSUPPORTED: lldb-api :: functionalities/darwin_log/basic/TestDarwinLogBasic.py (1037 of 1915) PASS: lldb-api :: functionalities/avoids-fd-leak/TestFdLeak.py (1038 of 1915) PASS: lldb-unit :: Utility/./UtilityTests/SerializationRountripTest.SerializeDeserializePodReferences (1039 of 1915) PASS: lldb-api :: tools/lldb-server/TestLldbGdbServer.py (1040 of 1915) PASS: lldb-shell :: SymbolFile/DWARF/debug_loclists-dwo.s (1041 of 1915) PASS: lldb-unit :: Process/gdb-remote/./ProcessGdbRemoteTests/GDBRemoteCommunicationTest.ReadPacket_checksum (1042 of 1915) PASS: lldb-api :: functionalities/thread/jump/TestThreadJump.py (1043 of 1915) PASS: lldb-unit :: Utility/./UtilityTests/ArgsTest.TestQuotedUnknownEscape (1044 of 1915) UNSUPPORTED: lldb-api :: functionalities/ubsan/user-expression/TestUbsanUserExpression.py (1045 of 1915) PASS: lldb-unit :: Utility/./UtilityTests/DataExtractorTest.GetMaxS64 (1046 of 1915) PASS: lldb-api :: types/TestIntegerTypeExpr.py (1047 of 1915) PASS: lldb-unit :: Utility/./UtilityTests/VMRange.Ordering (1048 of 1915) PASS: lldb-unit :: Process/gdb-remote/./ProcessGdbRemoteTests/GDBRemoteCommunicationClientTest.WriteRegister (1049 of 1915) PASS: lldb-unit :: UnwindAssembly/x86/./UnwindAssemblyx86Tests/Testx86AssemblyInspectionEngine.TestPushEAX (1050 of 1915) PASS: lldb-unit :: UnwindAssembly/x86/./UnwindAssemblyx86Tests/Testx86AssemblyInspectionEngine.TestPushR14 (1051 of 1915) PASS: lldb-api :: commands/frame/language/TestGuessLanguage.py (1052 of 1915) PASS: lldb-api :: lang/objc/hidden-ivars/TestHiddenIvars.py (1053 of 1915) UNSUPPORTED: lldb-api :: arm/breakpoint-thumb-codesection/TestBreakpointThumbCodesection.py (1054 of 1915) PASS: lldb-unit :: Process/minidump/./LLDBMinidumpTests/MinidumpParserTest.GetExceptionStream (1055 of 1915) UNSUPPORTED: lldb-shell :: Register/aarch64-fp-read.test (1056 of 1915) PASS: lldb-unit :: UnwindAssembly/x86/./UnwindAssemblyx86Tests/Testx86AssemblyInspectionEngine.TestSimplex86_64Augmented (1057 of 1915) PASS: lldb-unit :: Host/./HostTests/SocketTest.TCPListen0GetPort (1058 of 1915) PASS: lldb-unit :: Utility/./UtilityTests/StreamTest.AddressNoSuffix (1059 of 1915) PASS: lldb-api :: functionalities/completion/TestCompletion.py (1060 of 1915) UNSUPPORTED: lldb-api :: commands/register/register/intel_xtended_registers/TestMPXRegisters.py (1061 of 1915) PASS: lldb-shell :: SymbolFile/Breakpad/symtab-macho.test (1062 of 1915) PASS: lldb-unit :: Utility/./UtilityTests/ScalarTest.GetValue (1063 of 1915) PASS: lldb-unit :: Host/./HostTests/NativeProcessProtocolTest.SetBreakpointFailWrite (1064 of 1915) PASS: lldb-shell :: ObjectFile/wasm/embedded-debug-sections.yaml (1065 of 1915) PASS: lldb-api :: functionalities/breakpoint/move_nearest/TestMoveNearest.py (1066 of 1915) PASS: lldb-unit :: Utility/./UtilityTests/RegularExpression.Empty (1067 of 1915) PASS: lldb-unit :: Utility/./UtilityTests/RangeTest.ContainsEndInclusiveInvalid (1068 of 1915) UNSUPPORTED: lldb-api :: benchmarks/startup/TestStartupDelays.py (1069 of 1915) PASS: lldb-api :: python_api/name_lookup/TestNameLookup.py (1070 of 1915) PASS: lldb-api :: commands/expression/call-function/TestCallBuiltinFunction.py (1071 of 1915) PASS: lldb-api :: lang/objc/self/TestObjCSelf.py (1072 of 1915) PASS: lldb-api :: functionalities/tail_call_frames/ambiguous_tail_call_seq2/TestAmbiguousTailCallSeq2.py (1073 of 1915) PASS: lldb-unit :: Utility/./UtilityTests/StatusTest.ErrorConversion (1074 of 1915) PASS: lldb-api :: python_api/sbvalue_const_addrof/TestSBValueConstAddrOf.py (1075 of 1915) PASS: lldb-api :: lang/c/modules/TestCModules.py (1076 of 1915) PASS: lldb-unit :: Utility/./UtilityTests/StringListTest.DefaultConstructor (1077 of 1915) PASS: lldb-unit :: Symbol/./SymbolTests/TestClangASTContext.TestUnifyAccessSpecifiers (1078 of 1915) PASS: lldb-api :: lang/cpp/dynamic-value/TestDynamicValue.py (1079 of 1915) PASS: lldb-unit :: Interpreter/./InterpreterTests/CompletionTest.DirCompletionUsername (1080 of 1915) PASS: lldb-api :: macosx/function-starts/TestFunctionStarts.py (1081 of 1915) PASS: lldb-shell :: Breakpoint/debug_rnglist_rlestartend.test (1082 of 1915) PASS: lldb-unit :: Utility/./UtilityTests/RangeTest.LessThanInvalid (1083 of 1915) PASS: lldb-shell :: SymbolFile/DWARF/find-qualified-variable.cpp (1084 of 1915) PASS: lldb-shell :: Commands/command-source.test (1085 of 1915) PASS: lldb-unit :: Utility/./UtilityTests/EventTest.DumpEventDataBytes (1086 of 1915) PASS: lldb-unit :: Process/minidump/./LLDBMinidumpTests/MinidumpParserTest.GetMemoryRegionInfoFromMemoryList (1087 of 1915) PASS: lldb-unit :: ScriptInterpreter/Python/./ScriptInterpreterPythonTests/PythonDataObjectsTest.TestPythonCallableCheck (1088 of 1915) PASS: lldb-unit :: Utility/./UtilityTests/UriParserTest.SchemeHostSeparator4 (1089 of 1915) PASS: lldb-unit :: UnwindAssembly/x86/./UnwindAssemblyx86Tests/Testx86AssemblyInspectionEngine.TestSimple32bitFrameFunction (1090 of 1915) PASS: lldb-api :: functionalities/data-formatter/data-formatter-advanced/TestDataFormatterAdv.py (1091 of 1915) PASS: lldb-unit :: Utility/./UtilityTests/RangeTest.SetRangeBase (1092 of 1915) PASS: lldb-unit :: Utility/./UtilityTests/VMRange.SetEndAddress (1093 of 1915) PASS: lldb-api :: lang/cpp/scope/TestCppScope.py (1094 of 1915) PASS: lldb-shell :: ObjectFile/MachO/lc_version_min.yaml (1095 of 1915) PASS: lldb-api :: lang/cpp/incomplete-types/TestCppIncompleteTypes.py (1096 of 1915) PASS: lldb-shell :: ObjectFile/PECOFF/basic-info-arm.yaml (1097 of 1915) PASS: lldb-api :: python_api/disassemble-raw-data/TestDisassembleRawData.py (1098 of 1915) PASS: lldb-api :: functionalities/breakpoint/breakpoint_locations/TestBreakpointLocations.py (1099 of 1915) PASS: lldb-shell :: Breakpoint/dummy-target.test (1100 of 1915) PASS: lldb-unit :: UnwindAssembly/PPC64/./PPC64InstEmulationTests/TestPPC64InstEmulation.TestMediumFunction (1101 of 1915) PASS: lldb-shell :: SymbolFile/DWARF/debug_loc-aslr.s (1102 of 1915) PASS: lldb-shell :: Register/x86-64-gp-read.test (1103 of 1915) PASS: lldb-unit :: Symbol/./SymbolTests/SymbolsTest.LocateExecutableSymbolFileForUnknownExecutableAndMissingSymbolFile (1104 of 1915) PASS: lldb-unit :: Language/Highlighting/./HighlighterTests/HighlighterTest.ClangComments (1105 of 1915) PASS: lldb-unit :: Utility/./UtilityTests/DataExtractorTest.GetCStrAtNullOffset (1106 of 1915) PASS: lldb-unit :: UnwindAssembly/x86/./UnwindAssemblyx86Tests/Testx86AssemblyInspectionEngine.TestSpArithx86_64Augmented (1107 of 1915) PASS: lldb-unit :: Symbol/./SymbolTests/TestClangASTContext.TestGetTypeClassTypeOfExpr (1108 of 1915) PASS: lldb-api :: lang/objc/radar-9691614/TestObjCMethodReturningBOOL.py (1109 of 1915) PASS: lldb-unit :: Expression/./ExpressionTests/DiagnosticManagerTest.GetStringBasic (1110 of 1915) PASS: lldb-unit :: Host/./HostTests/FileSystemTest.Exists (1111 of 1915) PASS: lldb-unit :: Utility/./UtilityTests/StringListTest.AppendStringCString (1112 of 1915) PASS: lldb-api :: functionalities/breakpoint/cpp_exception/TestCPPExceptionBreakpoint.py (1113 of 1915) PASS: lldb-api :: lang/cpp/static_methods/TestCPPStaticMethods.py (1114 of 1915) UNRESOLVED: lldb-api :: commands/expression/import-std-module/list-basic/TestBasicList.py (1115 of 1915) ******************** TEST 'lldb-api :: commands/expression/import-std-module/list-basic/TestBasicList.py' FAILED ******************** Unable to find 'RESULT: PASSED' in dotest output (exit code -11):

Hide Details

lldb version 11.0.99 clang revision e03ead6771fc97b11cb0c94b7f023142184ad25f llvm revision e03ead6771fc97b11cb0c94b7f023142184ad25f

Hide Details

******************** PASS: lldb-api :: lang/cpp/this/TestCPPThis.py (1116 of 1915) UNRESOLVED: lldb-api :: commands/expression/import-std-module/vector-bool/TestBoolVector.py (1117 of 1915) ******************** TEST 'lldb-api :: commands/expression/import-std-module/vector-bool/TestBoolVector.py' FAILED ******************** Unable to find 'RESULT: PASSED' in dotest output (exit code -11):

Hide Details

lldb version 11.0.99 clang revision e03ead6771fc97b11cb0c94b7f023142184ad25f llvm revision e03ead6771fc97b11cb0c94b7f023142184ad25f

Hide Details

******************** PASS: lldb-unit :: Process/gdb-remote/./ProcessGdbRemoteTests/GDBRemoteClientBaseTest.SendContinueAndAsyncPacket (1118 of 1915) PASS: lldb-unit :: Interpreter/./InterpreterTests/OptionArgParserTest.toChar (1119 of 1915) PASS: lldb-unit :: Utility/./UtilityTests/ArchSpecTest.MergeFromMachOUnknown (1120 of 1915) PASS: lldb-api :: lang/c/tls_globals/TestTlsGlobals.py (1121 of 1915) PASS: lldb-unit :: Utility/./UtilityTests/StreamTeeTest.SetStreamAtIndexOverwrite (1122 of 1915) PASS: lldb-api :: lang/cpp/wchar_t/TestCxxWCharT.py (1123 of 1915) UNSUPPORTED: lldb-api :: functionalities/thread/concurrent_events/TestConcurrentNWatchNBreak.py (1124 of 1915) PASS: lldb-unit :: Language/Highlighting/./HighlighterTests/HighlighterTest.DefaultHighlighterWithCursor (1125 of 1915) UNSUPPORTED: lldb-shell :: SymbolFile/PDB/compilands.test (1126 of 1915) PASS: lldb-api :: functionalities/object-file/TestImageListMultiArchitecture.py (1127 of 1915) UNRESOLVED: lldb-api :: commands/expression/import-std-module/deque-basic/TestBasicDeque.py (1128 of 1915) ******************** TEST 'lldb-api :: commands/expression/import-std-module/deque-basic/TestBasicDeque.py' FAILED ******************** Unable to find 'RESULT: PASSED' in dotest output (exit code -11):

Hide Details

lldb version 11.0.99 clang revision e03ead6771fc97b11cb0c94b7f023142184ad25f llvm revision e03ead6771fc97b11cb0c94b7f023142184ad25f

Hide Details

******************** PASS: lldb-api :: functionalities/breakpoint/auto_continue/TestBreakpointAutoContinue.py (1129 of 1915) PASS: lldb-unit :: Utility/./UtilityTests/StreamTest.PutULEB128 (1130 of 1915) PASS: lldb-api :: commands/expression/import-std-module/conflicts/TestStdModuleWithConflicts.py (1131 of 1915) PASS: lldb-api :: lang/cpp/namespace/TestNamespace.py (1132 of 1915) PASS: lldb-api :: lang/c/local_types/TestUseClosestType.py (1133 of 1915) PASS: lldb-shell :: ObjectFile/ELF/PT_TLS-overlap-PT_LOAD.yaml (1134 of 1915) UNSUPPORTED: lldb-api :: benchmarks/expression/TestExpressionCmd.py (1135 of 1915) UNRESOLVED: lldb-api :: functionalities/data-formatter/data-formatter-stl/libcxx/string/TestDataFormatterLibcxxString.py (1136 of 1915) ******************** TEST 'lldb-api :: functionalities/data-formatter/data-formatter-stl/libcxx/string/TestDataFormatterLibcxxString.py' FAILED ******************** Unable to find 'RESULT: PASSED' in dotest output (exit code -11):

Hide Details

lldb version 11.0.99 clang revision e03ead6771fc97b11cb0c94b7f023142184ad25f llvm revision e03ead6771fc97b11cb0c94b7f023142184ad25f

Hide Details

******************** UNSUPPORTED: lldb-shell :: SymbolFile/DWARF/find-method.cpp (1137 of 1915) UNSUPPORTED: lldb-shell :: SymbolFile/NativePDB/ast-methods.cpp (1138 of 1915) PASS: lldb-api :: lang/objc/objc-optimized/TestObjcOptimized.py (1139 of 1915) PASS: lldb-api :: python_api/frame/inlines/TestInlinedFrame.py (1140 of 1915) PASS: lldb-api :: lang/objc/objc-new-syntax/TestObjCNewSyntaxLiteral.py (1141 of 1915) PASS: lldb-shell :: Settings/TestEchoCommands.test (1142 of 1915) UNSUPPORTED: lldb-shell :: SymbolFile/PDB/func-symbols.test (1143 of 1915) PASS: lldb-api :: functionalities/unwind/noreturn/TestNoreturnUnwind.py (1144 of 1915) UNRESOLVED: lldb-api :: commands/expression/import-std-module/stack/TestStack.py (1145 of 1915) ******************** TEST 'lldb-api :: commands/expression/import-std-module/stack/TestStack.py' FAILED ******************** Unable to find 'RESULT: PASSED' in dotest output (exit code -11):

Hide Details

lldb version 11.0.99 clang revision e03ead6771fc97b11cb0c94b7f023142184ad25f llvm revision e03ead6771fc97b11cb0c94b7f023142184ad25f

Hide Details

******************** PASS: lldb-unit :: Utility/./UtilityTests/VASprintfTest.BufferResize (1146 of 1915) PASS: lldb-unit :: Utility/./UtilityTests/StreamTest.PutSLEB128 (1147 of 1915) PASS: lldb-unit :: Expression/./ExpressionTests/DiagnosticManagerTest.AddDiagnostic (1148 of 1915) UNSUPPORTED: lldb-api :: functionalities/thread/concurrent_events/TestConcurrentDelayWatchBreak.py (1149 of 1915) PASS: lldb-api :: commands/frame/var/TestFrameVar.py (1150 of 1915) PASS: lldb-api :: commands/source/info/TestSourceInfo.py (1151 of 1915) UNSUPPORTED: lldb-api :: commands/watchpoints/watchpoint_events/TestWatchpointEvents.py (1152 of 1915) UNSUPPORTED: lldb-api :: functionalities/thread/multi_break/TestMultipleBreakpoints.py (1153 of 1915) PASS: lldb-api :: commands/frame/recognizer/TestFrameRecognizer.py (1154 of 1915) UNSUPPORTED: lldb-shell :: SymbolFile/DWARF/inline-function-address-shared.test (1155 of 1915) PASS: lldb-unit :: UnwindAssembly/x86/./UnwindAssemblyx86Tests/Testx86AssemblyInspectionEngine.TestStackRealign32BitDisp_x86_64 (1156 of 1915) PASS: lldb-unit :: Utility/./UtilityTests/IndexToObjectTest.ObjectForIndex (1157 of 1915) PASS: lldb-api :: functionalities/data-formatter/data-formatter-smart-array/TestDataFormatterSmartArray.py (1158 of 1915) PASS: lldb-shell :: Quit/TestQuitExitCodeHexA.test (1159 of 1915) PASS: lldb-unit :: Symbol/./SymbolTests/DWARFCallFrameInfoTest.Basic_eh (1160 of 1915) PASS: lldb-unit :: Utility/./UtilityTests/StreamTest.AddressRangeEmptyRange (1161 of 1915) PASS: lldb-unit :: UnwindAssembly/ARM64/./Arm64InstEmulationTests/TestArm64InstEmulation.TestFramelessThreeEpilogueFunction (1162 of 1915) PASS: lldb-unit :: Utility/./UtilityTests/RangeTest.ContainsRange (1163 of 1915) PASS: lldb-api :: functionalities/data-formatter/pyobjsynthprovider/TestPyObjSynthProvider.py (1164 of 1915) PASS: lldb-api :: commands/help/TestHelp.py (1165 of 1915) PASS: lldb-unit :: Utility/./UtilityTests/StringListTest.LongestCommonPrefixNoPrefix (1166 of 1915) PASS: lldb-api :: commands/expression/call-overridden-method/TestCallOverriddenMethod.py (1167 of 1915) UNSUPPORTED: lldb-api :: functionalities/unwind/ehframe/TestEhFrameUnwind.py (1168 of 1915) PASS: lldb-unit :: Utility/./UtilityTests/LogChannelTest.EnableOptions (1169 of 1915) PASS: lldb-api :: commands/settings/TestSettings.py (1170 of 1915) UNSUPPORTED: lldb-api :: functionalities/darwin_log/source/debug/TestDarwinLogSourceDebug.py (1171 of 1915) PASS: lldb-unit :: ScriptInterpreter/Python/./ScriptInterpreterPythonTests/PythonDataObjectsTest.TestPythonBytes (1172 of 1915) PASS: lldb-api :: functionalities/breakpoint/address_breakpoints/TestBadAddressBreakpoints.py (1173 of 1915) PASS: lldb-api :: commands/expression/deleting-implicit-copy-constructor/TestDeletingImplicitCopyConstructor.py (1174 of 1915) PASS: lldb-shell :: Settings/TestFrameFormatNoColor.test (1175 of 1915) PASS: lldb-unit :: UnwindAssembly/x86/./UnwindAssemblyx86Tests/Testx86AssemblyInspectionEngine.TestPush0 (1176 of 1915) PASS: lldb-unit :: Utility/./UtilityTests/StringListTest.CopyListSingle (1177 of 1915) PASS: lldb-shell :: BuildScript/modes.test (1178 of 1915) PASS: lldb-unit :: ObjectFile/Breakpad/./ObjectFileBreakpadTests/PublicRecord.parse (1179 of 1915) PASS: lldb-unit :: Symbol/./SymbolTests/TestClangASTContext.TestConvertAccessTypeToAccessSpecifier (1180 of 1915) PASS: lldb-unit :: Utility/./UtilityTests/StringListTest.AppendListCStringArrayEmpty (1181 of 1915) PASS: lldb-api :: functionalities/data-formatter/boolreference/TestFormattersBoolRefPtr.py (1182 of 1915) PASS: lldb-unit :: Utility/./UtilityTests/CompletionRequest.Constructor (1183 of 1915) PASS: lldb-unit :: Utility/./UtilityTests/StringListTest.ShiftCString (1184 of 1915) UNRESOLVED: lldb-api :: commands/expression/import-std-module/shared_ptr/TestSharedPtr.py (1185 of 1915) ******************** TEST 'lldb-api :: commands/expression/import-std-module/shared_ptr/TestSharedPtr.py' FAILED ******************** Unable to find 'RESULT: PASSED' in dotest output (exit code -11):

Hide Details

lldb version 11.0.99 clang revision e03ead6771fc97b11cb0c94b7f023142184ad25f llvm revision e03ead6771fc97b11cb0c94b7f023142184ad25f

Hide Details

******************** PASS: lldb-unit :: Utility/./UtilityTests/AnsiTerminal.Incomplete (1186 of 1915) PASS: lldb-api :: lang/objc/foundation/TestObjCMethodsNSError.py (1187 of 1915) PASS: lldb-unit :: Utility/./UtilityTests/OptionsWithRawTest.EmptyArgsOnlySuffix (1188 of 1915) PASS: lldb-unit :: Utility/./UtilityTests/BinaryStreamTest.PutULEB128TwoBytes (1189 of 1915) PASS: lldb-api :: python_api/process/TestProcessAPI.py (1190 of 1915) PASS: lldb-api :: lang/cpp/breakpoint-commands/TestCPPBreakpointCommands.py (1191 of 1915) UNSUPPORTED: lldb-api :: lang/objc/rdar-12408181/TestRdar12408181.py (1192 of 1915) PASS: lldb-unit :: Utility/./UtilityTests/ConstStringTest.CompareStringRef (1193 of 1915) PASS: lldb-unit :: Process/minidump/./LLDBMinidumpTests/RegisterContextMinidump.ConvertMinidumpContext_x86_64 (1194 of 1915) PASS: lldb-api :: commands/expression/anonymous-struct/TestCallUserAnonTypedef.py (1195 of 1915) PASS: lldb-unit :: Utility/./UtilityTests/SubsystemRAIITest.SubsystemWithErrorFailure (1196 of 1915) PASS: lldb-unit :: Host/./HostTests/TaskPoolTest.RunTasks (1197 of 1915) PASS: lldb-unit :: Utility/./UtilityTests/LogTest.Unregister (1198 of 1915) PASS: lldb-unit :: Process/gdb-remote/./ProcessGdbRemoteTests/GDBRemoteClientBaseTest.InterruptNoResponse (1199 of 1915) PASS: lldb-api :: python_api/sbtype_typeclass/TestSBTypeTypeClass.py (1200 of 1915) PASS: lldb-unit :: UnwindAssembly/x86/./UnwindAssemblyx86Tests/Testx86AssemblyInspectionEngine.TestPushR15 (1201 of 1915) PASS: lldb-api :: functionalities/thread/concurrent_events/TestConcurrentBreakpointOneDelayBreakpointThreads.py (1202 of 1915) PASS: lldb-api :: lang/objc/unicode-string/TestUnicodeString.py (1203 of 1915) PASS: lldb-api :: iohandler/completion/TestIOHandlerCompletion.py (1204 of 1915) PASS: lldb-unit :: Utility/./UtilityTests/LogChannelEnabledTest.log_options (1205 of 1915) PASS: lldb-unit :: Utility/./UtilityTests/NameMatchesTest.Contains (1206 of 1915) UNSUPPORTED: lldb-api :: tools/lldb-server/signal-filtering/TestGdbRemote_QPassSignals.py (1207 of 1915) PASS: lldb-unit :: Language/Highlighting/./HighlighterTests/HighlighterTest.DefaultHighlighterWithCursorOutOfBounds (1208 of 1915) UNSUPPORTED: lldb-shell :: SymbolFile/DWARF/find-basic-type.cpp (1209 of 1915) PASS: lldb-unit :: ScriptInterpreter/Python/./ScriptInterpreterPythonTests/PythonDataObjectsTest.TestPythonListValueEquality (1210 of 1915) PASS: lldb-api :: functionalities/non-overlapping-index-variable-i/TestIndexVariable.py (1211 of 1915) UNSUPPORTED: lldb-shell :: SymbolFile/dissassemble-entry-point.s (1212 of 1915) UNSUPPORTED: lldb-api :: commands/watchpoints/watchpoint_on_vectors/TestValueOfVectorVariable.py (1213 of 1915) UNSUPPORTED: lldb-api :: linux/mix-dwo-and-regular-objects/TestMixedDwarfBinary.py (1214 of 1915) UNSUPPORTED: lldb-api :: benchmarks/libcxxmap/TestBenchmarkLibcxxMap.py (1215 of 1915) PASS: lldb-unit :: Host/./HostTests/NativeProcessProtocolTest.SetBreakpointFailRead (1216 of 1915) PASS: lldb-unit :: SymbolFile/DWARF/./SymbolFileDWARFTests/SymbolFileDWARFTests.TestAbbrevNullAttrValidForm (1217 of 1915) PASS: lldb-shell :: SymbolFile/DWARF/debug-types-missing-signature.test (1218 of 1915) PASS: lldb-api :: functionalities/breakpoint/dummy_target_breakpoints/TestBreakpointsWithNoTargets.py (1219 of 1915) PASS: lldb-unit :: Utility/./UtilityTests/LogChannelTest.Disable (1220 of 1915) PASS: lldb-api :: functionalities/fat_archives/TestFatArchives.py (1221 of 1915) PASS: lldb-shell :: SymbolFile/DWARF/debug_line-relative_path.s (1222 of 1915) PASS: lldb-unit :: Utility/./UtilityTests/AnsiTerminal.Basic (1223 of 1915) PASS: lldb-unit :: Process/gdb-remote/./ProcessGdbRemoteTests/GDBRemoteCommunicationServerTest.SendErrorResponse_Status (1224 of 1915) PASS: lldb-unit :: Utility/./UtilityTests/Predicate.WaitForValueNotEqualTo (1225 of 1915) PASS: lldb-api :: lang/cpp/operators/TestCppOperators.py (1226 of 1915) PASS: lldb-unit :: Utility/./UtilityTests/ArgsTest.TestOverwriteArgs (1227 of 1915) PASS: lldb-unit :: Utility/./UtilityTests/RangeDataVector.FindEntryThatContains (1228 of 1915) UNSUPPORTED: lldb-shell :: SymbolFile/DWARF/debug-types-address-ranges.s (1229 of 1915) PASS: lldb-api :: commands/expression/two-files/TestObjCTypeQueryFromOtherCompileUnit.py (1230 of 1915) PASS: lldb-api :: functionalities/memory-region/TestMemoryRegion.py (1231 of 1915) PASS: lldb-unit :: Process/minidump/./LLDBMinidumpTests/MinidumpParserTest.GetMemory (1232 of 1915) UNSUPPORTED: lldb-api :: benchmarks/libcxxlist/TestBenchmarkLibcxxList.py (1233 of 1915) PASS: lldb-api :: functionalities/breakpoint/address_breakpoints/TestAddressBreakpoints.py (1234 of 1915) UNRESOLVED: lldb-api :: commands/expression/import-std-module/vector-of-vectors/TestVectorOfVectors.py (1235 of 1915) ******************** TEST 'lldb-api :: commands/expression/import-std-module/vector-of-vectors/TestVectorOfVectors.py' FAILED ******************** Unable to find 'RESULT: PASSED' in dotest output (exit code -11):

Hide Details

lldb version 11.0.99 clang revision e03ead6771fc97b11cb0c94b7f023142184ad25f llvm revision e03ead6771fc97b11cb0c94b7f023142184ad25f

Hide Details

******************** UNSUPPORTED: lldb-api :: functionalities/thread/concurrent_events/TestConcurrentSignalDelayWatch.py (1236 of 1915) PASS: lldb-unit :: Host/./HostTests/NativeProcessProtocolTest.ReadMemoryWithoutTrap (1237 of 1915) PASS: lldb-shell :: ObjectFile/ELF/minidebuginfo-find-symbols.yaml (1238 of 1915) PASS: lldb-api :: commands/quit/TestQuit.py (1239 of 1915) PASS: lldb-api :: functionalities/data-formatter/data-formatter-objc/nsindexpath/TestDataFormatterNSIndexPath.py (1240 of 1915) PASS: lldb-shell :: ObjectFile/PECOFF/section-types.yaml (1241 of 1915) PASS: lldb-api :: functionalities/data-formatter/vector-types/TestVectorTypesFormatting.py (1242 of 1915) PASS: lldb-unit :: Utility/./UtilityTests/StringListTest.ForRange (1243 of 1915) UNRESOLVED: lldb-api :: functionalities/data-formatter/data-formatter-stl/libcxx/map/TestDataFormatterLibccMap.py (1244 of 1915) ******************** TEST 'lldb-api :: functionalities/data-formatter/data-formatter-stl/libcxx/map/TestDataFormatterLibccMap.py' FAILED ******************** Unable to find 'RESULT: PASSED' in dotest output (exit code -11):

Hide Details

lldb version 11.0.99 clang revision e03ead6771fc97b11cb0c94b7f023142184ad25f llvm revision e03ead6771fc97b11cb0c94b7f023142184ad25f

Hide Details

******************** UNSUPPORTED: lldb-api :: commands/watchpoints/hello_watchlocation/TestWatchLocation.py (1245 of 1915) UNSUPPORTED: lldb-api :: lang/cpp/function-template-parameter-pack/TestFunctionTemplateParameterPack.py (1246 of 1915) PASS: lldb-unit :: Process/gdb-remote/./ProcessGdbRemoteTests/GDBRemoteCommunicationClientTest.GetModulesInfo_UUID20 (1247 of 1915) PASS: lldb-api :: lang/objc/foundation/TestObjCMethods2.py (1248 of 1915) PASS: lldb-unit :: Utility/./UtilityTests/RangeDataVector.FindEntryThatContains_Overlap (1249 of 1915) PASS: lldb-shell :: SymbolFile/DWARF/debug_loc.s (1250 of 1915) PASS: lldb-api :: functionalities/data-formatter/data-formatter-script/TestDataFormatterScript.py (1251 of 1915) UNSUPPORTED: lldb-api :: commands/expression/namespace_local_var_same_name_cpp_and_c/TestNamespaceLocalVarSameNameCppAndC.py (1252 of 1915) PASS: lldb-unit :: UnwindAssembly/x86/./UnwindAssemblyx86Tests/Testx86AssemblyInspectionEngine.Test64bitFramelessSmallStackFrame (1253 of 1915) PASS: lldb-api :: tools/lldb-server/TestGdbRemoteSingleStep.py (1254 of 1915) PASS: lldb-unit :: Utility/./UtilityTests/FileSpecTest.IsRelative (1255 of 1915) PASS: lldb-unit :: Utility/./UtilityTests/ArchSpecTest.TestSetTriple (1256 of 1915) PASS: lldb-unit :: Utility/./UtilityTests/UriParserTest.TypicalPortPath (1257 of 1915) PASS: lldb-unit :: Process/minidump/./LLDBMinidumpTests/MinidumpParserTest.InvalidMinidump (1258 of 1915) PASS: lldb-api :: tools/lldb-vscode/step/TestVSCode_step.py (1259 of 1915) PASS: lldb-api :: lang/objc/objc++/TestObjCXX.py (1260 of 1915) PASS: lldb-unit :: Signals/./SignalsTests/UnixSignalsTest.Iteration (1261 of 1915) PASS: lldb-unit :: Core/./LLDBCoreTests/MangledTest.ResultForValidName (1262 of 1915) UNRESOLVED: lldb-api :: python_api/lldbutil/iter/TestLLDBIterator.py (1263 of 1915) ******************** TEST 'lldb-api :: python_api/lldbutil/iter/TestLLDBIterator.py' FAILED ******************** Unable to find 'RESULT: PASSED' in dotest output (exit code -11):

Hide Details

lldb version 11.0.99 clang revision e03ead6771fc97b11cb0c94b7f023142184ad25f llvm revision e03ead6771fc97b11cb0c94b7f023142184ad25f

Hide Details

******************** PASS: lldb-unit :: Utility/./UtilityTests/StringExtractorTest.GetHexU8_Underflow_NoEof (1264 of 1915) PASS: lldb-api :: lang/cpp/accelerator-table/TestCPPAccelerator.py (1265 of 1915) PASS: lldb-unit :: Utility/./UtilityTests/RegularExpression.CopyAssignment (1266 of 1915) PASS: lldb-unit :: Utility/./UtilityTests/BinaryStreamTest.PutULEB128SixBytes (1267 of 1915) UNSUPPORTED: lldb-shell :: SymbolFile/PDB/typedefs.test (1268 of 1915) PASS: lldb-unit :: debugserver/./debugserverTests/RNBSocket.LoopBackConnectIPv6 (1269 of 1915) PASS: lldb-api :: lang/c/vla/TestVLA.py (1270 of 1915) PASS: lldb-unit :: SymbolFile/DWARF/./SymbolFileDWARFTests/SymbolFileDWARFTests.TestAbbrevInvalidNULLTag (1271 of 1915) PASS: lldb-api :: functionalities/inferior-crashing/TestInferiorCrashing.py (1272 of 1915) PASS: lldb-api :: functionalities/data-formatter/data-formatter-enum-format/TestDataFormatterEnumFormat.py (1273 of 1915) PASS: lldb-api :: functionalities/tail_call_frames/sbapi_support/TestTailCallFrameSBAPI.py (1274 of 1915) PASS: lldb-unit :: Symbol/./SymbolTests/Type.CompilerContextPattern (1275 of 1915) PASS: lldb-api :: macosx/thread-names/TestInterruptThreadNames.py (1276 of 1915) PASS: lldb-api :: functionalities/data-formatter/data-formatter-objc/TestDataFormatterObjCNSContainer.py (1277 of 1915) PASS: lldb-unit :: Utility/./UtilityTests/StreamTest.AddressPrefixAndSuffix (1278 of 1915) UNSUPPORTED: lldb-api :: commands/watchpoints/watchpoint_commands/TestWatchpointCommands.py (1279 of 1915) PASS: lldb-api :: functionalities/gdb_remote_client/TestJLink6Armv7RegisterDefinition.py (1280 of 1915) PASS: lldb-unit :: Language/Highlighting/./HighlighterTests/HighlighterTest.ClangSquareBrackets (1281 of 1915) PASS: lldb-unit :: Process/minidump/./LLDBMinidumpTests/RegisterContextMinidump.CheckRegisterContextMinidump_ARM (1282 of 1915) PASS: lldb-unit :: Utility/./UtilityTests/RecordReplayTest.InstrumentedBarRef (1283 of 1915) PASS: lldb-api :: functionalities/ptr_refs/TestPtrRefs.py (1284 of 1915) PASS: lldb-api :: functionalities/data-formatter/data-formatter-proper-plurals/TestFormattersOneIsSingular.py (1285 of 1915) PASS: lldb-unit :: Host/./HostTests/FileSystemTest.Readable (1286 of 1915) PASS: lldb-api :: commands/expression/radar_9531204/TestPrintfAfterUp.py (1287 of 1915) PASS: lldb-api :: functionalities/data-formatter/data-formatter-objc/TestDataFormatterObjCKVO.py (1288 of 1915) PASS: lldb-unit :: Process/minidump/./LLDBMinidumpTests/MinidumpParserTest.GetThreadContext_x86_64 (1289 of 1915) PASS: lldb-api :: functionalities/paths/TestPaths.py (1290 of 1915) PASS: lldb-api :: commands/expression/completion-crash-incomplete-record/TestCompletionCrashIncompleteRecord.py (1291 of 1915) PASS: lldb-unit :: Utility/./UtilityTests/CompletionRequest.TryCompleteCurrentArgMode (1292 of 1915) PASS: lldb-api :: commands/expression/options/TestExprOptions.py (1293 of 1915) PASS: lldb-api :: python_api/get-value-32bit-int/TestGetValue32BitInt.py (1294 of 1915) UNSUPPORTED: lldb-api :: lang/c/typedef/Testtypedef.py (1295 of 1915) UNRESOLVED: lldb-api :: commands/expression/call-function/TestCallStdStringFunction.py (1296 of 1915) ******************** TEST 'lldb-api :: commands/expression/call-function/TestCallStdStringFunction.py' FAILED ******************** Unable to find 'RESULT: PASSED' in dotest output (exit code -11):

Hide Details

lldb version 11.0.99 clang revision e03ead6771fc97b11cb0c94b7f023142184ad25f llvm revision e03ead6771fc97b11cb0c94b7f023142184ad25f

Hide Details

******************** PASS: lldb-api :: lang/objc/objc-ivar-protocols/TestIvarProtocols.py (1297 of 1915) UNSUPPORTED: lldb-api :: functionalities/thread/concurrent_events/TestConcurrentSignalWatch.py (1298 of 1915) PASS: lldb-api :: commands/expression/import-std-module/no-std-module/TestMissingStdModule.py (1299 of 1915) PASS: lldb-api :: commands/expression/multiline-navigation/TestMultilineNavigation.py (1300 of 1915) PASS: lldb-unit :: Utility/./UtilityTests/ArgsTest.ReplaceArgumentAtIndexShort (1301 of 1915) PASS: lldb-unit :: Utility/./UtilityTests/StringExtractorTest.GetHexU8_InvalidHex (1302 of 1915) PASS: lldb-api :: functionalities/step_scripted/TestStepScripted.py (1303 of 1915) PASS: lldb-api :: lang/objc/objc-runtime-ivars/TestRuntimeIvars.py (1304 of 1915) UNSUPPORTED: lldb-api :: functionalities/darwin_log/filter/exact_match/activity-chain/TestDarwinLogFilterMatchActivityChain.py (1305 of 1915) UNSUPPORTED: lldb-api :: functionalities/thread/concurrent_events/TestConcurrentWatchpointWithDelayWatchpointThreads.py (1306 of 1915) PASS: lldb-unit :: Utility/./UtilityTests/EnvironmentTest.EnvpConversion (1307 of 1915) PASS: lldb-shell :: ObjectFile/Breakpad/sections.test (1308 of 1915) PASS: lldb-unit :: Utility/./UtilityTests/BinaryStreamTest.PutSLEB128One (1309 of 1915) PASS: lldb-unit :: ScriptInterpreter/Python/./ScriptInterpreterPythonTests/PythonDataObjectsTest.TestPythonDictionaryToStructuredDictionary (1310 of 1915) PASS: lldb-api :: python_api/sblaunchinfo/TestSBLaunchInfo.py (1311 of 1915) PASS: lldb-unit :: Utility/./UtilityTests/StringListTest.SplitIntoLinesSingleTrailingCR (1312 of 1915) PASS: lldb-api :: commands/expression/call-throws/TestCallThatThrows.py (1313 of 1915) PASS: lldb-shell :: Register/x86-64-read.test (1314 of 1915) PASS: lldb-api :: lang/objc/objc-ivar-offsets/TestObjCIvarOffsets.py (1315 of 1915) UNRESOLVED: lldb-api :: functionalities/data-formatter/data-formatter-stl/libcxx/iterator/TestDataFormatterLibccIterator.py (1316 of 1915) ******************** TEST 'lldb-api :: functionalities/data-formatter/data-formatter-stl/libcxx/iterator/TestDataFormatterLibccIterator.py' FAILED ******************** Unable to find 'RESULT: PASSED' in dotest output (exit code -11):

Hide Details

lldb version 11.0.99 clang revision e03ead6771fc97b11cb0c94b7f023142184ad25f llvm revision e03ead6771fc97b11cb0c94b7f023142184ad25f

Hide Details

******************** PASS: lldb-api :: lang/c/shared_lib_stripped_symbols/TestSharedLibStrippedSymbols.py (1317 of 1915) UNSUPPORTED: lldb-shell :: ScriptInterpreter/Lua/persistent_state.test (1318 of 1915) PASS: lldb-api :: lang/cpp/class_static/TestStaticVariables.py (1319 of 1915) PASS: lldb-api :: functionalities/breakpoint/scripted_bkpt/TestScriptedResolver.py (1320 of 1915) PASS: lldb-api :: lang/cpp/chained-calls/TestCppChainedCalls.py (1321 of 1915) PASS: lldb-api :: lang/cpp/gmodules-templates/TestGModules.py (1322 of 1915) UNSUPPORTED: lldb-api :: functionalities/asan/TestReportData.py (1323 of 1915) PASS: lldb-unit :: Utility/./UtilityTests/TildeExpressionResolver.ResolveFullPath (1324 of 1915) PASS: lldb-unit :: Process/gdb-remote/./ProcessGdbRemoteTests/GDBRemoteCommunicationClientTest.ReadRegister (1325 of 1915) PASS: lldb-unit :: Symbol/./SymbolTests/TestClangASTContext.TestNotDeletingUserCopyCstrDueToMoveCStr (1326 of 1915) PASS: lldb-unit :: SymbolFile/DWARF/./SymbolFileDWARFTests/SymbolFileDWARFTests.TestAbbrevMissingTerminator (1327 of 1915) UNSUPPORTED: lldb-shell :: SymbolFile/DWARF/find-basic-namespace.cpp (1328 of 1915) PASS: lldb-shell :: ScriptInterpreter/None/none.test (1329 of 1915) PASS: lldb-unit :: Process/minidump/./LLDBMinidumpTests/MinidumpParserTest.GetPidWow64 (1330 of 1915) PASS: lldb-unit :: Process/gdb-remote/./ProcessGdbRemoteTests/GDBRemoteCommunicationServerTest.SendErrorResponse_UnimplementedError (1331 of 1915) PASS: lldb-unit :: Utility/./UtilityTests/TimeoutTest.Format (1332 of 1915) PASS: lldb-unit :: Utility/./UtilityTests/ArgsTest.TestQuotedTrailingBackslash (1333 of 1915) PASS: lldb-api :: python_api/value/empty_class/TestValueAPIEmptyClass.py (1334 of 1915) UNRESOLVED: lldb-api :: python_api/sbvalue_persist/TestSBValuePersist.py (1335 of 1915) ******************** TEST 'lldb-api :: python_api/sbvalue_persist/TestSBValuePersist.py' FAILED ******************** Unable to find 'RESULT: PASSED' in dotest output (exit code -11):

Hide Details

lldb version 11.0.99 clang revision e03ead6771fc97b11cb0c94b7f023142184ad25f llvm revision e03ead6771fc97b11cb0c94b7f023142184ad25f

Hide Details

******************** PASS: lldb-unit :: Host/./HostTests/FileSystemTest.MakeAbsolute (1336 of 1915) UNRESOLVED: lldb-api :: commands/expression/import-std-module/queue/TestQueue.py (1337 of 1915) ******************** TEST 'lldb-api :: commands/expression/import-std-module/queue/TestQueue.py' FAILED ******************** Unable to find 'RESULT: PASSED' in dotest output (exit code -11):

Hide Details

lldb version 11.0.99 clang revision e03ead6771fc97b11cb0c94b7f023142184ad25f llvm revision e03ead6771fc97b11cb0c94b7f023142184ad25f

Hide Details

******************** PASS: lldb-unit :: Utility/./UtilityTests/CompletionRequest.DuplicateFilteringWithComments (1338 of 1915) PASS: lldb-unit :: Utility/./UtilityTests/AnsiTerminal.Unknown (1339 of 1915) PASS: lldb-api :: commands/expression/cast_int_to_anonymous_enum/TestCastIntToAnonymousEnum.py (1340 of 1915) PASS: lldb-shell :: ObjectFile/ELF/netbsd-exec-8.99.30-amd64.yaml (1341 of 1915) UNSUPPORTED: lldb-shell :: SymbolFile/PDB/enums-layout.test (1342 of 1915) PASS: lldb-api :: commands/breakpoint/command/list/TestBreakpointCommandList.py (1343 of 1915) PASS: lldb-api :: functionalities/breakpoint/breakpoint_ignore_count/TestBreakpointIgnoreCount.py (1344 of 1915) PASS: lldb-api :: functionalities/rerun/TestRerun.py (1345 of 1915) PASS: lldb-api :: functionalities/postmortem/wow64_minidump/TestWow64MiniDump.py (1346 of 1915) PASS: lldb-api :: functionalities/thread/thread_specific_break/TestThreadSpecificBreakpoint.py (1347 of 1915) PASS: lldb-api :: functionalities/breakpoint/breakpoint_by_line_and_column/TestBreakpointByLineAndColumn.py (1348 of 1915) PASS: lldb-unit :: SymbolFile/NativePDB/./SymbolFileNativePDBTests/PDBFPOProgramToDWARFExpressionTests.UnresolvedDependentCyclicRegisterAssignmentReference (1349 of 1915) PASS: lldb-shell :: SymbolFile/DWARF/childless-compile-unit.s (1350 of 1915) PASS: lldb-unit :: Expression/./ExpressionTests/CppModuleConfigurationTest.MissingUsrInclude (1351 of 1915) PASS: lldb-unit :: Utility/./UtilityTests/StringListTest.JoinThree (1352 of 1915) PASS: lldb-unit :: Symbol/./SymbolTests/TestClangASTContext.TestIsClangType (1353 of 1915) PASS: lldb-api :: lang/c/global_variables/TestGlobalVariables.py (1354 of 1915) PASS: lldb-unit :: UnwindAssembly/x86/./UnwindAssemblyx86Tests/Testx86AssemblyInspectionEngine.TestPopRBPWithREX (1355 of 1915) PASS: lldb-unit :: Process/gdb-remote/./ProcessGdbRemoteTests/GDBRemoteCommunicationClientTest.GetModulesInfoInvalidResponse (1356 of 1915) PASS: lldb-shell :: SymbolFile/DWARF/clang-ast-from-dwarf-unamed-and-anon-structs.cpp (1357 of 1915) PASS: lldb-unit :: Utility/./UtilityTests/ScalarTest.Scalar_512 (1358 of 1915) PASS: lldb-unit :: Utility/./UtilityTests/CompletionRequest.DuplicateFiltering (1359 of 1915) UNSUPPORTED: lldb-api :: functionalities/data-formatter/data-formatter-stl/libstdcpp/tuple/TestDataFormatterStdTuple.py (1360 of 1915) PASS: lldb-shell :: Driver/TestRepl.test (1361 of 1915) UNSUPPORTED: lldb-shell :: SymbolFile/DWARF/find-variable-dwo.cpp (1362 of 1915) UNSUPPORTED: lldb-api :: functionalities/thread/concurrent_events/TestConcurrentTwoBreakpointsOneWatchpoint.py (1363 of 1915) PASS: lldb-shell :: ObjectFile/PECOFF/symbol.yaml (1364 of 1915) PASS: lldb-api :: lang/c/strings/TestCStrings.py (1365 of 1915) PASS: lldb-shell :: Driver/TestCore.test (1366 of 1915) PASS: lldb-unit :: UnwindAssembly/x86/./UnwindAssemblyx86Tests/Testx86AssemblyInspectionEngine.TestDisassemblyJunkBytes (1367 of 1915) UNRESOLVED: lldb-api :: functionalities/thread/concurrent_events/TestConcurrentManyBreakpoints.py (1368 of 1915) ******************** TEST 'lldb-api :: functionalities/thread/concurrent_events/TestConcurrentManyBreakpoints.py' FAILED ******************** Unable to find 'RESULT: PASSED' in dotest output (exit code -11):

Hide Details

lldb version 11.0.99 clang revision e03ead6771fc97b11cb0c94b7f023142184ad25f llvm revision e03ead6771fc97b11cb0c94b7f023142184ad25f

Hide Details

Session logs for test failures/errors/unexpected successes will go into directory '/Users/buildslave/jenkins/workspace/lldb-cmake-matrix/test/logs' Command invoked: /Users/buildslave/jenkins/workspace/lldb-cmake-matrix/llvm-project/lldb/test/API/dotest.py --arch x86_64 -s /Users/buildslave/jenkins/workspace/lldb-cmake-matrix/lldb-build/lldb-test-traces -S nm -u CXXFLAGS -u CFLAGS --codesign-identity lldb_codesign --server /Users/buildslave/jenkins/workspace/lldb-cmake-matrix/lldb-build/./bin/debugserver --arch x86_64 --build-dir /Users/buildslave/jenkins/workspace/lldb-cmake-matrix/lldb-build/lldb-test-build.noindex -s=/Users/buildslave/jenkins/workspace/lldb-cmake-matrix/test/logs -t --env TERM=vt100 --skip-category gmodules --skip-category watchpoint --arch=x86_64 --dwarf-version=4 --env LLVM_LIBS_DIR=/Users/buildslave/jenkins/workspace/lldb-cmake-matrix/lldb-build/./lib --build-dir /Users/buildslave/jenkins/workspace/lldb-cmake-matrix/lldb-build/lldb-test-build.noindex --lldb-module-cache-dir /Users/buildslave/jenkins/workspace/lldb-cmake-matrix/lldb-build/lldb-test-build.noindex/module-cache-lldb/lldb-api --clang-module-cache-dir /Users/buildslave/jenkins/workspace/lldb-cmake-matrix/lldb-build/lldb-test-build.noindex/module-cache-clang/lldb-api --executable /Users/buildslave/jenkins/workspace/lldb-cmake-matrix/lldb-build/./bin/lldb --compiler /Users/buildslave/jenkins/workspace/lldb-cmake-matrix/lldb-build/./bin/clang --dsymutil /Users/buildslave/jenkins/workspace/lldb-cmake-matrix/lldb-build/./bin/dsymutil --filecheck /Users/buildslave/jenkins/workspace/lldb-cmake-matrix/lldb-build/./bin/FileCheck /Users/buildslave/jenkins/workspace/lldb-cmake-matrix/llvm-project/lldb/packages/Python/lldbsuite/test/functionalities/thread/concurrent_events -p TestConcurrentManyBreakpoints.py Change dir to: /Users/buildslave/jenkins/workspace/lldb-cmake-matrix/llvm-project/lldb/packages/Python/lldbsuite/test/functionalities/thread/concurrent_events runCmd: settings set symbols.enable-external-lookup false output:

Hide Details

runCmd: settings set plugin.process.gdb-remote.packet-timeout 60 output:

Hide Details

runCmd: settings set symbols.clang-modules-cache-path "/Users/buildslave/jenkins/workspace/lldb-cmake-matrix/lldb-build/lldb-test-build.noindex/module-cache-lldb/lldb-api" output:

Hide Details

runCmd: settings set use-color false output:

Hide Details

runCmd: file /Users/buildslave/jenkins/workspace/lldb-cmake-matrix/lldb-build/lldb-test-build.noindex/functionalities/thread/concurrent_events/TestConcurrentManyBreakpoints.test/a.out output: Current executable set to '/Users/buildslave/jenkins/workspace/lldb-cmake-matrix/lldb-build/lldb-test-build.noindex/functionalities/thread/concurrent_events/TestConcurrentManyBreakpoints.test/a.out' (x86_64).

Hide Details

Hide Details

runCmd: breakpoint set -f "main.cpp" -l 138 output: Breakpoint 1: where = a.out`dotest() + 77 at main.cpp:138:5, address = 0x000000010000174d

Hide Details

Hide Details

Expecting pattern: ^Breakpoint (?P<bpno>[0-9]+): (?P<num_locations>[0-9]+) locations\.$ Not matched

Hide Details

Expecting pattern: ^Breakpoint (?P<bpno>[0-9]+): (?P<num_locations>no) locations \(pending\)\. Not matched

Hide Details

Expecting pattern: ^Breakpoint (?P<bpno>[0-9]+): where = (?P<module>.*)`(?P<symbol>[+\-]{0,1}[^+]+)( \+ (?P<offset>[0-9]+)){0,1}( \[inlined\] (?P<inline_symbol>.*)){0,1} at (?P<file>[^:]+):(?P<line_no>[0-9]+)(?P<column>(:[0-9]+)?), address = (?P<address>0x[0-9a-fA-F]+)$ Matched

Hide Details

runCmd: breakpoint set -f "main.cpp" -l 184 output: Breakpoint 2: where = a.out`main + 25 at main.cpp:184:5, address = 0x0000000100001dc9

Hide Details

Hide Details

Expecting pattern: ^Breakpoint (?P<bpno>[0-9]+): (?P<num_locations>[0-9]+) locations\.$ Not matched

Hide Details

Expecting pattern: ^Breakpoint (?P<bpno>[0-9]+): (?P<num_locations>no) locations \(pending\)\. Not matched

Hide Details

Expecting pattern: ^Breakpoint (?P<bpno>[0-9]+): where = (?P<module>.*)`(?P<symbol>[+\-]{0,1}[^+]+)( \+ (?P<offset>[0-9]+)){0,1}( \[inlined\] (?P<inline_symbol>.*)){0,1} at (?P<file>[^:]+):(?P<line_no>[0-9]+)(?P<column>(:[0-9]+)?), address = (?P<address>0x[0-9a-fA-F]+)$ Matched

Hide Details

runCmd: breakpoint set -f "main.cpp" -l 53 output: Breakpoint 3: where = a.out`breakpoint_func(void*) + 71 at main.cpp:53:17, address = 0x00000001000012d7

Hide Details

Hide Details

Expecting pattern: ^Breakpoint (?P<bpno>[0-9]+): (?P<num_locations>[0-9]+) locations\.$ Not matched

Hide Details

Expecting pattern: ^Breakpoint (?P<bpno>[0-9]+): (?P<num_locations>no) locations \(pending\)\. Not matched

Hide Details

Expecting pattern: ^Breakpoint (?P<bpno>[0-9]+): where = (?P<module>.*)`(?P<symbol>[+\-]{0,1}[^+]+)( \+ (?P<offset>[0-9]+)){0,1}( \[inlined\] (?P<inline_symbol>.*)){0,1} at (?P<file>[^:]+):(?P<line_no>[0-9]+)(?P<column>(:[0-9]+)?), address = (?P<address>0x[0-9a-fA-F]+)$ Matched

Hide Details

runCmd: breakpoint list -f output: Current breakpoints: 1: file = 'main.cpp', line = 138, exact_match = 0, locations = 1 1.1: where = a.out`dotest() + 77 at main.cpp:138:5, address = a.out[0x000000010000174d], unresolved, hit count = 0

Hide Details

2: file = 'main.cpp', line = 184, exact_match = 0, locations = 1 2.1: where = a.out`main + 25 at main.cpp:184:5, address = a.out[0x0000000100001dc9], unresolved, hit count = 0

Hide Details

3: file = 'main.cpp', line = 53, exact_match = 0, locations = 1 3.1: where = a.out`breakpoint_func(void*) + 71 at main.cpp:53:17, address = a.out[0x00000001000012d7], unresolved, hit count = 0

Hide Details

Hide Details

Hide Details

Expecting sub string: : file = 'main.cpp', line = 184 Matched

Hide Details

Expecting sub string: : file = 'main.cpp', line = 184 Matched

Hide Details

Expecting sub string: : file = 'main.cpp', line = 184 Matched

Hide Details

runCmd: run output: Process 20094 stopped * thread #1, queue = 'com.apple.main-thread', stop reason = breakpoint 1.1 frame #0: 0x000000010000174d a.out`dotest() at main.cpp:138:5 135 unsigned num_delay_signal_threads = 0; 136 unsigned num_delay_crash_threads = 0; 137 -> 138 register_signal_handler(SIGUSR1, sigusr1_handler); // Break here and adjust num_[breakpoint|watchpoint|signal|crash]_threads ^ 139 140 unsigned total_threads = num_breakpoint_threads \ 141 + num_watchpoint_threads \

Hide Details

Process 20094 launched: '/Users/buildslave/jenkins/workspace/lldb-cmake-matrix/lldb-build/lldb-test-build.noindex/functionalities/thread/concurrent_events/TestConcurrentManyBreakpoints.test/a.out' (x86_64)

Hide Details

Hide Details

runCmd: thread backtrace output: * thread #1, queue = 'com.apple.main-thread', stop reason = breakpoint 1.1 * frame #0: 0x000000010000174d a.out`dotest() at main.cpp:138:5 frame #1: 0x0000000100001dc4 a.out`main at main.cpp:183:5 frame #2: 0x00007fff77482085 libdyld.dylib`start + 1 frame #3: 0x00007fff77482085 libdyld.dylib`start + 1

Hide Details

Hide Details

Expecting sub string: stop reason = breakpoint 1. Matched

Hide Details

runCmd: expr num_breakpoint_threads=100 output: (unsigned int) $0 = 100

Hide Details

Hide Details

runCmd: expr num_crash_threads=0 output: (unsigned int) $1 = 0

Hide Details

Hide Details

runCmd: expr num_signal_threads=0 output: (unsigned int) $2 = 0

Hide Details

Hide Details

runCmd: expr num_watchpoint_threads=0 output: (unsigned int) $3 = 0

Hide Details

Hide Details

runCmd: expr num_delay_breakpoint_threads=0 output: (unsigned int) $4 = 0

Hide Details

Hide Details

runCmd: expr num_delay_crash_threads=0 output: (unsigned int) $5 = 0

Hide Details

Hide Details

runCmd: expr num_delay_signal_threads=0 output: (unsigned int) $6 = 0

Hide Details

Hide Details

runCmd: expr num_delay_watchpoint_threads=0 output: (unsigned int) $7 = 0

Hide Details

Hide Details

runCmd: continue output: Process 20094 resuming Process 20094 stopped * thread #2, stop reason = breakpoint 3.1 frame #0: 0x00000001000012d7 a.out`breakpoint_func(input=0x0000000000000000) at main.cpp:53:17 50 do_action_args(input); 51 52 // Do something -> 53 g_breakpoint++; // Set breakpoint here ^ 54 return 0; 55 } 56 thread #3, stop reason = breakpoint 3.1 frame #0: 0x00000001000012d7 a.out`breakpoint_func(input=0x0000000000000000) at main.cpp:53:17 50 do_action_args(input); 51 52 // Do something -> 53 g_breakpoint++; // Set breakpoint here ^ 54 return 0; 55 } 56 thread #7, stop reason = breakpoint 3.1 frame #0: 0x00000001000012d7 a.out`breakpoint_func(input=0x0000000000000000) at main.cpp:53:17 50 do_action_args(input); 51 52 // Do something -> 53 g_breakpoint++; // Set breakpoint here ^ 54 return 0; 55 } 56 thread #18, stop reason = breakpoint 3.1 frame #0: 0x00000001000012d7 a.out`breakpoint_func(input=0x0000000000000000) at main.cpp:53:17 50 do_action_args(input); 51 52 // Do something -> 53 g_breakpoint++; // Set breakpoint here ^ 54 return 0; 55 } 56 thread #19, stop reason = breakpoint 3.1 frame #0: 0x00000001000012d7 a.out`breakpoint_func(input=0x0000000000000000) at main.cpp:53:17 50 do_action_args(input); 51 52 // Do something -> 53 g_breakpoint++; // Set breakpoint here ^ 54 return 0; 55 } 56 thread #75, stop reason = breakpoint 3.1 frame #0: 0x00000001000012d7 a.out`breakpoint_func(input=0x0000000000000000) at main.cpp:53:17 50 do_action_args(input); 51 52 // Do something -> 53 g_breakpoint++; // Set breakpoint here ^ 54 return 0; 55 } 56 thread #76, stop reason = breakpoint 3.1 frame #0: 0x00000001000012d7 a.out`breakpoint_func(input=0x0000000000000000) at main.cpp:53:17 50 do_action_args(input); 51 52 // Do something -> 53 g_breakpoint++; // Set breakpoint here ^ 54 return 0; 55 } 56 thread #77, stop reason = breakpoint 3.1 frame #0: 0x00000001000012d7 a.out`breakpoint_func(input=0x0000000000000000) at main.cpp:53:17 50 do_action_args(input); 51 52 // Do something -> 53 g_breakpoint++; // Set breakpoint here ^ 54 return 0; 55 } 56 thread #78, stop reason = breakpoint 3.1 frame #0: 0x00000001000012d7 a.out`breakpoint_func(input=0x0000000000000000) at main.cpp:53:17 50 do_action_args(input); 51 52 // Do something -> 53 g_breakpoint++; // Set breakpoint here ^ 54 return 0; 55 } 56 thread #79, stop reason = breakpoint 3.1 frame #0: 0x00000001000012d7 a.out`breakpoint_func(input=0x0000000000000000) at main.cpp:53:17 50 do_action_args(input); 51 52 // Do something -> 53 g_breakpoint++; // Set breakpoint here ^ 54 return 0; 55 } 56 thread #84, stop reason = breakpoint 3.1 frame #0: 0x00000001000012d7 a.out`breakpoint_func(input=0x0000000000000000) at main.cpp:53:17 50 do_action_args(input); 51 52 // Do something -> 53 g_breakpoint++; // Set breakpoint here ^ 54 return 0; 55 } 56 thread #85, stop reason = breakpoint 3.1 frame #0: 0x00000001000012d7 a.out`breakpoint_func(input=0x0000000000000000) at main.cpp:53:17 50 do_action_args(input); 51 52 // Do something -> 53 g_breakpoint++; // Set breakpoint here ^ 54 return 0; 55 } 56 thread #86, stop reason = breakpoint 3.1 frame #0: 0x00000001000012d7 a.out`breakpoint_func(input=0x0000000000000000) at main.cpp:53:17 50 do_action_args(input); 51 52 // Do something -> 53 g_breakpoint++; // Set breakpoint here ^ 54 return 0; 55 } 56 thread #87, stop reason = breakpoint 3.1 frame #0: 0x00000001000012d7 a.out`breakpoint_func(input=0x0000000000000000) at main.cpp:53:17 50 do_action_args(input); 51 52 // Do something -> 53 g_breakpoint++; // Set breakpoint here ^ 54 return 0; 55 } 56 thread #88, stop reason = breakpoint 3.1 frame #0: 0x00000001000012d7 a.out`breakpoint_func(input=0x0000000000000000) at main.cpp:53:17 50 do_action_args(input); 51 52 // Do something -> 53 g_breakpoint++; // Set breakpoint here ^ 54 return 0; 55 } 56 thread #89, stop reason = breakpoint 3.1 frame #0: 0x00000001000012d7 a.out`breakpoint_func(input=0x0000000000000000) at main.cpp:53:17 50 do_action_args(input); 51 52 // Do something -> 53 g_breakpoint++; // Set breakpoint here ^ 54 return 0; 55 } 56 thread #90, stop reason = breakpoint 3.1 frame #0: 0x00000001000012d7 a.out`breakpoint_func(input=0x0000000000000000) at main.cpp:53:17 50 do_action_args(input); 51 52 // Do something -> 53 g_breakpoint++; // Set breakpoint here ^ 54 return 0; 55 } 56 thread #91, stop reason = breakpoint 3.1 frame #0: 0x00000001000012d7 a.out`breakpoint_func(input=0x0000000000000000) at main.cpp:53:17 50 do_action_args(input); 51 52 // Do something -> 53 g_breakpoint++; // Set breakpoint here ^ 54 return 0; 55 } 56 thread #92, stop reason = breakpoint 3.1 frame #0: 0x00000001000012d7 a.out`breakpoint_func(input=0x0000000000000000) at main.cpp:53:17 50 do_action_args(input); 51 52 // Do something -> 53 g_breakpoint++; // Set breakpoint here ^ 54 return 0; 55 } 56 thread #93, stop reason = breakpoint 3.1 frame #0: 0x00000001000012d7 a.out`breakpoint_func(input=0x0000000000000000) at main.cpp:53:17 50 do_action_args(input); 51 52 // Do something -> 53 g_breakpoint++; // Set breakpoint here ^ 54 return 0; 55 } 56 thread #94, stop reason = breakpoint 3.1 frame #0: 0x00000001000012d7 a.out`breakpoint_func(input=0x0000000000000000) at main.cpp:53:17 50 do_action_args(input); 51 52 // Do something -> 53 g_breakpoint++; // Set breakpoint here ^ 54 return 0; 55 } 56 thread #95, stop reason = breakpoint 3.1 frame #0: 0x00000001000012d7 a.out`breakpoint_func(input=0x0000000000000000) at main.cpp:53:17 50 do_action_args(input); 51 52 // Do something -> 53 g_breakpoint++; // Set breakpoint here ^ 54 return 0; 55 } 56 thread #96, stop reason = breakpoint 3.1 frame #0: 0x00000001000012d7 a.out`breakpoint_func(input=0x0000000000000000) at main.cpp:53:17 50 do_action_args(input); 51 52 // Do something -> 53 g_breakpoint++; // Set breakpoint here ^ 54 return 0; 55 } 56 thread #97, stop reason = breakpoint 3.1 frame #0: 0x00000001000012d7 a.out`breakpoint_func(input=0x0000000000000000) at main.cpp:53:17 50 do_action_args(input); 51 52 // Do something -> 53 g_breakpoint++; // Set breakpoint here ^ 54 return 0; 55 } 56 thread #98, stop reason = breakpoint 3.1 frame #0: 0x00000001000012d7 a.out`breakpoint_func(input=0x0000000000000000) at main.cpp:53:17 50 do_action_args(input); 51 52 // Do something -> 53 g_breakpoint++; // Set breakpoint here ^ 54 return 0; 55 } 56 thread #99, stop reason = breakpoint 3.1 frame #0: 0x00000001000012d7 a.out`breakpoint_func(input=0x0000000000000000) at main.cpp:53:17 50 do_action_args(input); 51 52 // Do something -> 53 g_breakpoint++; // Set breakpoint here ^ 54 return 0; 55 } 56 thread #100, stop reason = breakpoint 3.1 frame #0: 0x00000001000012d7 a.out`breakpoint_func(input=0x0000000000000000) at main.cpp:53:17 50 do_action_args(input); 51 52 // Do something -> 53 g_breakpoint++; // Set breakpoint here ^ 54 return 0; 55 } 56 thread #101, stop reason = breakpoint 3.1 frame #0: 0x00000001000012d7 a.out`breakpoint_func(input=0x0000000000000000) at main.cpp:53:17 50 do_action_args(input); 51 52 // Do something -> 53 g_breakpoint++; // Set breakpoint here ^ 54 return 0; 55 } 56

Hide Details

Hide Details

Hide Details

******************** PASS: lldb-unit :: SymbolFile/NativePDB/./SymbolFileNativePDBTests/PDBFPOProgramToDWARFExpressionTests.MultipleDependentAssignments (1369 of 1915) UNSUPPORTED: lldb-shell :: ScriptInterpreter/Lua/lua.test (1370 of 1915) PASS: lldb-api :: commands/command/script/import/TestImport.py (1371 of 1915) PASS: lldb-api :: functionalities/abbreviation/TestAbbreviations.py (1372 of 1915) PASS: lldb-unit :: UnwindAssembly/x86/./UnwindAssemblyx86Tests/Testx86AssemblyInspectionEngine.TestPopR14 (1373 of 1915) PASS: lldb-shell :: SymbolFile/Breakpad/line-table-discontinuous-file-ids.test (1374 of 1915) UNSUPPORTED: lldb-api :: functionalities/data-formatter/data-formatter-stl/libstdcpp/string/TestDataFormatterStdString.py (1375 of 1915) PASS: lldb-shell :: ObjectFile/PECOFF/sections-names.yaml (1376 of 1915) UNRESOLVED: lldb-api :: functionalities/thread/backtrace_all/TestBacktraceAll.py (1377 of 1915) ******************** TEST 'lldb-api :: functionalities/thread/backtrace_all/TestBacktraceAll.py' FAILED ******************** Unable to find 'RESULT: PASSED' in dotest output (exit code -11):

Hide Details

lldb version 11.0.99 clang revision e03ead6771fc97b11cb0c94b7f023142184ad25f llvm revision e03ead6771fc97b11cb0c94b7f023142184ad25f

Hide Details

******************** PASS: lldb-api :: python_api/function_symbol/TestSymbolAPI.py (1378 of 1915) PASS: lldb-api :: lang/cpp/stl/TestStdCXXDisassembly.py (1379 of 1915) PASS: lldb-api :: lang/objc/objc-builtin-types/TestObjCBuiltinTypes.py (1380 of 1915) UNSUPPORTED: lldb-shell :: SymbolFile/NativePDB/typedefs.cpp (1381 of 1915) UNSUPPORTED: lldb-shell :: SymbolFile/PDB/function-level-linking.test (1382 of 1915) UNRESOLVED: lldb-api :: functionalities/data-formatter/data-formatter-skip-summary/TestDataFormatterSkipSummary.py (1383 of 1915) ******************** TEST 'lldb-api :: functionalities/data-formatter/data-formatter-skip-summary/TestDataFormatterSkipSummary.py' FAILED ******************** Unable to find 'RESULT: PASSED' in dotest output (exit code -11):

Hide Details

lldb version 11.0.99 clang revision e03ead6771fc97b11cb0c94b7f023142184ad25f llvm revision e03ead6771fc97b11cb0c94b7f023142184ad25f

Hide Details

******************** PASS: lldb-unit :: Utility/./UtilityTests/StreamTeeTest.SetStreamAtIndexOutOfBounds (1384 of 1915) PASS: lldb-unit :: Utility/./UtilityTests/StringExtractorTest.GetU64LittleEndian (1385 of 1915) UNRESOLVED: lldb-api :: functionalities/data-formatter/data-formatter-stl/libcxx/unordered/TestDataFormatterUnordered.py (1386 of 1915) ******************** TEST 'lldb-api :: functionalities/data-formatter/data-formatter-stl/libcxx/unordered/TestDataFormatterUnordered.py' FAILED ******************** Unable to find 'RESULT: PASSED' in dotest output (exit code -11):

Hide Details

lldb version 11.0.99 clang revision e03ead6771fc97b11cb0c94b7f023142184ad25f llvm revision e03ead6771fc97b11cb0c94b7f023142184ad25f

Hide Details

******************** PASS: lldb-api :: functionalities/thread/concurrent_events/TestConcurrentDelaySignalBreak.py (1387 of 1915) PASS: lldb-unit :: Core/./LLDBCoreTests/RichManglingContextTest.SwitchProvider (1388 of 1915) PASS: lldb-api :: lang/objcxx/hide-runtime-values/TestObjCXXHideRuntimeValues.py (1389 of 1915) UNRESOLVED: lldb-api :: commands/expression/import-std-module/unique_ptr-dbg-info-content/TestUniquePtrDbgInfoContent.py (1390 of 1915) ******************** TEST 'lldb-api :: commands/expression/import-std-module/unique_ptr-dbg-info-content/TestUniquePtrDbgInfoContent.py' FAILED ******************** Unable to find 'RESULT: PASSED' in dotest output (exit code -11):

Hide Details

lldb version 11.0.99 clang revision e03ead6771fc97b11cb0c94b7f023142184ad25f llvm revision e03ead6771fc97b11cb0c94b7f023142184ad25f

Hide Details

******************** PASS: lldb-api :: lang/objc/blocks/TestObjCIvarsInBlocks.py (1391 of 1915) PASS: lldb-unit :: Utility/./UtilityTests/DataExtractorTest.GetBitfield (1392 of 1915) PASS: lldb-unit :: UnwindAssembly/x86/./UnwindAssemblyx86Tests/Testx86AssemblyInspectionEngine.TestPushESI (1393 of 1915) PASS: lldb-unit :: Process/minidump/./LLDBMinidumpTests/MinidumpParserTest.GetMemoryRegionInfoFromMemory64List (1394 of 1915) UNRESOLVED: lldb-api :: commands/expression/import-std-module/shared_ptr-dbg-info-content/TestSharedPtrDbgInfoContent.py (1395 of 1915) ******************** TEST 'lldb-api :: commands/expression/import-std-module/shared_ptr-dbg-info-content/TestSharedPtrDbgInfoContent.py' FAILED ******************** Unable to find 'RESULT: PASSED' in dotest output (exit code -11):

Hide Details

lldb version 11.0.99 clang revision e03ead6771fc97b11cb0c94b7f023142184ad25f llvm revision e03ead6771fc97b11cb0c94b7f023142184ad25f

Hide Details

******************** PASS: lldb-unit :: Process/gdb-remote/./ProcessGdbRemoteTests/GDBRemoteCommunicationClientTest.SendSignalsToIgnore (1396 of 1915) PASS: lldb-unit :: Utility/./UtilityTests/UserIDResolver.GetUserName (1397 of 1915) PASS: lldb-unit :: Process/minidump/./LLDBMinidumpTests/MinidumpParserTest.GetMemoryRegionInfo (1398 of 1915) PASS: lldb-unit :: SymbolFile/NativePDB/./SymbolFileNativePDBTests/PDBFPOProgramToDWARFExpressionTests.SingleAssignmentRegisterRef (1399 of 1915) PASS: lldb-unit :: Expression/./ExpressionTests/CppModuleConfigurationTest.AmbiguousCLib (1400 of 1915) PASS: lldb-unit :: ObjectFile/Breakpad/./ObjectFileBreakpadTests/FuncRecord.parse (1401 of 1915) PASS: lldb-unit :: Utility/./UtilityTests/StringListTest.SplitIntoLines (1402 of 1915) PASS: lldb-api :: functionalities/thread/num_threads/TestNumThreads.py (1403 of 1915) UNRESOLVED: lldb-api :: commands/expression/import-std-module/vector-dbg-info-content/TestDbgInfoContentVector.py (1404 of 1915) ******************** TEST 'lldb-api :: commands/expression/import-std-module/vector-dbg-info-content/TestDbgInfoContentVector.py' FAILED ******************** Unable to find 'RESULT: PASSED' in dotest output (exit code -11):

Hide Details

lldb version 11.0.99 clang revision e03ead6771fc97b11cb0c94b7f023142184ad25f llvm revision e03ead6771fc97b11cb0c94b7f023142184ad25f

Hide Details

******************** PASS: lldb-api :: functionalities/inline-stepping/TestInlineStepping.py (1405 of 1915) PASS: lldb-api :: commands/expression/top-level/TestTopLevelExprs.py (1406 of 1915) PASS: lldb-api :: functionalities/backticks/TestBackticksWithoutATarget.py (1407 of 1915) UNSUPPORTED: lldb-shell :: Register/x86-zmm-read.test (1408 of 1915) PASS: lldb-api :: functionalities/breakpoint/breakpoint_set_restart/TestBreakpointSetRestart.py (1409 of 1915) PASS: lldb-api :: functionalities/data-formatter/nssetsynth/TestNSSetSynthetic.py (1410 of 1915) UNSUPPORTED: lldb-shell :: BuildScript/toolchain-msvc.test (1411 of 1915) PASS: lldb-api :: functionalities/data-formatter/data-formatter-caching/TestDataFormatterCaching.py (1412 of 1915) PASS: lldb-unit :: Utility/./UtilityTests/StreamTest.PutStringAsRawHex8 (1413 of 1915) PASS: lldb-unit :: Utility/./UtilityTests/ProcessInstanceInfo.DumpTable_invalidUID (1414 of 1915) PASS: lldb-unit :: SymbolFile/DWARF/./SymbolFileDWARFTests/SymbolFileDWARFTests.TestAbbrevOutOfOrder (1415 of 1915) PASS: lldb-unit :: Utility/./UtilityTests/ProcessInstanceInfoMatch.Name (1416 of 1915) PASS: lldb-api :: lang/objc/ptr_refs/TestPtrRefsObjC.py (1417 of 1915) UNRESOLVED: lldb-api :: functionalities/data-formatter/data-formatter-stl/libcxx/list/loop/TestDataFormatterLibcxxListLoop.py (1418 of 1915) ******************** TEST 'lldb-api :: functionalities/data-formatter/data-formatter-stl/libcxx/list/loop/TestDataFormatterLibcxxListLoop.py' FAILED ******************** Unable to find 'RESULT: PASSED' in dotest output (exit code -11):

Hide Details

lldb version 11.0.99 clang revision e03ead6771fc97b11cb0c94b7f023142184ad25f llvm revision e03ead6771fc97b11cb0c94b7f023142184ad25f

Hide Details

******************** PASS: lldb-api :: commands/expression/inline-namespace/TestInlineNamespace.py (1419 of 1915) PASS: lldb-api :: tools/lldb-server/commandline/TestStubReverseConnect.py (1420 of 1915) PASS: lldb-unit :: Utility/./UtilityTests/UriParserTest.BadPort (1421 of 1915) PASS: lldb-unit :: Utility/./UtilityTests/StringExtractorTest.GetHexU8_Underflow2_NoEof (1422 of 1915) PASS: lldb-api :: functionalities/inferior-crashing/TestInferiorCrashingStep.py (1423 of 1915) PASS: lldb-api :: functionalities/thread/crash_during_step/TestCrashDuringStep.py (1424 of 1915) PASS: lldb-unit :: Utility/./UtilityTests/StreamTest.PutHex16ByteOrderBig (1425 of 1915) UNSUPPORTED: lldb-shell :: SymbolFile/PDB/vbases.test (1426 of 1915) PASS: lldb-unit :: UnwindAssembly/x86/./UnwindAssemblyx86Tests/Testx86AssemblyInspectionEngine.TestPopRBX (1427 of 1915) PASS: lldb-unit :: Process/gdb-remote/./ProcessGdbRemoteTests/GDBRemoteCommunicationServerTest.SendErrorResponse_ErrorNumber (1428 of 1915) PASS: lldb-unit :: Utility/./UtilityTests/StreamTest.ShiftOperatorPtr (1429 of 1915) PASS: lldb-unit :: Process/gdb-remote/./ProcessGdbRemoteTests/GDBRemoteClientBaseTest.SendContinueDelegateInterface (1430 of 1915) PASS: lldb-api :: lang/objc/real-definition/TestRealDefinition.py (1431 of 1915) UNSUPPORTED: lldb-api :: functionalities/darwin_log/filter/regex/category/TestDarwinLogFilterRegexCategory.py (1432 of 1915) PASS: lldb-api :: sample_test/TestSampleTest.py (1433 of 1915) PASS: lldb-shell :: Expr/TestIRMemoryMap.test (1434 of 1915) PASS: lldb-api :: lang/cpp/thread_local/TestThreadLocal.py (1435 of 1915) UNSUPPORTED: lldb-shell :: SymbolFile/DWARF/dir-separator-no-comp-dir.s (1436 of 1915) PASS: lldb-api :: functionalities/source-map/TestTargetSourceMap.py (1437 of 1915) PASS: lldb-unit :: Process/minidump/./LLDBMinidumpTests/MinidumpParserTest.FindMemoryRangeWithFullMemoryMinidump (1438 of 1915) UNSUPPORTED: lldb-api :: commands/expression/macros/TestMacros.py (1439 of 1915) PASS: lldb-unit :: Symbol/./SymbolTests/TestClangASTImporter.MetadataPropagation (1440 of 1915) PASS: lldb-api :: commands/frame/diagnose/virtual-method-call/TestDiagnoseDereferenceVirtualMethodCall.py (1441 of 1915) PASS: lldb-api :: python_api/type/TestTypeList.py (1442 of 1915) UNSUPPORTED: lldb-api :: functionalities/process_save_core/TestProcessSaveCore.py (1443 of 1915) PASS: lldb-unit :: Signals/./SignalsTests/UnixSignalsTest.VersionChange (1444 of 1915) PASS: lldb-unit :: Utility/./UtilityTests/RangeTest.ContainsEndInclusive (1445 of 1915) PASS: lldb-shell :: ObjectFile/wasm/stripped-debug-sections.yaml (1446 of 1915) PASS: lldb-api :: functionalities/breakpoint/breakpoint_options/TestBreakpointOptions.py (1447 of 1915) PASS: lldb-unit :: ScriptInterpreter/Python/./ScriptInterpreterPythonTests/PythonDataObjectsTest.TestPythonStringToStructuredString (1448 of 1915) UNSUPPORTED: lldb-api :: functionalities/breakpoint/hardware_breakpoints/hardware_breakpoint_on_multiple_threads/TestHWBreakMultiThread.py (1449 of 1915) PASS: lldb-api :: lang/objc/objc-new-syntax/TestObjCNewSyntaxDictionary.py (1450 of 1915) PASS: lldb-api :: lang/c/local_variables/TestLocalVariables.py (1451 of 1915) PASS: lldb-unit :: Core/./LLDBCoreTests/MangledTest.NameIndexes_FindFunctionSymbols (1452 of 1915) PASS: lldb-shell :: Commands/command-backtrace.test (1453 of 1915) PASS: lldb-unit :: Utility/./UtilityTests/StringExtractorTest.GetHexU8_Underflow2 (1454 of 1915) UNRESOLVED: lldb-api :: functionalities/data-formatter/data-formatter-stl/libcxx/list/TestDataFormatterLibcxxList.py (1455 of 1915) ******************** TEST 'lldb-api :: functionalities/data-formatter/data-formatter-stl/libcxx/list/TestDataFormatterLibcxxList.py' FAILED ******************** Unable to find 'RESULT: PASSED' in dotest output (exit code -11):

Hide Details

lldb version 11.0.99 clang revision e03ead6771fc97b11cb0c94b7f023142184ad25f llvm revision e03ead6771fc97b11cb0c94b7f023142184ad25f

Hide Details

******************** PASS: lldb-unit :: Process/minidump/./LLDBMinidumpTests/MinidumpParserTest.GetMiscInfo_no_stream (1456 of 1915) PASS: lldb-unit :: Utility/./UtilityTests/SerializationRountripTest.SerializeDeserializeObjectReference (1457 of 1915) PASS: lldb-shell :: Host/TestCustomShell.test (1458 of 1915) UNRESOLVED: lldb-api :: functionalities/data-formatter/data-formatter-disabling/TestDataFormatterDisabling.py (1459 of 1915) ******************** TEST 'lldb-api :: functionalities/data-formatter/data-formatter-disabling/TestDataFormatterDisabling.py' FAILED ******************** Unable to find 'RESULT: PASSED' in dotest output (exit code -11):

Hide Details

lldb version 11.0.99 clang revision e03ead6771fc97b11cb0c94b7f023142184ad25f llvm revision e03ead6771fc97b11cb0c94b7f023142184ad25f

Hide Details

******************** PASS: lldb-shell :: Minidump/fb-dump.test (1460 of 1915) PASS: lldb-unit :: Utility/./UtilityTests/StringExtractorTest.GetNameColonValueContainsColon (1461 of 1915) PASS: lldb-unit :: UnwindAssembly/x86/./UnwindAssemblyx86Tests/Testx86AssemblyInspectionEngine.TestSpillRegToStackViaMOVi386 (1462 of 1915) PASS: lldb-unit :: Utility/./UtilityTests/ArgsTest.TestAppendArg (1463 of 1915) PASS: lldb-shell :: Breakpoint/split-dwarf-5-addrbase.test (1464 of 1915) PASS: lldb-api :: lang/objc/foundation/TestConstStrings.py (1465 of 1915) PASS: lldb-api :: functionalities/data-formatter/array_typedef/TestArrayTypedef.py (1466 of 1915) UNSUPPORTED: lldb-shell :: SymbolFile/NativePDB/function-types-classes.cpp (1467 of 1915) PASS: lldb-api :: commands/command/script_alias/TestCommandScriptAlias.py (1468 of 1915) PASS: lldb-unit :: Utility/./UtilityTests/ArchSpecTest.OperatorBool (1469 of 1915) PASS: lldb-shell :: SymbolFile/DWARF/debug_rnglists.s (1470 of 1915) PASS: lldb-unit :: Utility/./UtilityTests/BinaryStreamTest.PutULEB128One (1471 of 1915) PASS: lldb-api :: lang/cpp/extern_c/TestExternCSymbols.py (1472 of 1915) PASS: lldb-unit :: Symbol/./SymbolTests/TestClangASTContext.TestDeletingImplicitCopyCstrDueToMoveCStr (1473 of 1915) PASS: lldb-unit :: Utility/./UtilityTests/OptionsWithRawTest.EmptyInput (1474 of 1915) PASS: lldb-api :: functionalities/data-formatter/language_category_updates/TestDataFormatterLanguageCategoryUpdates.py (1475 of 1915) PASS: lldb-api :: commands/expression/entry-bp/TestExprEntryBP.py (1476 of 1915) PASS: lldb-unit :: Utility/./UtilityTests/StringListTest.InsertStringAtIndexMove (1477 of 1915) PASS: lldb-api :: functionalities/thread/concurrent_events/TestConcurrentSignalBreak.py (1478 of 1915) PASS: lldb-unit :: Symbol/./SymbolTests/TestClangASTImporter.CopyTypeTagDecl (1479 of 1915) PASS: lldb-api :: functionalities/thread/backtrace_limit/TestBacktraceLimit.py (1480 of 1915) PASS: lldb-unit :: Utility/./UtilityTests/StringLexerTest.HasAtLeast (1481 of 1915) PASS: lldb-unit :: UnwindAssembly/x86/./UnwindAssemblyx86Tests/Testx86AssemblyInspectionEngine.TestPushRBP (1482 of 1915) PASS: lldb-unit :: Utility/./UtilityTests/LogChannelEnabledTest.LogVerboseThread (1483 of 1915) UNSUPPORTED: lldb-api :: functionalities/tsan/multiple/TestTsanMultiple.py (1484 of 1915) PASS: lldb-unit :: Utility/./UtilityTests/DataExtractorTest.GetMaxU64 (1485 of 1915) PASS: lldb-unit :: Expression/./ExpressionTests/DiagnosticManagerTest.AppendMessageAttachToLastDiag (1486 of 1915) PASS: lldb-api :: commands/frame/diagnose/local-variable/TestLocalVariable.py (1487 of 1915) PASS: lldb-unit :: Utility/./UtilityTests/RangeTest.LessThan (1488 of 1915) PASS: lldb-unit :: Interpreter/./InterpreterTests/CompletionTest.FileCompletionAbsolute (1489 of 1915) PASS: lldb-api :: tools/lldb-server/TestGdbRemote_qThreadStopInfo.py (1490 of 1915) PASS: lldb-unit :: Process/gdb-remote/./ProcessGdbRemoteTests/GDBRemoteCommunicationClientTest.SaveRestoreRegistersNoSuffix (1491 of 1915) PASS: lldb-unit :: Expression/./ExpressionTests/DiagnosticManagerTest.FixedExpression (1492 of 1915) PASS: lldb-shell :: Quit/TestQuitExitCode0.test (1493 of 1915) PASS: lldb-unit :: Utility/./UtilityTests/ConstStringTest.FromMidOfBufferStringRef (1494 of 1915) PASS: lldb-unit :: Expression/./ExpressionTests/DiagnosticManagerTest.GetStringMultipleDiags (1495 of 1915) PASS: lldb-unit :: Language/CPlusPlus/./LanguageCPlusPlusTests/CPlusPlusLanguage.CPlusPlusNameParser (1496 of 1915) PASS: lldb-unit :: Utility/./UtilityTests/StringListTest.AppendStringStdString (1497 of 1915) UNSUPPORTED: lldb-api :: lang/objc/modules-update/TestClangModulesUpdate.py (1498 of 1915) PASS: lldb-unit :: Utility/./UtilityTests/BinaryStreamTest.PutSLEB128Zero (1499 of 1915) PASS: lldb-unit :: Utility/./UtilityTests/RangeTest.Copy (1500 of 1915) PASS: lldb-shell :: SymbolFile/DWARF/debug-types-dwarf5.s (1501 of 1915) PASS: lldb-unit :: debugserver/./debugserverTests/RNBSocket.LoopBackConnectIPv4 (1502 of 1915) PASS: lldb-api :: types/TestShortType.py (1503 of 1915) PASS: lldb-shell :: Commands/command-script-import.test (1504 of 1915) PASS: lldb-api :: functionalities/memory/read/TestMemoryRead.py (1505 of 1915) PASS: lldb-unit :: Expression/./ExpressionTests/CppModuleConfigurationTest.AmbiguousLibCpp (1506 of 1915) UNRESOLVED: lldb-api :: functionalities/data-formatter/data-formatter-stl/libcxx/set/TestDataFormatterLibcxxSet.py (1507 of 1915) ******************** TEST 'lldb-api :: functionalities/data-formatter/data-formatter-stl/libcxx/set/TestDataFormatterLibcxxSet.py' FAILED ******************** Unable to find 'RESULT: PASSED' in dotest output (exit code -11):

Hide Details

lldb version 11.0.99 clang revision e03ead6771fc97b11cb0c94b7f023142184ad25f llvm revision e03ead6771fc97b11cb0c94b7f023142184ad25f

Hide Details

******************** UNSUPPORTED: lldb-api :: commands/expression/namespace_local_var_same_name_obj_c/TestNamespaceLocalVarSameNameObjC.py (1508 of 1915) PASS: lldb-shell :: Driver/TestConvenienceVariables.test (1509 of 1915) PASS: lldb-unit :: Utility/./UtilityTests/ReproducerTest.SetCapture (1510 of 1915) PASS: lldb-unit :: Utility/./UtilityTests/ArgsTest.TestUnknownEscape (1511 of 1915) PASS: lldb-api :: commands/expression/persistent_types/TestPersistentTypes.py (1512 of 1915) UNSUPPORTED: lldb-api :: functionalities/thread/concurrent_events/TestConcurrentSignalWatchBreak.py (1513 of 1915) PASS: lldb-unit :: Expression/./ExpressionTests/DiagnosticManagerTest.GetStringSeverityLabels (1514 of 1915) UNSUPPORTED: lldb-api :: functionalities/thread/concurrent_events/TestConcurrentTwoWatchpointsOneSignal.py (1515 of 1915) PASS: lldb-unit :: Utility/./UtilityTests/TimerTest.CategoryTimes (1516 of 1915) PASS: lldb-api :: functionalities/plugins/python_os_plugin/TestPythonOSPlugin.py (1517 of 1915) PASS: lldb-api :: lang/c/anonymous/TestAnonymous.py (1518 of 1915) PASS: lldb-unit :: Utility/./UtilityTests/ScalarTest.Comparison (1519 of 1915) PASS: lldb-unit :: Utility/./UtilityTests/StringListTest.LongestCommonPrefixEmpty (1520 of 1915) PASS: lldb-unit :: UnwindAssembly/x86/./UnwindAssemblyx86Tests/Testx86AssemblyInspectionEngine.TestAddESP (1521 of 1915) PASS: lldb-unit :: Host/./HostTests/Host.GetEnvironment (1522 of 1915) PASS: lldb-unit :: Language/Highlighting/./HighlighterTests/HighlighterTest.Keywords (1523 of 1915) PASS: lldb-api :: commands/expression/save_jit_objects/TestSaveJITObjects.py (1524 of 1915) PASS: lldb-shell :: ExecControl/StopHook/stop-hook.test (1525 of 1915) PASS: lldb-api :: functionalities/value_md5_crash/TestValueMD5Crash.py (1526 of 1915) PASS: lldb-shell :: Breakpoint/case-sensitive.test (1527 of 1915) PASS: lldb-api :: lang/objc/foundation/TestObjCMethodsString.py (1528 of 1915) PASS: lldb-api :: functionalities/inferior-assert/TestInferiorAssert.py (1529 of 1915) UNSUPPORTED: lldb-shell :: SymbolFile/DWARF/debug-types-dwo-cross-reference.cpp (1530 of 1915) PASS: lldb-unit :: Utility/./UtilityTests/AnsiTerminal.AtStart (1531 of 1915) PASS: lldb-unit :: Symbol/./SymbolTests/TestClangASTContext.TestGetBasicTypeFromEnum (1532 of 1915) UNSUPPORTED: lldb-api :: commands/watchpoints/watchpoint_size/TestWatchpointSizes.py (1533 of 1915) PASS: lldb-unit :: Language/Highlighting/./HighlighterTests/HighlighterTest.ClangTrailingBackslashBeforeNewline (1534 of 1915) PASS: lldb-api :: lang/objc/conflicting-definition/TestConflictingDefinition.py (1535 of 1915) PASS: lldb-api :: functionalities/tail_call_frames/thread_step_out_or_return/TestSteppingOutWithArtificialFrames.py (1536 of 1915) PASS: lldb-unit :: Utility/./UtilityTests/NameMatchesTest.Equals (1537 of 1915) PASS: lldb-unit :: ObjectFile/ELF/./ObjectFileELFTests/ObjectFileELFTest.GetSymtab_NoSymEntryPointArmAddressClass (1538 of 1915) PASS: lldb-api :: functionalities/breakpoint/global_constructor/TestBreakpointInGlobalConstructor.py (1539 of 1915) UNSUPPORTED: lldb-api :: commands/target/auto-install-main-executable/TestAutoInstallMainExecutable.py (1540 of 1915) PASS: lldb-unit :: Process/minidump/./LLDBMinidumpTests/MinidumpParserTest.GetThreadsAndGetThreadContext (1541 of 1915) PASS: lldb-unit :: Utility/./UtilityTests/StructuredDataTest.ParseJSONFromFile (1542 of 1915) PASS: lldb-unit :: SymbolFile/DWARF/./SymbolFileDWARFTests/SymbolFileDWARFTests.TestAbbrevValidAttrNullForm (1543 of 1915) PASS: lldb-api :: functionalities/breakpoint/cpp/TestCPPBreakpointLocations.py (1544 of 1915) PASS: lldb-unit :: Utility/./UtilityTests/OptionsWithRawTest.UnterminatedQuote (1545 of 1915) PASS: lldb-api :: functionalities/breakpoint/breakpoint_ids/TestBreakpointIDs.py (1546 of 1915) PASS: lldb-unit :: ScriptInterpreter/Python/./ScriptInterpreterPythonTests/PythonDataObjectsTest.TestTypeNameResolutionNoDot (1547 of 1915) PASS: lldb-api :: functionalities/data-formatter/data-formatter-objc/TestDataFormatterObjCNSBundle.py (1548 of 1915) PASS: lldb-unit :: Utility/./UtilityTests/UriParserTest.MinimalPort (1549 of 1915) PASS: lldb-unit :: Utility/./UtilityTests/StringListTest.SetSize (1550 of 1915) PASS: lldb-api :: lang/objc/exceptions/TestObjCExceptions.py (1551 of 1915) PASS: lldb-unit :: Utility/./UtilityTests/RangeTest.SizeTypes (1552 of 1915) PASS: lldb-api :: types/TestFloatTypes.py (1553 of 1915) PASS: lldb-api :: tools/lldb-vscode/attach/TestVSCode_attach.py (1554 of 1915) PASS: lldb-shell :: SymbolFile/DWARF/debug_ranges-missing-section.s (1555 of 1915) PASS: lldb-api :: lang/objc/objc-static-method/TestObjCStaticMethod.py (1556 of 1915) PASS: lldb-api :: lang/c/enum_types/TestEnumTypes.py (1557 of 1915) PASS: lldb-api :: functionalities/unwind/noreturn/module-end/TestNoReturnModuleEnd.py (1558 of 1915) PASS: lldb-api :: functionalities/breakpoint/comp_dir_symlink/TestCompDirSymLink.py (1559 of 1915) UNSUPPORTED: lldb-shell :: ObjectFile/PECOFF/dep-modules.yaml (1560 of 1915) PASS: lldb-unit :: UnwindAssembly/x86/./UnwindAssemblyx86Tests/Testx86AssemblyInspectionEngine.TestSimple64bitFrameFunction (1561 of 1915) UNSUPPORTED: lldb-shell :: SymbolFile/DWARF/debug-types-expressions.test (1562 of 1915) UNSUPPORTED: lldb-api :: functionalities/asan/TestMemoryHistory.py (1563 of 1915) UNSUPPORTED: lldb-shell :: SymbolFile/NativePDB/local-variables.cpp (1564 of 1915) PASS: lldb-unit :: Utility/./UtilityTests/NameMatchesTest.RegularExpression (1565 of 1915) PASS: lldb-unit :: ScriptInterpreter/Python/./ScriptInterpreterPythonTests/PythonDataObjectsTest.TestPythonTupleToStructuredList (1566 of 1915) PASS: lldb-shell :: ScriptInterpreter/None/import_module.test (1567 of 1915) PASS: lldb-api :: functionalities/data-formatter/data-formatter-categories/TestDataFormatterCategories.py (1568 of 1915) PASS: lldb-shell :: ObjectFile/MachO/lc_build_version_notools.yaml (1569 of 1915) UNSUPPORTED: lldb-shell :: Register/x86-64-zmm-write.test (1570 of 1915) PASS: lldb-unit :: Host/./HostTests/SocketTest.DomainListenConnectAccept (1571 of 1915) PASS: lldb-shell :: Reproducer/Functionalities/TestExpressionEvaluation.test (1572 of 1915) PASS: lldb-shell :: SymbolFile/DWARF/apple-index-is-used.cpp (1573 of 1915) PASS: lldb-unit :: ScriptInterpreter/Python/./ScriptInterpreterPythonTests/PythonDataObjectsTest.TestPythonInteger (1574 of 1915) PASS: lldb-unit :: Host/./HostTests/TaskPoolTest.AddTask (1575 of 1915) PASS: lldb-unit :: UnwindAssembly/x86/./UnwindAssemblyx86Tests/Testx86AssemblyInspectionEngine.TestStackRealignMSVC_i386 (1576 of 1915) PASS: lldb-api :: lang/objc/objc-class-method/TestObjCClassMethod.py (1577 of 1915) PASS: lldb-unit :: Utility/./UtilityTests/AnsiTerminal.AtEnd (1578 of 1915) PASS: lldb-unit :: Process/gdb-remote/./ProcessGdbRemoteTests/GDBRemoteCommunicationClientTest.TestPacketSpeedJSON (1579 of 1915) PASS: lldb-api :: api/command-return-object/TestSBCommandReturnObject.py (1580 of 1915) PASS: lldb-unit :: Utility/./UtilityTests/BinaryStreamTest.PutSLEB128OneByte (1581 of 1915) PASS: lldb-unit :: Expression/./ExpressionTests/DWARFExpression.DW_OP_piece (1582 of 1915) PASS: lldb-unit :: Language/Highlighting/./HighlighterTests/HighlighterTest.ClangCursorPos (1583 of 1915) UNSUPPORTED: lldb-api :: functionalities/tty/TestTerminal.py (1584 of 1915) PASS: lldb-unit :: Utility/./UtilityTests/UUIDTest.StringConverion (1585 of 1915) PASS: lldb-unit :: ScriptInterpreter/Python/./ScriptInterpreterPythonTests/PythonDataObjectsTest.TestPythonTupleInitializerList2 (1586 of 1915) PASS: lldb-shell :: Driver/LocalLLDBInit.test (1587 of 1915) PASS: lldb-unit :: Utility/./UtilityTests/ProcessInstanceInfo.DumpTable (1588 of 1915) PASS: lldb-unit :: Utility/./UtilityTests/RecordReplayTest.InstrumentedFoo (1589 of 1915) PASS: lldb-api :: commands/expression/char/TestExprsChar.py (1590 of 1915) PASS: lldb-unit :: Expression/./ExpressionTests/CppModuleConfigurationTest.LibCppV2 (1591 of 1915) UNSUPPORTED: lldb-api :: tools/lldb-server/thread-name/TestGdbRemoteThreadName.py (1592 of 1915) PASS: lldb-unit :: Utility/./UtilityTests/OptionsWithRawTest.EmptySuffix (1593 of 1915) PASS: lldb-api :: commands/expression/rdar42038760/TestScalarURem.py (1594 of 1915) PASS: lldb-api :: macosx/find-dsym/bundle-with-dot-in-filename/TestBundleWithDotInFilename.py (1595 of 1915) PASS: lldb-api :: functionalities/breakpoint/breakpoint_command/TestRegexpBreakCommand.py (1596 of 1915) PASS: lldb-unit :: ObjectFile/Breakpad/./ObjectFileBreakpadTests/StackWinRecord.parse (1597 of 1915) PASS: lldb-api :: functionalities/thread/thread_exit/TestThreadExit.py (1598 of 1915) PASS: lldb-unit :: UnwindAssembly/x86/./UnwindAssemblyx86Tests/Testx86AssemblyInspectionEngine.TestPopR12 (1599 of 1915) UNSUPPORTED: lldb-api :: lang/objc/objc-dynamic-value/TestObjCDynamicValue.py (1600 of 1915) PASS: lldb-unit :: Utility/./UtilityTests/BinaryStreamTest.PutULEB128EightBytes (1601 of 1915) PASS: lldb-shell :: ScriptInterpreter/Python/scripted_breakpoint.test (1602 of 1915) UNSUPPORTED: lldb-shell :: SymbolFile/NativePDB/break-by-line.cpp (1603 of 1915) PASS: lldb-api :: lang/cpp/dynamic-value/TestCppValueCast.py (1604 of 1915) PASS: lldb-unit :: Process/gdb-remote/./ProcessGdbRemoteTests/GDBRemoteClientBaseTest.SendPacketAndReceiveResponseWithOutputSupport (1605 of 1915) PASS: lldb-unit :: Utility/./UtilityTests/RecordReplayTest.InstrumentedFooSameThis (1606 of 1915) PASS: lldb-unit :: Utility/./UtilityTests/StringExtractorTest.GetNameColonValueNoSemicolon (1607 of 1915) PASS: lldb-unit :: Breakpoint/./LLDBBreakpointTests/BreakpointIDTest.StringIsBreakpointName (1608 of 1915) PASS: lldb-unit :: Utility/./UtilityTests/StreamTest.PutHex64ByteOrderLittle (1609 of 1915) PASS: lldb-unit :: Signals/./SignalsTests/UnixSignalsTest.GetFilteredSignals (1610 of 1915) PASS: lldb-unit :: Utility/./UtilityTests/StringLexerTest.Next (1611 of 1915) PASS: lldb-unit :: SymbolFile/NativePDB/./SymbolFileNativePDBTests/PDBFPOProgramToDWARFExpressionTests.InvalidOpBinary (1612 of 1915) PASS: lldb-api :: lang/c/forward/TestForwardDeclaration.py (1613 of 1915) PASS: lldb-unit :: Utility/./UtilityTests/StringExtractorTest.GetHexBytesAvail_Underflow (1614 of 1915) PASS: lldb-unit :: Expression/./ExpressionTests/ClangHostTest.ComputeClangResourceDirectory (1615 of 1915) PASS: lldb-api :: commands/expression/import-std-module/empty-module/TestEmptyStdModule.py (1616 of 1915) PASS: lldb-unit :: Core/./LLDBCoreTests/MangledTest.ResultForBlockInvocation (1617 of 1915) UNSUPPORTED: lldb-api :: functionalities/breakpoint/breakpoint_in_delayslot/TestAvoidBreakpointInDelaySlot.py (1618 of 1915) UNSUPPORTED: lldb-shell :: Register/arm-fp-read.test (1619 of 1915) PASS: lldb-api :: commands/command/nested_alias/TestNestedAlias.py (1620 of 1915) PASS: lldb-api :: lang/c/offsetof/TestOffsetof.py (1621 of 1915) PASS: lldb-unit :: Host/./HostTests/HostInfoTest.GetHostname (1622 of 1915) PASS: lldb-unit :: Target/./TargetTests/ExecutionContextTest.GetByteOrderProcess (1623 of 1915) PASS: lldb-api :: functionalities/data-formatter/parray/TestPrintArray.py (1624 of 1915) UNSUPPORTED: lldb-shell :: Register/x86-ymm-read.test (1625 of 1915) PASS: lldb-api :: commands/expression/function_template_specialization_temp_args/TestFunctionTemplateSpecializationTempArgs.py (1626 of 1915) PASS: lldb-api :: lang/cpp/frame-var-anon-unions/TestFrameVariableAnonymousUnions.py (1627 of 1915) PASS: lldb-shell :: Breakpoint/debug_rnglist_offset_pair.test (1628 of 1915) PASS: lldb-unit :: Utility/./UtilityTests/StringExtractorTest.GetU64BigEndian (1629 of 1915) PASS: lldb-unit :: Symbol/./SymbolTests/TestClangASTContext.TestGetTypeClassTypeOf (1630 of 1915) PASS: lldb-unit :: Utility/./UtilityTests/BinaryStreamTest.PutSLEB128MaxValue (1631 of 1915) PASS: lldb-unit :: Utility/./UtilityTests/StreamTeeTest.Flush (1632 of 1915) PASS: lldb-unit :: Utility/./UtilityTests/StringListTest.JoinMultiCharSeparator (1633 of 1915) PASS: lldb-shell :: Reproducer/TestWorkingDir.test (1634 of 1915) PASS: lldb-api :: functionalities/gdb_remote_client/TestNestedRegDefinitions.py (1635 of 1915) PASS: lldb-unit :: Utility/./UtilityTests/ArgsTest.ReplaceArgumentAtIndexLonger (1636 of 1915) UNRESOLVED: lldb-api :: functionalities/data-formatter/data-formatter-stl/libcxx/function/TestLibCxxFunction.py (1637 of 1915) ******************** TEST 'lldb-api :: functionalities/data-formatter/data-formatter-stl/libcxx/function/TestLibCxxFunction.py' FAILED ******************** Unable to find 'RESULT: PASSED' in dotest output (exit code -11):

Hide Details

lldb version 11.0.99 clang revision e03ead6771fc97b11cb0c94b7f023142184ad25f llvm revision e03ead6771fc97b11cb0c94b7f023142184ad25f

Hide Details

******************** PASS: lldb-api :: functionalities/data-formatter/data-formatter-synth/TestDataFormatterSynth.py (1638 of 1915) PASS: lldb-unit :: Utility/./UtilityTests/ArgsTest.TestArgv (1639 of 1915) PASS: lldb-unit :: Utility/./UtilityTests/UriParserTest.BracketedHostname (1640 of 1915) PASS: lldb-unit :: Utility/./UtilityTests/Flags.AnyClear (1641 of 1915) UNSUPPORTED: lldb-api :: functionalities/thread/concurrent_events/TestConcurrentBreakpointsDelayedBreakpointOneWatchpoint.py (1642 of 1915) PASS: lldb-api :: python_api/default-constructor/TestDefaultConstructorForAPIObjects.py (1643 of 1915) PASS: lldb-api :: commands/expression/ignore-artificial-constructors/TestIgnoreArtificialConstructors.py (1644 of 1915) UNSUPPORTED: lldb-api :: commands/watchpoints/multi_watchpoint_slots/TestWatchpointMultipleSlots.py (1645 of 1915) PASS: lldb-api :: commands/gui/basic/TestGuiBasic.py (1646 of 1915) PASS: lldb-api :: tools/lldb-server/TestGdbRemoteRegisterState.py (1647 of 1915) PASS: lldb-unit :: Utility/./UtilityTests/StringExtractorTest.GetHexBytesAvail_Partial (1648 of 1915) PASS: lldb-unit :: UnwindAssembly/x86/./UnwindAssemblyx86Tests/Testx86AssemblyInspectionEngine.TestStackRealign8BitDisp_i386 (1649 of 1915) PASS: lldb-shell :: Reproducer/Functionalities/TestDataFormatter.test (1650 of 1915) UNSUPPORTED: lldb-shell :: ScriptInterpreter/Lua/watchpoint_callback.test (1651 of 1915) PASS: lldb-unit :: Utility/./UtilityTests/StringExtractorTest.GetU32BigEndian (1652 of 1915) PASS: lldb-unit :: Utility/./UtilityTests/ConstStringTest.NullAndEmptyStates (1653 of 1915) PASS: lldb-api :: lang/c/step-target/TestStepTarget.py (1654 of 1915) PASS: lldb-unit :: Utility/./UtilityTests/RangeTest.NotEqual (1655 of 1915) PASS: lldb-api :: macosx/order/TestOrderFile.py (1656 of 1915) UNSUPPORTED: lldb-api :: lang/objc/modules-incomplete/TestIncompleteModules.py (1657 of 1915) UNSUPPORTED: lldb-shell :: SymbolFile/PDB/udt-layout.test (1658 of 1915) PASS: lldb-unit :: UnwindAssembly/x86/./UnwindAssemblyx86Tests/Testx86AssemblyInspectionEngine.TestPushRBX (1659 of 1915) PASS: lldb-unit :: Utility/./UtilityTests/StringExtractorTest.DecodeHexU8_InvalidHex2 (1660 of 1915) PASS: lldb-api :: functionalities/gdb_remote_client/TestWriteMemory.py (1661 of 1915) PASS: lldb-unit :: UnwindAssembly/x86/./UnwindAssemblyx86Tests/Testx86AssemblyInspectionEngine.TestPushECX (1662 of 1915) PASS: lldb-unit :: Symbol/./SymbolTests/TestClangASTImporter.CanImportInvalidType (1663 of 1915) PASS: lldb-shell :: SymbolFile/DWARF/find-method-local-struct.cpp (1664 of 1915) UNSUPPORTED: lldb-api :: python_api/watchpoint/TestWatchpointIter.py (1665 of 1915) PASS: lldb-unit :: Utility/./UtilityTests/RangeTest.Slide (1666 of 1915) PASS: lldb-shell :: ObjectFile/MachO/symtab.yaml (1667 of 1915) PASS: lldb-shell :: Reproducer/Functionalities/TestImageList.test (1668 of 1915) PASS: lldb-unit :: Utility/./UtilityTests/StreamTest.AddressPrefix (1669 of 1915) UNSUPPORTED: lldb-api :: functionalities/thread/concurrent_events/TestConcurrentDelaySignalWatch.py (1670 of 1915) PASS: lldb-unit :: Utility/./UtilityTests/LogChannelTest.List (1671 of 1915) PASS: lldb-unit :: tools/lldb-server/tests/./LLDBServerTests/TestBase.DebugserverEnv (1672 of 1915) PASS: lldb-unit :: Utility/./UtilityTests/StreamTeeTest.Assignment (1673 of 1915) PASS: lldb-unit :: ScriptInterpreter/Python/./ScriptInterpreterPythonTests/PythonDataObjectsTest.TestInstanceNameResolutionNoDot (1674 of 1915) PASS: lldb-unit :: ScriptInterpreter/Python/./ScriptInterpreterPythonTests/PythonDataObjectsTest.TestPythonFile (1675 of 1915) PASS: lldb-api :: tools/lldb-vscode/variables/TestVSCode_variables.py (1676 of 1915) PASS: lldb-unit :: Process/minidump/./LLDBMinidumpTests/MinidumpParserTest.GetLinuxProcStatus (1677 of 1915) PASS: lldb-api :: tools/lldb-server/TestGdbRemoteProcessInfo.py (1678 of 1915) PASS: lldb-api :: lang/c/shared_lib/TestSharedLib.py (1679 of 1915) PASS: lldb-unit :: Utility/./UtilityTests/FileSpecTest.FileAndDirectoryComponents (1680 of 1915) PASS: lldb-api :: tools/lldb-server/register-reading/TestGdbRemoteGPacket.py (1681 of 1915) UNSUPPORTED: lldb-shell :: Register/x86-64-gp-write.test (1682 of 1915) UNRESOLVED: lldb-api :: functionalities/data-formatter/data-formatter-stl/libcxx/multimap/TestDataFormatterLibccMultiMap.py (1683 of 1915) ******************** TEST 'lldb-api :: functionalities/data-formatter/data-formatter-stl/libcxx/multimap/TestDataFormatterLibccMultiMap.py' FAILED ******************** Unable to find 'RESULT: PASSED' in dotest output (exit code -11):

Hide Details

lldb version 11.0.99 clang revision e03ead6771fc97b11cb0c94b7f023142184ad25f llvm revision e03ead6771fc97b11cb0c94b7f023142184ad25f

Hide Details

******************** PASS: lldb-unit :: Utility/./UtilityTests/ScalarTest.CastOperations (1684 of 1915) PASS: lldb-unit :: Utility/./UtilityTests/RangeTest.Union (1685 of 1915) PASS: lldb-unit :: Language/Highlighting/./HighlighterTests/HighlighterTest.ClangUnterminatedString (1686 of 1915) PASS: lldb-unit :: Utility/./UtilityTests/OptionsWithRawTest.ArgsButNoDelimiter (1687 of 1915) PASS: lldb-api :: python_api/interpreter/TestCommandInterpreterAPI.py (1688 of 1915) PASS: lldb-api :: types/TestLongTypes.py (1689 of 1915) PASS: lldb-api :: commands/disassemble/basic/TestFrameDisassemble.py (1690 of 1915) PASS: lldb-api :: python_api/lldbutil/process/TestPrintStackTraces.py (1691 of 1915) PASS: lldb-shell :: Minidump/memory-region.yaml (1692 of 1915) UNSUPPORTED: lldb-api :: commands/watchpoints/hello_watchpoint/TestMyFirstWatchpoint.py (1693 of 1915) PASS: lldb-unit :: Utility/./UtilityTests/UriParserTest.SchemeHostSeparator (1694 of 1915) PASS: lldb-unit :: Utility/./UtilityTests/RangeTest.ContainsAddrInvalid (1695 of 1915) PASS: lldb-unit :: Utility/./UtilityTests/UUIDTest.RelationalOperators (1696 of 1915) PASS: lldb-api :: commands/add-dsym/uuid/TestAddDsymCommand.py (1697 of 1915) PASS: lldb-shell :: ObjectFile/PECOFF/sections.yaml (1698 of 1915) PASS: lldb-shell :: ObjectFile/ELF/section-types.yaml (1699 of 1915) PASS: lldb-shell :: ObjectFile/ELF/netbsd-core-amd64.test (1700 of 1915) PASS: lldb-api :: lang/objcxx/class-name-clash/TestNameClash.py (1701 of 1915) PASS: lldb-unit :: Utility/./UtilityTests/OptionsWithRawTest.SingleWordSuffix (1702 of 1915) PASS: lldb-api :: lang/cpp/const_this/TestConstThis.py (1703 of 1915) PASS: lldb-unit :: Utility/./UtilityTests/StreamTest.PutCharNull (1704 of 1915) PASS: lldb-unit :: Utility/./UtilityTests/NameMatchesTest.StartsWith (1705 of 1915) PASS: lldb-unit :: Utility/./UtilityTests/ScalarTest.SetValueFromCString (1706 of 1915) PASS: lldb-api :: functionalities/data-formatter/nsdictionarysynth/TestNSDictionarySynthetic.py (1707 of 1915) PASS: lldb-unit :: Process/minidump/./LLDBMinidumpTests/MinidumpParserTest.GetArchitecture (1708 of 1915) UNRESOLVED: lldb-api :: functionalities/data-formatter/data-formatter-stl/libcxx/initializerlist/TestInitializerList.py (1709 of 1915) ******************** TEST 'lldb-api :: functionalities/data-formatter/data-formatter-stl/libcxx/initializerlist/TestInitializerList.py' FAILED ******************** Unable to find 'RESULT: PASSED' in dotest output (exit code -11):

Hide Details

lldb version 11.0.99 clang revision e03ead6771fc97b11cb0c94b7f023142184ad25f llvm revision e03ead6771fc97b11cb0c94b7f023142184ad25f

Hide Details

******************** PASS: lldb-api :: python_api/sbdata/TestSBData.py (1710 of 1915) PASS: lldb-api :: python_api/sbstructureddata/TestStructuredDataAPI.py (1711 of 1915) PASS: lldb-unit :: UnwindAssembly/x86/./UnwindAssemblyx86Tests/Testx86AssemblyInspectionEngine.TestPushEDX (1712 of 1915) UNSUPPORTED: lldb-shell :: SymbolFile/DWARF/find-basic-variable.cpp (1713 of 1915) PASS: lldb-api :: lang/cpp/type_lookup/TestCppTypeLookup.py (1714 of 1915) PASS: lldb-api :: functionalities/data-formatter/data-formatter-objc/TestDataFormatterObjCNSURL.py (1715 of 1915) PASS: lldb-unit :: Utility/./UtilityTests/BinaryStreamTest.PutSLEB128SevenBytes (1716 of 1915) PASS: lldb-unit :: Utility/./UtilityTests/StreamTest.PutRawBytesToBigEndian (1717 of 1915) PASS: lldb-api :: functionalities/data-formatter/data-formatter-objc/TestDataFormatterObjCExpr.py (1718 of 1915) PASS: lldb-api :: commands/frame/diagnose/dereference-function-return/TestDiagnoseDereferenceFunctionReturn.py (1719 of 1915) PASS: lldb-unit :: ScriptInterpreter/Python/./ScriptInterpreterPythonTests/PythonDataObjectsTest.TestObjectAttributes (1720 of 1915) UNRESOLVED: lldb-api :: functionalities/data-formatter/data-formatter-stl/libcxx/multiset/TestDataFormatterLibcxxMultiSet.py (1721 of 1915) ******************** TEST 'lldb-api :: functionalities/data-formatter/data-formatter-stl/libcxx/multiset/TestDataFormatterLibcxxMultiSet.py' FAILED ******************** Unable to find 'RESULT: PASSED' in dotest output (exit code -11):

Hide Details

lldb version 11.0.99 clang revision e03ead6771fc97b11cb0c94b7f023142184ad25f llvm revision e03ead6771fc97b11cb0c94b7f023142184ad25f

Hide Details

******************** PASS: lldb-unit :: Utility/./UtilityTests/TimerTest.CategoryTimesStats (1722 of 1915) PASS: lldb-api :: commands/expression/expr-in-syscall/TestExpressionInSyscall.py (1723 of 1915) XFAIL: lldb-shell :: Register/x86-64-ymm-write.test (1724 of 1915) PASS: lldb-unit :: Utility/./UtilityTests/StreamTeeTest.Write (1725 of 1915) PASS: lldb-unit :: Utility/./UtilityTests/StringListTest.Join (1726 of 1915) PASS: lldb-unit :: Utility/./UtilityTests/UserIDResolver.GetGroupName (1727 of 1915) PASS: lldb-api :: lang/objc/print-obj/TestPrintObj.py (1728 of 1915) PASS: lldb-shell :: ObjectFile/ELF/PT_LOAD-overlap-section.yaml (1729 of 1915) PASS: lldb-unit :: ScriptInterpreter/Python/./ScriptInterpreterPythonTests/PythonDataObjectsTest.TestPythonIntegerToStructuredInteger (1730 of 1915) PASS: lldb-unit :: tools/lldb-server/tests/./LLDBServerTests/StandardStartupTest.TestStopReplyContainsThreadPcs (1731 of 1915) PASS: lldb-unit :: Expression/./ExpressionTests/DiagnosticManagerTest.GetStringMultiline (1732 of 1915) PASS: lldb-unit :: Process/minidump/./LLDBMinidumpTests/MinidumpParserTest.GetMiscInfoWindows (1733 of 1915) PASS: lldb-api :: python_api/process/io/TestProcessIO.py (1734 of 1915) PASS: lldb-unit :: Utility/./UtilityTests/OptionsWithRawTest.ArgsButNoLeadingDash (1735 of 1915) PASS: lldb-api :: commands/settings/quoting/TestQuoting.py (1736 of 1915) UNSUPPORTED: lldb-api :: python_api/watchpoint/condition/TestWatchpointConditionAPI.py (1737 of 1915) PASS: lldb-unit :: Utility/./UtilityTests/VASprintfTest.NoBufferResize (1738 of 1915) PASS: lldb-api :: api/log/TestAPILog.py (1739 of 1915) PASS: lldb-unit :: Utility/./UtilityTests/RegularExpression.Invalid (1740 of 1915) PASS: lldb-unit :: Process/gdb-remote/./ProcessGdbRemoteTests/GDBRemoteClientBaseTest.SendContinueDelegateStructuredDataReceipt (1741 of 1915) UNSUPPORTED: lldb-api :: tools/lldb-server/libraries-svr4/TestGdbRemoteLibrariesSvr4Support.py (1742 of 1915) PASS: lldb-unit :: Utility/./UtilityTests/StringLexerTest.GetUnlexed (1743 of 1915) PASS: lldb-api :: functionalities/param_entry_vals/basic_entry_values_x86_64/TestBasicEntryValuesX86_64.py (1744 of 1915) PASS: lldb-unit :: UnwindAssembly/x86/./UnwindAssemblyx86Tests/Testx86AssemblyInspectionEngine.TestPushRBPWithREX (1745 of 1915) PASS: lldb-unit :: Utility/./UtilityTests/VMRange.IsValid (1746 of 1915) PASS: lldb-unit :: Target/./TargetTests/ModuleCacheTest.GetAndPut (1747 of 1915) PASS: lldb-unit :: Utility/./UtilityTests/RegularExpression.Match (1748 of 1915) PASS: lldb-unit :: Utility/./UtilityTests/StreamTest.AddressSize (1749 of 1915) UNRESOLVED: lldb-api :: lang/cpp/class-template-parameter-pack/TestClassTemplateParameterPack.py (1750 of 1915) ******************** TEST 'lldb-api :: lang/cpp/class-template-parameter-pack/TestClassTemplateParameterPack.py' FAILED ******************** Unable to find 'RESULT: PASSED' in dotest output (exit code -11):

Hide Details

lldb version 11.0.99 clang revision e03ead6771fc97b11cb0c94b7f023142184ad25f llvm revision e03ead6771fc97b11cb0c94b7f023142184ad25f

Hide Details

******************** PASS: lldb-api :: tools/lldb-server/inferior-crash/TestGdbRemoteSegFault.py (1751 of 1915) UNSUPPORTED: lldb-shell :: Register/aarch64-gp-read.test (1752 of 1915) PASS: lldb-shell :: ObjectFile/ELF/many-sections.s (1753 of 1915) PASS: lldb-api :: functionalities/exec/TestExec.py (1754 of 1915) UNSUPPORTED: lldb-shell :: ObjectFile/ELF/basic-info.yaml (1755 of 1915) PASS: lldb-unit :: Utility/./UtilityTests/OptionsWithRawTest.MultiWordSuffix (1756 of 1915) UNSUPPORTED: lldb-shell :: SymbolFile/NativePDB/function-types-builtins.cpp (1757 of 1915) UNRESOLVED: lldb-api :: functionalities/var_path/TestVarPath.py (1758 of 1915) ******************** TEST 'lldb-api :: functionalities/var_path/TestVarPath.py' FAILED ******************** Unable to find 'RESULT: PASSED' in dotest output (exit code -11):

Hide Details

lldb version 11.0.99 clang revision e03ead6771fc97b11cb0c94b7f023142184ad25f llvm revision e03ead6771fc97b11cb0c94b7f023142184ad25f

Hide Details

******************** PASS: lldb-unit :: UnwindAssembly/x86/./UnwindAssemblyx86Tests/Testx86AssemblyInspectionEngine.TestPopEBX (1759 of 1915) PASS: lldb-unit :: ScriptInterpreter/Python/./ScriptInterpreterPythonTests/PythonDataObjectsTest.TestExtractingUInt64ThroughStructuredData (1760 of 1915) UNSUPPORTED: lldb-api :: arm/breakpoint-it/TestBreakpointIt.py (1761 of 1915) PASS: lldb-unit :: Language/Highlighting/./HighlighterTests/HighlighterTest.ClangBraces (1762 of 1915) UNSUPPORTED: lldb-api :: functionalities/thread/concurrent_events/TestConcurrentManySignals.py (1763 of 1915) PASS: lldb-api :: functionalities/breakpoint/inlined_breakpoints/TestInlinedBreakpoints.py (1764 of 1915) PASS: lldb-api :: lang/cpp/function_refs/TestFunctionRefs.py (1765 of 1915) PASS: lldb-api :: lang/c/bitfields/TestBitfields.py (1766 of 1915) PASS: lldb-unit :: Utility/./UtilityTests/StreamTest.PutRawBytesToLittleEndian (1767 of 1915) PASS: lldb-unit :: Symbol/./SymbolTests/TestClangASTImporter.MetadataPropagationIndirectImport (1768 of 1915) PASS: lldb-api :: functionalities/breakpoint/consecutive_breakpoints/TestConsecutiveBreakpoints.py (1769 of 1915) PASS: lldb-shell :: Breakpoint/debug_rnglistx_rlex.test (1770 of 1915) PASS: lldb-unit :: Utility/./UtilityTests/StringListTest.InsertStringAtIndexOutOfBounds (1771 of 1915) PASS: lldb-api :: commands/expression/context-object/TestContextObject.py (1772 of 1915) UNSUPPORTED: lldb-shell :: SymbolFile/NativePDB/ast-functions.cpp (1773 of 1915) PASS: lldb-api :: lang/cpp/overloaded-functions/TestOverloadedFunctions.py (1774 of 1915) PASS: lldb-unit :: Host/./HostTests/SocketTest.TCPListen0ConnectAccept (1775 of 1915) PASS: lldb-unit :: SymbolFile/NativePDB/./SymbolFileNativePDBTests/PDBFPOProgramToDWARFExpressionTests.UnsupportedRASearch (1776 of 1915) PASS: lldb-api :: functionalities/data-formatter/data-formatter-objc/cmtime/TestDataFormatterCMTime.py (1777 of 1915) UNRESOLVED: lldb-api :: python_api/exprpath_synthetic/TestExprPathSynthetic.py (1778 of 1915) ******************** TEST 'lldb-api :: python_api/exprpath_synthetic/TestExprPathSynthetic.py' FAILED ******************** Unable to find 'RESULT: PASSED' in dotest output (exit code -11):

Hide Details

lldb version 11.0.99 clang revision e03ead6771fc97b11cb0c94b7f023142184ad25f llvm revision e03ead6771fc97b11cb0c94b7f023142184ad25f

Hide Details

******************** PASS: lldb-unit :: Expression/./ExpressionTests/ClangHostTest.MacOSX (1779 of 1915) PASS: lldb-unit :: Host/./HostTests/FileSystemTest.OpenErrno (1780 of 1915) PASS: lldb-shell :: BuildScript/compiler-full-path.test (1781 of 1915) PASS: lldb-unit :: Utility/./UtilityTests/DataExtractorTest.GetCStrUnterminated (1782 of 1915) PASS: lldb-unit :: Utility/./UtilityTests/StringExtractorTest.InitMisc (1783 of 1915) PASS: lldb-unit :: Utility/./UtilityTests/DataExtractorTest.GetMaxU64_unchecked (1784 of 1915) UNSUPPORTED: lldb-shell :: Register/x86-64-zmm-read.test (1785 of 1915) PASS: lldb-unit :: Process/gdb-remote/./ProcessGdbRemoteTests/GDBRemoteClientBaseTest.SendContinueAndAsyncSignal (1786 of 1915) UNSUPPORTED: lldb-api :: functionalities/signal/handle-segv/TestHandleSegv.py (1787 of 1915) PASS: lldb-unit :: SymbolFile/DWARF/./SymbolFileDWARFTests/SymbolFileDWARFTests.TestAbbrevOrder1Start1 (1788 of 1915) UNSUPPORTED: lldb-api :: tools/lldb-vscode/completions/TestVSCode_completions.py (1789 of 1915) PASS: lldb-unit :: Process/gdb-remote/./ProcessGdbRemoteTests/GDBRemoteCommunicationClientTest.GetModulesInfo (1790 of 1915) PASS: lldb-shell :: Minidump/disassemble-no-module.yaml (1791 of 1915) PASS: lldb-api :: functionalities/data-formatter/poarray/TestPrintObjectArray.py (1792 of 1915) PASS: lldb-unit :: Language/CPlusPlus/./LanguageCPlusPlusTests/CPlusPlusLanguage.ExtractContextAndIdentifier (1793 of 1915) PASS: lldb-unit :: Utility/./UtilityTests/StringExtractorTest.GetHexBytes_Partial (1794 of 1915) UNSUPPORTED: lldb-shell :: ObjectFile/ELF/minidebuginfo-no-lzma.yaml (1795 of 1915) PASS: lldb-unit :: Utility/./UtilityTests/RangeTest.Clear (1796 of 1915) PASS: lldb-unit :: Utility/./UtilityTests/StringListTest.AppendList (1797 of 1915) PASS: lldb-api :: lang/cpp/trivial_abi/TestTrivialABI.py (1798 of 1915) PASS: lldb-shell :: SymbolFile/Breakpad/line-table-missing-file.test (1799 of 1915) PASS: lldb-unit :: Language/Highlighting/./HighlighterTests/HighlighterTest.ClangOperators (1800 of 1915) PASS: lldb-unit :: Utility/./UtilityTests/LogChannelEnabledTest.LogThread (1801 of 1915) PASS: lldb-unit :: Utility/./UtilityTests/Flags.AnySet (1802 of 1915) PASS: lldb-unit :: Utility/./UtilityTests/CompletionRequest.ShiftArguments (1803 of 1915) UNSUPPORTED: lldb-shell :: Register/x86-64-ymm16-write.test (1804 of 1915) PASS: lldb-unit :: Utility/./UtilityTests/StringExtractorTest.GetHexU8_Extra (1805 of 1915) PASS: lldb-shell :: ObjectFile/ELF/PT_LOAD-overlap.yaml (1806 of 1915) PASS: lldb-shell :: Settings/TestStopCommandSourceOnError.test (1807 of 1915) PASS: lldb-shell :: ObjectFile/ELF/section-overlap.yaml (1808 of 1915) PASS: lldb-api :: functionalities/pre_run_dylibs/TestPreRunDylibs.py (1809 of 1915) PASS: lldb-unit :: Expression/./ExpressionTests/DWARFExpression.DW_OP_convert (1810 of 1915) PASS: lldb-unit :: UnwindAssembly/PPC64/./PPC64InstEmulationTests/TestPPC64InstEmulation.TestSimpleFunction (1811 of 1915) PASS: lldb-unit :: UnwindAssembly/x86/./UnwindAssemblyx86Tests/Testx86AssemblyInspectionEngine.TestPopEDI (1812 of 1915) PASS: lldb-api :: tools/lldb-server/TestAppleSimulatorOSType.py (1813 of 1915) PASS: lldb-unit :: Language/Highlighting/./HighlighterTests/HighlighterTest.ClangScalarLiterals (1814 of 1915) PASS: lldb-api :: commands/process/attach/attach_denied/TestAttachDenied.py (1815 of 1915) PASS: lldb-api :: lang/objc/foundation/TestRuntimeTypes.py (1816 of 1915) PASS: lldb-unit :: Language/Highlighting/./HighlighterTests/HighlighterTest.ClangCursorPosAfterOtherToken (1817 of 1915) PASS: lldb-shell :: SymbolFile/DWARF/DW_OP_piece-struct.s (1818 of 1915) PASS: lldb-unit :: Utility/./UtilityTests/LogChannelTest.Enable (1819 of 1915) PASS: lldb-unit :: Process/gdb-remote/./ProcessGdbRemoteTests/GDBRemoteCommunicationServerTest.SendErrorResponse_StringError (1820 of 1915) UNSUPPORTED: lldb-shell :: SymbolFile/DWARF/debug-names-compressed.cpp (1821 of 1915) PASS: lldb-unit :: Expression/./ExpressionTests/DiagnosticManagerTest.GetStringPreserveOrder (1822 of 1915) UNSUPPORTED: lldb-api :: functionalities/darwin_log/filter/exact_match/subsystem/TestDarwinLogFilterMatchSubsystem.py (1823 of 1915) PASS: lldb-api :: functionalities/breakpoint/breakpoint_callback_command_source/TestBreakpointCallbackCommandSource.py (1824 of 1915) UNSUPPORTED: lldb-shell :: SymbolFile/NativePDB/globals-bss.cpp (1825 of 1915) PASS: lldb-unit :: Interpreter/./InterpreterTests/CompletionTest.DirCompletionAbsolute (1826 of 1915) PASS: lldb-api :: api/multiple-targets/TestMultipleTargets.py (1827 of 1915) PASS: lldb-unit :: Language/Highlighting/./HighlighterTests/HighlighterTest.ClangCursorPosEndOfLine (1828 of 1915) UNSUPPORTED: lldb-api :: commands/watchpoints/watchpoint_set_command/TestWatchLocationWithWatchSet.py (1829 of 1915) PASS: lldb-api :: functionalities/thread/concurrent_events/TestConcurrentTwoBreakpointsOneDelaySignal.py (1830 of 1915) PASS: lldb-api :: api/multithreaded/TestMultithreaded.py (1831 of 1915) PASS: lldb-unit :: Symbol/./SymbolTests/TestClangASTContext.TestRemoveFastQualifiers (1832 of 1915) PASS: lldb-unit :: Process/gdb-remote/./ProcessGdbRemoteTests/GDBRemoteClientBaseTest.SendContinueAndWait (1833 of 1915) PASS: lldb-api :: commands/frame/diagnose/array/TestArray.py (1834 of 1915) PASS: lldb-api :: tools/lldb-server/inferior-crash/TestGdbRemoteAbort.py (1835 of 1915) PASS: lldb-api :: lang/cpp/unicode-literals/TestUnicodeLiterals.py (1836 of 1915) PASS: lldb-unit :: SymbolFile/NativePDB/./SymbolFileNativePDBTests/PDBFPOProgramToDWARFExpressionTests.InvalidAssignmentMultiple (1837 of 1915) PASS: lldb-api :: lang/objc/objc-super/TestObjCSuper.py (1838 of 1915) PASS: lldb-unit :: Utility/./UtilityTests/StringListTest.InsertStringAtIndexStart (1839 of 1915) PASS: lldb-api :: commands/expression/dollar-in-variable/TestDollarInVariable.py (1840 of 1915) XFAIL: lldb-shell :: Register/x86-64-write.test (1841 of 1915) UNSUPPORTED: lldb-api :: lang/cpp/static_members/TestCPPStaticMembers.py (1842 of 1915) PASS: lldb-unit :: Language/Highlighting/./HighlighterTests/HighlighterTest.ClangStringLiterals (1843 of 1915) FAIL: lldb-unit :: Symbol/./SymbolTests/TestClangASTContext.TemplateArguments (1844 of 1915) ******************** TEST 'lldb-unit :: Symbol/./SymbolTests/TestClangASTContext.TemplateArguments' FAILED ******************** Note: Google Test filter = TestClangASTContext.TemplateArguments [==========] Running 1 test from 1 test case. [----------] Global test environment set-up. [----------] 1 test from TestClangASTContext [ RUN ] TestClangASTContext.TemplateArguments 0 SymbolTests 0x000000010e7b4975 llvm::sys::PrintStackTrace(llvm::raw_ostream&) + 37 1 SymbolTests 0x000000010e7b37a6 llvm::sys::RunSignalHandlers() + 198 2 SymbolTests 0x000000010e7b4f56 SignalHandler(int) + 262 3 libsystem_platform.dylib 0x00007fff7766bb3d _sigtramp + 29 4 libsystem_platform.dylib 0x000000011ff56f2b _sigtramp + 18446603343344088075 5 SymbolTests 0x000000010e7f2ae3 CreateTemplateParameterList(clang::ASTContext*, lldb_private::ClangASTContext::TemplateParameterInfos const&, llvm::SmallVector<clang::NamedDecl*, 8u>&) + 403 6 SymbolTests 0x000000010e7f2fbc lldb_private::ClangASTContext::CreateClassTemplateDecl(clang::DeclContext*, lldb::AccessType, char const*, int, lldb_private::ClangASTContext::TemplateParameterInfos const&) + 444 7 SymbolTests 0x000000010e6c7039 TestClangASTContext_TemplateArguments_Test::TestBody() + 521 8 SymbolTests 0x000000010e7bc98f testing::Test::Run() + 287 9 SymbolTests 0x000000010e7bd6f0 testing::TestInfo::Run() + 304 10 SymbolTests 0x000000010e7bdf07 testing::TestCase::Run() + 231 11 SymbolTests 0x000000010e7c6b67 testing::internal::UnitTestImpl::RunAllTests() + 1063 12 SymbolTests 0x000000010e7c66cb testing::UnitTest::Run() + 171 13 SymbolTests 0x000000010e7b5af9 main + 121 14 libdyld.dylib 0x00007fff77482085 start + 1

Hide Details

******************** PASS: lldb-api :: api/listeners/TestListener.py (1845 of 1915) PASS: lldb-api :: commands/expression/timeout/TestCallWithTimeout.py (1846 of 1915) PASS: lldb-shell :: ObjectFile/PECOFF/invalid-export-table.yaml (1847 of 1915) PASS: lldb-unit :: Symbol/./SymbolTests/DWARFCallFrameInfoTest.Basic_dwarf4 (1848 of 1915) PASS: lldb-api :: lang/cpp/bool/TestCPPBool.py (1849 of 1915) PASS: lldb-api :: functionalities/gdb_remote_client/TestStopPCs.py (1850 of 1915) PASS: lldb-shell :: Quit/TestQuitExitCode30.test (1851 of 1915) PASS: lldb-api :: functionalities/data-formatter/setvaluefromcstring/TestSetValueFromCString.py (1852 of 1915) PASS: lldb-unit :: Utility/./UtilityTests/RegularExpression.Valid (1853 of 1915) PASS: lldb-shell :: Quit/TestQuitExitCodeImplicit0.test (1854 of 1915) PASS: lldb-unit :: Utility/./UtilityTests/RangeTest.ContainsAddr (1855 of 1915) PASS: lldb-api :: lang/objc/objc-dyn-sbtype/TestObjCDynamicSBType.py (1856 of 1915) PASS: lldb-shell :: SymbolFile/DWARF/parallel-indexing-stress.s (1857 of 1915) PASS: lldb-api :: tools/lldb-vscode/breakpoint/TestVSCode_setFunctionBreakpoints.py (1858 of 1915) PASS: lldb-shell :: Watchpoint/SetErrorCases.test (1859 of 1915) PASS: lldb-unit :: Utility/./UtilityTests/StreamTeeTest.GetStreamAtIndexOutOfBounds (1860 of 1915) PASS: lldb-unit :: Utility/./UtilityTests/AnsiTerminal.WhiteSpace (1861 of 1915) PASS: lldb-shell :: Driver/TestSingleQuote.test (1862 of 1915) UNSUPPORTED: lldb-api :: benchmarks/frame_variable/TestFrameVariableResponse.py (1863 of 1915) PASS: lldb-api :: commands/expression/fixits/TestFixIts.py (1864 of 1915) PASS: lldb-unit :: Symbol/./SymbolTests/TestClangASTImporter.DeportDeclTagDecl (1865 of 1915) PASS: lldb-unit :: Utility/./UtilityTests/BinaryStreamTest.PutSLEB128FourBytes (1866 of 1915) PASS: lldb-api :: commands/expression/persistent_types/TestNestedPersistentTypes.py (1867 of 1915) PASS: lldb-api :: lang/c/unicode/TestUnicodeSymbols.py (1868 of 1915) UNRESOLVED: lldb-api :: commands/expression/import-std-module/list-dbg-info-content/TestDbgInfoContentList.py (1869 of 1915) ******************** TEST 'lldb-api :: commands/expression/import-std-module/list-dbg-info-content/TestDbgInfoContentList.py' FAILED ******************** Unable to find 'RESULT: PASSED' in dotest output (exit code -11):

Hide Details

lldb version 11.0.99 clang revision e03ead6771fc97b11cb0c94b7f023142184ad25f llvm revision e03ead6771fc97b11cb0c94b7f023142184ad25f

Hide Details

******************** PASS: lldb-unit :: Symbol/./SymbolTests/PostfixExpression.ParseFPOProgram (1870 of 1915) PASS: lldb-unit :: Host/./HostTests/SocketTest.UDPConnect (1871 of 1915) PASS: lldb-api :: lang/c/unions/TestUnionMembers.py (1872 of 1915) PASS: lldb-api :: functionalities/data-formatter/hexcaps/TestDataFormatterHexCaps.py (1873 of 1915) PASS: lldb-shell :: Settings/TestFrameFormatColor.test (1874 of 1915) PASS: lldb-unit :: Process/gdb-remote/./ProcessGdbRemoteTests/GDBRemoteCommunicationClientTest.GetMemoryRegionInfo (1875 of 1915) UNSUPPORTED: lldb-api :: functionalities/thread/concurrent_events/TestConcurrentManyWatchpoints.py (1876 of 1915) PASS: lldb-api :: functionalities/postmortem/elf-core/thread_crash/TestLinuxCoreThreads.py (1877 of 1915) PASS: lldb-api :: functionalities/process_group/TestChangeProcessGroup.py (1878 of 1915) PASS: lldb-api :: functionalities/gdb_remote_client/TestTargetXMLArch.py (1879 of 1915) PASS: lldb-unit :: ScriptInterpreter/Python/./ScriptInterpreterPythonTests/PythonDataObjectsTest.TestOwnedReferences (1880 of 1915) UNSUPPORTED: lldb-shell :: SymbolFile/NativePDB/disassembly.cpp (1881 of 1915) PASS: lldb-api :: functionalities/dead-strip/TestDeadStrip.py (1882 of 1915) UNRESOLVED: lldb-api :: commands/expression/import-std-module/forward_list-dbg-info-content/TestDbgInfoContentForwardList.py (1883 of 1915) ******************** TEST 'lldb-api :: commands/expression/import-std-module/forward_list-dbg-info-content/TestDbgInfoContentForwardList.py' FAILED ******************** Unable to find 'RESULT: PASSED' in dotest output (exit code -11):

Hide Details

lldb version 11.0.99 clang revision e03ead6771fc97b11cb0c94b7f023142184ad25f llvm revision e03ead6771fc97b11cb0c94b7f023142184ad25f

Hide Details

******************** PASS: lldb-api :: macosx/add-dsym/TestAddDsymMidExecutionCommand.py (1884 of 1915) PASS: lldb-unit :: Utility/./UtilityTests/StringListTest.ShiftMove (1885 of 1915) UNSUPPORTED: lldb-api :: commands/watchpoints/watchpoint_commands/command/TestWatchpointCommandPython.py (1886 of 1915) UNSUPPORTED: lldb-api :: functionalities/data-formatter/data-formatter-stl/libstdcpp/smart_ptr/TestDataFormatterStdSmartPtr.py (1887 of 1915) PASS: lldb-unit :: UnwindAssembly/x86/./UnwindAssemblyx86Tests/Testx86AssemblyInspectionEngine.TestReturnDetect (1888 of 1915) PASS: lldb-unit :: Target/./TargetTests/PathMappingListTest.RelativeTests (1889 of 1915) PASS: lldb-unit :: Utility/./UtilityTests/StringExtractorTest.GetHexBytesAvail_FullString (1890 of 1915) PASS: lldb-shell :: Quit/TestQuitExitCodeTooManyArgs.test (1891 of 1915) PASS: lldb-shell :: Settings/TestFrameFormatMangling.test (1892 of 1915) PASS: lldb-api :: lang/cpp/inlines/TestInlines.py (1893 of 1915) PASS: lldb-api :: commands/expression/xvalue/TestXValuePrinting.py (1894 of 1915) PASS: lldb-unit :: ScriptInterpreter/Python/./ScriptInterpreterPythonTests/PythonDataObjectsTest.TestPythonIntegerToStr (1895 of 1915) PASS: lldb-shell :: Driver/TestFile.test (1896 of 1915) PASS: lldb-unit :: Utility/./UtilityTests/ArgsTest.StringListConstructor (1897 of 1915) PASS: lldb-api :: lang/objc/foundation/TestObjectDescriptionAPI.py (1898 of 1915) PASS: lldb-unit :: Utility/./UtilityTests/ArgsTest.TestSingleQuotedArgWithSpace (1899 of 1915) PASS: lldb-api :: commands/expression/diagnostics/TestExprDiagnostics.py (1900 of 1915) PASS: lldb-api :: commands/process/attach-resume/TestAttachResume.py (1901 of 1915) PASS: lldb-api :: lang/objc/objc-struct-argument/TestObjCStructArgument.py (1902 of 1915) PASS: lldb-api :: commands/expression/multiline-completion/TestMultilineCompletion.py (1903 of 1915) PASS: lldb-api :: commands/expression/persistent_variables/TestPersistentVariables.py (1904 of 1915) PASS: lldb-api :: commands/expression/radar_9673664/TestExprHelpExamples.py (1905 of 1915) PASS: lldb-api :: functionalities/data-formatter/synthupdate/TestSyntheticFilterRecompute.py (1906 of 1915) PASS: lldb-api :: commands/expression/regression-access-function-template-in-record/TestRegressionAccessFunctionTemplateInRecord.py (1907 of 1915) PASS: lldb-api :: python_api/symbol-context/two-files/TestSymbolContextTwoFiles.py (1908 of 1915) PASS: lldb-api :: commands/expression/pr35310/TestExprsBug35310.py (1909 of 1915) PASS: lldb-api :: types/TestFloatTypesExpr.py (1910 of 1915) PASS: lldb-api :: lang/objc/objc-struct-return/TestObjCStructReturn.py (1911 of 1915) PASS: lldb-api :: types/TestLongTypesExpr.py (1912 of 1915) PASS: lldb-api :: lang/objc/foundation/TestObjCMethods.py (1913 of 1915) PASS: lldb-api :: lang/objc/foundation/TestFoundationDisassembly.py (1914 of 1915) Cancelling nested steps due to timeout Sending interrupt signal to process ninja: build stopped: interrupted by user. script returned exit code 143 [Pipeline] } [Pipeline] // timeout [Pipeline] } [Pipeline] // stage [Pipeline] stage [Pipeline] { (Test DWARF5) Stage "Test DWARF5" skipped due to earlier failure(s) [Pipeline] } [Pipeline] // stage [Pipeline] stage [Pipeline] { (Build Clang 5.0.2) Stage "Build Clang 5.0.2" skipped due to earlier failure(s) [Pipeline] } [Pipeline] // stage [Pipeline] stage [Pipeline] { (Test Clang 5.0.2) Stage "Test Clang 5.0.2" skipped due to earlier failure(s) [Pipeline] } [Pipeline] // stage [Pipeline] stage [Pipeline] { (Build Clang 7.0.1) Stage "Build Clang 7.0.1" skipped due to earlier failure(s) [Pipeline] } [Pipeline] // stage [Pipeline] stage [Pipeline] { (Test Clang 7.0.1) Stage "Test Clang 7.0.1" skipped due to earlier failure(s) [Pipeline] } [Pipeline] // stage [Pipeline] stage [Pipeline] { (Build Clang 9.0.0) Stage "Build Clang 9.0.0" skipped due to earlier failure(s) [Pipeline] } [Pipeline] // stage [Pipeline] stage [Pipeline] { (Test Clang 9.0.0) Stage "Test Clang 9.0.0" skipped due to earlier failure(s) [Pipeline] } [Pipeline] // stage [Pipeline] } [Pipeline] // withEnv [Pipeline] } [Pipeline] // node [Pipeline] End of Pipeline Timeout has been exceeded Finished: ABORTED