Regression

Test Clang 7.0.1 / lldb-api.tools/lldb-server/register-reading.TestGdbRemoteGPacket.py (from lldb-api)

Failing for the past 1 build (Since Unstable#966 )
Took 1.3 sec.

Stacktrace

Script:
--
/usr/local/bin/python /Users/buildslave/jenkins/workspace/lldb-cmake-matrix/llvm-project/lldb/test/API/dotest.py --arch x86_64 -s /Users/buildslave/jenkins/workspace/lldb-cmake-matrix/lldb-build/lldb-test-traces -S nm -u CXXFLAGS -u CFLAGS --codesign-identity lldb_codesign --server /Users/buildslave/jenkins/workspace/lldb-cmake-matrix/lldb-build/./bin/debugserver --arch x86_64 --build-dir /Users/buildslave/jenkins/workspace/lldb-cmake-matrix/lldb-build/lldb-test-build.noindex -s=/Users/buildslave/jenkins/workspace/lldb-cmake-matrix/test/logs -t --env TERM=vt100 --skip-category gmodules --skip-category watchpoint --arch=x86_64 --env LLVM_LIBS_DIR=/Users/buildslave/jenkins/workspace/lldb-cmake-matrix/lldb-build/./lib --build-dir /Users/buildslave/jenkins/workspace/lldb-cmake-matrix/lldb-build/lldb-test-build.noindex --lldb-module-cache-dir /Users/buildslave/jenkins/workspace/lldb-cmake-matrix/lldb-build/lldb-test-build.noindex/module-cache-lldb/lldb-api --clang-module-cache-dir /Users/buildslave/jenkins/workspace/lldb-cmake-matrix/lldb-build/lldb-test-build.noindex/module-cache-clang/lldb-api --executable /Users/buildslave/jenkins/workspace/lldb-cmake-matrix/lldb-build/./bin/lldb --compiler /Users/buildslave/jenkins/workspace/lldb-cmake-matrix/lldb-build/./bin/clang --dsymutil /Users/buildslave/jenkins/workspace/lldb-cmake-matrix/lldb-build/./bin/dsymutil --filecheck /Users/buildslave/jenkins/workspace/lldb-cmake-matrix/lldb-build/./bin/FileCheck /Users/buildslave/jenkins/workspace/lldb-cmake-matrix/llvm-project/lldb/packages/Python/lldbsuite/test/tools/lldb-server/register-reading -p TestGdbRemoteGPacket.py
--
Exit Code: 1

Command Output (stdout):
--
lldb version 11.0.99
  clang revision 713562f54858f10bf8998ee21ff2c7e7bad0d177
  llvm revision 713562f54858f10bf8998ee21ff2c7e7bad0d177
LLDB library dir: /Users/buildslave/jenkins/workspace/lldb-cmake-matrix/lldb-build/bin
LLDB import library dir: /Users/buildslave/jenkins/workspace/lldb-cmake-matrix/lldb-build/bin
libstdcxx tests will not be run because: Don't know how to build with libstdcxx on macosx
Skipping following debug info categories: ['dwo']
setting set target.prefer-dynamic-value no-dynamic-values

--
Command Output (stderr):
--

Session logs for test failures/errors/unexpected successes will go into directory '/Users/buildslave/jenkins/workspace/lldb-cmake-matrix/test/logs'
Command invoked: /Users/buildslave/jenkins/workspace/lldb-cmake-matrix/llvm-project/lldb/test/API/dotest.py --arch x86_64 -s /Users/buildslave/jenkins/workspace/lldb-cmake-matrix/lldb-build/lldb-test-traces -S nm -u CXXFLAGS -u CFLAGS --codesign-identity lldb_codesign --server /Users/buildslave/jenkins/workspace/lldb-cmake-matrix/lldb-build/./bin/debugserver --arch x86_64 --build-dir /Users/buildslave/jenkins/workspace/lldb-cmake-matrix/lldb-build/lldb-test-build.noindex -s=/Users/buildslave/jenkins/workspace/lldb-cmake-matrix/test/logs -t --env TERM=vt100 --skip-category gmodules --skip-category watchpoint --arch=x86_64 --env LLVM_LIBS_DIR=/Users/buildslave/jenkins/workspace/lldb-cmake-matrix/lldb-build/./lib --build-dir /Users/buildslave/jenkins/workspace/lldb-cmake-matrix/lldb-build/lldb-test-build.noindex --lldb-module-cache-dir /Users/buildslave/jenkins/workspace/lldb-cmake-matrix/lldb-build/lldb-test-build.noindex/module-cache-lldb/lldb-api --clang-module-cache-dir /Users/buildslave/jenkins/workspace/lldb-cmake-matrix/lldb-build/lldb-test-build.noindex/module-cache-clang/lldb-api --executable /Users/buildslave/jenkins/workspace/lldb-cmake-matrix/lldb-build/./bin/lldb --compiler /Users/buildslave/jenkins/workspace/lldb-cmake-matrix/lldb-build/./bin/clang --dsymutil /Users/buildslave/jenkins/workspace/lldb-cmake-matrix/lldb-build/./bin/dsymutil --filecheck /Users/buildslave/jenkins/workspace/lldb-cmake-matrix/lldb-build/./bin/FileCheck /Users/buildslave/jenkins/workspace/lldb-cmake-matrix/llvm-project/lldb/packages/Python/lldbsuite/test/tools/lldb-server/register-reading -p TestGdbRemoteGPacket.py
Change dir to: /Users/buildslave/jenkins/workspace/lldb-cmake-matrix/llvm-project/lldb/packages/Python/lldbsuite/test/tools/lldb-server/register-reading
runCmd: settings set symbols.enable-external-lookup false
output: 

runCmd: settings set plugin.process.gdb-remote.packet-timeout 60
output: 

runCmd: settings set symbols.clang-modules-cache-path "/Users/buildslave/jenkins/workspace/lldb-cmake-matrix/lldb-build/lldb-test-build.noindex/module-cache-lldb/lldb-api"
output: 

runCmd: settings set use-color false
output: 

Adding tearDown hook:         def shutdown_named_pipe():
            # Close the pipe.
            try:
                named_pipe.close()
            except:
                print("failed to close named pipe")
                None

            # Delete the pipe.
            try:
                os.remove(named_pipe_path)
            except:
                print("failed to delete named pipe: {}".format(named_pipe_path))
                None

            # Delete the temp directory.
            try:
                os.rmdir(temp_dir)
            except:
                print(
                    "failed to delete temp dir: {}, directory contents: '{}'".format(
                        temp_dir, os.listdir(temp_dir)))
                None


Adding tearDown hook:     def cleanupSubprocesses(self):
        # Ensure any subprocesses are cleaned up
        for p in self.subprocesses:
            p.terminate()
            del p
        del self.subprocesses[:]
        # Ensure any forked processes are cleaned up
        for pid in self.forkedProcessPids:
            if os.path.exists("/proc/" + str(pid)):
                os.kill(pid, signal.SIGTERM)


Adding tearDown hook:             def shutdown_debug_monitor():
                try:
                    server.terminate()
                except:
                    logger.warning(
                        "failed to terminate server for debug monitor: {}; ignoring".format(
                            sys.exc_info()[0]))


Adding tearDown hook:         def shutdown_socket():
            if sock:
                try:
                    # send the kill packet so lldb-server shuts down gracefully
                    sock.sendall(GdbRemoteTestCaseBase._GDBREMOTE_KILL_PACKET)
                except:
                    logger.warning(
                        "failed to send kill packet to debug monitor: {}; ignoring".format(
                            sys.exc_info()[0]))

                try:
                    sock.close()
                except:
                    logger.warning(
                        "failed to close socket to debug monitor: {}; ignoring".format(
                            sys.exc_info()[0]))


Adding tearDown hook:     def cleanupSubprocesses(self):
        # Ensure any subprocesses are cleaned up
        for p in self.subprocesses:
            p.terminate()
            del p
        del self.subprocesses[:]
        # Ensure any forked processes are cleaned up
        for pid in self.forkedProcessPids:
            if os.path.exists("/proc/" + str(pid)):
                os.kill(pid, signal.SIGTERM)


FAIL: LLDB (/Users/buildslave/jenkins/workspace/lldb-cmake-matrix/lldb-build/bin/clang-11-x86_64) :: test_g_packet_debugserver (TestGdbRemoteGPacket.TestGdbRemoteGPacket)
Executing tearDown hook:     def cleanupSubprocesses(self):
        # Ensure any subprocesses are cleaned up
        for p in self.subprocesses:
            p.terminate()
            del p
        del self.subprocesses[:]
        # Ensure any forked processes are cleaned up
        for pid in self.forkedProcessPids:
            if os.path.exists("/proc/" + str(pid)):
                os.kill(pid, signal.SIGTERM)


Executing tearDown hook:         def shutdown_socket():
            if sock:
                try:
                    # send the kill packet so lldb-server shuts down gracefully
                    sock.sendall(GdbRemoteTestCaseBase._GDBREMOTE_KILL_PACKET)
                except:
                    logger.warning(
                        "failed to send kill packet to debug monitor: {}; ignoring".format(
                            sys.exc_info()[0]))

                try:
                    sock.close()
                except:
                    logger.warning(
                        "failed to close socket to debug monitor: {}; ignoring".format(
                            sys.exc_info()[0]))


2020-01-25 17:12:37,800 WARNING  failed to send kill packet to debug monitor: <class 'TypeError'>; ignoring
Executing tearDown hook:             def shutdown_debug_monitor():
                try:
                    server.terminate()
                except:
                    logger.warning(
                        "failed to terminate server for debug monitor: {}; ignoring".format(
                            sys.exc_info()[0]))


Executing tearDown hook:     def cleanupSubprocesses(self):
        # Ensure any subprocesses are cleaned up
        for p in self.subprocesses:
            p.terminate()
            del p
        del self.subprocesses[:]
        # Ensure any forked processes are cleaned up
        for pid in self.forkedProcessPids:
            if os.path.exists("/proc/" + str(pid)):
                os.kill(pid, signal.SIGTERM)


Executing tearDown hook:         def shutdown_named_pipe():
            # Close the pipe.
            try:
                named_pipe.close()
            except:
                print("failed to close named pipe")
                None

            # Delete the pipe.
            try:
                os.remove(named_pipe_path)
            except:
                print("failed to delete named pipe: {}".format(named_pipe_path))
                None

            # Delete the temp directory.
            try:
                os.rmdir(temp_dir)
            except:
                print(
                    "failed to delete temp dir: {}, directory contents: '{}'".format(
                        temp_dir, os.listdir(temp_dir)))
                None


runCmd: settings set symbols.enable-external-lookup false
output: 

runCmd: settings set plugin.process.gdb-remote.packet-timeout 60
output: 

runCmd: settings set symbols.clang-modules-cache-path "/Users/buildslave/jenkins/workspace/lldb-cmake-matrix/lldb-build/lldb-test-build.noindex/module-cache-lldb/lldb-api"
output: 

runCmd: settings set use-color false
output: 

UNSUPPORTED: LLDB (/Users/buildslave/jenkins/workspace/lldb-cmake-matrix/lldb-build/bin/clang-11-x86_64) :: test_g_returns_correct_data_no_suffix_llgs (TestGdbRemoteGPacket.TestGdbRemoteGPacket) (llgs tests) 
runCmd: settings set symbols.enable-external-lookup false
output: 

runCmd: settings set plugin.process.gdb-remote.packet-timeout 60
output: 

runCmd: settings set symbols.clang-modules-cache-path "/Users/buildslave/jenkins/workspace/lldb-cmake-matrix/lldb-build/lldb-test-build.noindex/module-cache-lldb/lldb-api"
output: 

runCmd: settings set use-color false
output: 

UNSUPPORTED: LLDB (/Users/buildslave/jenkins/workspace/lldb-cmake-matrix/lldb-build/bin/clang-11-x86_64) :: test_g_returns_correct_data_with_suffix_llgs (TestGdbRemoteGPacket.TestGdbRemoteGPacket) (llgs tests) 
Restore dir to: /Users/buildslave/jenkins/workspace/lldb-cmake-matrix/lldb-build/tools/lldb/test
======================================================================
FAIL: test_g_packet_debugserver (TestGdbRemoteGPacket.TestGdbRemoteGPacket)
----------------------------------------------------------------------
Traceback (most recent call last):
  File "/Users/buildslave/jenkins/workspace/lldb-cmake-matrix/llvm-project/lldb/packages/Python/lldbsuite/test/decorators.py", line 140, in wrapper
    func(*args, **kwargs)
  File "/Users/buildslave/jenkins/workspace/lldb-cmake-matrix/llvm-project/lldb/packages/Python/lldbsuite/test/decorators.py", line 140, in wrapper
    func(*args, **kwargs)
  File "/Users/buildslave/jenkins/workspace/lldb-cmake-matrix/llvm-project/lldb/packages/Python/lldbsuite/test/tools/lldb-server/register-reading/TestGdbRemoteGPacket.py", line 58, in test_g_packet_debugserver
    self.run_test_g_packet()
  File "/Users/buildslave/jenkins/workspace/lldb-cmake-matrix/llvm-project/lldb/packages/Python/lldbsuite/test/tools/lldb-server/register-reading/TestGdbRemoteGPacket.py", line 40, in run_test_g_packet
    self.connect_to_debug_monitor()
  File "/Users/buildslave/jenkins/workspace/lldb-cmake-matrix/llvm-project/lldb/packages/Python/lldbsuite/test/tools/lldb-server/gdbremote_testcase.py", line 418, in connect_to_debug_monitor
    server = self.launch_debug_monitor(attach_pid=attach_pid)
  File "/Users/buildslave/jenkins/workspace/lldb-cmake-matrix/llvm-project/lldb/packages/Python/lldbsuite/test/tools/lldb-server/gdbremote_testcase.py", line 411, in launch_debug_monitor
    self.port = self.get_stub_port_from_named_socket(self._READ_TIMEOUT)
  File "/Users/buildslave/jenkins/workspace/lldb-cmake-matrix/llvm-project/lldb/packages/Python/lldbsuite/test/tools/lldb-server/gdbremote_testcase.py", line 225, in get_stub_port_from_named_socket
    "no content to read on pipe")
AssertionError: 0 == 0 : no content to read on pipe
Config=x86_64-/Users/buildslave/jenkins/workspace/lldb-cmake-matrix/lldb-build/bin/clang-11
----------------------------------------------------------------------
Ran 3 tests in 0.859s

RESULT: FAILED (0 passes, 1 failures, 0 errors, 2 skipped, 0 expected failures, 0 unexpected successes)

--