FailedConsole Output

Skipping 12,902 KB.. Full Log
ASS: lldb-shell :: Reproducer/Functionalities/TestDataFormatter.test (931 of 1915)
PASS: lldb-shell :: Reproducer/Functionalities/TestImageList.test (932 of 1915)
PASS: lldb-shell :: Reproducer/Functionalities/TestStepping.test (933 of 1915)
PASS: lldb-shell :: Reproducer/TestDiscard.test (934 of 1915)
PASS: lldb-shell :: Reproducer/Modules/TestModuleCXX.test (935 of 1915)
PASS: lldb-shell :: Reproducer/Functionalities/TestExpressionEvaluation.test (936 of 1915)
PASS: lldb-shell :: Reproducer/TestSynchronous.test (937 of 1915)
PASS: lldb-shell :: Reproducer/TestDump.test (938 of 1915)
UNSUPPORTED: lldb-shell :: ScriptInterpreter/Lua/bindings.test (939 of 1915)
UNSUPPORTED: lldb-shell :: ScriptInterpreter/Lua/breakpoint_callback.test (940 of 1915)
UNSUPPORTED: lldb-shell :: ScriptInterpreter/Lua/command_script_import.test (941 of 1915)
UNSUPPORTED: lldb-shell :: ScriptInterpreter/Lua/convenience_variables.test (942 of 1915)
UNSUPPORTED: lldb-shell :: ScriptInterpreter/Lua/independent_state.test (943 of 1915)
UNSUPPORTED: lldb-shell :: ScriptInterpreter/Lua/lua.test (944 of 1915)
UNSUPPORTED: lldb-shell :: ScriptInterpreter/Lua/nested_sessions.test (945 of 1915)
UNSUPPORTED: lldb-shell :: ScriptInterpreter/Lua/persistent_state.test (946 of 1915)
UNSUPPORTED: lldb-shell :: ScriptInterpreter/Lua/watchpoint_callback.test (947 of 1915)
PASS: lldb-shell :: Reproducer/TestFileRepro.test (948 of 1915)
PASS: lldb-shell :: ScriptInterpreter/None/import_module.test (949 of 1915)
PASS: lldb-shell :: ScriptInterpreter/None/none.test (950 of 1915)
PASS: lldb-shell :: Reproducer/TestRelativePath.test (951 of 1915)
PASS: lldb-shell :: Settings/TestDisableColor.test (952 of 1915)
PASS: lldb-shell :: ScriptInterpreter/Python/scripted_breakpoint.test (953 of 1915)
PASS: lldb-shell :: Settings/TestDisassemblyFormat.test (954 of 1915)
PASS: lldb-shell :: ScriptInterpreter/Python/crashlog.test (955 of 1915)
PASS: lldb-shell :: Reproducer/TestMultipleTargets.test (956 of 1915)
PASS: lldb-shell :: Settings/TestEchoCommands.test (957 of 1915)
PASS: lldb-shell :: Settings/TestModuleCacheSanity.test (958 of 1915)
PASS: lldb-shell :: Settings/TestSettingsSet.test (959 of 1915)
PASS: lldb-shell :: Reproducer/TestWorkingDir.test (960 of 1915)
PASS: lldb-shell :: Settings/TestSettingsWrite.test (961 of 1915)
PASS: lldb-shell :: Settings/TestStopCommandSourceOnError.test (962 of 1915)
PASS: lldb-shell :: SymbolFile/Breakpad/line-table-discontinuous-file-ids.test (963 of 1915)
PASS: lldb-shell :: Settings/TestFrameFormatColor.test (964 of 1915)
PASS: lldb-shell :: Settings/TestFrameFormatMangling.test (965 of 1915)
PASS: lldb-shell :: SymbolFile/Breakpad/line-table-edgecases.test (966 of 1915)
PASS: lldb-shell :: SymbolFile/Breakpad/line-table-missing-file.test (967 of 1915)
PASS: lldb-shell :: SymbolFile/Breakpad/line-table-mixed-path-styles.test (968 of 1915)
PASS: lldb-shell :: Reproducer/TestVersionCheck.test (969 of 1915)
PASS: lldb-shell :: SymbolFile/Breakpad/line-table.test (970 of 1915)
PASS: lldb-shell :: SymbolFile/Breakpad/stack-cfi-parsing.test (971 of 1915)
PASS: lldb-shell :: SymbolFile/Breakpad/symtab-macho.test (972 of 1915)
PASS: lldb-shell :: Settings/TestFrameFormatNoColor.test (973 of 1915)
PASS: lldb-shell :: SymbolFile/Breakpad/symtab.test (974 of 1915)
PASS: lldb-shell :: SymbolFile/Breakpad/unwind-via-raSearch.test (975 of 1915)
PASS: lldb-shell :: SymbolFile/Breakpad/unwind-via-stack-cfi.test (976 of 1915)
PASS: lldb-shell :: SymbolFile/Breakpad/unwind-via-stack-win.test (977 of 1915)
PASS: lldb-shell :: Reproducer/TestGDBRemoteRepro.test (978 of 1915)
UNSUPPORTED: lldb-shell :: SymbolFile/DWARF/array-sizes.s (979 of 1915)
PASS: lldb-shell :: SymbolFile/DWARF/DW_AT_loclists_base.s (980 of 1915)
PASS: lldb-shell :: SymbolFile/DWARF/DW_AT_low_pc-addrx.s (981 of 1915)
PASS: lldb-shell :: SymbolFile/DWARF/DW_OP_piece-struct.s (982 of 1915)
UNSUPPORTED: lldb-shell :: SymbolFile/DWARF/debug-line-basic.s (983 of 1915)
UNSUPPORTED: lldb-shell :: SymbolFile/DWARF/debug-names-compressed.cpp (984 of 1915)
UNSUPPORTED: lldb-shell :: SymbolFile/DWARF/debug-types-address-ranges.s (985 of 1915)
UNSUPPORTED: lldb-shell :: SymbolFile/DWARF/debug-types-basic.test (986 of 1915)
PASS: lldb-shell :: SymbolFile/DWARF/childless-compile-unit.s (987 of 1915)
UNSUPPORTED: lldb-shell :: SymbolFile/DWARF/debug-types-dwo-cross-reference.cpp (988 of 1915)
UNSUPPORTED: lldb-shell :: SymbolFile/DWARF/debug-types-expressions.test (989 of 1915)
PASS: lldb-shell :: SymbolFile/DWARF/apple-index-is-used.cpp (990 of 1915)
PASS: lldb-shell :: SymbolFile/DWARF/clang-ast-from-dwarf-objc-property.m (991 of 1915)
UNSUPPORTED: lldb-shell :: SymbolFile/DWARF/debug-types-signature-loop.s (992 of 1915)
PASS: lldb-shell :: SymbolFile/DWARF/clang-ast-from-dwarf-unamed-and-anon-structs.cpp (993 of 1915)
PASS: lldb-shell :: SymbolFile/DWARF/debug-types-dwarf5.s (994 of 1915)
PASS: lldb-api :: types/TestShortType.py (995 of 1915)
PASS: lldb-shell :: SymbolFile/DWARF/anon_class_w_and_wo_export_symbols.ll (996 of 1915)
PASS: lldb-shell :: SymbolFile/DWARF/debug-types-line-tables.s (997 of 1915)
PASS: lldb-shell :: Reproducer/TestReuseDirectory.test (998 of 1915)
PASS: lldb-shell :: SymbolFile/DWARF/debug_line-relative_path.s (999 of 1915)
PASS: lldb-shell :: SymbolFile/DWARF/debug_loc-aslr.s (1000 of 1915)
UNSUPPORTED: lldb-shell :: SymbolFile/DWARF/debug_ranges_and_rnglists.test (1001 of 1915)
PASS: lldb-shell :: SymbolFile/DWARF/debug_loc_and_loclists.s (1002 of 1915)
PASS: lldb-shell :: SymbolFile/DWARF/debug_loclists-dwo.s (1003 of 1915)
PASS: lldb-shell :: SymbolFile/DWARF/debug_ranges-missing-section.s (1004 of 1915)
UNSUPPORTED: lldb-shell :: SymbolFile/DWARF/dir-separator-no-comp-dir-relative-name.s (1005 of 1915)
UNSUPPORTED: lldb-shell :: SymbolFile/DWARF/dir-separator-no-comp-dir.s (1006 of 1915)
UNSUPPORTED: lldb-shell :: SymbolFile/DWARF/dir-separator-posix.s (1007 of 1915)
UNSUPPORTED: lldb-shell :: SymbolFile/DWARF/dir-separator-windows.s (1008 of 1915)
PASS: lldb-shell :: SymbolFile/DWARF/debug_ranges.s (1009 of 1915)
PASS: lldb-shell :: SymbolFile/DWARF/debug_rnglists-dwo.s (1010 of 1915)
UNSUPPORTED: lldb-shell :: SymbolFile/DWARF/dwarf5-index-is-used.cpp (1011 of 1915)
UNSUPPORTED: lldb-shell :: SymbolFile/DWARF/dwarf5-partial-index.cpp (1012 of 1915)
UNSUPPORTED: lldb-shell :: SymbolFile/DWARF/dwarf5_locations.s (1013 of 1915)
UNSUPPORTED: lldb-shell :: SymbolFile/DWARF/find-basic-function.cpp (1014 of 1915)
PASS: lldb-shell :: SymbolFile/DWARF/debug_loc.s (1015 of 1915)
UNSUPPORTED: lldb-shell :: SymbolFile/DWARF/find-basic-namespace.cpp (1016 of 1915)
UNSUPPORTED: lldb-shell :: SymbolFile/DWARF/find-basic-type.cpp (1017 of 1915)
UNSUPPORTED: lldb-shell :: SymbolFile/DWARF/find-basic-variable.cpp (1018 of 1915)
UNSUPPORTED: lldb-shell :: SymbolFile/DWARF/find-function-regex.cpp (1019 of 1915)
UNSUPPORTED: lldb-shell :: SymbolFile/DWARF/find-inline-method.s (1020 of 1915)
UNSUPPORTED: lldb-shell :: SymbolFile/DWARF/find-method.cpp (1021 of 1915)
PASS: lldb-shell :: SymbolFile/DWARF/debug_rnglists.s (1022 of 1915)
UNSUPPORTED: lldb-shell :: SymbolFile/DWARF/find-type-in-function.cpp (1023 of 1915)
UNSUPPORTED: lldb-shell :: SymbolFile/DWARF/find-variable-dwo.cpp (1024 of 1915)
UNSUPPORTED: lldb-shell :: SymbolFile/DWARF/find-variable-file.cpp (1025 of 1915)
PASS: lldb-shell :: SymbolFile/DWARF/dwarf5-debug_line.s (1026 of 1915)
PASS: lldb-shell :: SymbolFile/DWARF/dwarf5-atomic.s (1027 of 1915)
UNSUPPORTED: lldb-shell :: SymbolFile/DWARF/inline-function-address-shared.test (1028 of 1915)
UNSUPPORTED: lldb-shell :: SymbolFile/DWARF/inline-function-address.ll (1029 of 1915)
PASS: lldb-shell :: SymbolFile/DWARF/debug_aranges-empty-section.s (1030 of 1915)
PASS: lldb-shell :: SymbolFile/DWARF/find-qualified-variable.cpp (1031 of 1915)
PASS: lldb-shell :: SymbolFile/DWARF/forward-declarations.s (1032 of 1915)
UNSUPPORTED: lldb-shell :: SymbolFile/DWARF/win-i386-line-table.s (1033 of 1915)
UNSUPPORTED: lldb-shell :: SymbolFile/NativePDB/ast-functions-msvc.cpp (1034 of 1915)
PASS: lldb-shell :: SymbolFile/DWARF/find-method-local-struct.cpp (1035 of 1915)
UNSUPPORTED: lldb-shell :: SymbolFile/NativePDB/ast-functions.cpp (1036 of 1915)
UNSUPPORTED: lldb-shell :: SymbolFile/NativePDB/ast-types.cpp (1037 of 1915)
UNSUPPORTED: lldb-shell :: SymbolFile/NativePDB/ast-methods.cpp (1038 of 1915)
UNSUPPORTED: lldb-shell :: SymbolFile/NativePDB/bitfields.cpp (1039 of 1915)
UNSUPPORTED: lldb-shell :: SymbolFile/NativePDB/break-by-function.cpp (1040 of 1915)
UNSUPPORTED: lldb-shell :: SymbolFile/NativePDB/break-by-line.cpp (1041 of 1915)
UNSUPPORTED: lldb-shell :: SymbolFile/NativePDB/disassembly.cpp (1042 of 1915)
UNSUPPORTED: lldb-shell :: SymbolFile/NativePDB/function-types-builtins.cpp (1043 of 1915)
UNSUPPORTED: lldb-shell :: SymbolFile/NativePDB/function-types-calling-conv.cpp (1044 of 1915)
UNSUPPORTED: lldb-shell :: SymbolFile/NativePDB/function-types-classes.cpp (1045 of 1915)
UNSUPPORTED: lldb-shell :: SymbolFile/NativePDB/global-classes.cpp (1046 of 1915)
UNSUPPORTED: lldb-shell :: SymbolFile/NativePDB/globals-bss.cpp (1047 of 1915)
UNSUPPORTED: lldb-shell :: SymbolFile/NativePDB/local-variables.cpp (1048 of 1915)
UNSUPPORTED: lldb-shell :: SymbolFile/NativePDB/globals-fundamental.cpp (1049 of 1915)
UNSUPPORTED: lldb-shell :: SymbolFile/NativePDB/nested-types.cpp (1050 of 1915)
UNSUPPORTED: lldb-shell :: SymbolFile/NativePDB/s_constant.cpp (1051 of 1915)
UNSUPPORTED: lldb-shell :: SymbolFile/NativePDB/source-list.cpp (1052 of 1915)
UNSUPPORTED: lldb-shell :: SymbolFile/NativePDB/stack_unwinding01.cpp (1053 of 1915)
UNSUPPORTED: lldb-shell :: SymbolFile/NativePDB/tag-types.cpp (1054 of 1915)
UNSUPPORTED: lldb-shell :: SymbolFile/NativePDB/typedefs.cpp (1055 of 1915)
UNSUPPORTED: lldb-shell :: SymbolFile/PDB/ast-restore.test (1056 of 1915)
UNSUPPORTED: lldb-shell :: SymbolFile/PDB/calling-conventions.test (1057 of 1915)
UNSUPPORTED: lldb-shell :: SymbolFile/PDB/class-layout.test (1058 of 1915)
UNSUPPORTED: lldb-shell :: SymbolFile/PDB/compilands.test (1059 of 1915)
UNSUPPORTED: lldb-shell :: SymbolFile/PDB/enums-layout.test (1060 of 1915)
UNSUPPORTED: lldb-shell :: SymbolFile/PDB/expressions.test (1061 of 1915)
UNSUPPORTED: lldb-shell :: SymbolFile/PDB/func-symbols.test (1062 of 1915)
UNSUPPORTED: lldb-shell :: SymbolFile/PDB/function-level-linking.test (1063 of 1915)
UNSUPPORTED: lldb-shell :: SymbolFile/PDB/function-nested-block.test (1064 of 1915)
UNSUPPORTED: lldb-shell :: SymbolFile/PDB/pointers.test (1065 of 1915)
UNSUPPORTED: lldb-shell :: SymbolFile/PDB/type-quals.test (1066 of 1915)
UNSUPPORTED: lldb-shell :: SymbolFile/PDB/typedefs.test (1067 of 1915)
UNSUPPORTED: lldb-shell :: SymbolFile/PDB/udt-layout.test (1068 of 1915)
UNSUPPORTED: lldb-shell :: SymbolFile/PDB/variables-locations.test (1069 of 1915)
UNSUPPORTED: lldb-shell :: SymbolFile/PDB/variables.test (1070 of 1915)
UNSUPPORTED: lldb-shell :: SymbolFile/PDB/vbases.test (1071 of 1915)
UNSUPPORTED: lldb-shell :: SymbolFile/dissassemble-entry-point.s (1072 of 1915)
UNSUPPORTED: lldb-shell :: SymbolFile/target-symbols-add-unwind.test (1073 of 1915)
PASS: lldb-shell :: SymbolFile/DWARF/gnu-style-compression.cpp (1074 of 1915)
UNSUPPORTED: lldb-shell :: Unwind/eh-frame-small-fde.test (1075 of 1915)
PASS: lldb-shell :: SymbolFile/DWARF/split-dwarf-inlining.cpp (1076 of 1915)
PASS: lldb-shell :: SymbolFile/DWARF/parallel-indexing-stress.s (1077 of 1915)
PASS: lldb-shell :: SymbolFile/DWARF/split-dwarf-multiple-cu.ll (1078 of 1915)
UNSUPPORTED: lldb-shell :: Unwind/unwind-plan-dwarf-dump.test (1079 of 1915)
PASS: lldb-shell :: SymbolFile/symbol-binding.test (1080 of 1915)
UNSUPPORTED: lldb-shell :: Watchpoint/netbsd-nouserdbregs.test (1081 of 1915)
PASS: lldb-unit :: Breakpoint/Release/LLDBBreakpointTests/BreakpointIDTest.StringIsBreakpointName (1082 of 1915)
PASS: lldb-shell :: SymbolFile/DWARF/debug-types-missing-signature.test (1083 of 1915)
PASS: lldb-unit :: Core/Release/LLDBCoreTests/MangledTest.EmptyForInvalidName (1084 of 1915)
PASS: lldb-unit :: Core/Release/LLDBCoreTests/MangledTest.ResultForBlockInvocation (1085 of 1915)
PASS: lldb-unit :: Core/Release/LLDBCoreTests/MangledTest.NameIndexes_FindFunctionSymbols (1086 of 1915)
PASS: lldb-shell :: SymbolFile/DWARF/compilercontext.ll (1087 of 1915)
PASS: lldb-unit :: Core/Release/LLDBCoreTests/MangledTest.ResultForValidName (1088 of 1915)
PASS: lldb-unit :: Core/Release/LLDBCoreTests/RichManglingContextTest.Basic (1089 of 1915)
PASS: lldb-unit :: Core/Release/LLDBCoreTests/RichManglingContextTest.FromCxxMethodName (1090 of 1915)
PASS: lldb-unit :: Core/Release/LLDBCoreTests/StreamCallbackTest.Callback (1091 of 1915)
PASS: lldb-unit :: Core/Release/LLDBCoreTests/RichManglingContextTest.SwitchProvider (1092 of 1915)
PASS: lldb-unit :: Core/Release/LLDBCoreTests/RichManglingContextTest.IPDRealloc (1093 of 1915)
PASS: lldb-unit :: DataFormatter/Release/LLDBFormatterTests/FormatManagerTests.CompatibleLangs (1094 of 1915)
PASS: lldb-unit :: Core/Release/LLDBCoreTests/UniqueCStringMap.NoDefaultConstructor (1095 of 1915)
PASS: lldb-unit :: Disassembler/Release/DisassemblerTests/TestArm64Disassembly.TestArmv81Instruction (1096 of 1915)
PASS: lldb-unit :: Editline/Release/EditlineTests/EditlineTestFixture.EditlineReceivesMultiLineText (1097 of 1915)
PASS: lldb-unit :: Disassembler/Release/DisassemblerTests/TestArmv7Disassembly.TestCortexFPDisass (1098 of 1915)
PASS: lldb-unit :: Editline/Release/EditlineTests/EditlineTestFixture.EditlineReceivesSingleLineText (1099 of 1915)
PASS: lldb-unit :: Expression/Release/ExpressionTests/ClangExpressionDeclMapTest.TestPersistentDeclLookup (1100 of 1915)
PASS: lldb-unit :: Expression/Release/ExpressionTests/ClangExpressionDeclMapTest.TestUnknownIdentifierLookup (1101 of 1915)
PASS: lldb-unit :: Expression/Release/ExpressionTests/ClangHostTest.ComputeClangResourceDirectory (1102 of 1915)
PASS: lldb-unit :: Expression/Release/ExpressionTests/CppModuleConfigurationTest.AmbiguousCLib (1103 of 1915)
PASS: lldb-unit :: Expression/Release/ExpressionTests/ClangHostTest.MacOSX (1104 of 1915)
PASS: lldb-unit :: Expression/Release/ExpressionTests/CppModuleConfigurationTest.AmbiguousLibCpp (1105 of 1915)
PASS: lldb-unit :: Expression/Release/ExpressionTests/CppModuleConfigurationTest.IgnoreLibStdCpp (1106 of 1915)
PASS: lldb-unit :: Expression/Release/ExpressionTests/CppModuleConfigurationTest.LibCppV2 (1107 of 1915)
PASS: lldb-unit :: Expression/Release/ExpressionTests/CppModuleConfigurationTest.Linux (1108 of 1915)
PASS: lldb-unit :: Expression/Release/ExpressionTests/CppModuleConfigurationTest.LinuxLocalLibCpp (1109 of 1915)
PASS: lldb-unit :: Expression/Release/ExpressionTests/CppModuleConfigurationTest.MissingLibCpp (1110 of 1915)
PASS: lldb-unit :: Expression/Release/ExpressionTests/CppModuleConfigurationTest.MissingUsrInclude (1111 of 1915)
PASS: lldb-unit :: Expression/Release/ExpressionTests/CppModuleConfigurationTest.Sysroot (1112 of 1915)
PASS: lldb-unit :: Expression/Release/ExpressionTests/CppModuleConfigurationTest.UnknownLibCppFile (1113 of 1915)
PASS: lldb-unit :: Expression/Release/ExpressionTests/CppModuleConfigurationTest.UnrelatedLibrary (1114 of 1915)
PASS: lldb-shell :: SymbolFile/DWARF/deterministic-build.cpp (1115 of 1915)
PASS: lldb-unit :: Expression/Release/ExpressionTests/CppModuleConfigurationTest.Xcode (1116 of 1915)
PASS: lldb-unit :: Expression/Release/ExpressionTests/DWARFExpression.DW_OP_convert (1117 of 1915)
PASS: lldb-unit :: Expression/Release/ExpressionTests/DWARFExpression.DW_OP_pick (1118 of 1915)
PASS: lldb-unit :: Expression/Release/ExpressionTests/DWARFExpression.DW_OP_piece (1119 of 1915)
PASS: lldb-unit :: Expression/Release/ExpressionTests/DiagnosticManagerTest.AddDiagnostic (1120 of 1915)
PASS: lldb-unit :: Expression/Release/ExpressionTests/DiagnosticManagerTest.AppendMessageAttachToLastDiag (1121 of 1915)
PASS: lldb-unit :: Expression/Release/ExpressionTests/DiagnosticManagerTest.AppendMessageNoDiag (1122 of 1915)
PASS: lldb-unit :: Expression/Release/ExpressionTests/DiagnosticManagerTest.AppendMessageSubsequentDiags (1123 of 1915)
PASS: lldb-unit :: Expression/Release/ExpressionTests/DiagnosticManagerTest.GetStringBasic (1124 of 1915)
PASS: lldb-unit :: Expression/Release/ExpressionTests/DiagnosticManagerTest.FixedExpression (1125 of 1915)
PASS: lldb-unit :: Expression/Release/ExpressionTests/DiagnosticManagerTest.GetStringMultiline (1126 of 1915)
PASS: lldb-unit :: Expression/Release/ExpressionTests/DiagnosticManagerTest.GetStringMultipleDiags (1127 of 1915)
PASS: lldb-unit :: Expression/Release/ExpressionTests/DiagnosticManagerTest.GetStringPreserveOrder (1128 of 1915)
PASS: lldb-unit :: Expression/Release/ExpressionTests/DiagnosticManagerTest.GetStringNoDiags (1129 of 1915)
PASS: lldb-unit :: Expression/Release/ExpressionTests/DiagnosticManagerTest.GetStringSeverityLabels (1130 of 1915)
PASS: lldb-unit :: Expression/Release/ExpressionTests/DiagnosticManagerTest.HasFixits (1131 of 1915)
PASS: lldb-unit :: Expression/Release/ExpressionTests/DiagnosticManagerTest.PutString (1132 of 1915)
PASS: lldb-unit :: Expression/Release/ExpressionTests/DiagnosticManagerTest.PutStringMultiple (1133 of 1915)
PASS: lldb-unit :: Host/Release/HostTests/ConnectionFileDescriptorTest.TCPGetURIv4 (1134 of 1915)
PASS: lldb-unit :: Expression/Release/ExpressionTests/DiagnosticManagerTest.PutStringSeverities (1135 of 1915)
PASS: lldb-unit :: Host/Release/HostTests/File.GetStreamFromDescriptor (1136 of 1915)
PASS: lldb-unit :: Host/Release/HostTests/ConnectionFileDescriptorTest.TCPGetURIv6 (1137 of 1915)
PASS: lldb-unit :: Host/Release/HostTests/File.GetWaitableHandleFileno (1138 of 1915)
PASS: lldb-unit :: Host/Release/HostTests/FileActionTest.Open (1139 of 1915)
PASS: lldb-unit :: Host/Release/HostTests/FileSystemTest.Exists (1140 of 1915)
PASS: lldb-unit :: Host/Release/HostTests/FileSystemTest.EnumerateDirectory (1141 of 1915)
PASS: lldb-unit :: Host/Release/HostTests/FileSystemTest.GetByteSize (1142 of 1915)
PASS: lldb-unit :: Host/Release/HostTests/FileSystemTest.FileAndDirectoryComponents (1143 of 1915)
PASS: lldb-shell :: Unwind/eh-frame-dwarf-unwind.test (1144 of 1915)
PASS: lldb-unit :: Host/Release/HostTests/FileSystemTest.MakeAbsolute (1145 of 1915)
PASS: lldb-unit :: Host/Release/HostTests/FileSystemTest.GetPermissions (1146 of 1915)
PASS: lldb-unit :: Host/Release/HostTests/FileSystemTest.OpenErrno (1147 of 1915)
PASS: lldb-unit :: Host/Release/HostTests/FileSystemTest.Readable (1148 of 1915)
PASS: lldb-unit :: Host/Release/HostTests/FileSystemTest.Resolve (1149 of 1915)
PASS: lldb-unit :: Host/Release/HostTests/Host.WaitStatusFormat (1150 of 1915)
PASS: lldb-unit :: Host/Release/HostTests/Host.GetEnvironment (1151 of 1915)
PASS: lldb-unit :: Host/Release/HostTests/HostInfoTest.GetAugmentedArchSpec (1152 of 1915)
PASS: lldb-unit :: Host/Release/HostTests/HostInfoTest.GetHostname (1153 of 1915)
PASS: lldb-shell :: Unwind/thread-step-out-ret-addr-check.test (1154 of 1915)
PASS: lldb-unit :: Host/Release/HostTests/MainLoopTest.DetectsEOF (1155 of 1915)
PASS: lldb-shell :: Unwind/trap_frame_sym_ctx.test (1156 of 1915)
PASS: lldb-unit :: Host/Release/HostTests/MainLoopTest.ReadObject (1157 of 1915)
PASS: lldb-unit :: Host/Release/HostTests/MainLoopTest.Signal (1158 of 1915)
PASS: lldb-unit :: Host/Release/HostTests/MainLoopTest.TerminatesImmediately (1159 of 1915)
PASS: lldb-unit :: Host/Release/HostTests/NativeProcessProtocolTest.ReadCStringFromMemory (1160 of 1915)
PASS: lldb-unit :: Host/Release/HostTests/NativeProcessProtocolTest.ReadCStringFromMemory_CrossPageBoundary (1161 of 1915)
PASS: lldb-unit :: Host/Release/HostTests/NativeProcessProtocolTest.ReadCStringFromMemory_MaxSize (1162 of 1915)
PASS: lldb-unit :: Host/Release/HostTests/NativeProcessProtocolTest.ReadMemoryWithoutTrap (1163 of 1915)
PASS: lldb-unit :: Host/Release/HostTests/NativeProcessProtocolTest.SetBreakpoint (1164 of 1915)
PASS: lldb-unit :: Host/Release/HostTests/NativeProcessProtocolTest.SetBreakpointFailRead (1165 of 1915)
PASS: lldb-unit :: Host/Release/HostTests/NativeProcessProtocolTest.SetBreakpointFailVerify (1166 of 1915)
PASS: lldb-unit :: Host/Release/HostTests/NativeProcessProtocolTest.SetBreakpointFailWrite (1167 of 1915)
PASS: lldb-unit :: Host/Release/HostTests/ProcessLaunchInfoTest.Constructor (1168 of 1915)
PASS: lldb-unit :: Host/Release/HostTests/SocketTest.DecodeHostAndPort (1169 of 1915)
PASS: lldb-unit :: Host/Release/HostTests/SocketAddressTest.GetAddressInfo (1170 of 1915)
PASS: lldb-unit :: Host/Release/HostTests/SocketAddressTest.Set (1171 of 1915)
PASS: lldb-unit :: Host/Release/HostTests/SocketTest.DomainGetConnectURI (1172 of 1915)
PASS: lldb-unit :: Host/Release/HostTests/SocketTest.DomainListenConnectAccept (1173 of 1915)
PASS: lldb-unit :: Host/Release/HostTests/SocketTest.TCPGetAddress (1174 of 1915)
PASS: lldb-unit :: Host/Release/HostTests/SocketTest.TCPGetConnectURI (1175 of 1915)
PASS: lldb-unit :: Host/Release/HostTests/SocketTest.TCPListen0ConnectAccept (1176 of 1915)
PASS: lldb-unit :: Host/Release/HostTests/SocketTest.TCPListen0GetPort (1177 of 1915)
PASS: lldb-unit :: Host/Release/HostTests/SocketTest.UDPConnect (1178 of 1915)
PASS: lldb-unit :: Host/Release/HostTests/SocketTest.UDPGetConnectURI (1179 of 1915)
PASS: lldb-unit :: Host/Release/HostTests/TaskPoolTest.RunTasks (1180 of 1915)
PASS: lldb-unit :: Host/Release/HostTests/TaskPoolTest.TaskMap (1181 of 1915)
PASS: lldb-unit :: Host/Release/HostTests/TaskPoolTest.AddTask (1182 of 1915)
PASS: lldb-unit :: Interpreter/Release/InterpreterTests/CompletionTest.DirCompletionAbsolute (1183 of 1915)
PASS: lldb-unit :: Interpreter/Release/InterpreterTests/OptionArgParserTest.toScriptLanguage (1184 of 1915)
PASS: lldb-unit :: Interpreter/Release/InterpreterTests/OptionArgParserTest.toChar (1185 of 1915)
PASS: lldb-unit :: Interpreter/Release/InterpreterTests/CompletionTest.DirCompletionUsername (1186 of 1915)
PASS: lldb-unit :: Interpreter/Release/InterpreterTests/OptionArgParserTest.toBoolean (1187 of 1915)
PASS: lldb-unit :: Interpreter/Release/InterpreterTests/CompletionTest.FileCompletionAbsolute (1188 of 1915)
PASS: lldb-unit :: Language/CPlusPlus/Release/LanguageCPlusPlusTests/CPlusPlusLanguage.CPlusPlusNameParser (1189 of 1915)
PASS: lldb-unit :: Language/CPlusPlus/Release/LanguageCPlusPlusTests/CPlusPlusLanguage.FindAlternateFunctionManglings (1190 of 1915)
PASS: lldb-unit :: Language/CPlusPlus/Release/LanguageCPlusPlusTests/CPlusPlusLanguage.ExtractContextAndIdentifier (1191 of 1915)
PASS: lldb-unit :: Language/CPlusPlus/Release/LanguageCPlusPlusTests/CPlusPlusLanguage.MethodNameParsing (1192 of 1915)
PASS: lldb-unit :: Language/Highlighting/Release/HighlighterTests/HighlighterTest.ClangBraces (1193 of 1915)
PASS: lldb-unit :: Language/Highlighting/Release/HighlighterTests/HighlighterTest.ClangCommas (1194 of 1915)
PASS: lldb-unit :: Language/Highlighting/Release/HighlighterTests/HighlighterTest.ClangComments (1195 of 1915)
PASS: lldb-unit :: Language/Highlighting/Release/HighlighterTests/HighlighterTest.ClangCursorOutOfBounds (1196 of 1915)
PASS: lldb-unit :: Language/Highlighting/Release/HighlighterTests/HighlighterTest.ClangCursorPosAfterOtherToken (1197 of 1915)
PASS: lldb-unit :: Language/Highlighting/Release/HighlighterTests/HighlighterTest.ClangCursorPos (1198 of 1915)
PASS: lldb-unit :: Language/Highlighting/Release/HighlighterTests/HighlighterTest.ClangCursorPosBeforeOtherToken (1199 of 1915)
PASS: lldb-unit :: Language/Highlighting/Release/HighlighterTests/HighlighterTest.ClangCursorPosEndOfLine (1200 of 1915)
PASS: lldb-unit :: Language/Highlighting/Release/HighlighterTests/HighlighterTest.ClangCursorPosInOtherToken (1201 of 1915)
PASS: lldb-unit :: Language/Highlighting/Release/HighlighterTests/HighlighterTest.ClangIdentifiers (1202 of 1915)
PASS: lldb-unit :: Language/Highlighting/Release/HighlighterTests/HighlighterTest.ClangOperators (1203 of 1915)
PASS: lldb-unit :: Language/Highlighting/Release/HighlighterTests/HighlighterTest.ClangEmptyInput (1204 of 1915)
PASS: lldb-unit :: Language/Highlighting/Release/HighlighterTests/HighlighterTest.ClangPreserveNewLine (1205 of 1915)
PASS: lldb-unit :: Language/Highlighting/Release/HighlighterTests/HighlighterTest.ClangScalarLiterals (1206 of 1915)
PASS: lldb-unit :: Language/Highlighting/Release/HighlighterTests/HighlighterTest.ClangPPDirectives (1207 of 1915)
PASS: lldb-unit :: Language/Highlighting/Release/HighlighterTests/HighlighterTest.ClangTrailingBackslashBeforeNewline (1208 of 1915)
PASS: lldb-unit :: Language/Highlighting/Release/HighlighterTests/HighlighterTest.ClangStringLiterals (1209 of 1915)
PASS: lldb-unit :: Language/Highlighting/Release/HighlighterTests/HighlighterTest.ClangSquareBrackets (1210 of 1915)
PASS: lldb-unit :: Language/Highlighting/Release/HighlighterTests/HighlighterTest.ClangTrailingBackslashMissingNewLine (1211 of 1915)
PASS: lldb-unit :: Language/Highlighting/Release/HighlighterTests/HighlighterTest.ClangTrailingBackslashWithWhitespace (1212 of 1915)
PASS: lldb-unit :: Language/Highlighting/Release/HighlighterTests/HighlighterTest.ClangUnterminatedString (1213 of 1915)
PASS: lldb-unit :: Language/Highlighting/Release/HighlighterTests/HighlighterTest.DefaultHighlighter (1214 of 1915)
PASS: lldb-unit :: Language/Highlighting/Release/HighlighterTests/HighlighterTest.Colons (1215 of 1915)
PASS: lldb-unit :: Language/Highlighting/Release/HighlighterTests/HighlighterTest.DefaultHighlighterWithCursor (1216 of 1915)
PASS: lldb-unit :: Language/Highlighting/Release/HighlighterTests/HighlighterTest.DefaultHighlighterWithCursorOutOfBounds (1217 of 1915)
PASS: lldb-unit :: Language/Highlighting/Release/HighlighterTests/HighlighterTest.HighlighterSelectionPath (1218 of 1915)
PASS: lldb-unit :: Language/Highlighting/Release/HighlighterTests/HighlighterTest.FallbackHighlighter (1219 of 1915)
PASS: lldb-unit :: ObjectFile/Breakpad/Release/ObjectFileBreakpadTests/FileRecord.parse (1220 of 1915)
PASS: lldb-unit :: ObjectFile/Breakpad/Release/ObjectFileBreakpadTests/FuncRecord.parse (1221 of 1915)
PASS: lldb-unit :: Language/Highlighting/Release/HighlighterTests/HighlighterTest.Keywords (1222 of 1915)
PASS: lldb-unit :: Language/Highlighting/Release/HighlighterTests/HighlighterTest.HighlighterSelectionType (1223 of 1915)
PASS: lldb-unit :: ObjectFile/Breakpad/Release/ObjectFileBreakpadTests/LineRecord.parse (1224 of 1915)
PASS: lldb-unit :: ObjectFile/Breakpad/Release/ObjectFileBreakpadTests/InfoRecord.parse (1225 of 1915)
XFAIL: lldb-shell :: Unwind/prefer-debug-over-eh-frame.test (1226 of 1915)
PASS: lldb-unit :: ObjectFile/Breakpad/Release/ObjectFileBreakpadTests/ModuleRecord.parse (1227 of 1915)
PASS: lldb-unit :: ObjectFile/Breakpad/Release/ObjectFileBreakpadTests/Record.classify (1228 of 1915)
PASS: lldb-unit :: ObjectFile/Breakpad/Release/ObjectFileBreakpadTests/StackCFIRecord.parse (1229 of 1915)
PASS: lldb-unit :: ObjectFile/Breakpad/Release/ObjectFileBreakpadTests/PublicRecord.parse (1230 of 1915)
PASS: lldb-unit :: ObjectFile/Breakpad/Release/ObjectFileBreakpadTests/StackWinRecord.parse (1231 of 1915)
PASS: lldb-unit :: ObjectFile/ELF/Release/ObjectFileELFTests/ObjectFileELFTest.GetModuleSpecifications_EarlySectionHeaders (1232 of 1915)
PASS: lldb-unit :: ObjectFile/ELF/Release/ObjectFileELFTests/ObjectFileELFTest.GetSymtab_NoSymEntryPointArmThumbAddressClass (1233 of 1915)
PASS: lldb-unit :: ObjectFile/ELF/Release/ObjectFileELFTests/ObjectFileELFTest.GetSymtab_NoSymEntryPointArmAddressClass (1234 of 1915)
PASS: lldb-unit :: ObjectFile/ELF/Release/ObjectFileELFTests/ObjectFileELFTest.SectionsResolveConsistently (1235 of 1915)
PASS: lldb-unit :: ObjectFile/PECOFF/Release/ObjectFilePECOFFTests/PECallFrameInfoTest.Chained_eh (1236 of 1915)
PASS: lldb-unit :: ObjectFile/PECOFF/Release/ObjectFilePECOFFTests/PECallFrameInfoTest.Basic_eh (1237 of 1915)
PASS: lldb-unit :: Platform/Release/LLDBPlatformTests/PlatformDarwinTest.TestParseVersionBuildDir (1238 of 1915)
PASS: lldb-unit :: ObjectFile/PECOFF/Release/ObjectFilePECOFFTests/PECallFrameInfoTest.Frame_reg_eh (1239 of 1915)
PASS: lldb-unit :: Process/gdb-remote/Release/ProcessGdbRemoteTests/GDBRemoteClientBaseTest.SendContinueAndInterrupt2PacketBug (1240 of 1915)
PASS: lldb-unit :: Process/gdb-remote/Release/ProcessGdbRemoteTests/GDBRemoteClientBaseTest.SendContinueAndWait (1241 of 1915)
PASS: lldb-unit :: Process/gdb-remote/Release/ProcessGdbRemoteTests/GDBRemoteClientBaseTest.SendContinueDelegateInterface (1242 of 1915)
PASS: lldb-unit :: Process/gdb-remote/Release/ProcessGdbRemoteTests/GDBRemoteClientBaseTest.SendContinueDelegateStructuredDataReceipt (1243 of 1915)
PASS: lldb-unit :: Process/gdb-remote/Release/ProcessGdbRemoteTests/GDBRemoteClientBaseTest.SendPacketAndReceiveResponseWithOutputSupport (1244 of 1915)
PASS: lldb-unit :: Process/gdb-remote/Release/ProcessGdbRemoteTests/GDBRemoteCommunicationClientTest.GetMemoryRegionInfo (1245 of 1915)
PASS: lldb-unit :: Process/gdb-remote/Release/ProcessGdbRemoteTests/GDBRemoteCommunicationClientTest.GetMemoryRegionInfoInvalidResponse (1246 of 1915)
PASS: lldb-unit :: Process/gdb-remote/Release/ProcessGdbRemoteTests/GDBRemoteCommunicationClientTest.GetModulesInfo (1247 of 1915)
PASS: lldb-unit :: Process/gdb-remote/Release/ProcessGdbRemoteTests/GDBRemoteCommunicationClientTest.GetModulesInfo_UUID20 (1248 of 1915)
PASS: lldb-unit :: Process/gdb-remote/Release/ProcessGdbRemoteTests/GDBRemoteCommunicationClientTest.GetModulesInfoInvalidResponse (1249 of 1915)
PASS: lldb-unit :: Process/gdb-remote/Release/ProcessGdbRemoteTests/GDBRemoteCommunicationClientTest.ReadRegister (1250 of 1915)
PASS: lldb-unit :: Process/gdb-remote/Release/ProcessGdbRemoteTests/GDBRemoteCommunicationClientTest.SaveRestoreRegistersNoSuffix (1251 of 1915)
PASS: lldb-unit :: Process/gdb-remote/Release/ProcessGdbRemoteTests/GDBRemoteClientBaseTest.SendContinueAndInterrupt (1252 of 1915)
PASS: lldb-unit :: Process/gdb-remote/Release/ProcessGdbRemoteTests/GDBRemoteClientBaseTest.SendContinueAndAsyncSignal (1253 of 1915)
PASS: lldb-unit :: Process/gdb-remote/Release/ProcessGdbRemoteTests/GDBRemoteClientBaseTest.SendContinueAndLateInterrupt (1254 of 1915)
PASS: lldb-unit :: Process/gdb-remote/Release/ProcessGdbRemoteTests/GDBRemoteClientBaseTest.SendContinueAndAsyncPacket (1255 of 1915)
PASS: lldb-unit :: Process/gdb-remote/Release/ProcessGdbRemoteTests/GDBRemoteCommunicationClientTest.SendGetMetaDataPacket (1256 of 1915)
PASS: lldb-unit :: Process/gdb-remote/Release/ProcessGdbRemoteTests/GDBRemoteCommunicationClientTest.SendGetDataPacket (1257 of 1915)
PASS: lldb-unit :: Process/gdb-remote/Release/ProcessGdbRemoteTests/GDBRemoteCommunicationClientTest.SendStartTracePacket (1258 of 1915)
PASS: lldb-unit :: Process/gdb-remote/Release/ProcessGdbRemoteTests/GDBRemoteCommunicationClientTest.SendSignalsToIgnore (1259 of 1915)
PASS: lldb-unit :: Process/gdb-remote/Release/ProcessGdbRemoteTests/GDBRemoteCommunicationClientTest.SendStopTracePacket (1260 of 1915)
PASS: lldb-unit :: Process/gdb-remote/Release/ProcessGdbRemoteTests/GDBRemoteCommunicationClientTest.SendGetTraceConfigPacket (1261 of 1915)
PASS: lldb-unit :: Process/gdb-remote/Release/ProcessGdbRemoteTests/GDBRemoteCommunicationClientTest.SyncThreadState (1262 of 1915)
PASS: lldb-unit :: Process/gdb-remote/Release/ProcessGdbRemoteTests/GDBRemoteCommunicationServerTest.SendErrorResponse_ErrorNumber (1263 of 1915)
PASS: lldb-unit :: Process/gdb-remote/Release/ProcessGdbRemoteTests/GDBRemoteCommunicationServerTest.SendErrorResponse_ErrorList (1264 of 1915)
PASS: lldb-unit :: Process/gdb-remote/Release/ProcessGdbRemoteTests/GDBRemoteCommunicationClientTest.WriteRegisterNoSuffix (1265 of 1915)
PASS: lldb-unit :: Process/gdb-remote/Release/ProcessGdbRemoteTests/GDBRemoteCommunicationClientTest.WriteRegister (1266 of 1915)
PASS: lldb-unit :: Process/gdb-remote/Release/ProcessGdbRemoteTests/GDBRemoteCommunicationServerTest.SendErrorResponse_Status (1267 of 1915)
PASS: lldb-unit :: Process/gdb-remote/Release/ProcessGdbRemoteTests/GDBRemoteCommunicationServerTest.SendErrorResponse_StringError (1268 of 1915)
PASS: lldb-unit :: Process/minidump/Release/LLDBMinidumpTests/MinidumpParserTest.FindMemoryRange (1269 of 1915)
PASS: lldb-unit :: Process/gdb-remote/Release/ProcessGdbRemoteTests/GDBRemoteCommunicationServerTest.SendErrorResponse_UnimplementedError (1270 of 1915)
PASS: lldb-unit :: Process/gdb-remote/Release/ProcessGdbRemoteTests/GDBRemoteCommunicationTest.ReadPacket_checksum (1271 of 1915)
PASS: lldb-unit :: Process/gdb-remote/Release/ProcessGdbRemoteTests/GDBRemoteCommunicationClientTest.TestPacketSpeedJSON (1272 of 1915)
PASS: lldb-unit :: Process/minidump/Release/LLDBMinidumpTests/MinidumpParserTest.FindMemoryRangeWithFullMemoryMinidump (1273 of 1915)
PASS: lldb-unit :: Process/minidump/Release/LLDBMinidumpTests/MinidumpParserTest.GetFilteredModuleList (1274 of 1915)
PASS: lldb-unit :: Process/minidump/Release/LLDBMinidumpTests/MinidumpParserTest.GetArchitectureWindows (1275 of 1915)
PASS: lldb-unit :: Process/minidump/Release/LLDBMinidumpTests/MinidumpParserTest.GetArchitecture (1276 of 1915)
PASS: lldb-unit :: Process/minidump/Release/LLDBMinidumpTests/MinidumpParserTest.GetExceptionStream (1277 of 1915)
PASS: lldb-unit :: Process/minidump/Release/LLDBMinidumpTests/MinidumpParserTest.GetLinuxProcStatus (1278 of 1915)
PASS: lldb-unit :: Process/minidump/Release/LLDBMinidumpTests/MinidumpParserTest.GetLinuxProcStatus_no_stream (1279 of 1915)
PASS: lldb-unit :: Process/minidump/Release/LLDBMinidumpTests/MinidumpParserTest.GetMemoryRegionInfoFromMemory64List (1280 of 1915)
PASS: lldb-unit :: Process/minidump/Release/LLDBMinidumpTests/MinidumpParserTest.GetMemoryRegionInfoFromMemoryList (1281 of 1915)
PASS: lldb-unit :: Process/minidump/Release/LLDBMinidumpTests/MinidumpParserTest.GetMemory (1282 of 1915)
PASS: lldb-unit :: Process/minidump/Release/LLDBMinidumpTests/MinidumpParserTest.GetMemoryRegionInfo (1283 of 1915)
PASS: lldb-unit :: Process/minidump/Release/LLDBMinidumpTests/MinidumpParserTest.GetMemoryRegionInfoLinuxMaps (1284 of 1915)
PASS: lldb-unit :: Process/minidump/Release/LLDBMinidumpTests/MinidumpParserTest.GetMiscInfoWindows (1285 of 1915)
PASS: lldb-unit :: Process/minidump/Release/LLDBMinidumpTests/MinidumpParserTest.GetThreadContext_x86_32 (1286 of 1915)
PASS: lldb-unit :: Process/minidump/Release/LLDBMinidumpTests/MinidumpParserTest.GetPid (1287 of 1915)
PASS: lldb-unit :: Process/minidump/Release/LLDBMinidumpTests/MinidumpParserTest.GetMiscInfo_no_stream (1288 of 1915)
PASS: lldb-unit :: Process/minidump/Release/LLDBMinidumpTests/MinidumpParserTest.GetPidWindows (1289 of 1915)
PASS: lldb-unit :: Process/minidump/Release/LLDBMinidumpTests/MinidumpParserTest.GetPidWow64 (1290 of 1915)
PASS: lldb-unit :: Process/minidump/Release/LLDBMinidumpTests/MinidumpParserTest.GetThreadContext_x86_32_wow64 (1291 of 1915)
PASS: lldb-unit :: Process/minidump/Release/LLDBMinidumpTests/MinidumpParserTest.GetThreadsAndGetThreadContext (1292 of 1915)
PASS: lldb-unit :: Process/minidump/Release/LLDBMinidumpTests/MinidumpParserTest.GetThreadContext_x86_64 (1293 of 1915)
PASS: lldb-unit :: Process/minidump/Release/LLDBMinidumpTests/MinidumpParserTest.MinidumpDuplicateModuleMinAddress (1294 of 1915)
PASS: lldb-unit :: Process/minidump/Release/LLDBMinidumpTests/MinidumpParserTest.InvalidMinidump (1295 of 1915)
PASS: lldb-unit :: Process/minidump/Release/LLDBMinidumpTests/MinidumpParserTest.MinidumpModuleOrder (1296 of 1915)
PASS: lldb-unit :: Process/minidump/Release/LLDBMinidumpTests/RegisterContextMinidump.CheckRegisterContextMinidump_ARM (1297 of 1915)
PASS: lldb-unit :: Process/minidump/Release/LLDBMinidumpTests/RegisterContextMinidump.ConvertMinidumpContext_x86_64 (1298 of 1915)
PASS: lldb-unit :: Process/minidump/Release/LLDBMinidumpTests/RegisterContextMinidump.ConvertMinidumpContext_x86_32 (1299 of 1915)
PASS: lldb-unit :: ScriptInterpreter/Python/Release/ScriptInterpreterPythonTests/PythonDataObjectsTest.TestDictionaryResolutionWithDot (1300 of 1915)
PASS: lldb-unit :: ScriptInterpreter/Python/Release/ScriptInterpreterPythonTests/PythonDataObjectsTest.TestBorrowedReferences (1301 of 1915)
PASS: lldb-unit :: ScriptInterpreter/Python/Release/ScriptInterpreterPythonTests/PythonDataObjectsTest.TestExceptions (1302 of 1915)
PASS: lldb-shell :: Watchpoint/SetErrorCases.test (1303 of 1915)
PASS: lldb-unit :: ScriptInterpreter/Python/Release/ScriptInterpreterPythonTests/PythonDataObjectsTest.TestExtractingUInt64ThroughStructuredData (1304 of 1915)
PASS: lldb-unit :: ScriptInterpreter/Python/Release/ScriptInterpreterPythonTests/PythonDataObjectsTest.TestGlobalNameResolutionNoDot (1305 of 1915)
PASS: lldb-unit :: ScriptInterpreter/Python/Release/ScriptInterpreterPythonTests/PythonDataObjectsTest.TestCallable (1306 of 1915)
PASS: lldb-unit :: ScriptInterpreter/Python/Release/ScriptInterpreterPythonTests/PythonDataObjectsTest.TestGlobalNameResolutionWithDot (1307 of 1915)
PASS: lldb-unit :: ScriptInterpreter/Python/Release/ScriptInterpreterPythonTests/PythonDataObjectsTest.TestInstanceNameResolutionNoDot (1308 of 1915)
PASS: lldb-unit :: ScriptInterpreter/Python/Release/ScriptInterpreterPythonTests/PythonDataObjectsTest.TestModuleNameResolutionNoDot (1309 of 1915)
PASS: lldb-unit :: ScriptInterpreter/Python/Release/ScriptInterpreterPythonTests/PythonDataObjectsTest.TestObjectAttributes (1310 of 1915)
PASS: lldb-unit :: ScriptInterpreter/Python/Release/ScriptInterpreterPythonTests/PythonDataObjectsTest.TestOwnedReferences (1311 of 1915)
PASS: lldb-unit :: ScriptInterpreter/Python/Release/ScriptInterpreterPythonTests/PythonDataObjectsTest.TestPythonBoolean (1312 of 1915)
PASS: lldb-unit :: ScriptInterpreter/Python/Release/ScriptInterpreterPythonTests/PythonDataObjectsTest.TestPythonByteArray (1313 of 1915)
PASS: lldb-unit :: ScriptInterpreter/Python/Release/ScriptInterpreterPythonTests/PythonDataObjectsTest.TestPythonBytes (1314 of 1915)
PASS: lldb-unit :: ScriptInterpreter/Python/Release/ScriptInterpreterPythonTests/PythonDataObjectsTest.TestPythonCallableCheck (1315 of 1915)
PASS: lldb-unit :: ScriptInterpreter/Python/Release/ScriptInterpreterPythonTests/PythonDataObjectsTest.TestPythonCallableInvoke (1316 of 1915)
PASS: lldb-unit :: ScriptInterpreter/Python/Release/ScriptInterpreterPythonTests/PythonDataObjectsTest.TestPythonDictionaryManipulation (1317 of 1915)
PASS: lldb-unit :: ScriptInterpreter/Python/Release/ScriptInterpreterPythonTests/PythonDataObjectsTest.TestPythonDictionaryValueEquality (1318 of 1915)
PASS: lldb-unit :: ScriptInterpreter/Python/Release/ScriptInterpreterPythonTests/PythonDataObjectsTest.TestPythonDictionaryToStructuredDictionary (1319 of 1915)
PASS: lldb-unit :: ScriptInterpreter/Python/Release/ScriptInterpreterPythonTests/PythonDataObjectsTest.TestPythonFile (1320 of 1915)
PASS: lldb-unit :: ScriptInterpreter/Python/Release/ScriptInterpreterPythonTests/PythonDataObjectsTest.TestPythonIntegerToStr (1321 of 1915)
PASS: lldb-unit :: ScriptInterpreter/Python/Release/ScriptInterpreterPythonTests/PythonDataObjectsTest.TestPythonInteger (1322 of 1915)
PASS: lldb-unit :: ScriptInterpreter/Python/Release/ScriptInterpreterPythonTests/PythonDataObjectsTest.TestPythonListManipulation (1323 of 1915)
PASS: lldb-unit :: ScriptInterpreter/Python/Release/ScriptInterpreterPythonTests/PythonDataObjectsTest.TestPythonIntegerToStructuredInteger (1324 of 1915)
PASS: lldb-unit :: ScriptInterpreter/Python/Release/ScriptInterpreterPythonTests/PythonDataObjectsTest.TestPythonListValueEquality (1325 of 1915)
PASS: lldb-unit :: ScriptInterpreter/Python/Release/ScriptInterpreterPythonTests/PythonDataObjectsTest.TestPythonListToStructuredList (1326 of 1915)
PASS: lldb-unit :: ScriptInterpreter/Python/Release/ScriptInterpreterPythonTests/PythonDataObjectsTest.TestPythonString (1327 of 1915)
PASS: lldb-unit :: ScriptInterpreter/Python/Release/ScriptInterpreterPythonTests/PythonDataObjectsTest.TestPythonStringToStructuredString (1328 of 1915)
PASS: lldb-unit :: ScriptInterpreter/Python/Release/ScriptInterpreterPythonTests/PythonDataObjectsTest.TestPythonStringToStr (1329 of 1915)
PASS: lldb-unit :: ScriptInterpreter/Python/Release/ScriptInterpreterPythonTests/PythonDataObjectsTest.TestPythonTupleInitializerList (1330 of 1915)
PASS: lldb-unit :: ScriptInterpreter/Python/Release/ScriptInterpreterPythonTests/PythonDataObjectsTest.TestPythonTupleInitializerList2 (1331 of 1915)
PASS: lldb-unit :: ScriptInterpreter/Python/Release/ScriptInterpreterPythonTests/PythonDataObjectsTest.TestPythonTupleSize (1332 of 1915)
PASS: lldb-unit :: ScriptInterpreter/Python/Release/ScriptInterpreterPythonTests/PythonDataObjectsTest.TestPythonTupleToStructuredList (1333 of 1915)
PASS: lldb-unit :: ScriptInterpreter/Python/Release/ScriptInterpreterPythonTests/PythonDataObjectsTest.TestPythonTupleValues (1334 of 1915)
PASS: lldb-unit :: Signals/Release/SignalsTests/UnixSignalsTest.GetFilteredSignals (1335 of 1915)
PASS: lldb-unit :: Signals/Release/SignalsTests/UnixSignalsTest.GetInfo (1336 of 1915)
PASS: lldb-unit :: ScriptInterpreter/Python/Release/ScriptInterpreterPythonTests/PythonDataObjectsTest.TestResetting (1337 of 1915)
PASS: lldb-unit :: ScriptInterpreter/Python/Release/ScriptInterpreterPythonTests/PythonDataObjectsTest.TestRun (1338 of 1915)
PASS: lldb-unit :: Signals/Release/SignalsTests/UnixSignalsTest.Iteration (1339 of 1915)
PASS: lldb-unit :: Signals/Release/SignalsTests/UnixSignalsTest.VersionChange (1340 of 1915)
PASS: lldb-unit :: ScriptInterpreter/Python/Release/ScriptInterpreterPythonTests/PythonDataObjectsTest.TestScript (1341 of 1915)
PASS: lldb-unit :: ScriptInterpreter/Python/Release/ScriptInterpreterPythonTests/PythonDataObjectsTest.TestTypeNameResolutionNoDot (1342 of 1915)
PASS: lldb-unit :: Symbol/Release/SymbolTests/DWARFCallFrameInfoTest.Basic_dwarf3 (1343 of 1915)
PASS: lldb-unit :: Symbol/Release/SymbolTests/DWARFCallFrameInfoTest.Basic_dwarf4 (1344 of 1915)
PASS: lldb-unit :: Symbol/Release/SymbolTests/DWARFCallFrameInfoTest.Basic_eh (1345 of 1915)
PASS: lldb-unit :: Symbol/Release/SymbolTests/LineEntryTest.GetSameLineContiguousAddressRangeNestedInline (1346 of 1915)
PASS: lldb-unit :: Symbol/Release/SymbolTests/PostfixExpression.ParseFPOProgram (1347 of 1915)
PASS: lldb-unit :: Symbol/Release/SymbolTests/PostfixExpression.ParseOneExpression (1348 of 1915)
PASS: lldb-unit :: Symbol/Release/SymbolTests/LineEntryTest.GetSameLineContiguousAddressRangeNoInlines (1349 of 1915)
PASS: lldb-unit :: Symbol/Release/SymbolTests/LineEntryTest.GetSameLineContiguousAddressRangeOneInline (1350 of 1915)
PASS: lldb-unit :: Symbol/Release/SymbolTests/PostfixExpression.ToDWARF (1351 of 1915)
PASS: lldb-unit :: Symbol/Release/SymbolTests/SymbolsTest.LocateExecutableSymbolFileForUnknownExecutableAndMissingSymbolFile (1352 of 1915)
PASS: lldb-unit :: Symbol/Release/SymbolTests/SymbolsTest.TerminateLocateExecutableSymbolFileForUnknownExecutableAndUnknownSymbolFile (1353 of 1915)
PASS: lldb-unit :: Symbol/Release/SymbolTests/TestClangASTContext.TemplateArguments (1354 of 1915)
PASS: lldb-unit :: Symbol/Release/SymbolTests/TestClangASTContext.TestConvertAccessTypeToAccessSpecifier (1355 of 1915)
PASS: lldb-unit :: Symbol/Release/SymbolTests/TestClangASTContext.TestBuiltinTypeForEncodingAndBitSize (1356 of 1915)
PASS: lldb-unit :: Symbol/Release/SymbolTests/TestClangASTContext.TestDeletingImplicitCopyCstrDueToMoveCStr (1357 of 1915)
PASS: lldb-unit :: Symbol/Release/SymbolTests/TestClangASTContext.TestFunctionTemplateConstruction (1358 of 1915)
PASS: lldb-unit :: Symbol/Release/SymbolTests/TestClangASTContext.TestFunctionTemplateInRecordConstruction (1359 of 1915)
PASS: lldb-unit :: Symbol/Release/SymbolTests/TestClangASTContext.TestGetBasicTypeFromEnum (1360 of 1915)
PASS: lldb-unit :: Symbol/Release/SymbolTests/TestClangASTContext.TestGetTypeClassNested (1361 of 1915)
PASS: lldb-unit :: Symbol/Release/SymbolTests/TestClangASTContext.TestGetBasicTypeFromName (1362 of 1915)
PASS: lldb-unit :: Symbol/Release/SymbolTests/TestClangASTContext.TestGetTypeClassDeclType (1363 of 1915)
PASS: lldb-unit :: Symbol/Release/SymbolTests/TestClangASTContext.TestGetTypeClassTypeOf (1364 of 1915)
PASS: lldb-unit :: Symbol/Release/SymbolTests/TestClangASTContext.TestGetTypeClassTypeOfExpr (1365 of 1915)
PASS: lldb-unit :: Symbol/Release/SymbolTests/TestClangASTContext.TestIsClangType (1366 of 1915)
PASS: lldb-unit :: Symbol/Release/SymbolTests/TestClangASTContext.TestRemoveFastQualifiers (1367 of 1915)
PASS: lldb-unit :: Symbol/Release/SymbolTests/TestClangASTContext.TestUnifyAccessSpecifiers (1368 of 1915)
PASS: lldb-unit :: Symbol/Release/SymbolTests/TestClangASTContext.TestRecordHasFields (1369 of 1915)
PASS: lldb-unit :: Symbol/Release/SymbolTests/TestClangASTContext.TestNotDeletingUserCopyCstrDueToMoveCStr (1370 of 1915)
PASS: lldb-unit :: Symbol/Release/SymbolTests/TestClangASTImporter.CanImportInvalidType (1371 of 1915)
PASS: lldb-unit :: Symbol/Release/SymbolTests/TestClangASTImporter.CopyTypeTagDecl (1372 of 1915)
PASS: lldb-unit :: Symbol/Release/SymbolTests/TestClangASTImporter.CopyDeclTagDecl (1373 of 1915)
PASS: lldb-unit :: Symbol/Release/SymbolTests/TestClangASTImporter.ImportInvalidType (1374 of 1915)
PASS: lldb-unit :: Symbol/Release/SymbolTests/TestClangASTImporter.DeportDeclTagDecl (1375 of 1915)
PASS: lldb-unit :: Symbol/Release/SymbolTests/TestClangASTImporter.DeportTypeTagDecl (1376 of 1915)
PASS: lldb-unit :: Symbol/Release/SymbolTests/TestClangASTImporter.MetadataPropagation (1377 of 1915)
PASS: lldb-unit :: Symbol/Release/SymbolTests/TestClangASTImporter.MetadataPropagationAfterCopying (1378 of 1915)
PASS: lldb-unit :: Symbol/Release/SymbolTests/TestClangASTImporter.RecordLayout (1379 of 1915)
PASS: lldb-unit :: Symbol/Release/SymbolTests/TestClangASTImporter.MetadataPropagationIndirectImport (1380 of 1915)
PASS: lldb-unit :: Symbol/Release/SymbolTests/Type.GetTypeScopeAndBasename (1381 of 1915)
PASS: lldb-unit :: Symbol/Release/SymbolTests/Type.CompilerContextPattern (1382 of 1915)
PASS: lldb-unit :: SymbolFile/DWARF/Release/SymbolFileDWARFTests/SymbolFileDWARFTests.TestAbbrevInvalidNULLTag (1383 of 1915)
PASS: lldb-unit :: SymbolFile/DWARF/Release/SymbolFileDWARFTests/DWARFASTParserClangTests.EnsureAllDIEsInDeclContextHaveBeenParsedParsesOnlyMatchingEntries (1384 of 1915)
PASS: lldb-unit :: SymbolFile/DWARF/Release/SymbolFileDWARFTests/SymbolFileDWARFTests.TestAbbrevMissingTerminator (1385 of 1915)
PASS: lldb-unit :: SymbolFile/DWARF/Release/SymbolFileDWARFTests/SymbolFileDWARFTests.TestAbbrevOrder1Start1 (1386 of 1915)
PASS: lldb-unit :: SymbolFile/DWARF/Release/SymbolFileDWARFTests/SymbolFileDWARFTests.TestAbbrevNullAttrValidForm (1387 of 1915)
PASS: lldb-unit :: SymbolFile/DWARF/Release/SymbolFileDWARFTests/SymbolFileDWARFTests.TestAbbrevOrder1Start5 (1388 of 1915)
PASS: lldb-unit :: SymbolFile/NativePDB/Release/SymbolFileNativePDBTests/PDBFPOProgramToDWARFExpressionTests.DependencyChain (1389 of 1915)
PASS: lldb-unit :: SymbolFile/DWARF/Release/SymbolFileDWARFTests/SymbolFileDWARFTests.TestAbbrevOutOfOrder (1390 of 1915)
PASS: lldb-unit :: SymbolFile/DWARF/Release/SymbolFileDWARFTests/SymbolFileDWARFTests.TestAbbrevValidAttrNullForm (1391 of 1915)
PASS: lldb-unit :: SymbolFile/DWARF/Release/SymbolFileDWARFTests/SymbolFileDWARFTests.TestAbilitiesForDWARF (1392 of 1915)
PASS: lldb-unit :: SymbolFile/NativePDB/Release/SymbolFileNativePDBTests/PDBFPOProgramToDWARFExpressionTests.InvalidAssignmentSingle (1393 of 1915)
PASS: lldb-unit :: SymbolFile/NativePDB/Release/SymbolFileNativePDBTests/PDBFPOProgramToDWARFExpressionTests.InvalidAssignmentMultiple (1394 of 1915)
PASS: lldb-unit :: SymbolFile/NativePDB/Release/SymbolFileNativePDBTests/PDBFPOProgramToDWARFExpressionTests.MultipleDependentAssignments (1395 of 1915)
PASS: lldb-unit :: SymbolFile/NativePDB/Release/SymbolFileNativePDBTests/PDBFPOProgramToDWARFExpressionTests.MissingTargetRegister (1396 of 1915)
PASS: lldb-unit :: SymbolFile/NativePDB/Release/SymbolFileNativePDBTests/PDBFPOProgramToDWARFExpressionTests.InvalidOpUnary (1397 of 1915)
PASS: lldb-unit :: SymbolFile/NativePDB/Release/SymbolFileNativePDBTests/PDBFPOProgramToDWARFExpressionTests.InvalidOpBinary (1398 of 1915)
PASS: lldb-unit :: SymbolFile/NativePDB/Release/SymbolFileNativePDBTests/PDBFPOProgramToDWARFExpressionTests.MultipleIndependentAssignments (1399 of 1915)
PASS: lldb-unit :: SymbolFile/NativePDB/Release/SymbolFileNativePDBTests/PDBFPOProgramToDWARFExpressionTests.UnknownOp (1400 of 1915)
PASS: lldb-unit :: SymbolFile/NativePDB/Release/SymbolFileNativePDBTests/PDBFPOProgramToDWARFExpressionTests.SingleAssignmentRegisterRef (1401 of 1915)
PASS: lldb-unit :: SymbolFile/NativePDB/Release/SymbolFileNativePDBTests/PDBFPOProgramToDWARFExpressionTests.UnresolvedRegisterReference (1402 of 1915)
PASS: lldb-unit :: SymbolFile/NativePDB/Release/SymbolFileNativePDBTests/PDBFPOProgramToDWARFExpressionTests.UnsupportedRASearch (1403 of 1915)
PASS: lldb-unit :: SymbolFile/NativePDB/Release/SymbolFileNativePDBTests/PDBFPOProgramToDWARFExpressionTests.UnresolvedCyclicRegisterAssignmentReference (1404 of 1915)
PASS: lldb-unit :: SymbolFile/NativePDB/Release/SymbolFileNativePDBTests/PDBFPOProgramToDWARFExpressionTests.UnresolvedRegisterAssignmentReference (1405 of 1915)
PASS: lldb-unit :: SymbolFile/NativePDB/Release/SymbolFileNativePDBTests/PDBFPOProgramToDWARFExpressionTests.UnresolvedDependentCyclicRegisterAssignmentReference (1406 of 1915)
PASS: lldb-unit :: Target/Release/TargetTests/ExecutionContextTest.GetByteOrder (1407 of 1915)
PASS: lldb-unit :: Target/Release/TargetTests/MemoryRegionInfoTest.Formatv (1408 of 1915)
PASS: lldb-unit :: Target/Release/TargetTests/ExecutionContextTest.GetByteOrderProcess (1409 of 1915)
PASS: lldb-unit :: Target/Release/TargetTests/ExecutionContextTest.GetByteOrderTarget (1410 of 1915)
PASS: lldb-unit :: Target/Release/TargetTests/ModuleCacheTest.GetAndPutUuidExists (1411 of 1915)
PASS: lldb-unit :: Target/Release/TargetTests/ModuleCacheTest.GetAndPut (1412 of 1915)
PASS: lldb-unit :: Target/Release/TargetTests/ModuleCacheTest.GetAndPutStrangeHostname (1413 of 1915)
PASS: lldb-unit :: Target/Release/TargetTests/PathMappingListTest.AbsoluteTests (1414 of 1915)
PASS: lldb-unit :: Target/Release/TargetTests/PathMappingListTest.RelativeTests (1415 of 1915)
PASS: lldb-unit :: Target/Release/TargetTests/PathMappingListTest.RemapRoot (1416 of 1915)
PASS: lldb-unit :: UnwindAssembly/ARM64/Release/Arm64InstEmulationTests/TestArm64InstEmulation.TestRegisterDoubleSpills (1417 of 1915)
PASS: lldb-unit :: UnwindAssembly/ARM64/Release/Arm64InstEmulationTests/TestArm64InstEmulation.TestFramelessThreeEpilogueFunction (1418 of 1915)
PASS: lldb-unit :: UnwindAssembly/ARM64/Release/Arm64InstEmulationTests/TestArm64InstEmulation.TestRegisterSavedTwice (1419 of 1915)
PASS: lldb-unit :: UnwindAssembly/ARM64/Release/Arm64InstEmulationTests/TestArm64InstEmulation.TestMediumDarwinFunction (1420 of 1915)
PASS: lldb-unit :: UnwindAssembly/ARM64/Release/Arm64InstEmulationTests/TestArm64InstEmulation.TestSimpleDarwinFunction (1421 of 1915)
PASS: lldb-unit :: UnwindAssembly/PPC64/Release/PPC64InstEmulationTests/TestPPC64InstEmulation.TestSimpleFunction (1422 of 1915)
PASS: lldb-unit :: UnwindAssembly/PPC64/Release/PPC64InstEmulationTests/TestPPC64InstEmulation.TestMediumFunction (1423 of 1915)
PASS: lldb-api :: types/TestCharTypeExpr.py (1424 of 1915)
PASS: lldb-unit :: UnwindAssembly/x86/Release/UnwindAssemblyx86Tests/Testx86AssemblyInspectionEngine.Test32bitFramelessSmallStackFrame (1425 of 1915)
PASS: lldb-unit :: UnwindAssembly/x86/Release/UnwindAssemblyx86Tests/Testx86AssemblyInspectionEngine.Test32BitOnlyInstruction (1426 of 1915)
PASS: lldb-unit :: UnwindAssembly/x86/Release/UnwindAssemblyx86Tests/Testx86AssemblyInspectionEngine.Test32bitFramelessBigStackFrame (1427 of 1915)
PASS: lldb-unit :: UnwindAssembly/x86/Release/UnwindAssemblyx86Tests/Testx86AssemblyInspectionEngine.Test64bitFramelessBigStackFrame (1428 of 1915)
PASS: lldb-unit :: UnwindAssembly/x86/Release/UnwindAssemblyx86Tests/Testx86AssemblyInspectionEngine.Test64bitFramelessSmallStackFrame (1429 of 1915)
PASS: lldb-unit :: UnwindAssembly/x86/Release/UnwindAssemblyx86Tests/Testx86AssemblyInspectionEngine.TestCALLNextInsn (1430 of 1915)
PASS: lldb-unit :: UnwindAssembly/x86/Release/UnwindAssemblyx86Tests/Testx86AssemblyInspectionEngine.TestAddRSP (1431 of 1915)
PASS: lldb-unit :: UnwindAssembly/x86/Release/UnwindAssemblyx86Tests/Testx86AssemblyInspectionEngine.TestAddESP (1432 of 1915)
PASS: lldb-unit :: UnwindAssembly/x86/Release/UnwindAssemblyx86Tests/Testx86AssemblyInspectionEngine.TestLEAVE (1433 of 1915)
PASS: lldb-unit :: UnwindAssembly/x86/Release/UnwindAssemblyx86Tests/Testx86AssemblyInspectionEngine.TestDisassemblyJunkBytes (1434 of 1915)
PASS: lldb-unit :: UnwindAssembly/x86/Release/UnwindAssemblyx86Tests/Testx86AssemblyInspectionEngine.TestDisassemblyMidFunctionEpilogues (1435 of 1915)
PASS: lldb-unit :: UnwindAssembly/x86/Release/UnwindAssemblyx86Tests/Testx86AssemblyInspectionEngine.TestMovRSPtoRBP (1436 of 1915)
PASS: lldb-unit :: UnwindAssembly/x86/Release/UnwindAssemblyx86Tests/Testx86AssemblyInspectionEngine.TestPopEBP (1437 of 1915)
PASS: lldb-unit :: UnwindAssembly/x86/Release/UnwindAssemblyx86Tests/Testx86AssemblyInspectionEngine.TestPopEBX (1438 of 1915)
PASS: lldb-unit :: UnwindAssembly/x86/Release/UnwindAssemblyx86Tests/Testx86AssemblyInspectionEngine.TestPopEDI (1439 of 1915)
PASS: lldb-unit :: UnwindAssembly/x86/Release/UnwindAssemblyx86Tests/Testx86AssemblyInspectionEngine.TestPopESI (1440 of 1915)
PASS: lldb-unit :: UnwindAssembly/x86/Release/UnwindAssemblyx86Tests/Testx86AssemblyInspectionEngine.TestPopR13 (1441 of 1915)
PASS: lldb-unit :: UnwindAssembly/x86/Release/UnwindAssemblyx86Tests/Testx86AssemblyInspectionEngine.TestPopR15 (1442 of 1915)
PASS: lldb-unit :: UnwindAssembly/x86/Release/UnwindAssemblyx86Tests/Testx86AssemblyInspectionEngine.TestPopR12 (1443 of 1915)
PASS: lldb-unit :: UnwindAssembly/x86/Release/UnwindAssemblyx86Tests/Testx86AssemblyInspectionEngine.TestPopR14 (1444 of 1915)
PASS: lldb-unit :: UnwindAssembly/x86/Release/UnwindAssemblyx86Tests/Testx86AssemblyInspectionEngine.TestPopRBP (1445 of 1915)
PASS: lldb-unit :: UnwindAssembly/x86/Release/UnwindAssemblyx86Tests/Testx86AssemblyInspectionEngine.TestPopRBPWithREX (1446 of 1915)
PASS: lldb-unit :: UnwindAssembly/x86/Release/UnwindAssemblyx86Tests/Testx86AssemblyInspectionEngine.TestPopRBX (1447 of 1915)
PASS: lldb-unit :: UnwindAssembly/x86/Release/UnwindAssemblyx86Tests/Testx86AssemblyInspectionEngine.TestPush0 (1448 of 1915)
PASS: lldb-unit :: UnwindAssembly/x86/Release/UnwindAssemblyx86Tests/Testx86AssemblyInspectionEngine.TestPushEBX (1449 of 1915)
PASS: lldb-unit :: UnwindAssembly/x86/Release/UnwindAssemblyx86Tests/Testx86AssemblyInspectionEngine.TestPushEBP (1450 of 1915)
PASS: lldb-unit :: UnwindAssembly/x86/Release/UnwindAssemblyx86Tests/Testx86AssemblyInspectionEngine.TestPushECX (1451 of 1915)
PASS: lldb-unit :: UnwindAssembly/x86/Release/UnwindAssemblyx86Tests/Testx86AssemblyInspectionEngine.TestPushEAX (1452 of 1915)
PASS: lldb-unit :: UnwindAssembly/x86/Release/UnwindAssemblyx86Tests/Testx86AssemblyInspectionEngine.TestPushEDI (1453 of 1915)
PASS: lldb-unit :: UnwindAssembly/x86/Release/UnwindAssemblyx86Tests/Testx86AssemblyInspectionEngine.TestPushExtended (1454 of 1915)
PASS: lldb-unit :: UnwindAssembly/x86/Release/UnwindAssemblyx86Tests/Testx86AssemblyInspectionEngine.TestPushEDX (1455 of 1915)
PASS: lldb-unit :: UnwindAssembly/x86/Release/UnwindAssemblyx86Tests/Testx86AssemblyInspectionEngine.TestPushESI (1456 of 1915)
PASS: lldb-unit :: UnwindAssembly/x86/Release/UnwindAssemblyx86Tests/Testx86AssemblyInspectionEngine.TestPushR14 (1457 of 1915)
PASS: lldb-unit :: UnwindAssembly/x86/Release/UnwindAssemblyx86Tests/Testx86AssemblyInspectionEngine.TestPushR12 (1458 of 1915)
PASS: lldb-unit :: UnwindAssembly/x86/Release/UnwindAssemblyx86Tests/Testx86AssemblyInspectionEngine.TestPushImm (1459 of 1915)
PASS: lldb-unit :: UnwindAssembly/x86/Release/UnwindAssemblyx86Tests/Testx86AssemblyInspectionEngine.TestPushR13 (1460 of 1915)
PASS: lldb-unit :: UnwindAssembly/x86/Release/UnwindAssemblyx86Tests/Testx86AssemblyInspectionEngine.TestPushR15 (1461 of 1915)
PASS: lldb-unit :: UnwindAssembly/x86/Release/UnwindAssemblyx86Tests/Testx86AssemblyInspectionEngine.TestPushRBPWithREX (1462 of 1915)
PASS: lldb-unit :: UnwindAssembly/x86/Release/UnwindAssemblyx86Tests/Testx86AssemblyInspectionEngine.TestPushRBX (1463 of 1915)
PASS: lldb-unit :: UnwindAssembly/x86/Release/UnwindAssemblyx86Tests/Testx86AssemblyInspectionEngine.TestPushRBP (1464 of 1915)
PASS: lldb-unit :: UnwindAssembly/x86/Release/UnwindAssemblyx86Tests/Testx86AssemblyInspectionEngine.TestReturnDetect (1465 of 1915)
PASS: lldb-unit :: UnwindAssembly/x86/Release/UnwindAssemblyx86Tests/Testx86AssemblyInspectionEngine.TestSimple32bitFrameFunction (1466 of 1915)
PASS: lldb-unit :: UnwindAssembly/x86/Release/UnwindAssemblyx86Tests/Testx86AssemblyInspectionEngine.TestSimplei386ugmented (1467 of 1915)
PASS: lldb-unit :: UnwindAssembly/x86/Release/UnwindAssemblyx86Tests/Testx86AssemblyInspectionEngine.TestSimple64bitFrameFunction (1468 of 1915)
PASS: lldb-unit :: UnwindAssembly/x86/Release/UnwindAssemblyx86Tests/Testx86AssemblyInspectionEngine.TestSimplex86_64Augmented (1469 of 1915)
PASS: lldb-unit :: UnwindAssembly/x86/Release/UnwindAssemblyx86Tests/Testx86AssemblyInspectionEngine.TestSpillRegToStackViaMOVx86_64 (1470 of 1915)
PASS: lldb-unit :: UnwindAssembly/x86/Release/UnwindAssemblyx86Tests/Testx86AssemblyInspectionEngine.TestSpArithx86_64Augmented (1471 of 1915)
PASS: lldb-unit :: UnwindAssembly/x86/Release/UnwindAssemblyx86Tests/Testx86AssemblyInspectionEngine.TestSpillRegToStackViaMOVi386 (1472 of 1915)
PASS: lldb-unit :: Utility/Release/UtilityTests/AnsiTerminal.AtEnd (1473 of 1915)
PASS: lldb-unit :: Utility/Release/UtilityTests/AnsiTerminal.AtStart (1474 of 1915)
PASS: lldb-unit :: UnwindAssembly/x86/Release/UnwindAssemblyx86Tests/Testx86AssemblyInspectionEngine.TestSubESP (1475 of 1915)
PASS: lldb-unit :: UnwindAssembly/x86/Release/UnwindAssemblyx86Tests/Testx86AssemblyInspectionEngine.TestStackRealignMSVC_i386 (1476 of 1915)
PASS: lldb-unit :: UnwindAssembly/x86/Release/UnwindAssemblyx86Tests/Testx86AssemblyInspectionEngine.TestStackRealign8BitDisp_i386 (1477 of 1915)
PASS: lldb-unit :: UnwindAssembly/x86/Release/UnwindAssemblyx86Tests/Testx86AssemblyInspectionEngine.TestStackRealign32BitDisp_x86_64 (1478 of 1915)
PASS: lldb-unit :: UnwindAssembly/x86/Release/UnwindAssemblyx86Tests/Testx86AssemblyInspectionEngine.TestSubRSP (1479 of 1915)
PASS: lldb-unit :: UnwindAssembly/x86/Release/UnwindAssemblyx86Tests/Testx86AssemblyInspectionEngine.Testi386IgnoredRegisters (1480 of 1915)
PASS: lldb-unit :: Utility/Release/UtilityTests/AnsiTerminal.Basic (1481 of 1915)
PASS: lldb-unit :: Utility/Release/UtilityTests/AnsiTerminal.Empty (1482 of 1915)
PASS: lldb-unit :: Utility/Release/UtilityTests/AnsiTerminal.Unknown (1483 of 1915)
PASS: lldb-unit :: Utility/Release/UtilityTests/AnsiTerminal.Incomplete (1484 of 1915)
PASS: lldb-unit :: Utility/Release/UtilityTests/AnsiTerminal.KnownPrefix (1485 of 1915)
PASS: lldb-unit :: Utility/Release/UtilityTests/AnsiTerminal.Twice (1486 of 1915)
PASS: lldb-unit :: Utility/Release/UtilityTests/AnsiTerminal.WhiteSpace (1487 of 1915)
PASS: lldb-unit :: Utility/Release/UtilityTests/ArchSpecTest.Compatibility (1488 of 1915)
PASS: lldb-unit :: Utility/Release/UtilityTests/ArchSpecTest.MergeFromMachOUnknown (1489 of 1915)
PASS: lldb-unit :: Utility/Release/UtilityTests/ArchSpecTest.TestParseMachCPUDashSubtypeTripleExtra (1490 of 1915)
PASS: lldb-unit :: Utility/Release/UtilityTests/ArchSpecTest.MergeFrom (1491 of 1915)
PASS: lldb-unit :: Utility/Release/UtilityTests/ArchSpecTest.TestParseMachCPUDashSubtypeTripleSimple (1492 of 1915)
PASS: lldb-unit :: Utility/Release/UtilityTests/ArchSpecTest.OperatorBool (1493 of 1915)
PASS: lldb-unit :: Utility/Release/UtilityTests/ArchSpecTest.TestSetTriple (1494 of 1915)
PASS: lldb-unit :: Utility/Release/UtilityTests/ArchSpecTest.TripleComponentsWereSpecified (1495 of 1915)
PASS: lldb-unit :: Utility/Release/UtilityTests/ArgsTest.AppendArguments (1496 of 1915)
PASS: lldb-unit :: Utility/Release/UtilityTests/ArgsTest.BareSingleQuote (1497 of 1915)
PASS: lldb-unit :: Utility/Release/UtilityTests/ArgsTest.GetArgumentArrayRef (1498 of 1915)
PASS: lldb-unit :: Utility/Release/UtilityTests/ArgsTest.EscapeLLDBCommandArgument (1499 of 1915)
PASS: lldb-unit :: Utility/Release/UtilityTests/ArgsTest.DoubleQuotedItem (1500 of 1915)
PASS: lldb-unit :: Utility/Release/UtilityTests/ArgsTest.ReplaceArgumentAtIndexEqual (1501 of 1915)
PASS: lldb-unit :: Utility/Release/UtilityTests/ArgsTest.GetQuotedCommandString (1502 of 1915)
PASS: lldb-unit :: Utility/Release/UtilityTests/ArgsTest.ReplaceArgumentAtIndexFarOutOfRange (1503 of 1915)
PASS: lldb-unit :: Utility/Release/UtilityTests/ArgsTest.ReplaceArgumentAtIndexLonger (1504 of 1915)
PASS: lldb-unit :: Utility/Release/UtilityTests/ArgsTest.ReplaceArgumentAtIndexShort (1505 of 1915)
PASS: lldb-unit :: Utility/Release/UtilityTests/ArgsTest.ReplaceArgumentAtIndexOutOfRange (1506 of 1915)
PASS: lldb-unit :: Utility/Release/UtilityTests/ArgsTest.TestInsertArg (1507 of 1915)
PASS: lldb-unit :: Utility/Release/UtilityTests/ArgsTest.StringListConstructor (1508 of 1915)
PASS: lldb-unit :: Utility/Release/UtilityTests/ArgsTest.TestArgv (1509 of 1915)
PASS: lldb-unit :: Utility/Release/UtilityTests/ArgsTest.TestAppendArg (1510 of 1915)
PASS: lldb-unit :: Utility/Release/UtilityTests/ArgsTest.TestMultipleArgs (1511 of 1915)
PASS: lldb-unit :: Utility/Release/UtilityTests/ArgsTest.TestOverwriteArgs (1512 of 1915)
PASS: lldb-unit :: Utility/Release/UtilityTests/ArgsTest.TestQuotedTrailingBackslash (1513 of 1915)
PASS: lldb-unit :: Utility/Release/UtilityTests/ArgsTest.TestQuotedUnknownEscape (1514 of 1915)
PASS: lldb-unit :: Utility/Release/UtilityTests/ArgsTest.TestSingleArgWithQuotedSpace (1515 of 1915)
PASS: lldb-unit :: Utility/Release/UtilityTests/ArgsTest.TestSingleQuotedArgWithSpace (1516 of 1915)
PASS: lldb-unit :: Utility/Release/UtilityTests/ArgsTest.TestSingleArg (1517 of 1915)
PASS: lldb-unit :: Utility/Release/UtilityTests/ArgsTest.TestTrailingBackslash (1518 of 1915)
PASS: lldb-unit :: Utility/Release/UtilityTests/BinaryStreamTest.PutSLEB128EightBytes (1519 of 1915)
PASS: lldb-unit :: Utility/Release/UtilityTests/ArgsTest.TestUnknownEscape (1520 of 1915)
PASS: lldb-unit :: Utility/Release/UtilityTests/BinaryStreamTest.PutSLEB128FiveBytes (1521 of 1915)
PASS: lldb-unit :: Utility/Release/UtilityTests/BinaryStreamTest.PutSLEB128FourBytes (1522 of 1915)
PASS: lldb-unit :: Utility/Release/UtilityTests/BinaryStreamTest.PutSLEB128MaxValue (1523 of 1915)
PASS: lldb-unit :: Utility/Release/UtilityTests/BinaryStreamTest.PutSLEB128One (1524 of 1915)
PASS: lldb-unit :: Utility/Release/UtilityTests/BinaryStreamTest.PutSLEB128NineBytes (1525 of 1915)
PASS: lldb-unit :: Utility/Release/UtilityTests/BinaryStreamTest.PutSLEB128OneByte (1526 of 1915)
PASS: lldb-unit :: Utility/Release/UtilityTests/BinaryStreamTest.PutSLEB128SevenBytes (1527 of 1915)
PASS: lldb-unit :: Utility/Release/UtilityTests/BinaryStreamTest.PutSLEB128SixBytes (1528 of 1915)
PASS: lldb-unit :: Utility/Release/UtilityTests/BinaryStreamTest.PutSLEB128TwoBytes (1529 of 1915)
PASS: lldb-unit :: Utility/Release/UtilityTests/BinaryStreamTest.PutSLEB128ThreeBytes (1530 of 1915)
PASS: lldb-unit :: Utility/Release/UtilityTests/BinaryStreamTest.PutULEB128FourBytes (1531 of 1915)
PASS: lldb-unit :: Utility/Release/UtilityTests/BinaryStreamTest.PutULEB128FiveBytes (1532 of 1915)
PASS: lldb-unit :: Utility/Release/UtilityTests/BinaryStreamTest.PutSLEB128Zero (1533 of 1915)
PASS: lldb-unit :: Utility/Release/UtilityTests/BinaryStreamTest.PutULEB128EightBytes (1534 of 1915)
PASS: lldb-unit :: Utility/Release/UtilityTests/BinaryStreamTest.PutULEB128MaxValue (1535 of 1915)
PASS: lldb-unit :: Utility/Release/UtilityTests/BinaryStreamTest.PutULEB128NineBytes (1536 of 1915)
PASS: lldb-unit :: Utility/Release/UtilityTests/BinaryStreamTest.PutULEB128SevenBytes (1537 of 1915)
PASS: lldb-unit :: Utility/Release/UtilityTests/BinaryStreamTest.PutULEB128SixBytes (1538 of 1915)
PASS: lldb-unit :: Utility/Release/UtilityTests/BinaryStreamTest.PutULEB128One (1539 of 1915)
PASS: lldb-unit :: Utility/Release/UtilityTests/BinaryStreamTest.PutULEB128OneByte (1540 of 1915)
PASS: lldb-unit :: Utility/Release/UtilityTests/BinaryStreamTest.PutULEB128TwoBytes (1541 of 1915)
PASS: lldb-unit :: Utility/Release/UtilityTests/BinaryStreamTest.PutULEB128ThreeBytes (1542 of 1915)
PASS: lldb-unit :: Utility/Release/UtilityTests/BroadcasterTest.BroadcastEvent (1543 of 1915)
PASS: lldb-unit :: Utility/Release/UtilityTests/BinaryStreamTest.PutULEB128Zero (1544 of 1915)
PASS: lldb-unit :: Utility/Release/UtilityTests/CompletionRequest.DuplicateFilteringWithComments (1545 of 1915)
PASS: lldb-unit :: Utility/Release/UtilityTests/BroadcasterTest.EventTypeHasListeners (1546 of 1915)
PASS: lldb-unit :: Utility/Release/UtilityTests/CompletionRequest.FakeLastArg (1547 of 1915)
PASS: lldb-unit :: Utility/Release/UtilityTests/CompletionRequest.Constructor (1548 of 1915)
PASS: lldb-unit :: Utility/Release/UtilityTests/CompletionRequest.DuplicateFiltering (1549 of 1915)
PASS: lldb-unit :: Utility/Release/UtilityTests/CompletionRequest.ShiftArguments (1550 of 1915)
PASS: lldb-unit :: Utility/Release/UtilityTests/CompletionRequest.TestCompletionOwnership (1551 of 1915)
PASS: lldb-unit :: Utility/Release/UtilityTests/CompletionRequest.TryCompleteCurrentArgBad (1552 of 1915)
PASS: lldb-unit :: Utility/Release/UtilityTests/ConstStringTest.CompareConstString (1553 of 1915)
PASS: lldb-unit :: Utility/Release/UtilityTests/CompletionRequest.TryCompleteCurrentArgMode (1554 of 1915)
PASS: lldb-unit :: Utility/Release/UtilityTests/ConstStringTest.FromMidOfBufferStringRef (1555 of 1915)
PASS: lldb-unit :: Utility/Release/UtilityTests/ConstStringTest.MangledCounterpart (1556 of 1915)
PASS: lldb-unit :: Utility/Release/UtilityTests/ConstStringTest.CompareStringRef (1557 of 1915)
PASS: lldb-unit :: Utility/Release/UtilityTests/CompletionRequest.TryCompleteCurrentArgGood (1558 of 1915)
PASS: lldb-unit :: Utility/Release/UtilityTests/ConstStringTest.UpdateMangledCounterpart (1559 of 1915)
PASS: lldb-unit :: Utility/Release/UtilityTests/ConstStringTest.NullAndEmptyStates (1560 of 1915)
PASS: lldb-unit :: Utility/Release/UtilityTests/ConstStringTest.format_provider (1561 of 1915)
PASS: lldb-unit :: Utility/Release/UtilityTests/DataExtractorTest.GetBitfield (1562 of 1915)
PASS: lldb-unit :: Utility/Release/UtilityTests/DataExtractorTest.GetCStrEmpty (1563 of 1915)
PASS: lldb-unit :: Utility/Release/UtilityTests/DataExtractorTest.GetCStr (1564 of 1915)
PASS: lldb-unit :: Utility/Release/UtilityTests/DataExtractorTest.GetCStrAtEnd (1565 of 1915)
PASS: lldb-unit :: Utility/Release/UtilityTests/DataExtractorTest.GetCStrAtNullOffset (1566 of 1915)
PASS: lldb-unit :: Utility/Release/UtilityTests/DataExtractorTest.GetMaxS64 (1567 of 1915)
PASS: lldb-unit :: Utility/Release/UtilityTests/DataExtractorTest.GetCStrUnterminated (1568 of 1915)
PASS: lldb-unit :: Utility/Release/UtilityTests/DataExtractorTest.GetMaxU64 (1569 of 1915)
PASS: lldb-unit :: Utility/Release/UtilityTests/DataExtractorTest.GetMaxU64_unchecked (1570 of 1915)
PASS: lldb-unit :: Utility/Release/UtilityTests/DataExtractorTest.PeekData (1571 of 1915)
PASS: lldb-unit :: Utility/Release/UtilityTests/DeserializerTest.HasData (1572 of 1915)
PASS: lldb-unit :: Utility/Release/UtilityTests/EnvironmentTest.EnvpConversion (1573 of 1915)
PASS: lldb-unit :: Utility/Release/UtilityTests/EnvironmentTest.EnvpConstruction (1574 of 1915)
PASS: lldb-unit :: Utility/Release/UtilityTests/EventTest.DumpEventDataBytes (1575 of 1915)
PASS: lldb-unit :: Utility/Release/UtilityTests/FileSpecTest.AppendPathComponent (1576 of 1915)
PASS: lldb-unit :: Utility/Release/UtilityTests/FileSpecTest.EqualDotsPosix (1577 of 1915)
PASS: lldb-unit :: Utility/Release/UtilityTests/FileSpecTest.CopyByAppendingPathComponent (1578 of 1915)
PASS: lldb-unit :: Utility/Release/UtilityTests/FileSpecTest.EqualDotsWindows (1579 of 1915)
PASS: lldb-unit :: Utility/Release/UtilityTests/FileSpecTest.Equal (1580 of 1915)
PASS: lldb-unit :: Utility/Release/UtilityTests/FileSpecTest.EqualDotsPosixRoot (1581 of 1915)
PASS: lldb-unit :: Utility/Release/UtilityTests/FileSpecTest.EqualSeparator (1582 of 1915)
PASS: lldb-unit :: Utility/Release/UtilityTests/FileSpecTest.FormatFileSpec (1583 of 1915)
PASS: lldb-unit :: Utility/Release/UtilityTests/FileSpecTest.FileAndDirectoryComponents (1584 of 1915)
PASS: lldb-unit :: Utility/Release/UtilityTests/FileSpecTest.GetPath (1585 of 1915)
PASS: lldb-unit :: Utility/Release/UtilityTests/FileSpecTest.Match (1586 of 1915)
PASS: lldb-unit :: Utility/Release/UtilityTests/FileSpecTest.GuessPathStyle (1587 of 1915)
PASS: lldb-unit :: Utility/Release/UtilityTests/FileSpecTest.IsRelative (1588 of 1915)
PASS: lldb-unit :: Utility/Release/UtilityTests/FileSpecTest.PrependPathComponent (1589 of 1915)
PASS: lldb-unit :: Utility/Release/UtilityTests/FileSpecTest.RemoveLastPathComponent (1590 of 1915)
PASS: lldb-unit :: Utility/Release/UtilityTests/Flags.AllSet (1591 of 1915)
PASS: lldb-unit :: Utility/Release/UtilityTests/Flags.AllClear (1592 of 1915)
PASS: lldb-unit :: Utility/Release/UtilityTests/Flags.Clear (1593 of 1915)
PASS: lldb-unit :: Utility/Release/UtilityTests/Flags.AnySet (1594 of 1915)
PASS: lldb-unit :: Utility/Release/UtilityTests/Flags.GetBitSize (1595 of 1915)
PASS: lldb-unit :: Utility/Release/UtilityTests/Flags.AnyClear (1596 of 1915)
PASS: lldb-unit :: Utility/Release/UtilityTests/Flags.Reset (1597 of 1915)
PASS: lldb-unit :: Utility/Release/UtilityTests/Flags.IsClear (1598 of 1915)
PASS: lldb-unit :: Utility/Release/UtilityTests/Flags.Test (1599 of 1915)
PASS: lldb-unit :: Utility/Release/UtilityTests/GeneratorTest.Create (1600 of 1915)
PASS: lldb-unit :: Utility/Release/UtilityTests/IndexToObjectTest.ObjectForIndex (1601 of 1915)
PASS: lldb-unit :: Utility/Release/UtilityTests/GeneratorTest.Get (1602 of 1915)
PASS: lldb-unit :: Utility/Release/UtilityTests/ListenerTest.GetEventImmediate (1603 of 1915)
PASS: lldb-unit :: Utility/Release/UtilityTests/GeneratorTest.GetOrCreate (1604 of 1915)
PASS: lldb-unit :: Utility/Release/UtilityTests/LogChannelEnabledTest.LLDB_LOG_ERROR (1605 of 1915)
PASS: lldb-unit :: Utility/Release/UtilityTests/LogChannelEnabledTest.LogGetLogThread (1606 of 1915)
PASS: lldb-unit :: Utility/Release/UtilityTests/LogChannelEnabledTest.LogThread (1607 of 1915)
PASS: lldb-unit :: Utility/Release/UtilityTests/LogChannelEnabledTest.log_options (1608 of 1915)
PASS: lldb-unit :: Utility/Release/UtilityTests/LogChannelTest.Disable (1609 of 1915)
PASS: lldb-unit :: Utility/Release/UtilityTests/LogChannelTest.Enable (1610 of 1915)
PASS: lldb-unit :: Utility/Release/UtilityTests/LogChannelEnabledTest.LogVerboseThread (1611 of 1915)
PASS: lldb-unit :: Utility/Release/UtilityTests/LogChannelTest.EnableOptions (1612 of 1915)
PASS: lldb-unit :: Utility/Release/UtilityTests/LogChannelTest.List (1613 of 1915)
PASS: lldb-unit :: Utility/Release/UtilityTests/LogTest.LLDB_LOG_nullptr (1614 of 1915)
PASS: lldb-unit :: Utility/Release/UtilityTests/ListenerTest.GetEventWait (1615 of 1915)
PASS: lldb-unit :: Utility/Release/UtilityTests/LogTest.Unregister (1616 of 1915)
PASS: lldb-unit :: Utility/Release/UtilityTests/LogTest.Register (1617 of 1915)
PASS: lldb-unit :: Utility/Release/UtilityTests/NameMatchesTest.Contains (1618 of 1915)
PASS: lldb-unit :: Utility/Release/UtilityTests/NameMatchesTest.EndsWith (1619 of 1915)
PASS: lldb-unit :: Utility/Release/UtilityTests/NameMatchesTest.Equals (1620 of 1915)
PASS: lldb-unit :: Utility/Release/UtilityTests/NameMatchesTest.Ignore (1621 of 1915)
PASS: lldb-unit :: Utility/Release/UtilityTests/NameMatchesTest.StartsWith (1622 of 1915)
PASS: lldb-unit :: Utility/Release/UtilityTests/NameMatchesTest.RegularExpression (1623 of 1915)
PASS: lldb-unit :: Utility/Release/UtilityTests/OptionsWithRawTest.EmptyArgsOnlySuffix (1624 of 1915)
PASS: lldb-unit :: Utility/Release/UtilityTests/OptionsWithRawTest.ArgsButNoDelimiter (1625 of 1915)
PASS: lldb-unit :: Utility/Release/UtilityTests/OptionsWithRawTest.ArgsButNoLeadingDash (1626 of 1915)
PASS: lldb-unit :: Utility/Release/UtilityTests/OptionsWithRawTest.EmptyInput (1627 of 1915)
PASS: lldb-unit :: Utility/Release/UtilityTests/OptionsWithRawTest.EmptySuffix (1628 of 1915)
PASS: lldb-unit :: Utility/Release/UtilityTests/OptionsWithRawTest.EmptySuffixSingleWhitespace (1629 of 1915)
PASS: lldb-unit :: Utility/Release/UtilityTests/OptionsWithRawTest.MultiWordSuffix (1630 of 1915)
PASS: lldb-unit :: Utility/Release/UtilityTests/OptionsWithRawTest.LeadingSpaceArgs (1631 of 1915)
PASS: lldb-unit :: Utility/Release/UtilityTests/OptionsWithRawTest.SingleWordSuffix (1632 of 1915)
PASS: lldb-unit :: Utility/Release/UtilityTests/OptionsWithRawTest.SingleWhitespaceInput (1633 of 1915)
PASS: lldb-unit :: Utility/Release/UtilityTests/OptionsWithRawTest.QuotedSuffix (1634 of 1915)
PASS: lldb-unit :: Utility/Release/UtilityTests/OptionsWithRawTest.TerminatedQuote (1635 of 1915)
PASS: lldb-unit :: Utility/Release/UtilityTests/OptionsWithRawTest.WhitespaceInput (1636 of 1915)
PASS: lldb-unit :: Utility/Release/UtilityTests/OptionsWithRawTest.UnterminatedQuote (1637 of 1915)
PASS: lldb-unit :: Utility/Release/UtilityTests/OptionsWithRawTest.WhitespaceSuffix (1638 of 1915)
PASS: lldb-unit :: Utility/Release/UtilityTests/ProcessInstanceInfo.Dump (1639 of 1915)
PASS: lldb-unit :: Utility/Release/UtilityTests/ProcessInfoTest.Constructor (1640 of 1915)
PASS: lldb-unit :: Utility/Release/UtilityTests/ProcessInstanceInfo.DumpTable (1641 of 1915)
PASS: lldb-unit :: Utility/Release/UtilityTests/ProcessInstanceInfo.DumpTable_invalidUID (1642 of 1915)
PASS: lldb-unit :: Utility/Release/UtilityTests/ProcessInstanceInfoMatch.Name (1643 of 1915)
PASS: lldb-unit :: Utility/Release/UtilityTests/Predicate.WaitForValueNotEqualTo (1644 of 1915)
PASS: lldb-unit :: Utility/Release/UtilityTests/RangeDataVector.CustomSort (1645 of 1915)
PASS: lldb-unit :: Utility/Release/UtilityTests/RangeDataVector.FindEntryThatContains (1646 of 1915)
PASS: lldb-unit :: Utility/Release/UtilityTests/RangeDataVector.FindEntryThatContains_Overlap (1647 of 1915)
PASS: lldb-unit :: Utility/Release/UtilityTests/RangeTest.Clear (1648 of 1915)
PASS: lldb-unit :: Utility/Release/UtilityTests/RangeTest.Constructor (1649 of 1915)
PASS: lldb-unit :: Utility/Release/UtilityTests/RangeTest.ClearWithStarAddress (1650 of 1915)
PASS: lldb-unit :: Utility/Release/UtilityTests/RangeTest.ContainsAddr (1651 of 1915)
PASS: lldb-unit :: Utility/Release/UtilityTests/RangeTest.ContainsAddrInvalid (1652 of 1915)
PASS: lldb-unit :: Utility/Release/UtilityTests/RangeTest.ContainsEndInclusive (1653 of 1915)
PASS: lldb-unit :: Utility/Release/UtilityTests/RangeTest.ContainsEndInclusiveInvalid (1654 of 1915)
PASS: lldb-unit :: Utility/Release/UtilityTests/RangeTest.ContainsRange (1655 of 1915)
PASS: lldb-unit :: Utility/Release/UtilityTests/RangeTest.Copy (1656 of 1915)
PASS: lldb-unit :: Utility/Release/UtilityTests/RangeTest.ContainsRangeStartingFromZero (1657 of 1915)
PASS: lldb-unit :: Utility/Release/UtilityTests/RangeTest.DefaultConstructor (1658 of 1915)
PASS: lldb-unit :: Utility/Release/UtilityTests/RangeTest.DoesAdjoinOrIntersect (1659 of 1915)
PASS: lldb-unit :: Utility/Release/UtilityTests/RangeTest.EqualInvalid (1660 of 1915)
PASS: lldb-unit :: Utility/Release/UtilityTests/RangeTest.Equal (1661 of 1915)
PASS: lldb-unit :: Utility/Release/UtilityTests/RangeTest.DoesIntersect (1662 of 1915)
PASS: lldb-unit :: Utility/Release/UtilityTests/RangeTest.LessThan (1663 of 1915)
PASS: lldb-unit :: Utility/Release/UtilityTests/RangeTest.LessThanInvalid (1664 of 1915)
PASS: lldb-unit :: Utility/Release/UtilityTests/RangeTest.NotEqualInvalid (1665 of 1915)
PASS: lldb-unit :: Utility/Release/UtilityTests/RangeTest.NotEqual (1666 of 1915)
PASS: lldb-unit :: Utility/Release/UtilityTests/RangeTest.SizeTypes (1667 of 1915)
PASS: lldb-unit :: Utility/Release/UtilityTests/RangeTest.Slide (1668 of 1915)
PASS: lldb-unit :: Utility/Release/UtilityTests/RangeTest.SetRangeBase (1669 of 1915)
PASS: lldb-unit :: Utility/Release/UtilityTests/RangeTest.SlideZero (1670 of 1915)
PASS: lldb-unit :: Utility/Release/UtilityTests/RangeTest.Union (1671 of 1915)
PASS: lldb-unit :: Host/Release/HostTests/MainLoopTest.UnmonitoredSignal (1672 of 1915)
PASS: lldb-unit :: Utility/Release/UtilityTests/RecordReplayTest.InstrumentedBar (1673 of 1915)
PASS: lldb-unit :: Utility/Release/UtilityTests/RecordReplayTest.InstrumentedBarPtr (1674 of 1915)
PASS: lldb-unit :: Utility/Release/UtilityTests/Predicate.WaitForValueEqualTo (1675 of 1915)
PASS: lldb-unit :: Utility/Release/UtilityTests/RecordReplayTest.InstrumentedFoo (1676 of 1915)
PASS: lldb-unit :: Utility/Release/UtilityTests/RecordReplayTest.InstrumentedBarRef (1677 of 1915)
PASS: lldb-unit :: Utility/Release/UtilityTests/RecordReplayTest.InstrumentedFooSameThis (1678 of 1915)
PASS: lldb-unit :: Utility/Release/UtilityTests/RegisterValueTest.GetSet8 (1679 of 1915)
PASS: lldb-unit :: Utility/Release/UtilityTests/RegularExpression.CopyAssignment (1680 of 1915)
PASS: lldb-unit :: Utility/Release/UtilityTests/RegularExpression.Empty (1681 of 1915)
PASS: lldb-unit :: Utility/Release/UtilityTests/RegularExpression.Invalid (1682 of 1915)
PASS: lldb-unit :: Utility/Release/UtilityTests/RegularExpression.Match (1683 of 1915)
PASS: lldb-unit :: Utility/Release/UtilityTests/RegularExpression.Valid (1684 of 1915)
PASS: lldb-unit :: Utility/Release/UtilityTests/ScalarTest.APIntConstructor (1685 of 1915)
PASS: lldb-unit :: Utility/Release/UtilityTests/ReproducerTest.SetCapture (1686 of 1915)
PASS: lldb-unit :: Utility/Release/UtilityTests/ReproducerTest.SetReplay (1687 of 1915)
PASS: lldb-unit :: Utility/Release/UtilityTests/ScalarTest.CastOperations (1688 of 1915)
PASS: lldb-unit :: Utility/Release/UtilityTests/ScalarTest.Comparison (1689 of 1915)
PASS: lldb-unit :: Utility/Release/UtilityTests/ScalarTest.ComparisonFloat (1690 of 1915)
PASS: lldb-unit :: Utility/Release/UtilityTests/ScalarTest.Division (1691 of 1915)
PASS: lldb-unit :: Utility/Release/UtilityTests/ScalarTest.ExtractBitfield (1692 of 1915)
PASS: lldb-unit :: Utility/Release/UtilityTests/ScalarTest.Equality (1693 of 1915)
PASS: lldb-unit :: Utility/Release/UtilityTests/ScalarTest.GetBytes (1694 of 1915)
PASS: lldb-unit :: Utility/Release/UtilityTests/ScalarTest.Promotion (1695 of 1915)
PASS: lldb-unit :: Utility/Release/UtilityTests/ScalarTest.RightShiftOperator (1696 of 1915)
PASS: lldb-unit :: Utility/Release/UtilityTests/ScalarTest.GetValue (1697 of 1915)
PASS: lldb-unit :: Utility/Release/UtilityTests/ScalarTest.Scalar_512 (1698 of 1915)
PASS: lldb-unit :: Utility/Release/UtilityTests/ScalarTest.SetValueFromCString (1699 of 1915)
PASS: lldb-unit :: Utility/Release/UtilityTests/SerializationRountripTest.SerializeDeserializeObjectPointer (1700 of 1915)
PASS: lldb-unit :: Utility/Release/UtilityTests/SerializationRountripTest.SerializeDeserializeObjectReference (1701 of 1915)
PASS: lldb-unit :: Utility/Release/UtilityTests/SerializationRountripTest.SerializeDeserializeCString (1702 of 1915)
PASS: lldb-unit :: Utility/Release/UtilityTests/StateTest.Formatv (1703 of 1915)
PASS: lldb-unit :: Utility/Release/UtilityTests/SerializationRountripTest.SerializeDeserializePod (1704 of 1915)
PASS: lldb-unit :: Utility/Release/UtilityTests/SerializationRountripTest.SerializeDeserializePodReferences (1705 of 1915)
PASS: lldb-unit :: Utility/Release/UtilityTests/SerializationRountripTest.SerializeDeserializePodPointers (1706 of 1915)
PASS: lldb-unit :: Utility/Release/UtilityTests/StatusTest.ErrorConstructor (1707 of 1915)
PASS: lldb-unit :: Utility/Release/UtilityTests/StatusTest.ErrorConversion (1708 of 1915)
PASS: lldb-unit :: Utility/Release/UtilityTests/StreamTeeTest.AppendStream (1709 of 1915)
PASS: lldb-unit :: Utility/Release/UtilityTests/StatusTest.Formatv (1710 of 1915)
PASS: lldb-unit :: Utility/Release/UtilityTests/StreamTeeTest.Assignment (1711 of 1915)
PASS: lldb-unit :: Utility/Release/UtilityTests/StreamTeeTest.Constructor1Stream (1712 of 1915)
PASS: lldb-unit :: Utility/Release/UtilityTests/StreamTeeTest.Constructor2Streams (1713 of 1915)
PASS: lldb-unit :: Utility/Release/UtilityTests/StreamTeeTest.CopyConstructor (1714 of 1915)
PASS: lldb-unit :: Utility/Release/UtilityTests/StreamTeeTest.DefaultConstructor (1715 of 1915)
PASS: lldb-unit :: Utility/Release/UtilityTests/StreamTeeTest.Flush (1716 of 1915)
PASS: lldb-unit :: Utility/Release/UtilityTests/StreamTeeTest.GetStreamAtIndexOutOfBounds (1717 of 1915)
PASS: lldb-unit :: Utility/Release/UtilityTests/StreamTeeTest.SetStreamAtIndexOverwrite (1718 of 1915)
PASS: lldb-unit :: Utility/Release/UtilityTests/StreamTeeTest.GetStreamAtIndexOutOfBoundsEmpty (1719 of 1915)
PASS: lldb-unit :: Utility/Release/UtilityTests/StreamTeeTest.SetStreamAtIndexOutOfBounds (1720 of 1915)
PASS: lldb-unit :: Utility/Release/UtilityTests/StreamTeeTest.Write (1721 of 1915)
PASS: lldb-unit :: Utility/Release/UtilityTests/StreamTest.AddressEmptyPrefix (1722 of 1915)
PASS: lldb-unit :: Utility/Release/UtilityTests/StreamTest.AddressNoSuffix (1723 of 1915)
PASS: lldb-unit :: Utility/Release/UtilityTests/StreamTest.AddressPrefixAndSuffix (1724 of 1915)
PASS: lldb-unit :: Utility/Release/UtilityTests/StreamTest.AddressPrefix (1725 of 1915)
PASS: lldb-unit :: Utility/Release/UtilityTests/StreamTest.AddressRange (1726 of 1915)
PASS: lldb-unit :: Utility/Release/UtilityTests/StreamTest.AddressRangeEmptyRange (1727 of 1915)
PASS: lldb-unit :: Utility/Release/UtilityTests/StreamTest.AddressRangeInvalidRange (1728 of 1915)
PASS: lldb-unit :: Utility/Release/UtilityTests/StreamTest.AddressRangeSize (1729 of 1915)
PASS: lldb-unit :: Utility/Release/UtilityTests/StreamTest.ChangingByteOrder (1730 of 1915)
PASS: lldb-unit :: Utility/Release/UtilityTests/StreamTest.PutBytesAsRawHex8ToLittleEndian (1731 of 1915)
PASS: lldb-unit :: Utility/Release/UtilityTests/StreamTest.AddressSize (1732 of 1915)
PASS: lldb-unit :: Utility/Release/UtilityTests/StreamTest.PutBytesAsRawHex8ToBigEndian (1733 of 1915)
PASS: lldb-unit :: Utility/Release/UtilityTests/StreamTest.AddressSuffix (1734 of 1915)
PASS: lldb-unit :: Utility/Release/UtilityTests/StreamTest.PutBytesAsRawHex8ToMixedEndian (1735 of 1915)
PASS: lldb-unit :: Utility/Release/UtilityTests/StreamTest.PutChar (1736 of 1915)
PASS: lldb-unit :: Utility/Release/UtilityTests/StreamTest.PutCString (1737 of 1915)
PASS: lldb-unit :: Utility/Release/UtilityTests/StreamTest.PutCStringWithStringRef (1738 of 1915)
PASS: lldb-unit :: Utility/Release/UtilityTests/StreamTest.PutCharNull (1739 of 1915)
PASS: lldb-unit :: Utility/Release/UtilityTests/StreamTest.PutHex16ByteOrderBig (1740 of 1915)
PASS: lldb-unit :: Utility/Release/UtilityTests/StreamTest.PutCharWhitespace (1741 of 1915)
PASS: lldb-unit :: Utility/Release/UtilityTests/StreamTest.PutHex16ByteOrderLittle (1742 of 1915)
PASS: lldb-unit :: Utility/Release/UtilityTests/StreamTest.PutHex32ByteOrderBig (1743 of 1915)
PASS: lldb-unit :: Utility/Release/UtilityTests/StreamTest.PutHex32ByteOrderLittle (1744 of 1915)
PASS: lldb-unit :: Utility/Release/UtilityTests/StreamTest.PutHex8 (1745 of 1915)
PASS: lldb-unit :: Utility/Release/UtilityTests/StreamTest.PutHex64ByteOrderLittle (1746 of 1915)
PASS: lldb-unit :: Utility/Release/UtilityTests/StreamTest.PutHex64ByteOrderBig (1747 of 1915)
PASS: lldb-unit :: Utility/Release/UtilityTests/StreamTest.PutMaxHex64ByteOrderLittle (1748 of 1915)
PASS: lldb-unit :: Utility/Release/UtilityTests/StreamTest.PutPtr (1749 of 1915)
PASS: lldb-unit :: Utility/Release/UtilityTests/StreamTest.PutRawBytesToBigEndian (1750 of 1915)
PASS: lldb-unit :: Utility/Release/UtilityTests/StreamTest.PutMaxHex64ByteOrderBig (1751 of 1915)
PASS: lldb-unit :: Utility/Release/UtilityTests/StreamTest.PutNHex8 (1752 of 1915)
PASS: lldb-unit :: Utility/Release/UtilityTests/StreamTest.PutRawBytesToLittleEndian (1753 of 1915)
PASS: lldb-unit :: Utility/Release/UtilityTests/StreamTest.PutSLEB128 (1754 of 1915)
PASS: lldb-unit :: Utility/Release/UtilityTests/StreamTest.PutRawBytesToMixedEndian (1755 of 1915)
PASS: lldb-unit :: Utility/Release/UtilityTests/StreamTest.PutStringAsRawHex8 (1756 of 1915)
PASS: lldb-unit :: Utility/Release/UtilityTests/StreamTest.PutULEB128 (1757 of 1915)
PASS: lldb-unit :: Utility/Release/UtilityTests/StreamTest.QuotedCString (1758 of 1915)
PASS: lldb-unit :: Utility/Release/UtilityTests/StreamTest.ShiftOperatorChars (1759 of 1915)
PASS: lldb-unit :: Utility/Release/UtilityTests/StreamTest.ShiftOperatorStrings (1760 of 1915)
PASS: lldb-unit :: Utility/Release/UtilityTests/StreamTest.ShiftOperatorPtr (1761 of 1915)
PASS: lldb-unit :: Utility/Release/UtilityTests/StringExtractorTest.DecodeHexU8_Exact (1762 of 1915)
PASS: lldb-unit :: Utility/Release/UtilityTests/StringExtractorTest.DecodeHexU8_InvalidHex (1763 of 1915)
PASS: lldb-unit :: Utility/Release/UtilityTests/StringExtractorTest.DecodeHexU8_Extra (1764 of 1915)
PASS: lldb-unit :: Utility/Release/UtilityTests/StringExtractorTest.DecodeHexU8_InvalidHex2 (1765 of 1915)
PASS: lldb-unit :: Utility/Release/UtilityTests/StringExtractorTest.GetHexBytesAvail (1766 of 1915)
PASS: lldb-unit :: Utility/Release/UtilityTests/StringExtractorTest.GetHexBytes (1767 of 1915)
PASS: lldb-unit :: Utility/Release/UtilityTests/StringExtractorTest.DecodeHexU8_Underflow (1768 of 1915)
PASS: lldb-unit :: Utility/Release/UtilityTests/StringExtractorTest.DecodeHexU8_Underflow2 (1769 of 1915)
PASS: lldb-unit :: Utility/Release/UtilityTests/StringExtractorTest.GetHexBytesAvail_FullString (1770 of 1915)
PASS: lldb-unit :: Utility/Release/UtilityTests/StringExtractorTest.GetHexBytesAvail_OddPair (1771 of 1915)
PASS: lldb-unit :: Utility/Release/UtilityTests/StringExtractorTest.GetHexBytesAvail_Underflow (1772 of 1915)
PASS: lldb-unit :: Utility/Release/UtilityTests/StringExtractorTest.GetHexBytesAvail_Partial (1773 of 1915)
PASS: lldb-unit :: Utility/Release/UtilityTests/StringExtractorTest.GetHexBytesAvail_OddPair2 (1774 of 1915)
PASS: lldb-unit :: Utility/Release/UtilityTests/StringExtractorTest.GetHexBytes_Partial (1775 of 1915)
PASS: lldb-unit :: Utility/Release/UtilityTests/StringExtractorTest.GetHexBytes_OddPair (1776 of 1915)
PASS: lldb-unit :: Utility/Release/UtilityTests/StringExtractorTest.GetHexBytes_Underflow (1777 of 1915)
PASS: lldb-unit :: Utility/Release/UtilityTests/StringExtractorTest.GetHexBytes_FullString (1778 of 1915)
PASS: lldb-unit :: Utility/Release/UtilityTests/StringExtractorTest.GetHexBytes_OddPair2 (1779 of 1915)
PASS: lldb-unit :: Utility/Release/UtilityTests/StringExtractorTest.GetHexU8_Exact (1780 of 1915)
PASS: lldb-unit :: Utility/Release/UtilityTests/StringExtractorTest.GetHexU8_Extra_NoEof (1781 of 1915)
PASS: lldb-unit :: Utility/Release/UtilityTests/StringExtractorTest.GetHexU8_Extra (1782 of 1915)
PASS: lldb-unit :: Utility/Release/UtilityTests/StringExtractorTest.GetHexU8_Exact_NoEof (1783 of 1915)
PASS: lldb-unit :: Utility/Release/UtilityTests/StringExtractorTest.GetHexU8_Underflow (1784 of 1915)
PASS: lldb-unit :: Utility/Release/UtilityTests/StringExtractorTest.GetHexU8_InvalidHex_NoEof (1785 of 1915)
PASS: lldb-unit :: Utility/Release/UtilityTests/StringExtractorTest.GetHexU8_Underflow2 (1786 of 1915)
PASS: lldb-unit :: Utility/Release/UtilityTests/StringExtractorTest.GetHexU8_InvalidHex (1787 of 1915)
PASS: lldb-unit :: Utility/Release/UtilityTests/StringExtractorTest.GetHexU8_Underflow2_NoEof (1788 of 1915)
PASS: lldb-unit :: Utility/Release/UtilityTests/StringExtractorTest.GetHexU8_Underflow_NoEof (1789 of 1915)
PASS: lldb-unit :: Utility/Release/UtilityTests/StringExtractorTest.GetNameColonValueContainsColon (1790 of 1915)
PASS: lldb-unit :: Utility/Release/UtilityTests/StringExtractorTest.GetNameColonValueNoColon (1791 of 1915)
PASS: lldb-unit :: Utility/Release/UtilityTests/StringExtractorTest.GetNameColonValueNoSemicolon (1792 of 1915)
PASS: lldb-unit :: Utility/Release/UtilityTests/StringExtractorTest.GetU32BigEndian (1793 of 1915)
PASS: lldb-unit :: Utility/Release/UtilityTests/StringExtractorTest.GetU64BigEndian (1794 of 1915)
PASS: lldb-unit :: Utility/Release/UtilityTests/StringExtractorTest.GetU32LittleEndian (1795 of 1915)
PASS: lldb-unit :: Utility/Release/UtilityTests/StringExtractorTest.GetNameColonValueSuccess (1796 of 1915)
PASS: lldb-unit :: Utility/Release/UtilityTests/StringExtractorTest.GetU64LittleEndian (1797 of 1915)
PASS: lldb-unit :: Utility/Release/UtilityTests/StringExtractorTest.InitEmpty (1798 of 1915)
PASS: lldb-unit :: Utility/Release/UtilityTests/StringLexerTest.AdvanceIf (1799 of 1915)
PASS: lldb-unit :: Utility/Release/UtilityTests/StringLexerTest.GetUnlexed (1800 of 1915)
PASS: lldb-unit :: Utility/Release/UtilityTests/StringExtractorTest.InitMisc (1801 of 1915)
PASS: lldb-unit :: Utility/Release/UtilityTests/StringLexerTest.HasAtLeast (1802 of 1915)
PASS: lldb-unit :: Utility/Release/UtilityTests/StringLexerTest.Next (1803 of 1915)
PASS: lldb-unit :: Utility/Release/UtilityTests/StringLexerTest.NextIf (1804 of 1915)
PASS: lldb-unit :: Utility/Release/UtilityTests/StringLexerTest.Peek (1805 of 1915)
PASS: lldb-unit :: Utility/Release/UtilityTests/StringLexerTest.NextIfList (1806 of 1915)
PASS: lldb-unit :: Utility/Release/UtilityTests/StringLexerTest.PutBack (1807 of 1915)
PASS: lldb-unit :: Utility/Release/UtilityTests/StringListTest.AppendList (1808 of 1915)
PASS: lldb-unit :: Utility/Release/UtilityTests/StringListTest.AppendListCStringArray (1809 of 1915)
PASS: lldb-unit :: Utility/Release/UtilityTests/StringListTest.AppendListCStringArrayEmpty (1810 of 1915)
PASS: lldb-unit :: Utility/Release/UtilityTests/StringListTest.Clear (1811 of 1915)
PASS: lldb-unit :: Utility/Release/UtilityTests/StringListTest.Assignment (1812 of 1915)
PASS: lldb-unit :: Utility/Release/UtilityTests/StringListTest.AppendStringMove (1813 of 1915)
PASS: lldb-unit :: Utility/Release/UtilityTests/StringListTest.AppendStringCString (1814 of 1915)
PASS: lldb-unit :: Utility/Release/UtilityTests/StringListTest.AppendStringStdString (1815 of 1915)
PASS: lldb-unit :: Utility/Release/UtilityTests/StringListTest.CopyList (1816 of 1915)
PASS: lldb-unit :: Utility/Release/UtilityTests/StringListTest.CopyListSingle (1817 of 1915)
PASS: lldb-unit :: Utility/Release/UtilityTests/StringListTest.CopyListEmpty (1818 of 1915)
PASS: lldb-unit :: Utility/Release/UtilityTests/StringListTest.DefaultConstructor (1819 of 1915)
PASS: lldb-unit :: Utility/Release/UtilityTests/StringListTest.GetMaxStringLengthDecreasingSize (1820 of 1915)
PASS: lldb-unit :: Utility/Release/UtilityTests/StringListTest.GetMaxStringLengthEmpty (1821 of 1915)
PASS: lldb-unit :: Utility/Release/UtilityTests/StringListTest.ForRange (1822 of 1915)
PASS: lldb-unit :: Utility/Release/UtilityTests/StringListTest.ForRangeEmpty (1823 of 1915)
PASS: lldb-unit :: Utility/Release/UtilityTests/StringListTest.GetMaxStringLengthEqualSize (1824 of 1915)
PASS: lldb-unit :: Utility/Release/UtilityTests/StringListTest.GetMaxStringLengthIncreasingSize (1825 of 1915)
PASS: lldb-unit :: Utility/Release/UtilityTests/StringListTest.GetMaxStringLengthMixed (1826 of 1915)
PASS: lldb-unit :: Utility/Release/UtilityTests/StringListTest.InsertStringAtIndexEnd (1827 of 1915)
PASS: lldb-unit :: Utility/Release/UtilityTests/StringListTest.GetSize (1828 of 1915)
PASS: lldb-unit :: Utility/Release/UtilityTests/StringListTest.InsertStringAtIndexStart (1829 of 1915)
PASS: lldb-unit :: Utility/Release/UtilityTests/StringListTest.InsertStringAtIndexOutOfBounds (1830 of 1915)
PASS: lldb-unit :: Utility/Release/UtilityTests/StringListTest.InsertStringAtIndexMove (1831 of 1915)
PASS: lldb-unit :: Utility/Release/UtilityTests/StringListTest.JoinEmpty (1832 of 1915)
PASS: lldb-unit :: Utility/Release/UtilityTests/StringListTest.Join (1833 of 1915)
PASS: lldb-unit :: Utility/Release/UtilityTests/StringListTest.InsertStringAtIndexStdString (1834 of 1915)
PASS: lldb-unit :: Utility/Release/UtilityTests/StringListTest.JoinMultiCharSeparator (1835 of 1915)
PASS: lldb-unit :: Utility/Release/UtilityTests/StringListTest.JoinSingle (1836 of 1915)
PASS: lldb-unit :: Utility/Release/UtilityTests/StringListTest.JoinNonSpace (1837 of 1915)
PASS: lldb-unit :: Utility/Release/UtilityTests/StringListTest.LongestCommonPrefixDuplicateElement (1838 of 1915)
PASS: lldb-unit :: Utility/Release/UtilityTests/StringListTest.LongestCommonPrefixNoPrefix (1839 of 1915)
PASS: lldb-unit :: Utility/Release/UtilityTests/StringListTest.LongestCommonPrefixEmpty (1840 of 1915)
PASS: lldb-unit :: Utility/Release/UtilityTests/StringListTest.JoinThree (1841 of 1915)
PASS: lldb-unit :: Utility/Release/UtilityTests/StringListTest.LongestCommonPrefix (1842 of 1915)
PASS: lldb-unit :: Utility/Release/UtilityTests/StringListTest.LongestCommonPrefixSingleElement (1843 of 1915)
PASS: lldb-unit :: Utility/Release/UtilityTests/StringListTest.PopBack (1844 of 1915)
PASS: lldb-unit :: Utility/Release/UtilityTests/StringListTest.RemoveBlankLines (1845 of 1915)
PASS: lldb-unit :: Utility/Release/UtilityTests/StringListTest.SetSize (1846 of 1915)
PASS: lldb-unit :: Utility/Release/UtilityTests/SubsystemRAIITest.NormalSubsystem (1847 of 1915)
PASS: lldb-unit :: Utility/Release/UtilityTests/StringListTest.ShiftCString (1848 of 1915)
PASS: lldb-unit :: Utility/Release/UtilityTests/StringListTest.SplitIntoLinesSingleTrailingCR (1849 of 1915)
PASS: lldb-unit :: Utility/Release/UtilityTests/StringListTest.ShiftStdString (1850 of 1915)
PASS: lldb-unit :: Utility/Release/UtilityTests/StringListTest.SplitIntoLines (1851 of 1915)
PASS: lldb-unit :: Utility/Release/UtilityTests/StringListTest.SplitIntoLinesEmpty (1852 of 1915)
PASS: lldb-unit :: Utility/Release/UtilityTests/StringListTest.ShiftMove (1853 of 1915)
PASS: lldb-unit :: Utility/Release/UtilityTests/StructuredDataTest.StringDump (1854 of 1915)
PASS: lldb-unit :: Utility/Release/UtilityTests/StructuredDataTest.ParseJSONFromFile (1855 of 1915)
PASS: lldb-unit :: Utility/Release/UtilityTests/TildeExpressionResolver.ResolveFullPath (1856 of 1915)
PASS: lldb-unit :: Utility/Release/UtilityTests/TimeoutTest.Construction (1857 of 1915)
PASS: lldb-unit :: Utility/Release/UtilityTests/TimeoutTest.Format (1858 of 1915)
PASS: lldb-unit :: Utility/Release/UtilityTests/SubsystemRAIITest.SubsystemWithErrorFailure (1859 of 1915)
PASS: lldb-unit :: Utility/Release/UtilityTests/SubsystemRAIITest.SubsystemWithErrorSuccess (1860 of 1915)
PASS: lldb-unit :: Utility/Release/UtilityTests/TimerTest.CategoryTimes (1861 of 1915)
PASS: lldb-unit :: Utility/Release/UtilityTests/UUIDTest.Validity (1862 of 1915)
PASS: lldb-unit :: Utility/Release/UtilityTests/UUIDTest.SetFromStringRef (1863 of 1915)
PASS: lldb-unit :: Utility/Release/UtilityTests/UUIDTest.StringConverion (1864 of 1915)
PASS: lldb-unit :: Utility/Release/UtilityTests/UUIDTest.RelationalOperators (1865 of 1915)
PASS: lldb-unit :: Utility/Release/UtilityTests/UriParserTest.BadPort (1866 of 1915)
PASS: lldb-unit :: Utility/Release/UtilityTests/TimerTest.CategoryTimesNested (1867 of 1915)
PASS: lldb-unit :: Utility/Release/UtilityTests/UriParserTest.BadPort2 (1868 of 1915)
PASS: lldb-unit :: Utility/Release/UtilityTests/UriParserTest.BracketedHostnameWithColon (1869 of 1915)
PASS: lldb-unit :: Utility/Release/UtilityTests/UriParserTest.BracketedHostnamePort (1870 of 1915)
PASS: lldb-unit :: Utility/Release/UtilityTests/UriParserTest.Empty (1871 of 1915)
PASS: lldb-unit :: Utility/Release/UtilityTests/UriParserTest.BracketedHostname (1872 of 1915)
PASS: lldb-unit :: Utility/Release/UtilityTests/UriParserTest.LongPath (1873 of 1915)
PASS: lldb-unit :: Utility/Release/UtilityTests/UriParserTest.Minimal (1874 of 1915)
PASS: lldb-unit :: Utility/Release/UtilityTests/UriParserTest.MinimalPath (1875 of 1915)
PASS: lldb-unit :: Utility/Release/UtilityTests/UriParserTest.MinimalPort (1876 of 1915)
PASS: lldb-unit :: Utility/Release/UtilityTests/UriParserTest.SchemeHostSeparator2 (1877 of 1915)
PASS: lldb-unit :: Utility/Release/UtilityTests/UriParserTest.MinimalPortPath (1878 of 1915)
PASS: lldb-unit :: Utility/Release/UtilityTests/UriParserTest.PortOverflow (1879 of 1915)
PASS: lldb-unit :: Utility/Release/UtilityTests/UriParserTest.SchemeHostSeparator (1880 of 1915)
PASS: lldb-unit :: Utility/Release/UtilityTests/UriParserTest.SchemeHostSeparator3 (1881 of 1915)
PASS: lldb-unit :: Utility/Release/UtilityTests/UriParserTest.SchemeHostSeparator4 (1882 of 1915)
PASS: lldb-unit :: Utility/Release/UtilityTests/UriParserTest.TypicalPortPath (1883 of 1915)
PASS: lldb-unit :: Utility/Release/UtilityTests/VASprintfTest.BufferResize (1884 of 1915)
PASS: lldb-unit :: Utility/Release/UtilityTests/UserIDResolver.GetUserName (1885 of 1915)
PASS: lldb-unit :: Utility/Release/UtilityTests/UserIDResolver.GetGroupName (1886 of 1915)
PASS: lldb-unit :: Utility/Release/UtilityTests/VASprintfTest.EncodingError (1887 of 1915)
PASS: lldb-unit :: Utility/Release/UtilityTests/VASprintfTest.NoBufferResize (1888 of 1915)
PASS: lldb-unit :: Utility/Release/UtilityTests/VMRange.Clear (1889 of 1915)
PASS: lldb-unit :: Utility/Release/UtilityTests/VMRange.Comparison (1890 of 1915)
PASS: lldb-unit :: Utility/Release/UtilityTests/VMRange.CollectionContains (1891 of 1915)
PASS: lldb-unit :: Utility/Release/UtilityTests/VMRange.ContainsAddr (1892 of 1915)
PASS: lldb-unit :: Utility/Release/UtilityTests/VMRange.ContainsRange (1893 of 1915)
PASS: lldb-unit :: Utility/Release/UtilityTests/VMRange.IsValid (1894 of 1915)
PASS: lldb-unit :: Utility/Release/UtilityTests/TimerTest.CategoryTimes2 (1895 of 1915)
PASS: lldb-unit :: Utility/Release/UtilityTests/VMRange.Ordering (1896 of 1915)
PASS: lldb-unit :: Utility/Release/UtilityTests/VMRange.Reset (1897 of 1915)
PASS: lldb-unit :: Utility/Release/UtilityTests/TimerTest.CategoryTimesStats (1898 of 1915)
PASS: lldb-unit :: debugserver/Release/debugserverTests/JSON.Parse (1899 of 1915)
PASS: lldb-unit :: debugserver/Release/debugserverTests/RNBSocket.LoopBackConnectIPv4 (1900 of 1915)
PASS: lldb-unit :: Utility/Release/UtilityTests/VMRange.SetEndAddress (1901 of 1915)
PASS: lldb-unit :: debugserver/Release/debugserverTests/RNBSocket.LoopBackConnectIPv6 (1902 of 1915)
PASS: lldb-unit :: debugserver/Release/debugserverTests/RNBSocket.AnyListen (1903 of 1915)
PASS: lldb-unit :: debugserver/Release/debugserverTests/RNBSocket.LoopBackListenIPv4 (1904 of 1915)
PASS: lldb-unit :: debugserver/Release/debugserverTests/RNBSocket.LoopBackListenIPv6 (1905 of 1915)
PASS: lldb-unit :: tools/lldb-server/tests/Release/LLDBServerTests/TestBase.DebugserverEnv (1906 of 1915)
PASS: lldb-unit :: tools/lldb-server/tests/Release/LLDBServerTests/TestBase.LaunchModePreservesEnvironment (1907 of 1915)
PASS: lldb-unit :: tools/lldb-server/tests/Release/LLDBServerTests/StandardStartupTest.TestStopReplyContainsThreadPcs (1908 of 1915)
PASS: lldb-api :: types/TestIntegerTypeExpr.py (1909 of 1915)
PASS: lldb-unit :: Process/gdb-remote/Release/ProcessGdbRemoteTests/GDBRemoteClientBaseTest.InterruptNoResponse (1910 of 1915)
PASS: lldb-api :: types/TestShortTypeExpr.py (1911 of 1915)
PASS: lldb-api :: lang/objc/foundation/TestFoundationDisassembly.py (1912 of 1915)
PASS: lldb-api :: types/TestLongTypes.py (1913 of 1915)
PASS: lldb-api :: types/TestLongTypesExpr.py (1914 of 1915)
PASS: lldb-api :: tools/lldb-server/TestLldbGdbServer.py (1915 of 1915)

Hide Details

Testing Time: 369.28s ******************** Failing Tests (2): lldb-shell :: ObjectFile/ELF/PT_LOAD-overlap-PT_TLS.yaml lldb-shell :: ObjectFile/ELF/PT_TLS-overlap-PT_LOAD.yaml

Hide Details

Expected Passes : 1708 Expected Failures : 5 Unsupported Tests : 200 Unexpected Failures: 2 make: *** [/Users/buildslave/jenkins/workspace/lldb-cmake-standalone/lldb-xcode-build/test/CMakeFiles/check-lldb-lit] Error 1

Hide Details

** BUILD FAILED **

Hide Details

Hide Details

The following build commands failed: PhaseScriptExecution CMake\ Rules /Users/buildslave/jenkins/workspace/lldb-cmake-standalone/lldb-xcode-build/test/lldb.build/Release/check-lldb-lit.build/Script-D6BE3B5CEF994A538E41BAFF.sh (1 failure) Command failed: Command '['/usr/bin/env', 'TERM=vt100', '/usr/local/bin/cmake', '--build', '.', '--config', 'Release', '--target', 'check-lldb']' returned non-zero exit status 65. Command: ['/usr/bin/env', 'TERM=vt100', '/usr/local/bin/cmake', '--build', '.', '--config', 'Release', '--target', 'check-lldb'] [Pipeline] } [Pipeline] // timeout [Pipeline] } [Pipeline] // stage [Pipeline] stage [Pipeline] { (Declarative: Post Actions) [Pipeline] emailext Not sending mail to unregistered user kparzysz@codeaurora.org because your SCM claimed this was associated with a user ID ‘kparzysz' which your security realm does not recognize; you may need changes in your SCM plugin Not sending mail to unregistered user maskray@google.com because your SCM claimed this was associated with a user ID ‘maskray' which your security realm does not recognize; you may need changes in your SCM plugin Not sending mail to unregistered user adam.balogh@ericsson.com because your SCM claimed this was associated with a user ID ‘adam.balogh' which your security realm does not recognize; you may need changes in your SCM plugin Not sending mail to unregistered user benny.kra@googlemail.com because your SCM claimed this was associated with a user ID ‘benny.kra' which your security realm does not recognize; you may need changes in your SCM plugin Not sending mail to unregistered user zinenko@google.com because your SCM claimed this was associated with a user ID ‘zinenko' which your security realm does not recognize; you may need changes in your SCM plugin Not sending mail to unregistered user efriedma@codeaurora.org because your SCM claimed this was associated with a user ID ‘efriedma' which your security realm does not recognize; you may need changes in your SCM plugin Not sending mail to unregistered user mark.murray@arm.com because your SCM claimed this was associated with a user ID ‘mark.murray' which your security realm does not recognize; you may need changes in your SCM plugin Not sending mail to unregistered user jaskiewiczs@icloud.com because your SCM claimed this was associated with a user ID ‘jaskiewiczs' which your security realm does not recognize; you may need changes in your SCM plugin Not sending mail to unregistered user gchatelet@google.com because your SCM claimed this was associated with a user ID ‘gchatelet' which your security realm does not recognize; you may need changes in your SCM plugin Not sending mail to unregistered user dschuff@google.com because your SCM claimed this was associated with a user ID ‘dschuff' which your security realm does not recognize; you may need changes in your SCM plugin Not sending mail to unregistered user steveire@gmail.com because your SCM claimed this was associated with a user ID ‘steveire' which your security realm does not recognize; you may need changes in your SCM plugin Not sending mail to unregistered user lebedev.ri@gmail.com because your SCM claimed this was associated with a user ID ‘lebedev.ri' which your security realm does not recognize; you may need changes in your SCM plugin Not sending mail to unregistered user zakk.chen@sifive.com because your SCM claimed this was associated with a user ID ‘zakk.chen' which your security realm does not recognize; you may need changes in your SCM plugin Not sending mail to unregistered user jpienaar@google.com because your SCM claimed this was associated with a user ID ‘jpienaar' which your security realm does not recognize; you may need changes in your SCM plugin Not sending mail to unregistered user flo@fhahn.com because your SCM claimed this was associated with a user ID ‘flo' which your security realm does not recognize; you may need changes in your SCM plugin Not sending mail to unregistered user alexey.bader@intel.com because your SCM claimed this was associated with a user ID ‘alexey.bader' which your security realm does not recognize; you may need changes in your SCM plugin Not sending mail to unregistered user ro@gcc.gnu.org because your SCM claimed this was associated with a user ID ‘ro' which your security realm does not recognize; you may need changes in your SCM plugin Not sending mail to unregistered user kadircet@google.com because your SCM claimed this was associated with a user ID ‘kadircet' which your security realm does not recognize; you may need changes in your SCM plugin Not sending mail to unregistered user tra@google.com because your SCM claimed this was associated with a user ID ‘tra' which your security realm does not recognize; you may need changes in your SCM plugin Not sending mail to unregistered user thakis@chromium.org because your SCM claimed this was associated with a user ID ‘thakis' which your security realm does not recognize; you may need changes in your SCM plugin Not sending mail to unregistered user craig.topper@intel.com because your SCM claimed this was associated with a user ID ‘craig.topper' which your security realm does not recognize; you may need changes in your SCM plugin Not sending mail to unregistered user andrzej.warzynski@arm.com because your SCM claimed this was associated with a user ID ‘andrzej.warzynski' which your security realm does not recognize; you may need changes in your SCM plugin Not sending mail to unregistered user sjoerd.meijer@arm.com because your SCM claimed this was associated with a user ID ‘sjoerd.meijer' which your security realm does not recognize; you may need changes in your SCM plugin Not sending mail to unregistered user sidneym@quicinc.com because your SCM claimed this was associated with a user ID ‘sidneym' which your security realm does not recognize; you may need changes in your SCM plugin Not sending mail to unregistered user yikong@google.com because your SCM claimed this was associated with a user ID ‘yikong' which your security realm does not recognize; you may need changes in your SCM plugin Not sending mail to unregistered user antiagainst@gmail.com because your SCM claimed this was associated with a user ID ‘antiagainst' which your security realm does not recognize; you may need changes in your SCM plugin Not sending mail to unregistered user gabor.marton@ericsson.com because your SCM claimed this was associated with a user ID ‘gabor.marton' which your security realm does not recognize; you may need changes in your SCM plugin Not sending mail to unregistered user a.bataev@hotmail.com because your SCM claimed this was associated with a user ID ‘a.bataev' which your security realm does not recognize; you may need changes in your SCM plugin Not sending mail to unregistered user mtrofin@google.com because your SCM claimed this was associated with a user ID ‘mtrofin' which your security realm does not recognize; you may need changes in your SCM plugin Not sending mail to unregistered user 31459023+hctim@users.noreply.github.com because your SCM claimed this was associated with a user ID ‘31459023+hctim' which your security realm does not recognize; you may need changes in your SCM plugin Not sending mail to unregistered user daniil.fukalov@amd.com because your SCM claimed this was associated with a user ID ‘dfukalov' which your security realm does not recognize; you may need changes in your SCM plugin Not sending mail to unregistered user serguei.n.dmitriev@intel.com because your SCM claimed this was associated with a user ID ‘serguei.n.dmitriev' which your security realm does not recognize; you may need changes in your SCM plugin Not sending mail to unregistered user nicolai.haehnle@amd.com because your SCM claimed this was associated with a user ID ‘nicolai.haehnle' which your security realm does not recognize; you may need changes in your SCM plugin Not sending mail to unregistered user kevin.neal@sas.com because your SCM claimed this was associated with a user ID ‘kevin.neal' which your security realm does not recognize; you may need changes in your SCM plugin Not sending mail to unregistered user richard@metafoo.co.uk because your SCM claimed this was associated with a user ID ‘richard' which your security realm does not recognize; you may need changes in your SCM plugin Not sending mail to unregistered user asbirlea@google.com because your SCM claimed this was associated with a user ID ‘asbirlea' which your security realm does not recognize; you may need changes in your SCM plugin Not sending mail to unregistered user qcolombet@apple.com because your SCM claimed this was associated with a user ID ‘qcolombet' which your security realm does not recognize; you may need changes in your SCM plugin Not sending mail to unregistered user anna.welker@arm.com because your SCM claimed this was associated with a user ID ‘anna.welker' which your security realm does not recognize; you may need changes in your SCM plugin Not sending mail to unregistered user ikudrin@accesssoftek.com because your SCM claimed this was associated with a user ID ‘ikudrin' which your security realm does not recognize; you may need changes in your SCM plugin Not sending mail to unregistered user david.green@arm.com because your SCM claimed this was associated with a user ID ‘david.green' which your security realm does not recognize; you may need changes in your SCM plugin Not sending mail to unregistered user Milos.Stojanovic@rt-rk.com because your SCM claimed this was associated with a user ID ‘Milos.Stojanovic' which your security realm does not recognize; you may need changes in your SCM plugin Not sending mail to unregistered user kbobyrev@google.com because your SCM claimed this was associated with a user ID ‘kbobyrev' which your security realm does not recognize; you may need changes in your SCM plugin Not sending mail to unregistered user courbet@google.com because your SCM claimed this was associated with a user ID ‘courbet' which your security realm does not recognize; you may need changes in your SCM plugin Not sending mail to unregistered user francesco.petrogalli@arm.com because your SCM claimed this was associated with a user ID ‘francesco.petrogalli' which your security realm does not recognize; you may need changes in your SCM plugin Not sending mail to unregistered user arsenm2@gmail.com because your SCM claimed this was associated with a user ID ‘arsenm2' which your security realm does not recognize; you may need changes in your SCM plugin Not sending mail to unregistered user i@maskray.me because your SCM claimed this was associated with a user ID ‘i' which your security realm does not recognize; you may need changes in your SCM plugin Not sending mail to unregistered user simon.tatham@arm.com because your SCM claimed this was associated with a user ID ‘simon.tatham' which your security realm does not recognize; you may need changes in your SCM plugin Not sending mail to unregistered user llvm-dev@redking.me.uk because your SCM claimed this was associated with a user ID ‘llvm-dev' which your security realm does not recognize; you may need changes in your SCM plugin Not sending mail to unregistered user peter@pcc.me.uk because your SCM claimed this was associated with a user ID ‘peter' which your security realm does not recognize; you may need changes in your SCM plugin Not sending mail to unregistered user jonathanchesterfield@gmail.com because your SCM claimed this was associated with a user ID ‘jonathanchesterfield' which your security realm does not recognize; you may need changes in your SCM plugin Not sending mail to unregistered user andrew.ng@sony.com because your SCM claimed this was associated with a user ID ‘andrew.ng' which your security realm does not recognize; you may need changes in your SCM plugin Not sending mail to unregistered user diogo.sampaio@arm.com because your SCM claimed this was associated with a user ID ‘diogo.sampaio' which your security realm does not recognize; you may need changes in your SCM plugin Not sending mail to unregistered user epastor@google.com because your SCM claimed this was associated with a user ID ‘epastor' which your security realm does not recognize; you may need changes in your SCM plugin Not sending mail to unregistered user SourabhSingh.Tomar@amd.com because your SCM claimed this was associated with a user ID ‘SourabhSingh.Tomar' which your security realm does not recognize; you may need changes in your SCM plugin Not sending mail to unregistered user hokein.wu@gmail.com because your SCM claimed this was associated with a user ID ‘hokein.wu' which your security realm does not recognize; you may need changes in your SCM plugin Not sending mail to unregistered user martin@martin.st because your SCM claimed this was associated with a user ID ‘martin' which your security realm does not recognize; you may need changes in your SCM plugin Not sending mail to unregistered user kostyak@google.com because your SCM claimed this was associated with a user ID ‘kostyak' which your security realm does not recognize; you may need changes in your SCM plugin Not sending mail to unregistered user sivachandra@google.com because your SCM claimed this was associated with a user ID ‘sivachandra' which your security realm does not recognize; you may need changes in your SCM plugin Not sending mail to unregistered user thomasp@graphcore.ai because your SCM claimed this was associated with a user ID ‘thomasp' which your security realm does not recognize; you may need changes in your SCM plugin Not sending mail to unregistered user saar@raz.email because your SCM claimed this was associated with a user ID ‘saar' which your security realm does not recognize; you may need changes in your SCM plugin Not sending mail to unregistered user peter.smith@linaro.org because your SCM claimed this was associated with a user ID ‘peter.smith' which your security realm does not recognize; you may need changes in your SCM plugin Not sending mail to unregistered user pavel@labath.sk because your SCM claimed this was associated with a user ID ‘pavel' which your security realm does not recognize; you may need changes in your SCM plugin Not sending mail to unregistered user nathan@lanza.io because your SCM claimed this was associated with a user ID ‘nathan' which your security realm does not recognize; you may need changes in your SCM plugin Not sending mail to unregistered user alexandre.ganea@ubisoft.com because your SCM claimed this was associated with a user ID ‘alexandre.ganea' which your security realm does not recognize; you may need changes in your SCM plugin Not sending mail to unregistered user david.spickett@arm.com because your SCM claimed this was associated with a user ID ‘david.spickett' which your security realm does not recognize; you may need changes in your SCM plugin Not sending mail to unregistered user csigg@google.com because your SCM claimed this was associated with a user ID ‘csigg' which your security realm does not recognize; you may need changes in your SCM plugin Not sending mail to unregistered user ehudkatz@gmail.com because your SCM claimed this was associated with a user ID ‘ehudkatz' which your security realm does not recognize; you may need changes in your SCM plugin Not sending mail to unregistered user michael.hliao@gmail.com because your SCM claimed this was associated with a user ID ‘michael.hliao' which your security realm does not recognize; you may need changes in your SCM plugin Not sending mail to unregistered user evgueni.brevnov@gmail.com because your SCM claimed this was associated with a user ID ‘evgueni.brevnov' which your security realm does not recognize; you may need changes in your SCM plugin Not sending mail to unregistered user ntv@google.com because your SCM claimed this was associated with a user ID ‘ntv' which your security realm does not recognize; you may need changes in your SCM plugin Not sending mail to unregistered user jrtc27@jrtc27.com because your SCM claimed this was associated with a user ID ‘jrtc27' which your security realm does not recognize; you may need changes in your SCM plugin Not sending mail to unregistered user rnk@google.com because your SCM claimed this was associated with a user ID ‘rnk' which your security realm does not recognize; you may need changes in your SCM plugin Not sending mail to unregistered user spatel@rotateright.com because your SCM claimed this was associated with a user ID ‘spatel' which your security realm does not recognize; you may need changes in your SCM plugin Not sending mail to unregistered user grimar@accesssoftek.com because your SCM claimed this was associated with a user ID ‘grimar' which your security realm does not recognize; you may need changes in your SCM plugin Not sending mail to unregistered user tlively@google.com because your SCM claimed this was associated with a user ID ‘tlively' which your security realm does not recognize; you may need changes in your SCM plugin Not sending mail to unregistered user eugenis@google.com because your SCM claimed this was associated with a user ID ‘eugenis' which your security realm does not recognize; you may need changes in your SCM plugin Not sending mail to unregistered user llvmgnsyncbot@gmail.com because your SCM claimed this was associated with a user ID ‘llvmgnsyncbot' which your security realm does not recognize; you may need changes in your SCM plugin Not sending mail to unregistered user frank.laub@intel.com because your SCM claimed this was associated with a user ID ‘frank.laub' which your security realm does not recognize; you may need changes in your SCM plugin Not sending mail to unregistered user tpopp@google.com because your SCM claimed this was associated with a user ID ‘tpopp' which your security realm does not recognize; you may need changes in your SCM plugin Not sending mail to unregistered user dblaikie@gmail.com because your SCM claimed this was associated with a user ID ‘dblaikie' which your security realm does not recognize; you may need changes in your SCM plugin Not sending mail to unregistered user mydeveloperday@gmail.com because your SCM claimed this was associated with a user ID ‘paulhoad' which your security realm does not recognize; you may need changes in your SCM plugin Not sending mail to unregistered user eric@efcs.ca because your SCM claimed this was associated with a user ID ‘eric' which your security realm does not recognize; you may need changes in your SCM plugin Not sending mail to unregistered user phosek@chromium.org because your SCM claimed this was associated with a user ID ‘phosek' which your security realm does not recognize; you may need changes in your SCM plugin Not sending mail to unregistered user kparzysz@codeaurora.org because your SCM claimed this was associated with a user ID ‘kparzysz' which your security realm does not recognize; you may need changes in your SCM plugin Not sending mail to unregistered user alexandre.ganea@ubisoft.com because your SCM claimed this was associated with a user ID ‘alexandre.ganea' which your security realm does not recognize; you may need changes in your SCM plugin Not sending mail to unregistered user ehudkatz@gmail.com because your SCM claimed this was associated with a user ID ‘ehudkatz' which your security realm does not recognize; you may need changes in your SCM plugin Not sending mail to unregistered user maskray@google.com because your SCM claimed this was associated with a user ID ‘maskray' which your security realm does not recognize; you may need changes in your SCM plugin Not sending mail to unregistered user francesco.petrogalli@arm.com because your SCM claimed this was associated with a user ID ‘francesco.petrogalli' which your security realm does not recognize; you may need changes in your SCM plugin Not sending mail to unregistered user antiagainst@gmail.com because your SCM claimed this was associated with a user ID ‘antiagainst' which your security realm does not recognize; you may need changes in your SCM plugin Not sending mail to unregistered user i@maskray.me because your SCM claimed this was associated with a user ID ‘i' which your security realm does not recognize; you may need changes in your SCM plugin Not sending mail to unregistered user a.bataev@hotmail.com because your SCM claimed this was associated with a user ID ‘a.bataev' which your security realm does not recognize; you may need changes in your SCM plugin Not sending mail to unregistered user rnk@google.com because your SCM claimed this was associated with a user ID ‘rnk' which your security realm does not recognize; you may need changes in your SCM plugin Not sending mail to unregistered user kevin.neal@sas.com because your SCM claimed this was associated with a user ID ‘kevin.neal' which your security realm does not recognize; you may need changes in your SCM plugin Not sending mail to unregistered user jaskiewiczs@icloud.com because your SCM claimed this was associated with a user ID ‘jaskiewiczs' which your security realm does not recognize; you may need changes in your SCM plugin Not sending mail to unregistered user tlively@google.com because your SCM claimed this was associated with a user ID ‘tlively' which your security realm does not recognize; you may need changes in your SCM plugin Not sending mail to unregistered user lebedev.ri@gmail.com because your SCM claimed this was associated with a user ID ‘lebedev.ri' which your security realm does not recognize; you may need changes in your SCM plugin Not sending mail to unregistered user kostyak@google.com because your SCM claimed this was associated with a user ID ‘kostyak' which your security realm does not recognize; you may need changes in your SCM plugin Not sending mail to unregistered user alexey.bader@intel.com because your SCM claimed this was associated with a user ID ‘alexey.bader' which your security realm does not recognize; you may need changes in your SCM plugin Not sending mail to unregistered user qcolombet@apple.com because your SCM claimed this was associated with a user ID ‘qcolombet' which your security realm does not recognize; you may need changes in your SCM plugin Not sending mail to unregistered user kadircet@google.com because your SCM claimed this was associated with a user ID ‘kadircet' which your security realm does not recognize; you may need changes in your SCM plugin Not sending mail to unregistered user tra@google.com because your SCM claimed this was associated with a user ID ‘tra' which your security realm does not recognize; you may need changes in your SCM plugin

Hide Details

Begin Pre-Send Script... Sending email to: mschifer@apple.com jji@us.ibm.com devnexen@gmail.com friss@apple.com lhames@gmail.com teemperor@gmail.com vsk@apple.com jdevlieghere@apple.com mehdi.amini@apple.com Francis Visoiu-Mistrih <francisvm@apple.com> Azhar Mohammed <azhar@apple.com>
[Pipeline] } [Pipeline] // stage [Pipeline] } [Pipeline] // withEnv [Pipeline] } [Pipeline] // node [Pipeline] End of Pipeline ERROR: script returned exit code 1 Finished: FAILURE