FailedConsole Output

Skipping 15,898 KB.. Full Log
) than being linked (10.12)
ld: warning: object file (/Users/buildslave/jenkins/workspace/lldb-cmake-standalone/clang-build/lib/libLLVMAsmPrinter.a(DwarfUnit.cpp.o)) was built for newer OSX version (10.14) than being linked (10.12)
ld: warning: object file (/Users/buildslave/jenkins/workspace/lldb-cmake-standalone/clang-build/lib/libLLVMExecutionEngine.a(TargetSelect.cpp.o)) was built for newer OSX version (10.14) than being linked (10.12)
ld: warning: object file (/Users/buildslave/jenkins/workspace/lldb-cmake-standalone/clang-build/lib/libLLVMAnalysis.a(LazyCallGraph.cpp.o)) was built for newer OSX version (10.14) than being linked (10.12)
ld: warning: object file (/Users/buildslave/jenkins/workspace/lldb-cmake-standalone/clang-build/lib/libLLVMCodeGen.a(LiveRangeCalc.cpp.o)) was built for newer OSX version (10.14) than being linked (10.12)
ld: warning: object file (/Users/buildslave/jenkins/workspace/lldb-cmake-standalone/clang-build/lib/libLLVMTransformUtils.a(PredicateInfo.cpp.o)) was built for newer OSX version (10.14) than being linked (10.12)
ld: warning: object file (/Users/buildslave/jenkins/workspace/lldb-cmake-standalone/clang-build/lib/libLLVMAArch64CodeGen.a(AArch64CallingConvention.cpp.o)) was built for newer OSX version (10.14) than being linked (10.12)
ld: warning: object file (/Users/buildslave/jenkins/workspace/lldb-cmake-standalone/clang-build/lib/libLLVMAsmPrinter.a(DebugLocStream.cpp.o)) was built for newer OSX version (10.14) than being linked (10.12)
ld: warning: object file (/Users/buildslave/jenkins/workspace/lldb-cmake-standalone/clang-build/lib/libLLVMAnalysis.a(DependenceAnalysis.cpp.o)) was built for newer OSX version (10.14) than being linked (10.12)
ld: warning: object file (/Users/buildslave/jenkins/workspace/lldb-cmake-standalone/clang-build/lib/libLLVMTransformUtils.a(LoopVersioning.cpp.o)) was built for newer OSX version (10.14) than being linked (10.12)
ld: warning: object file (/Users/buildslave/jenkins/workspace/lldb-cmake-standalone/clang-build/lib/libLLVMCore.a(ProfileSummary.cpp.o)) was built for newer OSX version (10.14) than being linked (10.12)
ld: warning: object file (/Users/buildslave/jenkins/workspace/lldb-cmake-standalone/clang-build/lib/libLLVMCodeGen.a(SpillPlacement.cpp.o)) was built for newer OSX version (10.14) than being linked (10.12)
ld: warning: object file (/Users/buildslave/jenkins/workspace/lldb-cmake-standalone/clang-build/lib/libLLVMSupport.a(ToolOutputFile.cpp.o)) was built for newer OSX version (10.14) than being linked (10.12)
ld: warning: object file (/Users/buildslave/jenkins/workspace/lldb-cmake-standalone/clang-build/lib/libLLVMCodeGen.a(CalcSpillWeights.cpp.o)) was built for newer OSX version (10.14) than being linked (10.12)
ld: warning: object file (/Users/buildslave/jenkins/workspace/lldb-cmake-standalone/clang-build/lib/libLLVMAMDGPUCodeGen.a(AMDGPUInstrInfo.cpp.o)) was built for newer OSX version (10.14) than being linked (10.12)
ld: warning: object file (/Users/buildslave/jenkins/workspace/lldb-cmake-standalone/clang-build/lib/libLLVMARMCodeGen.a(ARMRegisterInfo.cpp.o)) was built for newer OSX version (10.14) than being linked (10.12)
ld: warning: object file (/Users/buildslave/jenkins/workspace/lldb-cmake-standalone/clang-build/lib/libLLVMCodeGen.a(AllocationOrder.cpp.o)) was built for newer OSX version (10.14) than being linked (10.12)
ld: warning: object file (/Users/buildslave/jenkins/workspace/lldb-cmake-standalone/clang-build/lib/libLLVMAnalysis.a(CGSCCPassManager.cpp.o)) was built for newer OSX version (10.14) than being linked (10.12)
ld: warning: object file (/Users/buildslave/jenkins/workspace/lldb-cmake-standalone/clang-build/lib/libLLVMSelectionDAG.a(SelectionDAGAddressAnalysis.cpp.o)) was built for newer OSX version (10.14) than being linked (10.12)
ld: warning: object file (/Users/buildslave/jenkins/workspace/lldb-cmake-standalone/clang-build/lib/libLLVMDebugInfoDWARF.a(DWARFDebugFrame.cpp.o)) was built for newer OSX version (10.14) than being linked (10.12)
ld: warning: object file (/Users/buildslave/jenkins/workspace/lldb-cmake-standalone/clang-build/lib/libLLVMDebugInfoDWARF.a(DWARFDebugMacro.cpp.o)) was built for newer OSX version (10.14) than being linked (10.12)
ld: warning: object file (/Users/buildslave/jenkins/workspace/lldb-cmake-standalone/clang-build/lib/libLLVMAsmPrinter.a(DwarfExpression.cpp.o)) was built for newer OSX version (10.14) than being linked (10.12)
ld: warning: object file (/Users/buildslave/jenkins/workspace/lldb-cmake-standalone/clang-build/lib/libLLVMAsmPrinter.a(DwarfStringPool.cpp.o)) was built for newer OSX version (10.14) than being linked (10.12)
ld: warning: object file (/Users/buildslave/jenkins/workspace/lldb-cmake-standalone/clang-build/lib/libLLVMProfileData.a(InstrProfReader.cpp.o)) was built for newer OSX version (10.14) than being linked (10.12)
ld: warning: object file (/Users/buildslave/jenkins/workspace/lldb-cmake-standalone/clang-build/lib/libLLVMSupport.a(LockFileManager.cpp.o)) was built for newer OSX version (10.14) than being linked (10.12)
ld: warning: object file (/Users/buildslave/jenkins/workspace/lldb-cmake-standalone/clang-build/lib/libLLVMSupport.a(Signposts.cpp.o)) was built for newer OSX version (10.14) than being linked (10.12)
ld: warning: object file (/Users/buildslave/jenkins/workspace/lldb-cmake-standalone/clang-build/lib/libLLVMVectorize.a(VPlanPredicator.cpp.o)) was built for newer OSX version (10.14) than being linked (10.12)
ld: warning: object file (/Users/buildslave/jenkins/workspace/lldb-cmake-standalone/clang-build/lib/libLLVMVectorize.a(VPlanTransforms.cpp.o)) was built for newer OSX version (10.14) than being linked (10.12)
ld: warning: object file (/Users/buildslave/jenkins/workspace/lldb-cmake-standalone/clang-build/lib/libLLVMCore.a(AbstractCallSite.cpp.o)) was built for newer OSX version (10.14) than being linked (10.12)
ld: warning: object file (/Users/buildslave/jenkins/workspace/lldb-cmake-standalone/clang-build/lib/libLLVMDebugInfoDWARF.a(DWARFDebugAbbrev.cpp.o)) was built for newer OSX version (10.14) than being linked (10.12)
ld: warning: object file (/Users/buildslave/jenkins/workspace/lldb-cmake-standalone/clang-build/lib/libLLVMTransformUtils.a(DemoteRegToStack.cpp.o)) was built for newer OSX version (10.14) than being linked (10.12)
ld: warning: object file (/Users/buildslave/jenkins/workspace/lldb-cmake-standalone/clang-build/lib/libLLVMAsmPrinter.a(DwarfCompileUnit.cpp.o)) was built for newer OSX version (10.14) than being linked (10.12)
ld: warning: object file (/Users/buildslave/jenkins/workspace/lldb-cmake-standalone/clang-build/lib/libLLVMTransformUtils.a(EscapeEnumerator.cpp.o)) was built for newer OSX version (10.14) than being linked (10.12)
ld: warning: object file (/Users/buildslave/jenkins/workspace/lldb-cmake-standalone/clang-build/lib/libLLVMMC.a(MachObjectWriter.cpp.o)) was built for newer OSX version (10.14) than being linked (10.12)
ld: warning: object file (/Users/buildslave/jenkins/workspace/lldb-cmake-standalone/clang-build/lib/libLLVMCodeGen.a(RegAllocPBQP.cpp.o)) was built for newer OSX version (10.14) than being linked (10.12)
ld: warning: object file (/Users/buildslave/jenkins/workspace/lldb-cmake-standalone/clang-build/lib/libLLVMSupport.a(ScaledNumber.cpp.o)) was built for newer OSX version (10.14) than being linked (10.12)
ld: warning: object file (/Users/buildslave/jenkins/workspace/lldb-cmake-standalone/clang-build/lib/libLLVMAggressiveInstCombine.a(TruncInstCombine.cpp.o)) was built for newer OSX version (10.14) than being linked (10.12)
ld: warning: object file (/Users/buildslave/jenkins/workspace/lldb-cmake-standalone/clang-build/lib/libLLVMTransformUtils.a(LoopUnrollAndJam.cpp.o)) was built for newer OSX version (10.14) than being linked (10.12)
ld: warning: object file (/Users/buildslave/jenkins/workspace/lldb-cmake-standalone/clang-build/lib/libLLVMVectorize.a(VPlanHCFGBuilder.cpp.o)) was built for newer OSX version (10.14) than being linked (10.12)
ld: warning: object file (/Users/buildslave/jenkins/workspace/lldb-cmake-standalone/clang-build/lib/libLLVMDebugInfoDWARF.a(DWARFDebugAranges.cpp.o)) was built for newer OSX version (10.14) than being linked (10.12)
ld: warning: object file (/Users/buildslave/jenkins/workspace/lldb-cmake-standalone/clang-build/lib/libLLVMCodeGen.a(InterferenceCache.cpp.o)) was built for newer OSX version (10.14) than being linked (10.12)
ld: warning: object file (/Users/buildslave/jenkins/workspace/lldb-cmake-standalone/clang-build/lib/libLLVMGlobalISel.a(LegalizeMutations.cpp.o)) was built for newer OSX version (10.14) than being linked (10.12)
ld: warning: object file (/Users/buildslave/jenkins/workspace/lldb-cmake-standalone/clang-build/lib/libLLVMCodeGen.a(LiveIntervalUnion.cpp.o)) was built for newer OSX version (10.14) than being linked (10.12)
ld: warning: object file (/Users/buildslave/jenkins/workspace/lldb-cmake-standalone/clang-build/lib/libLLVMAnalysis.a(PhiValues.cpp.o)) was built for newer OSX version (10.14) than being linked (10.12)
ld: warning: object file (/Users/buildslave/jenkins/workspace/lldb-cmake-standalone/clang-build/lib/libLLVMXCoreCodeGen.a(XCoreMachineFunctionInfo.cpp.o)) was built for newer OSX version (10.14) than being linked (10.12)
ld: warning: object file (/Users/buildslave/jenkins/workspace/lldb-cmake-standalone/clang-build/lib/libLLVMSupport.a(BinaryStreamWriter.cpp.o)) was built for newer OSX version (10.14) than being linked (10.12)
ld: warning: object file (/Users/buildslave/jenkins/workspace/lldb-cmake-standalone/clang-build/lib/libLLVMDebugInfoDWARF.a(DWARFDebugPubTable.cpp.o)) was built for newer OSX version (10.14) than being linked (10.12)
ld: warning: object file (/Users/buildslave/jenkins/workspace/lldb-cmake-standalone/clang-build/lib/libLLVMTransformUtils.a(FunctionComparator.cpp.o)) was built for newer OSX version (10.14) than being linked (10.12)
ld: warning: object file (/Users/buildslave/jenkins/workspace/lldb-cmake-standalone/clang-build/lib/libLLVMGlobalISel.a(LegalityPredicates.cpp.o)) was built for newer OSX version (10.14) than being linked (10.12)
ld: warning: object file (/Users/buildslave/jenkins/workspace/lldb-cmake-standalone/clang-build/lib/libLLVMCodeGen.a(LiveDebugVariables.cpp.o)) was built for newer OSX version (10.14) than being linked (10.12)
ld: warning: object file (/Users/buildslave/jenkins/workspace/lldb-cmake-standalone/clang-build/lib/libLLVMVectorize.a(LoopVectorizationLegality.cpp.o)) was built for newer OSX version (10.14) than being linked (10.12)
ld: warning: object file (/Users/buildslave/jenkins/workspace/lldb-cmake-standalone/clang-build/lib/libLLVMSelectionDAG.a(ScheduleDAGSDNodes.cpp.o)) was built for newer OSX version (10.14) than being linked (10.12)
ld: warning: object file (/Users/buildslave/jenkins/workspace/lldb-cmake-standalone/clang-build/lib/libLLVMMC.a(StringTableBuilder.cpp.o)) was built for newer OSX version (10.14) than being linked (10.12)
ld: warning: object file (/Users/buildslave/jenkins/workspace/lldb-cmake-standalone/clang-build/lib/libLLVMTransformUtils.a(BypassSlowDivision.cpp.o)) was built for newer OSX version (10.14) than being linked (10.12)
ld: warning: object file (/Users/buildslave/jenkins/workspace/lldb-cmake-standalone/clang-build/lib/libLLVMSupport.a(DJB.cpp.o)) was built for newer OSX version (10.14) than being linked (10.12)
ld: warning: object file (/Users/buildslave/jenkins/workspace/lldb-cmake-standalone/clang-build/lib/libLLVMMCParser.a(ELFAsmParser.cpp.o)) was built for newer OSX version (10.14) than being linked (10.12)
ld: warning: object file (/Users/buildslave/jenkins/workspace/lldb-cmake-standalone/clang-build/lib/libLLVMDebugInfoDWARF.a(DWARFDebugAddr.cpp.o)) was built for newer OSX version (10.14) than being linked (10.12)
ld: warning: object file (/Users/buildslave/jenkins/workspace/lldb-cmake-standalone/clang-build/lib/libLLVMDebugInfoDWARF.a(DWARFDebugArangeSet.cpp.o)) was built for newer OSX version (10.14) than being linked (10.12)
ld: warning: object file (/Users/buildslave/jenkins/workspace/lldb-cmake-standalone/clang-build/lib/libLLVMDebugInfoDWARF.a(DWARFDebugInfoEntry.cpp.o)) was built for newer OSX version (10.14) than being linked (10.12)
ld: warning: object file (/Users/buildslave/jenkins/workspace/lldb-cmake-standalone/clang-build/lib/libLLVMDebugInfoDWARF.a(DWARFDebugRangeList.cpp.o)) was built for newer OSX version (10.14) than being linked (10.12)
ld: warning: object file (/Users/buildslave/jenkins/workspace/lldb-cmake-standalone/clang-build/lib/libLLVMAnalysis.a(IVDescriptors.cpp.o)) was built for newer OSX version (10.14) than being linked (10.12)
ld: warning: object file (/Users/buildslave/jenkins/workspace/lldb-cmake-standalone/clang-build/lib/libLLVMGlobalISel.a(InstructionSelector.cpp.o)) was built for newer OSX version (10.14) than being linked (10.12)
ld: warning: object file (/Users/buildslave/jenkins/workspace/lldb-cmake-standalone/clang-build/lib/libLLVMCodeGen.a(MachineLoopUtils.cpp.o)) was built for newer OSX version (10.14) than being linked (10.12)
ld: warning: object file (/Users/buildslave/jenkins/workspace/lldb-cmake-standalone/clang-build/lib/libLLVMSelectionDAG.a(StatepointLowering.cpp.o)) was built for newer OSX version (10.14) than being linked (10.12)
ld: warning: object file (/Users/buildslave/jenkins/workspace/lldb-cmake-standalone/clang-build/lib/libLLVMMCParser.a(COFFAsmParser.cpp.o)) was built for newer OSX version (10.14) than being linked (10.12)
ld: warning: object file (/Users/buildslave/jenkins/workspace/lldb-cmake-standalone/clang-build/lib/libLLVMCodeGen.a(InlineSpiller.cpp.o)) was built for newer OSX version (10.14) than being linked (10.12)
ld: warning: object file (/Users/buildslave/jenkins/workspace/lldb-cmake-standalone/clang-build/lib/libLLVMMCParser.a(WasmAsmParser.cpp.o)) was built for newer OSX version (10.14) than being linked (10.12)
ld: warning: object file (/Users/buildslave/jenkins/workspace/lldb-cmake-standalone/clang-build/lib/libLLVMAMDGPUCodeGen.a(AMDGPUISelLowering.cpp.o)) was built for newer OSX version (10.14) than being linked (10.12)
ld: warning: object file (/Users/buildslave/jenkins/workspace/lldb-cmake-standalone/clang-build/lib/libLLVMExecutionEngine.a(SectionMemoryManager.cpp.o)) was built for newer OSX version (10.14) than being linked (10.12)
ld: warning: object file (/Users/buildslave/jenkins/workspace/lldb-cmake-standalone/clang-build/lib/libLLVMAnalysis.a(LoopUnrollAnalyzer.cpp.o)) was built for newer OSX version (10.14) than being linked (10.12)
ld: warning: object file (/Users/buildslave/jenkins/workspace/lldb-cmake-standalone/clang-build/lib/libLLVMAnalysis.a(CmpInstAnalysis.cpp.o)) was built for newer OSX version (10.14) than being linked (10.12)
ld: warning: object file (/Users/buildslave/jenkins/workspace/lldb-cmake-standalone/clang-build/lib/libLLVMAsmPrinter.a(AccelTable.cpp.o)) was built for newer OSX version (10.14) than being linked (10.12)
ld: warning: object file (/Users/buildslave/jenkins/workspace/lldb-cmake-standalone/clang-build/lib/libLLVMAnalysis.a(DivergenceAnalysis.cpp.o)) was built for newer OSX version (10.14) than being linked (10.12)
ld: warning: object file (/Users/buildslave/jenkins/workspace/lldb-cmake-standalone/clang-build/lib/libLLVMHexagonCodeGen.a(HexagonISelLoweringHVX.cpp.o)) was built for newer OSX version (10.14) than being linked (10.12)
ld: warning: object file (/Users/buildslave/jenkins/workspace/lldb-cmake-standalone/clang-build/lib/libLLVMProfileData.a(ProfileSummaryBuilder.cpp.o)) was built for newer OSX version (10.14) than being linked (10.12)
ld: warning: object file (/Users/buildslave/jenkins/workspace/lldb-cmake-standalone/clang-build/lib/libLLVMSupport.a(SymbolRemappingReader.cpp.o)) was built for newer OSX version (10.14) than being linked (10.12)
ld: warning: object file (/Users/buildslave/jenkins/workspace/lldb-cmake-standalone/clang-build/lib/libLLVMInstrumentation.a(ValueProfileCollector.cpp.o)) was built for newer OSX version (10.14) than being linked (10.12)
ld: warning: object file (/Users/buildslave/jenkins/workspace/lldb-cmake-standalone/clang-build/lib/libLLVMMCParser.a(DarwinAsmParser.cpp.o)) was built for newer OSX version (10.14) than being linked (10.12)
ld: warning: object file (/Users/buildslave/jenkins/workspace/lldb-cmake-standalone/clang-build/lib/libLLVMMC.a(ELFObjectWriter.cpp.o)) was built for newer OSX version (10.14) than being linked (10.12)
ld: warning: object file (/Users/buildslave/jenkins/workspace/lldb-cmake-standalone/clang-build/lib/libLLVMMipsCodeGen.a(Mips16InstrInfo.cpp.o)) was built for newer OSX version (10.14) than being linked (10.12)
ld: warning: object file (/Users/buildslave/jenkins/workspace/lldb-cmake-standalone/clang-build/lib/libLLVMMipsCodeGen.a(MipsSEInstrInfo.cpp.o)) was built for newer OSX version (10.14) than being linked (10.12)
ld: warning: object file (/Users/buildslave/jenkins/workspace/lldb-cmake-standalone/clang-build/lib/libLLVMCodeGen.a(RegAllocBasic.cpp.o)) was built for newer OSX version (10.14) than being linked (10.12)
ld: warning: object file (/Users/buildslave/jenkins/workspace/lldb-cmake-standalone/clang-build/lib/libLLVMAnalysis.a(IndirectCallPromotionAnalysis.cpp.o)) was built for newer OSX version (10.14) than being linked (10.12)
ld: warning: object file (/Users/buildslave/jenkins/workspace/lldb-cmake-standalone/clang-build/lib/libLLVMPowerPCCodeGen.a(PPCHazardRecognizers.cpp.o)) was built for newer OSX version (10.14) than being linked (10.12)
ld: warning: object file (/Users/buildslave/jenkins/workspace/lldb-cmake-standalone/clang-build/lib/libLLVMAnalysis.a(SyncDependenceAnalysis.cpp.o)) was built for newer OSX version (10.14) than being linked (10.12)
ld: warning: object file (/Users/buildslave/jenkins/workspace/lldb-cmake-standalone/clang-build/lib/libLLVMSelectionDAG.a(ScheduleDAGVLIW.cpp.o)) was built for newer OSX version (10.14) than being linked (10.12)
ld: warning: object file (/Users/buildslave/jenkins/workspace/lldb-cmake-standalone/clang-build/lib/libLLVMMC.a(WasmObjectWriter.cpp.o)) was built for newer OSX version (10.14) than being linked (10.12)
ld: warning: object file (/Users/buildslave/jenkins/workspace/lldb-cmake-standalone/clang-build/lib/libLLVMCodeGen.a(MIRNamerPass.cpp.o)) was built for newer OSX version (10.14) than being linked (10.12)
ld: warning: object file (/Users/buildslave/jenkins/workspace/lldb-cmake-standalone/clang-build/lib/libLLVMAnalysis.a(ScalarEvolutionNormalization.cpp.o)) was built for newer OSX version (10.14) than being linked (10.12)
ld: warning: object file (/Users/buildslave/jenkins/workspace/lldb-cmake-standalone/clang-build/lib/libLLVMTransformUtils.a(InjectTLIMappings.cpp.o)) was built for newer OSX version (10.14) than being linked (10.12)
ld: warning: object file (/Users/buildslave/jenkins/workspace/lldb-cmake-standalone/clang-build/lib/libLLVMRuntimeDyld.a(JITSymbol.cpp.o)) was built for newer OSX version (10.14) than being linked (10.12)
ld: warning: object file (/Users/buildslave/jenkins/workspace/lldb-cmake-standalone/clang-build/lib/libLLVMMC.a(MCELFObjectTargetWriter.cpp.o)) was built for newer OSX version (10.14) than being linked (10.12)
ld: warning: object file (/Users/buildslave/jenkins/workspace/lldb-cmake-standalone/clang-build/lib/libLLVMMC.a(XCOFFObjectWriter.cpp.o)) was built for newer OSX version (10.14) than being linked (10.12)
ld: warning: object file (/Users/buildslave/jenkins/workspace/lldb-cmake-standalone/clang-build/lib/libLLVMMC.a(MCMachObjectTargetWriter.cpp.o)) was built for newer OSX version (10.14) than being linked (10.12)
ld: warning: object file (/Users/buildslave/jenkins/workspace/lldb-cmake-standalone/clang-build/lib/libLLVMMC.a(MCWasmObjectTargetWriter.cpp.o)) was built for newer OSX version (10.14) than being linked (10.12)
ld: warning: object file (/Users/buildslave/jenkins/workspace/lldb-cmake-standalone/clang-build/lib/libLLVMSystemZCodeGen.a(SystemZConstantPoolValue.cpp.o)) was built for newer OSX version (10.14) than being linked (10.12)
ld: warning: object file (/Users/buildslave/jenkins/workspace/lldb-cmake-standalone/clang-build/lib/libLLVMMC.a(MCXCOFFObjectTargetWriter.cpp.o)) was built for newer OSX version (10.14) than being linked (10.12)
ld: warning: object file (/Users/buildslave/jenkins/workspace/lldb-cmake-standalone/clang-build/lib/libLLVMCodeGen.a(RegisterUsageInfo.cpp.o)) was built for newer OSX version (10.14) than being linked (10.12)
ld: warning: object file (/Users/buildslave/jenkins/workspace/lldb-cmake-standalone/clang-build/lib/libLLVMAsmPrinter.a(DbgEntityHistoryCalculator.cpp.o)) was built for newer OSX version (10.14) than being linked (10.12)
ld: warning: object file (/Users/buildslave/jenkins/workspace/lldb-cmake-standalone/clang-build/lib/libLLVMSelectionDAG.a(ScheduleDAGRRList.cpp.o)) was built for newer OSX version (10.14) than being linked (10.12)
ld: warning: object file (/Users/buildslave/jenkins/workspace/lldb-cmake-standalone/clang-build/lib/libLLVMMipsCodeGen.a(Mips16FrameLowering.cpp.o)) was built for newer OSX version (10.14) than being linked (10.12)
ld: warning: object file (/Users/buildslave/jenkins/workspace/lldb-cmake-standalone/clang-build/lib/libLLVMMipsCodeGen.a(MipsSEFrameLowering.cpp.o)) was built for newer OSX version (10.14) than being linked (10.12)
ld: warning: object file (/Users/buildslave/jenkins/workspace/lldb-cmake-standalone/clang-build/lib/libLLVMMC.a(WinCOFFObjectWriter.cpp.o)) was built for newer OSX version (10.14) than being linked (10.12)
ld: warning: object file (/Users/buildslave/jenkins/workspace/lldb-cmake-standalone/clang-build/lib/libLLVMAnalysis.a(LazyBlockFrequencyInfo.cpp.o)) was built for newer OSX version (10.14) than being linked (10.12)
ld: warning: object file (/Users/buildslave/jenkins/workspace/lldb-cmake-standalone/clang-build/lib/libLLVMTransformUtils.a(SimplifyLibCalls.cpp.o)) was built for newer OSX version (10.14) than being linked (10.12)
ld: warning: object file (/Users/buildslave/jenkins/workspace/lldb-cmake-standalone/clang-build/lib/libLLVMMipsCodeGen.a(Mips16ISelLowering.cpp.o)) was built for newer OSX version (10.14) than being linked (10.12)
ld: warning: object file (/Users/buildslave/jenkins/workspace/lldb-cmake-standalone/clang-build/lib/libLLVMMipsCodeGen.a(MipsSEISelLowering.cpp.o)) was built for newer OSX version (10.14) than being linked (10.12)
ld: warning: object file (/Users/buildslave/jenkins/workspace/lldb-cmake-standalone/clang-build/lib/libLLVMCore.a(PassInstrumentation.cpp.o)) was built for newer OSX version (10.14) than being linked (10.12)
ld: warning: object file (/Users/buildslave/jenkins/workspace/lldb-cmake-standalone/clang-build/lib/libLLVMSupport.a(ItaniumManglingCanonicalizer.cpp.o)) was built for newer OSX version (10.14) than being linked (10.12)
ld: warning: object file (/Users/buildslave/jenkins/workspace/lldb-cmake-standalone/clang-build/lib/libLLVMCodeGen.a(MIRCanonicalizerPass.cpp.o)) was built for newer OSX version (10.14) than being linked (10.12)
ld: warning: object file (/Users/buildslave/jenkins/workspace/lldb-cmake-standalone/clang-build/lib/libLLVMAnalysis.a(ValueLatticeUtils.cpp.o)) was built for newer OSX version (10.14) than being linked (10.12)
ld: warning: object file (/Users/buildslave/jenkins/workspace/lldb-cmake-standalone/clang-build/lib/libLLVMTransformUtils.a(ImportedFunctionsInliningStatistics.cpp.o)) was built for newer OSX version (10.14) than being linked (10.12)
ld: warning: object file (/Users/buildslave/jenkins/workspace/lldb-cmake-standalone/clang-build/lib/libLLVMARMCodeGen.a(ARMFastISel.cpp.o)) was built for newer OSX version (10.14) than being linked (10.12)
ld: warning: object file (/Users/buildslave/jenkins/workspace/lldb-cmake-standalone/clang-build/lib/libLLVMPowerPCCodeGen.a(PPCFastISel.cpp.o)) was built for newer OSX version (10.14) than being linked (10.12)
ld: warning: object file (/Users/buildslave/jenkins/workspace/lldb-cmake-standalone/clang-build/lib/libLLVMDebugInfoMSF.a(MappedBlockStream.cpp.o)) was built for newer OSX version (10.14) than being linked (10.12)
ld: warning: object file (/Users/buildslave/jenkins/workspace/lldb-cmake-standalone/clang-build/lib/libLLVMDebugInfoMSF.a(MSFCommon.cpp.o)) was built for newer OSX version (10.14) than being linked (10.12)
ld: warning: object file (/Users/buildslave/jenkins/workspace/lldb-cmake-standalone/clang-build/lib/libLLVMDebugInfoPDB.a(PDBInterfaceAnchors.cpp.o)) was built for newer OSX version (10.14) than being linked (10.12)
ld: warning: object file (/Users/buildslave/jenkins/workspace/lldb-cmake-standalone/clang-build/lib/libLLVMDebugInfoPDB.a(SymbolCache.cpp.o)) was built for newer OSX version (10.14) than being linked (10.12)
ld: warning: object file (/Users/buildslave/jenkins/workspace/lldb-cmake-standalone/clang-build/lib/libLLVMDebugInfoPDB.a(Hash.cpp.o)) was built for newer OSX version (10.14) than being linked (10.12)
ld: warning: object file (/Users/buildslave/jenkins/workspace/lldb-cmake-standalone/clang-build/lib/libLLVMDebugInfoPDB.a(PublicsStream.cpp.o)) was built for newer OSX version (10.14) than being linked (10.12)
ld: warning: object file (/Users/buildslave/jenkins/workspace/lldb-cmake-standalone/clang-build/lib/libLLVMDebugInfoPDB.a(TpiHashing.cpp.o)) was built for newer OSX version (10.14) than being linked (10.12)
ld: warning: object file (/Users/buildslave/jenkins/workspace/lldb-cmake-standalone/clang-build/lib/libLLVMDebugInfoPDB.a(NamedStreamMap.cpp.o)) was built for newer OSX version (10.14) than being linked (10.12)
ld: warning: object file (/Users/buildslave/jenkins/workspace/lldb-cmake-standalone/clang-build/lib/libLLVMDebugInfoPDB.a(PDBStringTable.cpp.o)) was built for newer OSX version (10.14) than being linked (10.12)
ld: warning: object file (/Users/buildslave/jenkins/workspace/lldb-cmake-standalone/clang-build/lib/libLLVMDebugInfoPDB.a(RawError.cpp.o)) was built for newer OSX version (10.14) than being linked (10.12)
ld: warning: object file (/Users/buildslave/jenkins/workspace/lldb-cmake-standalone/clang-build/lib/libLLVMDebugInfoPDB.a(NativeExeSymbol.cpp.o)) was built for newer OSX version (10.14) than being linked (10.12)
ld: warning: object file (/Users/buildslave/jenkins/workspace/lldb-cmake-standalone/clang-build/lib/libLLVMDebugInfoPDB.a(HashTable.cpp.o)) was built for newer OSX version (10.14) than being linked (10.12)
ld: warning: object file (/Users/buildslave/jenkins/workspace/lldb-cmake-standalone/clang-build/lib/libLLVMDebugInfoPDB.a(InjectedSourceStream.cpp.o)) was built for newer OSX version (10.14) than being linked (10.12)
ld: warning: object file (/Users/buildslave/jenkins/workspace/lldb-cmake-standalone/clang-build/lib/libLLVMDebugInfoPDB.a(NativeEnumInjectedSources.cpp.o)) was built for newer OSX version (10.14) than being linked (10.12)
ld: warning: object file (/Users/buildslave/jenkins/workspace/lldb-cmake-standalone/clang-build/lib/libLLVMSupport.a(ThreadLocal.cpp.o)) was built for newer OSX version (10.14) than being linked (10.12)
ld: warning: object file (/Users/buildslave/jenkins/workspace/lldb-cmake-standalone/clang-build/lib/libLLVMSupport.a(Unicode.cpp.o)) was built for newer OSX version (10.14) than being linked (10.12)
ld: warning: object file (/Users/buildslave/jenkins/workspace/lldb-cmake-standalone/clang-build/lib/libLLVMMipsCodeGen.a(MipsFastISel.cpp.o)) was built for newer OSX version (10.14) than being linked (10.12)
ld: warning: object file (/Users/buildslave/jenkins/workspace/lldb-cmake-standalone/clang-build/lib/libLLVMTextAPI.a(TextStub.cpp.o)) was built for newer OSX version (10.14) than being linked (10.12)
ld: warning: object file (/Users/buildslave/jenkins/workspace/lldb-cmake-standalone/clang-build/lib/libLLVMTextAPI.a(Target.cpp.o)) was built for newer OSX version (10.14) than being linked (10.12)
ld: warning: object file (/Users/buildslave/jenkins/workspace/lldb-cmake-standalone/clang-build/lib/libLLVMAnalysis.a(AliasAnalysisSummary.cpp.o)) was built for newer OSX version (10.14) than being linked (10.12)
ld: warning: object file (/Users/buildslave/jenkins/workspace/lldb-cmake-standalone/clang-build/lib/libLLVMAMDGPUCodeGen.a(AMDGPUGlobalISelUtils.cpp.o)) was built for newer OSX version (10.14) than being linked (10.12)
ld: warning: object file (/Users/buildslave/jenkins/workspace/lldb-cmake-standalone/clang-build/lib/libLLVMObject.a(ELFObjectFile.cpp.o)) was built for newer OSX version (10.14) than being linked (10.12)
ld: warning: object file (/Users/buildslave/jenkins/workspace/lldb-cmake-standalone/clang-build/lib/libLLVMObject.a(WasmObjectFile.cpp.o)) was built for newer OSX version (10.14) than being linked (10.12)
ld: warning: object file (/Users/buildslave/jenkins/workspace/lldb-cmake-standalone/clang-build/lib/libLLVMObject.a(MachOObjectFile.cpp.o)) was built for newer OSX version (10.14) than being linked (10.12)
ld: warning: object file (/Users/buildslave/jenkins/workspace/lldb-cmake-standalone/clang-build/lib/libLLVMObject.a(XCOFFObjectFile.cpp.o)) was built for newer OSX version (10.14) than being linked (10.12)
ld: warning: object file (/Users/buildslave/jenkins/workspace/lldb-cmake-standalone/clang-build/lib/libLLVMObject.a(IRObjectFile.cpp.o)) was built for newer OSX version (10.14) than being linked (10.12)
ld: warning: object file (/Users/buildslave/jenkins/workspace/lldb-cmake-standalone/clang-build/lib/libLLVMObject.a(RelocationResolver.cpp.o)) was built for newer OSX version (10.14) than being linked (10.12)
ld: warning: object file (/Users/buildslave/jenkins/workspace/lldb-cmake-standalone/clang-build/lib/libLLVMObject.a(TapiFile.cpp.o)) was built for newer OSX version (10.14) than being linked (10.12)
ld: warning: object file (/Users/buildslave/jenkins/workspace/lldb-cmake-standalone/clang-build/lib/libLLVMAArch64CodeGen.a(AArch64FastISel.cpp.o)) was built for newer OSX version (10.14) than being linked (10.12)
ld: warning: object file (/Users/buildslave/jenkins/workspace/lldb-cmake-standalone/clang-build/lib/libLLVMAsmPrinter.a(DIEHash.cpp.o)) was built for newer OSX version (10.14) than being linked (10.12)
ld: warning: object file (/Users/buildslave/jenkins/workspace/lldb-cmake-standalone/clang-build/lib/libLLVMAsmParser.a(LLLexer.cpp.o)) was built for newer OSX version (10.14) than being linked (10.12)
ld: warning: object file (/Users/buildslave/jenkins/workspace/lldb-cmake-standalone/clang-build/lib/libLLVMBinaryFormat.a(MsgPackWriter.cpp.o)) was built for newer OSX version (10.14) than being linked (10.12)
ld: warning: object file (/Users/buildslave/jenkins/workspace/lldb-cmake-standalone/clang-build/lib/libLLVMAnalysis.a(ObjCARCInstKind.cpp.o)) was built for newer OSX version (10.14) than being linked (10.12)
ld: warning: object file (/Users/buildslave/jenkins/workspace/lldb-cmake-standalone/clang-build/lib/libLLVMAnalysis.a(ObjCARCAnalysisUtils.cpp.o)) was built for newer OSX version (10.14) than being linked (10.12)
ld: warning: object file (/Users/buildslave/jenkins/workspace/lldb-cmake-standalone/clang-build/lib/libLLVMRemarks.a(RemarkFormat.cpp.o)) was built for newer OSX version (10.14) than being linked (10.12)
ld: warning: object file (/Users/buildslave/jenkins/workspace/lldb-cmake-standalone/clang-build/lib/libLLVMRemarks.a(RemarkSerializer.cpp.o)) was built for newer OSX version (10.14) than being linked (10.12)
ld: warning: object file (/Users/buildslave/jenkins/workspace/lldb-cmake-standalone/clang-build/lib/libLLVMMCParser.a(AsmLexer.cpp.o)) was built for newer OSX version (10.14) than being linked (10.12)
ld: warning: object file (/Users/buildslave/jenkins/workspace/lldb-cmake-standalone/clang-build/lib/libLLVMSelectionDAG.a(FastISel.cpp.o)) was built for newer OSX version (10.14) than being linked (10.12)
ld: warning: object file (/Users/buildslave/jenkins/workspace/lldb-cmake-standalone/clang-build/lib/libLLVMAsmParser.a(LLParser.cpp.o)) was built for newer OSX version (10.14) than being linked (10.12)
ld: warning: object file (/Users/buildslave/jenkins/workspace/lldb-cmake-standalone/clang-build/lib/libLLVMCodeGen.a(GCStrategy.cpp.o)) was built for newer OSX version (10.14) than being linked (10.12)
ld: warning: object file (/Users/buildslave/jenkins/workspace/lldb-cmake-standalone/clang-build/lib/libLLVMDebugInfoCodeView.a(EnumTables.cpp.o)) was built for newer OSX version (10.14) than being linked (10.12)
ld: warning: object file (/Users/buildslave/jenkins/workspace/lldb-cmake-standalone/clang-build/lib/libLLVMDebugInfoCodeView.a(TypeRecordHelpers.cpp.o)) was built for newer OSX version (10.14) than being linked (10.12)
ld: warning: object file (/Users/buildslave/jenkins/workspace/lldb-cmake-standalone/clang-build/lib/libLLVMDebugInfoCodeView.a(CVTypeVisitor.cpp.o)) was built for newer OSX version (10.14) than being linked (10.12)
ld: warning: object file (/Users/buildslave/jenkins/workspace/lldb-cmake-standalone/clang-build/lib/libLLVMDebugInfoCodeView.a(CodeViewRecordIO.cpp.o)) was built for newer OSX version (10.14) than being linked (10.12)
ld: warning: object file (/Users/buildslave/jenkins/workspace/lldb-cmake-standalone/clang-build/lib/libLLVMDebugInfoCodeView.a(TypeTableCollection.cpp.o)) was built for newer OSX version (10.14) than being linked (10.12)
ld: warning: object file (/Users/buildslave/jenkins/workspace/lldb-cmake-standalone/clang-build/lib/libLLVMDebugInfoCodeView.a(SimpleTypeSerializer.cpp.o)) was built for newer OSX version (10.14) than being linked (10.12)
ld: warning: object file (/Users/buildslave/jenkins/workspace/lldb-cmake-standalone/clang-build/lib/libLLVMDebugInfoCodeView.a(GlobalTypeTableBuilder.cpp.o)) was built for newer OSX version (10.14) than being linked (10.12)
ld: warning: object file (/Users/buildslave/jenkins/workspace/lldb-cmake-standalone/clang-build/lib/libLLVMDebugInfoCodeView.a(StringsAndChecksums.cpp.o)) was built for newer OSX version (10.14) than being linked (10.12)
ld: warning: object file (/Users/buildslave/jenkins/workspace/lldb-cmake-standalone/clang-build/lib/libLLVMDebugInfoCodeView.a(LazyRandomTypeCollection.cpp.o)) was built for newer OSX version (10.14) than being linked (10.12)
ld: warning: object file (/Users/buildslave/jenkins/workspace/lldb-cmake-standalone/clang-build/lib/libLLVMDebugInfoCodeView.a(ContinuationRecordBuilder.cpp.o)) was built for newer OSX version (10.14) than being linked (10.12)
ld: warning: object file (/Users/buildslave/jenkins/workspace/lldb-cmake-standalone/clang-build/lib/libLLVMDebugInfoCodeView.a(DebugFrameDataSubsection.cpp.o)) was built for newer OSX version (10.14) than being linked (10.12)
ld: warning: object file (/Users/buildslave/jenkins/workspace/lldb-cmake-standalone/clang-build/lib/libLLVMDebugInfoCodeView.a(Line.cpp.o)) was built for newer OSX version (10.14) than being linked (10.12)
ld: warning: object file (/Users/buildslave/jenkins/workspace/lldb-cmake-standalone/clang-build/lib/libLLVMDebugInfoCodeView.a(TypeIndex.cpp.o)) was built for newer OSX version (10.14) than being linked (10.12)
ld: warning: object file (/Users/buildslave/jenkins/workspace/lldb-cmake-standalone/clang-build/lib/libLLVMSupport.a(xxhash.cpp.o)) was built for newer OSX version (10.14) than being linked (10.12)
ld: warning: object file (/Users/buildslave/jenkins/workspace/lldb-cmake-standalone/clang-build/lib/libLLVMAsmPrinter.a(DwarfFile.cpp.o)) was built for newer OSX version (10.14) than being linked (10.12)
ld: warning: object file (/Users/buildslave/jenkins/workspace/lldb-cmake-standalone/clang-build/lib/libLLVMTransformUtils.a(Evaluator.cpp.o)) was built for newer OSX version (10.14) than being linked (10.12)
ld: warning: object file (/Users/buildslave/jenkins/workspace/lldb-cmake-standalone/clang-build/lib/libLLVMSupport.a(KnownBits.cpp.o)) was built for newer OSX version (10.14) than being linked (10.12)
ld: warning: object file (/Users/buildslave/jenkins/workspace/lldb-cmake-standalone/clang-build/lib/libLLVMCore.a(OptBisect.cpp.o)) was built for newer OSX version (10.14) than being linked (10.12)
ld: warning: object file (/Users/buildslave/jenkins/workspace/lldb-cmake-standalone/clang-build/lib/libLLVMSupport.a(MathExtras.cpp.o)) was built for newer OSX version (10.14) than being linked (10.12)
ld: warning: object file (/Users/buildslave/jenkins/workspace/lldb-cmake-standalone/clang-build/lib/libLLVMTransformUtils.a(MisExpect.cpp.o)) was built for newer OSX version (10.14) than being linked (10.12)
ld: warning: object file (/Users/buildslave/jenkins/workspace/lldb-cmake-standalone/clang-build/lib/libLLVMCodeGen.a(SafeStackLayout.cpp.o)) was built for newer OSX version (10.14) than being linked (10.12)
ld: warning: object file (/Users/buildslave/jenkins/workspace/lldb-cmake-standalone/clang-build/lib/libLLVMCodeGen.a(SafeStackColoring.cpp.o)) was built for newer OSX version (10.14) than being linked (10.12)
ld: warning: object file (/Users/buildslave/jenkins/workspace/lldb-cmake-standalone/clang-build/lib/libLLVMSupport.a(Optional.cpp.o)) was built for newer OSX version (10.14) than being linked (10.12)
ld: warning: object file (/Users/buildslave/jenkins/workspace/lldb-cmake-standalone/clang-build/lib/libLLVMAnalysis.a(ValueLattice.cpp.o)) was built for newer OSX version (10.14) than being linked (10.12)
ld: warning: object file (/Users/buildslave/jenkins/workspace/lldb-cmake-standalone/clang-build/lib/libclangAST.a(DeclFriend.cpp.o)) was built for newer OSX version (10.14) than being linked (10.12)
ld: warning: object file (/Users/buildslave/jenkins/workspace/lldb-cmake-standalone/clang-build/lib/libclangLex.a(TokenLexer.cpp.o)) was built for newer OSX version (10.14) than being linked (10.12)
ld: warning: object file (/Users/buildslave/jenkins/workspace/lldb-cmake-standalone/clang-build/lib/libclangBasic.a(Sanitizers.cpp.o)) was built for newer OSX version (10.14) than being linked (10.12)
ld: warning: object file (/Users/buildslave/jenkins/workspace/lldb-cmake-standalone/clang-build/lib/libclangAST.a(ASTConsumer.cpp.o)) was built for newer OSX version (10.14) than being linked (10.12)
ld: warning: object file (/Users/buildslave/jenkins/workspace/lldb-cmake-standalone/clang-build/lib/libclangLex.a(PPLexerChange.cpp.o)) was built for newer OSX version (10.14) than being linked (10.12)
ld: warning: object file (/Users/buildslave/jenkins/workspace/lldb-cmake-standalone/clang-build/lib/libclangSerialization.a(GeneratePCH.cpp.o)) was built for newer OSX version (10.14) than being linked (10.12)
ld: warning: object file (/Users/buildslave/jenkins/workspace/lldb-cmake-standalone/clang-build/lib/libclangLex.a(PPCaching.cpp.o)) was built for newer OSX version (10.14) than being linked (10.12)
ld: warning: object file (/Users/buildslave/jenkins/workspace/lldb-cmake-standalone/clang-build/lib/libclangLex.a(PPDirectives.cpp.o)) was built for newer OSX version (10.14) than being linked (10.12)
ld: warning: object file (/Users/buildslave/jenkins/workspace/lldb-cmake-standalone/clang-build/lib/libclangLex.a(Pragma.cpp.o)) was built for newer OSX version (10.14) than being linked (10.12)
ld: warning: object file (/Users/buildslave/jenkins/workspace/lldb-cmake-standalone/clang-build/lib/libclangLex.a(PPMacroExpansion.cpp.o)) was built for newer OSX version (10.14) than being linked (10.12)
ld: warning: object file (/Users/buildslave/jenkins/workspace/lldb-cmake-standalone/clang-build/lib/libclangSema.a(SemaConsumer.cpp.o)) was built for newer OSX version (10.14) than being linked (10.12)
ld: warning: object file (/Users/buildslave/jenkins/workspace/lldb-cmake-standalone/clang-build/lib/libclangAnalysis.a(ThreadSafety.cpp.o)) was built for newer OSX version (10.14) than being linked (10.12)
ld: warning: object file (/Users/buildslave/jenkins/workspace/lldb-cmake-standalone/clang-build/lib/libclangSema.a(ParsedAttr.cpp.o)) was built for newer OSX version (10.14) than being linked (10.12)
ld: warning: object file (/Users/buildslave/jenkins/workspace/lldb-cmake-standalone/clang-build/lib/libclangCodeGen.a(ModuleBuilder.cpp.o)) was built for newer OSX version (10.14) than being linked (10.12)
ld: warning: object file (/Users/buildslave/jenkins/workspace/lldb-cmake-standalone/clang-build/lib/libclangLex.a(ScratchBuffer.cpp.o)) was built for newer OSX version (10.14) than being linked (10.12)
ld: warning: object file (/Users/buildslave/jenkins/workspace/lldb-cmake-standalone/clang-build/lib/libclangBasic.a(CodeGenOptions.cpp.o)) was built for newer OSX version (10.14) than being linked (10.12)
ld: warning: object file (/Users/buildslave/jenkins/workspace/lldb-cmake-standalone/clang-build/lib/libclangLex.a(MacroInfo.cpp.o)) was built for newer OSX version (10.14) than being linked (10.12)
ld: warning: object file (/Users/buildslave/jenkins/workspace/lldb-cmake-standalone/clang-build/lib/libclangRewrite.a(RewriteRope.cpp.o)) was built for newer OSX version (10.14) than being linked (10.12)
ld: warning: object file (/Users/buildslave/jenkins/workspace/lldb-cmake-standalone/clang-build/lib/libclangFrontend.a(ASTConsumers.cpp.o)) was built for newer OSX version (10.14) than being linked (10.12)
ld: warning: object file (/Users/buildslave/jenkins/workspace/lldb-cmake-standalone/clang-build/lib/libclangFrontend.a(FrontendOptions.cpp.o)) was built for newer OSX version (10.14) than being linked (10.12)
ld: warning: object file (/Users/buildslave/jenkins/workspace/lldb-cmake-standalone/clang-build/lib/libclangFrontend.a(SerializedDiagnosticPrinter.cpp.o)) was built for newer OSX version (10.14) than being linked (10.12)
ld: warning: object file (/Users/buildslave/jenkins/workspace/lldb-cmake-standalone/clang-build/lib/libclangSerialization.a(ASTReader.cpp.o)) was built for newer OSX version (10.14) than being linked (10.12)
ld: warning: object file (/Users/buildslave/jenkins/workspace/lldb-cmake-standalone/clang-build/lib/libclangSerialization.a(GlobalModuleIndex.cpp.o)) was built for newer OSX version (10.14) than being linked (10.12)
ld: warning: object file (/Users/buildslave/jenkins/workspace/lldb-cmake-standalone/clang-build/lib/libclangFrontend.a(MultiplexConsumer.cpp.o)) was built for newer OSX version (10.14) than being linked (10.12)
ld: warning: object file (/Users/buildslave/jenkins/workspace/lldb-cmake-standalone/clang-build/lib/libclangBasic.a(Stack.cpp.o)) was built for newer OSX version (10.14) than being linked (10.12)
ld: warning: object file (/Users/buildslave/jenkins/workspace/lldb-cmake-standalone/clang-build/lib/libclangSema.a(IdentifierResolver.cpp.o)) was built for newer OSX version (10.14) than being linked (10.12)
ld: warning: object file (/Users/buildslave/jenkins/workspace/lldb-cmake-standalone/clang-build/lib/libclangLex.a(ModuleMap.cpp.o)) was built for newer OSX version (10.14) than being linked (10.12)
ld: warning: object file (/Users/buildslave/jenkins/workspace/lldb-cmake-standalone/clang-build/lib/libclangDriver.a(OptionUtils.cpp.o)) was built for newer OSX version (10.14) than being linked (10.12)
ld: warning: object file (/Users/buildslave/jenkins/workspace/lldb-cmake-standalone/clang-build/lib/libclangLex.a(PreprocessingRecord.cpp.o)) was built for newer OSX version (10.14) than being linked (10.12)
ld: warning: object file (/Users/buildslave/jenkins/workspace/lldb-cmake-standalone/clang-build/lib/libclangBasic.a(XRayInstr.cpp.o)) was built for newer OSX version (10.14) than being linked (10.12)
ld: warning: object file (/Users/buildslave/jenkins/workspace/lldb-cmake-standalone/clang-build/lib/libclangSema.a(CodeCompleteConsumer.cpp.o)) was built for newer OSX version (10.14) than being linked (10.12)
ld: warning: object file (/Users/buildslave/jenkins/workspace/lldb-cmake-standalone/clang-build/lib/libclangFrontend.a(LayoutOverrideSource.cpp.o)) was built for newer OSX version (10.14) than being linked (10.12)
ld: warning: object file (/Users/buildslave/jenkins/workspace/lldb-cmake-standalone/clang-build/lib/libclangFrontend.a(LogDiagnosticPrinter.cpp.o)) was built for newer OSX version (10.14) than being linked (10.12)
ld: warning: object file (/Users/buildslave/jenkins/workspace/lldb-cmake-standalone/clang-build/lib/libclangSema.a(SemaOverload.cpp.o)) was built for newer OSX version (10.14) than being linked (10.12)
ld: warning: object file (/Users/buildslave/jenkins/workspace/lldb-cmake-standalone/clang-build/lib/libclangBasic.a(Warnings.cpp.o)) was built for newer OSX version (10.14) than being linked (10.12)
ld: warning: object file (/Users/buildslave/jenkins/workspace/lldb-cmake-standalone/clang-build/lib/libclangFrontend.a(TextDiagnosticPrinter.cpp.o)) was built for newer OSX version (10.14) than being linked (10.12)
ld: warning: object file (/Users/buildslave/jenkins/workspace/lldb-cmake-standalone/clang-build/lib/libclangAST.a(PrintfFormatString.cpp.o)) was built for newer OSX version (10.14) than being linked (10.12)
ld: warning: object file (/Users/buildslave/jenkins/workspace/lldb-cmake-standalone/clang-build/lib/libclangAST.a(FormatString.cpp.o)) was built for newer OSX version (10.14) than being linked (10.12)
ld: warning: object file (/Users/buildslave/jenkins/workspace/lldb-cmake-standalone/clang-build/lib/libclangAST.a(ASTImporterLookupTable.cpp.o)) was built for newer OSX version (10.14) than being linked (10.12)
ld: warning: object file (/Users/buildslave/jenkins/workspace/lldb-cmake-standalone/clang-build/lib/libclangFrontend.a(HeaderIncludeGen.cpp.o)) was built for newer OSX version (10.14) than being linked (10.12)
ld: warning: object file (/Users/buildslave/jenkins/workspace/lldb-cmake-standalone/clang-build/lib/libclangAST.a(ASTConcept.cpp.o)) was built for newer OSX version (10.14) than being linked (10.12)
ld: warning: object file (/Users/buildslave/jenkins/workspace/lldb-cmake-standalone/clang-build/lib/libclangFrontend.a(InitPreprocessor.cpp.o)) was built for newer OSX version (10.14) than being linked (10.12)
ld: warning: object file (/Users/buildslave/jenkins/workspace/lldb-cmake-standalone/clang-build/lib/libclangFrontend.a(TestModuleFileExtension.cpp.o)) was built for newer OSX version (10.14) than being linked (10.12)
ld: warning: object file (/Users/buildslave/jenkins/workspace/lldb-cmake-standalone/clang-build/lib/libclangFrontend.a(InitHeaderSearch.cpp.o)) was built for newer OSX version (10.14) than being linked (10.12)
ld: warning: object file (/Users/buildslave/jenkins/workspace/lldb-cmake-standalone/clang-build/lib/libclangFrontend.a(DependencyGraph.cpp.o)) was built for newer OSX version (10.14) than being linked (10.12)
ld: warning: object file (/Users/buildslave/jenkins/workspace/lldb-cmake-standalone/clang-build/lib/libclangFrontend.a(PrintPreprocessedOutput.cpp.o)) was built for newer OSX version (10.14) than being linked (10.12)
ld: warning: object file (/Users/buildslave/jenkins/workspace/lldb-cmake-standalone/clang-build/lib/libclangBasic.a(SanitizerSpecialCaseList.cpp.o)) was built for newer OSX version (10.14) than being linked (10.12)
ld: warning: object file (/Users/buildslave/jenkins/workspace/lldb-cmake-standalone/clang-build/lib/libclangFrontend.a(VerifyDiagnosticConsumer.cpp.o)) was built for newer OSX version (10.14) than being linked (10.12)
ld: warning: object file (/Users/buildslave/jenkins/workspace/lldb-cmake-standalone/clang-build/lib/libclangSerialization.a(ASTCommon.cpp.o)) was built for newer OSX version (10.14) than being linked (10.12)
ld: warning: object file (/Users/buildslave/jenkins/workspace/lldb-cmake-standalone/clang-build/lib/libclangSema.a(MultiplexExternalSemaSource.cpp.o)) was built for newer OSX version (10.14) than being linked (10.12)
ld: warning: object file (/Users/buildslave/jenkins/workspace/lldb-cmake-standalone/clang-build/lib/libclangFrontend.a(ChainedIncludesSource.cpp.o)) was built for newer OSX version (10.14) than being linked (10.12)
ld: warning: object file (/Users/buildslave/jenkins/workspace/lldb-cmake-standalone/clang-build/lib/libclangAST.a(ASTStructuralEquivalence.cpp.o)) was built for newer OSX version (10.14) than being linked (10.12)
ld: warning: object file (/Users/buildslave/jenkins/workspace/lldb-cmake-standalone/clang-build/lib/libclangAST.a(ASTDiagnostic.cpp.o)) was built for newer OSX version (10.14) than being linked (10.12)
ld: warning: object file (/Users/buildslave/jenkins/workspace/lldb-cmake-standalone/clang-build/lib/libclangLex.a(DependencyDirectivesSourceMinimizer.cpp.o)) was built for newer OSX version (10.14) than being linked (10.12)
ld: warning: object file (/Users/buildslave/jenkins/workspace/lldb-cmake-standalone/clang-build/lib/libclangSema.a(SemaDecl.cpp.o)) was built for newer OSX version (10.14) than being linked (10.12)
ld: warning: object file (/Users/buildslave/jenkins/workspace/lldb-cmake-standalone/clang-build/lib/libclangSema.a(SemaStmt.cpp.o)) was built for newer OSX version (10.14) than being linked (10.12)
ld: warning: object file (/Users/buildslave/jenkins/workspace/lldb-cmake-standalone/clang-build/lib/libclangSema.a(SemaExpr.cpp.o)) was built for newer OSX version (10.14) than being linked (10.12)
ld: warning: object file (/Users/buildslave/jenkins/workspace/lldb-cmake-standalone/clang-build/lib/libclangSema.a(SemaModule.cpp.o)) was built for newer OSX version (10.14) than being linked (10.12)
ld: warning: object file (/Users/buildslave/jenkins/workspace/lldb-cmake-standalone/clang-build/lib/libclangSema.a(SemaAttr.cpp.o)) was built for newer OSX version (10.14) than being linked (10.12)
ld: warning: object file (/Users/buildslave/jenkins/workspace/lldb-cmake-standalone/clang-build/lib/libclangSema.a(SemaDeclCXX.cpp.o)) was built for newer OSX version (10.14) than being linked (10.12)
ld: warning: object file (/Users/buildslave/jenkins/workspace/lldb-cmake-standalone/clang-build/lib/libclangSema.a(SemaTemplate.cpp.o)) was built for newer OSX version (10.14) than being linked (10.12)
ld: warning: object file (/Users/buildslave/jenkins/workspace/lldb-cmake-standalone/clang-build/lib/libclangSema.a(SemaCUDA.cpp.o)) was built for newer OSX version (10.14) than being linked (10.12)
ld: warning: object file (/Users/buildslave/jenkins/workspace/lldb-cmake-standalone/clang-build/lib/libclangSema.a(SemaCXXScopeSpec.cpp.o)) was built for newer OSX version (10.14) than being linked (10.12)
ld: warning: object file (/Users/buildslave/jenkins/workspace/lldb-cmake-standalone/clang-build/lib/libclangSema.a(SemaType.cpp.o)) was built for newer OSX version (10.14) than being linked (10.12)
ld: warning: object file (/Users/buildslave/jenkins/workspace/lldb-cmake-standalone/clang-build/lib/libclangSema.a(SemaTemplateInstantiateDecl.cpp.o)) was built for newer OSX version (10.14) than being linked (10.12)
ld: warning: object file (/Users/buildslave/jenkins/workspace/lldb-cmake-standalone/clang-build/lib/libclangSema.a(SemaExceptionSpec.cpp.o)) was built for newer OSX version (10.14) than being linked (10.12)
ld: warning: object file (/Users/buildslave/jenkins/workspace/lldb-cmake-standalone/clang-build/lib/libclangSema.a(SemaOpenMP.cpp.o)) was built for newer OSX version (10.14) than being linked (10.12)
ld: warning: object file (/Users/buildslave/jenkins/workspace/lldb-cmake-standalone/clang-build/lib/libclangSema.a(SemaDeclAttr.cpp.o)) was built for newer OSX version (10.14) than being linked (10.12)
ld: warning: object file (/Users/buildslave/jenkins/workspace/lldb-cmake-standalone/clang-build/lib/libclangSema.a(SemaExprCXX.cpp.o)) was built for newer OSX version (10.14) than being linked (10.12)
ld: warning: object file (/Users/buildslave/jenkins/workspace/lldb-cmake-standalone/clang-build/lib/libclangSema.a(SemaTemplateDeduction.cpp.o)) was built for newer OSX version (10.14) than being linked (10.12)
ld: warning: object file (/Users/buildslave/jenkins/workspace/lldb-cmake-standalone/clang-build/lib/libclangSema.a(SemaTemplateInstantiate.cpp.o)) was built for newer OSX version (10.14) than being linked (10.12)
ld: warning: object file (/Users/buildslave/jenkins/workspace/lldb-cmake-standalone/clang-build/lib/libclangSema.a(SemaCodeComplete.cpp.o)) was built for newer OSX version (10.14) than being linked (10.12)
ld: warning: object file (/Users/buildslave/jenkins/workspace/lldb-cmake-standalone/clang-build/lib/libclangSema.a(SemaInit.cpp.o)) was built for newer OSX version (10.14) than being linked (10.12)
ld: warning: object file (/Users/buildslave/jenkins/workspace/lldb-cmake-standalone/clang-build/lib/libclangSema.a(SemaDeclObjC.cpp.o)) was built for newer OSX version (10.14) than being linked (10.12)
ld: warning: object file (/Users/buildslave/jenkins/workspace/lldb-cmake-standalone/clang-build/lib/libclangEdit.a(EditedSource.cpp.o)) was built for newer OSX version (10.14) than being linked (10.12)
ld: warning: object file (/Users/buildslave/jenkins/workspace/lldb-cmake-standalone/clang-build/lib/libclangEdit.a(Commit.cpp.o)) was built for newer OSX version (10.14) than being linked (10.12)
ld: warning: object file (/Users/buildslave/jenkins/workspace/lldb-cmake-standalone/clang-build/lib/libclangSema.a(DelayedDiagnostic.cpp.o)) was built for newer OSX version (10.14) than being linked (10.12)
ld: warning: object file (/Users/buildslave/jenkins/workspace/lldb-cmake-standalone/clang-build/lib/libclangSema.a(ScopeInfo.cpp.o)) was built for newer OSX version (10.14) than being linked (10.12)
ld: warning: object file (/Users/buildslave/jenkins/workspace/lldb-cmake-standalone/clang-build/lib/libclangSema.a(AnalysisBasedWarnings.cpp.o)) was built for newer OSX version (10.14) than being linked (10.12)
ld: warning: object file (/Users/buildslave/jenkins/workspace/lldb-cmake-standalone/clang-build/lib/libclangAST.a(NSAPI.cpp.o)) was built for newer OSX version (10.14) than being linked (10.12)
ld: warning: object file (/Users/buildslave/jenkins/workspace/lldb-cmake-standalone/clang-build/lib/libclangSema.a(Scope.cpp.o)) was built for newer OSX version (10.14) than being linked (10.12)
ld: warning: object file (/Users/buildslave/jenkins/workspace/lldb-cmake-standalone/clang-build/lib/libclangParse.a(ParseDeclCXX.cpp.o)) was built for newer OSX version (10.14) than being linked (10.12)
ld: warning: object file (/Users/buildslave/jenkins/workspace/lldb-cmake-standalone/clang-build/lib/libclangParse.a(ParsePragma.cpp.o)) was built for newer OSX version (10.14) than being linked (10.12)
ld: warning: object file (/Users/buildslave/jenkins/workspace/lldb-cmake-standalone/clang-build/lib/libclangParse.a(ParseDecl.cpp.o)) was built for newer OSX version (10.14) than being linked (10.12)
ld: warning: object file (/Users/buildslave/jenkins/workspace/lldb-cmake-standalone/clang-build/lib/libclangParse.a(ParseExprCXX.cpp.o)) was built for newer OSX version (10.14) than being linked (10.12)
ld: warning: object file (/Users/buildslave/jenkins/workspace/lldb-cmake-standalone/clang-build/lib/libclangParse.a(ParseStmt.cpp.o)) was built for newer OSX version (10.14) than being linked (10.12)
ld: warning: object file (/Users/buildslave/jenkins/workspace/lldb-cmake-standalone/clang-build/lib/libclangParse.a(ParseObjc.cpp.o)) was built for newer OSX version (10.14) than being linked (10.12)
ld: warning: object file (/Users/buildslave/jenkins/workspace/lldb-cmake-standalone/clang-build/lib/libclangParse.a(ParseTentative.cpp.o)) was built for newer OSX version (10.14) than being linked (10.12)
ld: warning: object file (/Users/buildslave/jenkins/workspace/lldb-cmake-standalone/clang-build/lib/libclangParse.a(ParseTemplate.cpp.o)) was built for newer OSX version (10.14) than being linked (10.12)
ld: warning: object file (/Users/buildslave/jenkins/workspace/lldb-cmake-standalone/clang-build/lib/libclangParse.a(ParseExpr.cpp.o)) was built for newer OSX version (10.14) than being linked (10.12)
ld: warning: object file (/Users/buildslave/jenkins/workspace/lldb-cmake-standalone/clang-build/lib/libclangParse.a(ParseCXXInlineMethods.cpp.o)) was built for newer OSX version (10.14) than being linked (10.12)
ld: warning: object file (/Users/buildslave/jenkins/workspace/lldb-cmake-standalone/clang-build/lib/libclangParse.a(ParseOpenMP.cpp.o)) was built for newer OSX version (10.14) than being linked (10.12)
ld: warning: object file (/Users/buildslave/jenkins/workspace/lldb-cmake-standalone/clang-build/lib/libclangDriver.a(Darwin.cpp.o)) was built for newer OSX version (10.14) than being linked (10.12)
ld: warning: object file (/Users/buildslave/jenkins/workspace/lldb-cmake-standalone/clang-build/lib/libclangDriver.a(Gnu.cpp.o)) was built for newer OSX version (10.14) than being linked (10.12)
ld: warning: object file (/Users/buildslave/jenkins/workspace/lldb-cmake-standalone/clang-build/lib/libclangDriver.a(WebAssembly.cpp.o)) was built for newer OSX version (10.14) than being linked (10.12)
ld: warning: object file (/Users/buildslave/jenkins/workspace/lldb-cmake-standalone/clang-build/lib/libclangDriver.a(AVR.cpp.o)) was built for newer OSX version (10.14) than being linked (10.12)
ld: warning: object file (/Users/buildslave/jenkins/workspace/lldb-cmake-standalone/clang-build/lib/libclangDriver.a(HIP.cpp.o)) was built for newer OSX version (10.14) than being linked (10.12)
ld: warning: object file (/Users/buildslave/jenkins/workspace/lldb-cmake-standalone/clang-build/lib/libclangDriver.a(TCE.cpp.o)) was built for newer OSX version (10.14) than being linked (10.12)
ld: warning: object file (/Users/buildslave/jenkins/workspace/lldb-cmake-standalone/clang-build/lib/libclangDriver.a(Cuda.cpp.o)) was built for newer OSX version (10.14) than being linked (10.12)
ld: warning: object file (/Users/buildslave/jenkins/workspace/lldb-cmake-standalone/clang-build/lib/libclangDriver.a(NaCl.cpp.o)) was built for newer OSX version (10.14) than being linked (10.12)
ld: warning: object file (/Users/buildslave/jenkins/workspace/lldb-cmake-standalone/clang-build/lib/libclangDriver.a(RISCVToolchain.cpp.o)) was built for newer OSX version (10.14) than being linked (10.12)
ld: warning: object file (/Users/buildslave/jenkins/workspace/lldb-cmake-standalone/clang-build/lib/libclangDriver.a(XCore.cpp.o)) was built for newer OSX version (10.14) than being linked (10.12)
ld: warning: object file (/Users/buildslave/jenkins/workspace/lldb-cmake-standalone/clang-build/lib/libclangDriver.a(Myriad.cpp.o)) was built for newer OSX version (10.14) than being linked (10.12)
ld: warning: object file (/Users/buildslave/jenkins/workspace/lldb-cmake-standalone/clang-build/lib/libclangDriver.a(MipsLinux.cpp.o)) was built for newer OSX version (10.14) than being linked (10.12)
ld: warning: object file (/Users/buildslave/jenkins/workspace/lldb-cmake-standalone/clang-build/lib/libclangDriver.a(CrossWindows.cpp.o)) was built for newer OSX version (10.14) than being linked (10.12)
ld: warning: object file (/Users/buildslave/jenkins/workspace/lldb-cmake-standalone/clang-build/lib/libclangDriver.a(AIX.cpp.o)) was built for newer OSX version (10.14) than being linked (10.12)
ld: warning: object file (/Users/buildslave/jenkins/workspace/lldb-cmake-standalone/clang-build/lib/libclangDriver.a(Hurd.cpp.o)) was built for newer OSX version (10.14) than being linked (10.12)
ld: warning: object file (/Users/buildslave/jenkins/workspace/lldb-cmake-standalone/clang-build/lib/libclangDriver.a(Haiku.cpp.o)) was built for newer OSX version (10.14) than being linked (10.12)
ld: warning: object file (/Users/buildslave/jenkins/workspace/lldb-cmake-standalone/clang-build/lib/libclangDriver.a(Linux.cpp.o)) was built for newer OSX version (10.14) than being linked (10.12)
ld: warning: object file (/Users/buildslave/jenkins/workspace/lldb-cmake-standalone/clang-build/lib/libclangDriver.a(MinGW.cpp.o)) was built for newer OSX version (10.14) than being linked (10.12)
ld: warning: object file (/Users/buildslave/jenkins/workspace/lldb-cmake-standalone/clang-build/lib/libclangDriver.a(Minix.cpp.o)) was built for newer OSX version (10.14) than being linked (10.12)
ld: warning: object file (/Users/buildslave/jenkins/workspace/lldb-cmake-standalone/clang-build/lib/libclangDriver.a(Ananas.cpp.o)) was built for newer OSX version (10.14) than being linked (10.12)
ld: warning: object file (/Users/buildslave/jenkins/workspace/lldb-cmake-standalone/clang-build/lib/libclangDriver.a(NetBSD.cpp.o)) was built for newer OSX version (10.14) than being linked (10.12)
ld: warning: object file (/Users/buildslave/jenkins/workspace/lldb-cmake-standalone/clang-build/lib/libclangDriver.a(Contiki.cpp.o)) was built for newer OSX version (10.14) than being linked (10.12)
ld: warning: object file (/Users/buildslave/jenkins/workspace/lldb-cmake-standalone/clang-build/lib/libclangDriver.a(FreeBSD.cpp.o)) was built for newer OSX version (10.14) than being linked (10.12)
ld: warning: object file (/Users/buildslave/jenkins/workspace/lldb-cmake-standalone/clang-build/lib/libclangDriver.a(Fuchsia.cpp.o)) was built for newer OSX version (10.14) than being linked (10.12)
ld: warning: object file (/Users/buildslave/jenkins/workspace/lldb-cmake-standalone/clang-build/lib/libclangDriver.a(OpenBSD.cpp.o)) was built for newer OSX version (10.14) than being linked (10.12)
ld: warning: object file (/Users/buildslave/jenkins/workspace/lldb-cmake-standalone/clang-build/lib/libclangDriver.a(Solaris.cpp.o)) was built for newer OSX version (10.14) than being linked (10.12)
ld: warning: object file (/Users/buildslave/jenkins/workspace/lldb-cmake-standalone/clang-build/lib/libclangDriver.a(CloudABI.cpp.o)) was built for newer OSX version (10.14) than being linked (10.12)
ld: warning: object file (/Users/buildslave/jenkins/workspace/lldb-cmake-standalone/clang-build/lib/libclangDriver.a(BareMetal.cpp.o)) was built for newer OSX version (10.14) than being linked (10.12)
ld: warning: object file (/Users/buildslave/jenkins/workspace/lldb-cmake-standalone/clang-build/lib/libclangDriver.a(DragonFly.cpp.o)) was built for newer OSX version (10.14) than being linked (10.12)
ld: warning: object file (/Users/buildslave/jenkins/workspace/lldb-cmake-standalone/clang-build/lib/libclangDriver.a(DriverOptions.cpp.o)) was built for newer OSX version (10.14) than being linked (10.12)
ld: warning: object file (/Users/buildslave/jenkins/workspace/lldb-cmake-standalone/clang-build/lib/libclangDriver.a(Flang.cpp.o)) was built for newer OSX version (10.14) than being linked (10.12)
ld: warning: object file (/Users/buildslave/jenkins/workspace/lldb-cmake-standalone/clang-build/lib/libclangDriver.a(Phases.cpp.o)) was built for newer OSX version (10.14) than being linked (10.12)
ld: warning: object file (/Users/buildslave/jenkins/workspace/lldb-cmake-standalone/clang-build/lib/libclangDriver.a(Multilib.cpp.o)) was built for newer OSX version (10.14) than being linked (10.12)
ld: warning: object file (/Users/buildslave/jenkins/workspace/lldb-cmake-standalone/clang-build/lib/libclangAST.a(EvalEmitter.cpp.o)) was built for newer OSX version (10.14) than being linked (10.12)
ld: warning: object file (/Users/buildslave/jenkins/workspace/lldb-cmake-standalone/clang-build/lib/libclangAST.a(InterpFrame.cpp.o)) was built for newer OSX version (10.14) than being linked (10.12)
ld: warning: object file (/Users/buildslave/jenkins/workspace/lldb-cmake-standalone/clang-build/lib/libclangAST.a(InterpStack.cpp.o)) was built for newer OSX version (10.14) than being linked (10.12)
ld: warning: object file (/Users/buildslave/jenkins/workspace/lldb-cmake-standalone/clang-build/lib/libclangAST.a(InterpState.cpp.o)) was built for newer OSX version (10.14) than being linked (10.12)
ld: warning: object file (/Users/buildslave/jenkins/workspace/lldb-cmake-standalone/clang-build/lib/libclangAST.a(ByteCodeEmitter.cpp.o)) was built for newer OSX version (10.14) than being linked (10.12)
ld: warning: object file (/Users/buildslave/jenkins/workspace/lldb-cmake-standalone/clang-build/lib/libclangAST.a(ByteCodeExprGen.cpp.o)) was built for newer OSX version (10.14) than being linked (10.12)
ld: warning: object file (/Users/buildslave/jenkins/workspace/lldb-cmake-standalone/clang-build/lib/libclangAST.a(ByteCodeStmtGen.cpp.o)) was built for newer OSX version (10.14) than being linked (10.12)
ld: warning: object file (/Users/buildslave/jenkins/workspace/lldb-cmake-standalone/clang-build/lib/libclangAST.a(ByteCodeGenError.cpp.o)) was built for newer OSX version (10.14) than being linked (10.12)
ld: warning: object file (/Users/buildslave/jenkins/workspace/lldb-cmake-standalone/clang-build/lib/libclangAST.a(Pointer.cpp.o)) was built for newer OSX version (10.14) than being linked (10.12)
ld: warning: object file (/Users/buildslave/jenkins/workspace/lldb-cmake-standalone/clang-build/lib/libclangAST.a(Program.cpp.o)) was built for newer OSX version (10.14) than being linked (10.12)
ld: warning: object file (/Users/buildslave/jenkins/workspace/lldb-cmake-standalone/clang-build/lib/libclangAST.a(Interp.cpp.o)) was built for newer OSX version (10.14) than being linked (10.12)
ld: warning: object file (/Users/buildslave/jenkins/workspace/lldb-cmake-standalone/clang-build/lib/libclangFrontend.a(ASTUnit.cpp.o)) was built for newer OSX version (10.14) than being linked (10.12)
ld: warning: object file (/Users/buildslave/jenkins/workspace/lldb-cmake-standalone/clang-build/lib/libclangSema.a(DeclSpec.cpp.o)) was built for newer OSX version (10.14) than being linked (10.12)
ld: warning: object file (/Users/buildslave/jenkins/workspace/lldb-cmake-standalone/clang-build/lib/libclangParse.a(ParseAST.cpp.o)) was built for newer OSX version (10.14) than being linked (10.12)
ld: warning: object file (/Users/buildslave/jenkins/workspace/lldb-cmake-standalone/clang-build/lib/libclangRewrite.a(Rewriter.cpp.o)) was built for newer OSX version (10.14) than being linked (10.12)
ld: warning: object file (/Users/buildslave/jenkins/workspace/lldb-cmake-standalone/clang-build/lib/libclangAST.a(CommentBriefParser.cpp.o)) was built for newer OSX version (10.14) than being linked (10.12)
ld: warning: object file (/Users/buildslave/jenkins/workspace/lldb-cmake-standalone/clang-build/lib/libclangAST.a(CommentSema.cpp.o)) was built for newer OSX version (10.14) than being linked (10.12)
ld: warning: object file (/Users/buildslave/jenkins/workspace/lldb-cmake-standalone/clang-build/lib/libclangAST.a(CommentLexer.cpp.o)) was built for newer OSX version (10.14) than being linked (10.12)
ld: warning: object file (/Users/buildslave/jenkins/workspace/lldb-cmake-standalone/clang-build/lib/libclangAST.a(CommentParser.cpp.o)) was built for newer OSX version (10.14) than being linked (10.12)
ld: warning: object file (/Users/buildslave/jenkins/workspace/lldb-cmake-standalone/clang-build/lib/libclangAST.a(DeclGroup.cpp.o)) was built for newer OSX version (10.14) than being linked (10.12)
ld: warning: object file (/Users/buildslave/jenkins/workspace/lldb-cmake-standalone/clang-build/lib/libclangRewrite.a(DeltaTree.cpp.o)) was built for newer OSX version (10.14) than being linked (10.12)
ld: warning: object file (/Users/buildslave/jenkins/workspace/lldb-cmake-standalone/clang-build/lib/libclangLex.a(HeaderMap.cpp.o)) was built for newer OSX version (10.14) than being linked (10.12)
ld: warning: object file (/Users/buildslave/jenkins/workspace/lldb-cmake-standalone/clang-build/lib/libclangLex.a(MacroArgs.cpp.o)) was built for newer OSX version (10.14) than being linked (10.12)
ld: warning: object file (/Users/buildslave/jenkins/workspace/lldb-cmake-standalone/clang-build/lib/libclangBasic.a(DiagnosticOptions.cpp.o)) was built for newer OSX version (10.14) than being linked (10.12)
ld: warning: object file (/Users/buildslave/jenkins/workspace/lldb-cmake-standalone/clang-build/lib/libLLVMMC.a(MCAsmMacro.cpp.o)) was built for newer OSX version (10.14) than being linked (10.12)
ld: warning: object file (/Users/buildslave/jenkins/workspace/lldb-cmake-standalone/clang-build/lib/libLLVMDebugInfoDWARF.a(DWARFAddressRange.cpp.o)) was built for newer OSX version (10.14) than being linked (10.12)
ld: warning: object file (/Users/buildslave/jenkins/workspace/lldb-cmake-standalone/clang-build/lib/libLLVMCore.a(ModuleSummaryIndex.cpp.o)) was built for newer OSX version (10.14) than being linked (10.12)
ld: warning: object file (/Users/buildslave/jenkins/workspace/lldb-cmake-standalone/clang-build/lib/libLLVMAnalysis.a(OrderedInstructions.cpp.o)) was built for newer OSX version (10.14) than being linked (10.12)
ld: warning: object file (/Users/buildslave/jenkins/workspace/lldb-cmake-standalone/clang-build/lib/libLLVMDebugInfoDWARF.a(DWARFAbbreviationDeclaration.cpp.o)) was built for newer OSX version (10.14) than being linked (10.12)
ld: warning: object file (/Users/buildslave/jenkins/workspace/lldb-cmake-standalone/clang-build/lib/libclangAST.a(StmtOpenMP.cpp.o)) was built for newer OSX version (10.14) than being linked (10.12)
ld: warning: object file (/Users/buildslave/jenkins/workspace/lldb-cmake-standalone/clang-build/lib/libclangAST.a(Source.cpp.o)) was built for newer OSX version (10.14) than being linked (10.12)
ld: warning: object file (/Users/buildslave/jenkins/workspace/lldb-cmake-standalone/clang-build/lib/libclangAST.a(Function.cpp.o)) was built for newer OSX version (10.14) than being linked (10.12)
ld: warning: object file (/Users/buildslave/jenkins/workspace/lldb-cmake-standalone/clang-build/lib/libLLVMDebugInfoDWARF.a(DWARFTypeUnit.cpp.o)) was built for newer OSX version (10.14) than being linked (10.12)
ld: warning: object file (/Users/buildslave/jenkins/workspace/lldb-cmake-standalone/clang-build/lib/libLLVMDebugInfoDWARF.a(DWARFCompileUnit.cpp.o)) was built for newer OSX version (10.14) than being linked (10.12)
ld: warning: object file (/Users/buildslave/jenkins/workspace/lldb-cmake-standalone/clang-build/lib/libLLVMCore.a(DiagnosticHandler.cpp.o)) was built for newer OSX version (10.14) than being linked (10.12)
ld: warning: object file (/Users/buildslave/jenkins/workspace/lldb-cmake-standalone/clang-build/lib/libLLVMLanaiCodeGen.a(LanaiMachineFunctionInfo.cpp.o)) was built for newer OSX version (10.14) than being linked (10.12)
ld: warning: object file (/Users/buildslave/jenkins/workspace/lldb-cmake-standalone/clang-build/lib/libLLVMMSP430CodeGen.a(MSP430MachineFunctionInfo.cpp.o)) was built for newer OSX version (10.14) than being linked (10.12)
ld: warning: object file (/Users/buildslave/jenkins/workspace/lldb-cmake-standalone/clang-build/lib/libclangLex.a(PPCallbacks.cpp.o)) was built for newer OSX version (10.14) than being linked (10.12)
ld: warning: object file (/Users/buildslave/jenkins/workspace/lldb-cmake-standalone/clang-build/lib/libclangFrontend.a(ChainedDiagnosticConsumer.cpp.o)) was built for newer OSX version (10.14) than being linked (10.12)
ld: warning: object file (/Users/buildslave/jenkins/workspace/lldb-cmake-standalone/clang-build/lib/libclangDriver.a(PPCLinux.cpp.o)) was built for newer OSX version (10.14) than being linked (10.12)
ld: warning: object file (/Users/buildslave/jenkins/workspace/lldb-cmake-standalone/clang-build/lib/libclangDriver.a(InterfaceStubs.cpp.o)) was built for newer OSX version (10.14) than being linked (10.12)
ld: warning: object file (/Users/buildslave/jenkins/workspace/lldb-cmake-standalone/clang-build/lib/libLLVMCodeGen.a(MIRVRegNamerUtils.cpp.o)) was built for newer OSX version (10.14) than being linked (10.12)
ld: warning: object file (/Users/buildslave/jenkins/workspace/lldb-cmake-standalone/clang-build/lib/libLLVMDebugInfoCodeView.a(TypeHashing.cpp.o)) was built for newer OSX version (10.14) than being linked (10.12)
ld: warning: object file (/Users/buildslave/jenkins/workspace/lldb-cmake-standalone/clang-build/lib/libLLVMSelectionDAG.a(InstrEmitter.cpp.o)) was built for newer OSX version (10.14) than being linked (10.12)
ld: warning: object file (/Users/buildslave/jenkins/workspace/lldb-cmake-standalone/clang-build/lib/libLLVMBitReader.a(BitcodeReader.cpp.o)) was built for newer OSX version (10.14) than being linked (10.12)
ld: warning: object file (/Users/buildslave/jenkins/workspace/lldb-cmake-standalone/clang-build/lib/libLLVMBitstreamReader.a(BitstreamReader.cpp.o)) was built for newer OSX version (10.14) than being linked (10.12)
ld: warning: object file (/Users/buildslave/jenkins/workspace/lldb-cmake-standalone/clang-build/lib/libLLVMCore.a(AutoUpgrade.cpp.o)) was built for newer OSX version (10.14) than being linked (10.12)
ld: warning: object file (/Users/buildslave/jenkins/workspace/lldb-cmake-standalone/clang-build/lib/libLLVMSelectionDAG.a(LegalizeFloatTypes.cpp.o)) was built for newer OSX version (10.14) than being linked (10.12)
ld: warning: object file (/Users/buildslave/jenkins/workspace/lldb-cmake-standalone/clang-build/lib/libLLVMSelectionDAG.a(LegalizeVectorTypes.cpp.o)) was built for newer OSX version (10.14) than being linked (10.12)
ld: warning: object file (/Users/buildslave/jenkins/workspace/lldb-cmake-standalone/clang-build/lib/libLLVMSelectionDAG.a(LegalizeIntegerTypes.cpp.o)) was built for newer OSX version (10.14) than being linked (10.12)
ld: warning: object file (/Users/buildslave/jenkins/workspace/lldb-cmake-standalone/clang-build/lib/libLLVMObject.a(ModuleSymbolTable.cpp.o)) was built for newer OSX version (10.14) than being linked (10.12)
ld: warning: object file (/Users/buildslave/jenkins/workspace/lldb-cmake-standalone/clang-build/lib/libLLVMSupport.a(ARMAttributeParser.cpp.o)) was built for newer OSX version (10.14) than being linked (10.12)
ld: warning: object file (/Users/buildslave/jenkins/workspace/lldb-cmake-standalone/clang-build/lib/libLLVMMipsCodeGen.a(Mips16RegisterInfo.cpp.o)) was built for newer OSX version (10.14) than being linked (10.12)
ld: warning: object file (/Users/buildslave/jenkins/workspace/lldb-cmake-standalone/clang-build/lib/libLLVMMipsCodeGen.a(MipsSERegisterInfo.cpp.o)) was built for newer OSX version (10.14) than being linked (10.12)
ld: warning: object file (/Users/buildslave/jenkins/workspace/lldb-cmake-standalone/clang-build/lib/libLLVMMipsCodeGen.a(Mips16HardFloatInfo.cpp.o)) was built for newer OSX version (10.14) than being linked (10.12)
ld: warning: object file (/Users/buildslave/jenkins/workspace/lldb-cmake-standalone/clang-build/lib/libLLVMRuntimeDyld.a(RTDyldMemoryManager.cpp.o)) was built for newer OSX version (10.14) than being linked (10.12)
ld: warning: object file (/Users/buildslave/jenkins/workspace/lldb-cmake-standalone/clang-build/lib/libLLVMSupport.a(FileUtilities.cpp.o)) was built for newer OSX version (10.14) than being linked (10.12)
ld: warning: object file (/Users/buildslave/jenkins/workspace/lldb-cmake-standalone/clang-build/lib/libLLVMSelectionDAG.a(ResourcePriorityQueue.cpp.o)) was built for newer OSX version (10.14) than being linked (10.12)
ld: warning: object file (/Users/buildslave/jenkins/workspace/lldb-cmake-standalone/clang-build/lib/libLLVMRuntimeDyld.a(RuntimeDyld.cpp.o)) was built for newer OSX version (10.14) than being linked (10.12)
ld: warning: object file (/Users/buildslave/jenkins/workspace/lldb-cmake-standalone/clang-build/lib/libLLVMAnalysis.a(LazyBranchProbabilityInfo.cpp.o)) was built for newer OSX version (10.14) than being linked (10.12)
ld: warning: object file (/Users/buildslave/jenkins/workspace/lldb-cmake-standalone/clang-build/lib/libLLVMDebugInfoMSF.a(MSFError.cpp.o)) was built for newer OSX version (10.14) than being linked (10.12)
ld: warning: object file (/Users/buildslave/jenkins/workspace/lldb-cmake-standalone/clang-build/lib/libLLVMDebugInfoPDB.a(NativeTypeUDT.cpp.o)) was built for newer OSX version (10.14) than being linked (10.12)
ld: warning: object file (/Users/buildslave/jenkins/workspace/lldb-cmake-standalone/clang-build/lib/libLLVMDebugInfoPDB.a(NativeTypeEnum.cpp.o)) was built for newer OSX version (10.14) than being linked (10.12)
ld: warning: object file (/Users/buildslave/jenkins/workspace/lldb-cmake-standalone/clang-build/lib/libLLVMDebugInfoPDB.a(NativeEnumTypes.cpp.o)) was built for newer OSX version (10.14) than being linked (10.12)
ld: warning: object file (/Users/buildslave/jenkins/workspace/lldb-cmake-standalone/clang-build/lib/libLLVMDebugInfoPDB.a(NativeRawSymbol.cpp.o)) was built for newer OSX version (10.14) than being linked (10.12)
ld: warning: object file (/Users/buildslave/jenkins/workspace/lldb-cmake-standalone/clang-build/lib/libLLVMDebugInfoPDB.a(NativeTypeArray.cpp.o)) was built for newer OSX version (10.14) than being linked (10.12)
ld: warning: object file (/Users/buildslave/jenkins/workspace/lldb-cmake-standalone/clang-build/lib/libLLVMDebugInfoPDB.a(NativeEnumGlobals.cpp.o)) was built for newer OSX version (10.14) than being linked (10.12)
ld: warning: object file (/Users/buildslave/jenkins/workspace/lldb-cmake-standalone/clang-build/lib/libLLVMDebugInfoPDB.a(NativeEnumModules.cpp.o)) was built for newer OSX version (10.14) than being linked (10.12)
ld: warning: object file (/Users/buildslave/jenkins/workspace/lldb-cmake-standalone/clang-build/lib/libLLVMDebugInfoPDB.a(NativeTypeBuiltin.cpp.o)) was built for newer OSX version (10.14) than being linked (10.12)
ld: warning: object file (/Users/buildslave/jenkins/workspace/lldb-cmake-standalone/clang-build/lib/libLLVMDebugInfoPDB.a(NativeTypePointer.cpp.o)) was built for newer OSX version (10.14) than being linked (10.12)
ld: warning: object file (/Users/buildslave/jenkins/workspace/lldb-cmake-standalone/clang-build/lib/libLLVMDebugInfoPDB.a(NativeTypeTypedef.cpp.o)) was built for newer OSX version (10.14) than being linked (10.12)
ld: warning: object file (/Users/buildslave/jenkins/workspace/lldb-cmake-standalone/clang-build/lib/libLLVMDebugInfoPDB.a(NativeTypeVTShape.cpp.o)) was built for newer OSX version (10.14) than being linked (10.12)
ld: warning: object file (/Users/buildslave/jenkins/workspace/lldb-cmake-standalone/clang-build/lib/libLLVMDebugInfoPDB.a(NativeCompilandSymbol.cpp.o)) was built for newer OSX version (10.14) than being linked (10.12)
ld: warning: object file (/Users/buildslave/jenkins/workspace/lldb-cmake-standalone/clang-build/lib/libLLVMDebugInfoPDB.a(NativeTypeFunctionSig.cpp.o)) was built for newer OSX version (10.14) than being linked (10.12)
ld: warning: object file (/Users/buildslave/jenkins/workspace/lldb-cmake-standalone/clang-build/lib/libLLVMSupport.a(Memory.cpp.o)) was built for newer OSX version (10.14) than being linked (10.12)
ld: warning: object file (/Users/buildslave/jenkins/workspace/lldb-cmake-standalone/clang-build/lib/libLLVMSupport.a(UnicodeCaseFold.cpp.o)) was built for newer OSX version (10.14) than being linked (10.12)
ld: warning: object file (/Users/buildslave/jenkins/workspace/lldb-cmake-standalone/clang-build/lib/libLLVMBinaryFormat.a(Wasm.cpp.o)) was built for newer OSX version (10.14) than being linked (10.12)
ld: warning: object file (/Users/buildslave/jenkins/workspace/lldb-cmake-standalone/clang-build/lib/libLLVMTextAPI.a(TextStubCommon.cpp.o)) was built for newer OSX version (10.14) than being linked (10.12)
ld: warning: object file (/Users/buildslave/jenkins/workspace/lldb-cmake-standalone/clang-build/lib/libLLVMTextAPI.a(InterfaceFile.cpp.o)) was built for newer OSX version (10.14) than being linked (10.12)
ld: warning: object file (/Users/buildslave/jenkins/workspace/lldb-cmake-standalone/clang-build/lib/libLLVMTextAPI.a(ArchitectureSet.cpp.o)) was built for newer OSX version (10.14) than being linked (10.12)
ld: warning: object file (/Users/buildslave/jenkins/workspace/lldb-cmake-standalone/clang-build/lib/libLLVMTextAPI.a(Platform.cpp.o)) was built for newer OSX version (10.14) than being linked (10.12)
ld: warning: object file (/Users/buildslave/jenkins/workspace/lldb-cmake-standalone/clang-build/lib/libLLVMTextAPI.a(Architecture.cpp.o)) was built for newer OSX version (10.14) than being linked (10.12)
ld: warning: object file (/Users/buildslave/jenkins/workspace/lldb-cmake-standalone/clang-build/lib/libLLVMObject.a(ELF.cpp.o)) was built for newer OSX version (10.14) than being linked (10.12)
ld: warning: object file (/Users/buildslave/jenkins/workspace/lldb-cmake-standalone/clang-build/lib/libLLVMRemarks.a(YAMLRemarkSerializer.cpp.o)) was built for newer OSX version (10.14) than being linked (10.12)
ld: warning: object file (/Users/buildslave/jenkins/workspace/lldb-cmake-standalone/clang-build/lib/libLLVMRemarks.a(BitstreamRemarkSerializer.cpp.o)) was built for newer OSX version (10.14) than being linked (10.12)
ld: warning: object file (/Users/buildslave/jenkins/workspace/lldb-cmake-standalone/clang-build/lib/libLLVMDebugInfoCodeView.a(TypeIndexDiscovery.cpp.o)) was built for newer OSX version (10.14) than being linked (10.12)
ld: warning: object file (/Users/buildslave/jenkins/workspace/lldb-cmake-standalone/clang-build/lib/libLLVMDebugInfoCodeView.a(RecordSerialization.cpp.o)) was built for newer OSX version (10.14) than being linked (10.12)
ld: warning: object file (/Users/buildslave/jenkins/workspace/lldb-cmake-standalone/clang-build/lib/libLLVMObject.a(IRSymtab.cpp.o)) was built for newer OSX version (10.14) than being linked (10.12)
ld: warning: object file (/Users/buildslave/jenkins/workspace/lldb-cmake-standalone/clang-build/lib/libclangLex.a(PPExpressions.cpp.o)) was built for newer OSX version (10.14) than being linked (10.12)
ld: warning: object file (/Users/buildslave/jenkins/workspace/lldb-cmake-standalone/clang-build/lib/libclangAnalysis.a(ThreadSafetyCommon.cpp.o)) was built for newer OSX version (10.14) than being linked (10.12)
ld: warning: object file (/Users/buildslave/jenkins/workspace/lldb-cmake-standalone/clang-build/lib/libclangAnalysis.a(ThreadSafetyTIL.cpp.o)) was built for newer OSX version (10.14) than being linked (10.12)
ld: warning: object file (/Users/buildslave/jenkins/workspace/lldb-cmake-standalone/clang-build/lib/libclangSerialization.a(ModuleFile.cpp.o)) was built for newer OSX version (10.14) than being linked (10.12)
ld: warning: object file (/Users/buildslave/jenkins/workspace/lldb-cmake-standalone/clang-build/lib/libclangSerialization.a(ModuleManager.cpp.o)) was built for newer OSX version (10.14) than being linked (10.12)
ld: warning: object file (/Users/buildslave/jenkins/workspace/lldb-cmake-standalone/clang-build/lib/libclangFrontend.a(TextDiagnostic.cpp.o)) was built for newer OSX version (10.14) than being linked (10.12)
ld: warning: object file (/Users/buildslave/jenkins/workspace/lldb-cmake-standalone/clang-build/lib/libclangSema.a(TypeLocBuilder.cpp.o)) was built for newer OSX version (10.14) than being linked (10.12)
ld: warning: object file (/Users/buildslave/jenkins/workspace/lldb-cmake-standalone/clang-build/lib/libclangAnalysis.a(ReachableCode.cpp.o)) was built for newer OSX version (10.14) than being linked (10.12)
ld: warning: object file (/Users/buildslave/jenkins/workspace/lldb-cmake-standalone/clang-build/lib/libclangSerialization.a(ASTReaderDecl.cpp.o)) was built for newer OSX version (10.14) than being linked (10.12)
ld: warning: object file (/Users/buildslave/jenkins/workspace/lldb-cmake-standalone/clang-build/lib/libclangAST.a(DeclOpenMP.cpp.o)) was built for newer OSX version (10.14) than being linked (10.12)
ld: warning: object file (/Users/buildslave/jenkins/workspace/lldb-cmake-standalone/clang-build/lib/libclangAnalysis.a(PostOrderCFGView.cpp.o)) was built for newer OSX version (10.14) than being linked (10.12)
ld: warning: object file (/Users/buildslave/jenkins/workspace/lldb-cmake-standalone/clang-build/lib/libclangFrontend.a(SerializedDiagnosticReader.cpp.o)) was built for newer OSX version (10.14) than being linked (10.12)
ld: warning: object file (/Users/buildslave/jenkins/workspace/lldb-cmake-standalone/clang-build/lib/libclangFrontend.a(PrecompiledPreamble.cpp.o)) was built for newer OSX version (10.14) than being linked (10.12)
ld: warning: object file (/Users/buildslave/jenkins/workspace/lldb-cmake-standalone/clang-build/lib/libclangFrontend.a(DiagnosticRenderer.cpp.o)) was built for newer OSX version (10.14) than being linked (10.12)
ld: warning: object file (/Users/buildslave/jenkins/workspace/lldb-cmake-standalone/clang-build/lib/libclangLex.a(TokenConcatenation.cpp.o)) was built for newer OSX version (10.14) than being linked (10.12)
ld: warning: object file (/Users/buildslave/jenkins/workspace/lldb-cmake-standalone/clang-build/lib/libclangBasic.a(OperatorPrecedence.cpp.o)) was built for newer OSX version (10.14) than being linked (10.12)
ld: warning: object file (/Users/buildslave/jenkins/workspace/lldb-cmake-standalone/clang-build/lib/libclangAnalysis.a(AnalysisDeclContext.cpp.o)) was built for newer OSX version (10.14) than being linked (10.12)
ld: warning: object file (/Users/buildslave/jenkins/workspace/lldb-cmake-standalone/clang-build/lib/libclangSerialization.a(InMemoryModuleCache.cpp.o)) was built for newer OSX version (10.14) than being linked (10.12)
ld: warning: object file (/Users/buildslave/jenkins/workspace/lldb-cmake-standalone/clang-build/lib/libclangSerialization.a(ModuleFileExtension.cpp.o)) was built for newer OSX version (10.14) than being linked (10.12)
ld: warning: object file (/Users/buildslave/jenkins/workspace/lldb-cmake-standalone/clang-build/lib/libclangSema.a(SemaCoroutine.cpp.o)) was built for newer OSX version (10.14) than being linked (10.12)
ld: warning: object file (/Users/buildslave/jenkins/workspace/lldb-cmake-standalone/clang-build/lib/libclangAnalysis.a(UninitializedValues.cpp.o)) was built for newer OSX version (10.14) than being linked (10.12)
ld: warning: object file (/Users/buildslave/jenkins/workspace/lldb-cmake-standalone/clang-build/lib/libclangSema.a(SemaFixItUtils.cpp.o)) was built for newer OSX version (10.14) than being linked (10.12)
ld: warning: object file (/Users/buildslave/jenkins/workspace/lldb-cmake-standalone/clang-build/lib/libclangAnalysis.a(CFGReachabilityAnalysis.cpp.o)) was built for newer OSX version (10.14) than being linked (10.12)
ld: warning: object file (/Users/buildslave/jenkins/workspace/lldb-cmake-standalone/clang-build/lib/libclangSema.a(SemaExprObjC.cpp.o)) was built for newer OSX version (10.14) than being linked (10.12)
ld: warning: object file (/Users/buildslave/jenkins/workspace/lldb-cmake-standalone/clang-build/lib/libclangSema.a(SemaObjCProperty.cpp.o)) was built for newer OSX version (10.14) than being linked (10.12)
ld: warning: object file (/Users/buildslave/jenkins/workspace/lldb-cmake-standalone/clang-build/lib/libclangSema.a(SemaChecking.cpp.o)) was built for newer OSX version (10.14) than being linked (10.12)
ld: warning: object file (/Users/buildslave/jenkins/workspace/lldb-cmake-standalone/clang-build/lib/libclangSema.a(SemaStmtAsm.cpp.o)) was built for newer OSX version (10.14) than being linked (10.12)
ld: warning: object file (/Users/buildslave/jenkins/workspace/lldb-cmake-standalone/clang-build/lib/libclangSema.a(SemaLambda.cpp.o)) was built for newer OSX version (10.14) than being linked (10.12)
ld: warning: object file (/Users/buildslave/jenkins/workspace/lldb-cmake-standalone/clang-build/lib/libclangSema.a(SemaExprMember.cpp.o)) was built for newer OSX version (10.14) than being linked (10.12)
ld: warning: object file (/Users/buildslave/jenkins/workspace/lldb-cmake-standalone/clang-build/lib/libclangSema.a(SemaTemplateVariadic.cpp.o)) was built for newer OSX version (10.14) than being linked (10.12)
ld: warning: object file (/Users/buildslave/jenkins/workspace/lldb-cmake-standalone/clang-build/lib/libclangSema.a(SemaCast.cpp.o)) was built for newer OSX version (10.14) than being linked (10.12)
ld: warning: object file (/Users/buildslave/jenkins/workspace/lldb-cmake-standalone/clang-build/lib/libclangSema.a(JumpDiagnostics.cpp.o)) was built for newer OSX version (10.14) than being linked (10.12)
ld: warning: object file (/Users/buildslave/jenkins/workspace/lldb-cmake-standalone/clang-build/lib/libclangSema.a(SemaStmtAttr.cpp.o)) was built for newer OSX version (10.14) than being linked (10.12)
ld: warning: object file (/Users/buildslave/jenkins/workspace/lldb-cmake-standalone/clang-build/lib/libclangSema.a(SemaPseudoObject.cpp.o)) was built for newer OSX version (10.14) than being linked (10.12)
ld: warning: object file (/Users/buildslave/jenkins/workspace/lldb-cmake-standalone/clang-build/lib/libclangSema.a(SemaConcept.cpp.o)) was built for newer OSX version (10.14) than being linked (10.12)
ld: warning: object file (/Users/buildslave/jenkins/workspace/lldb-cmake-standalone/clang-build/lib/libclangParse.a(ParseStmtAsm.cpp.o)) was built for newer OSX version (10.14) than being linked (10.12)
ld: warning: object file (/Users/buildslave/jenkins/workspace/lldb-cmake-standalone/clang-build/lib/libclangParse.a(ParseInit.cpp.o)) was built for newer OSX version (10.14) than being linked (10.12)
ld: warning: object file (/Users/buildslave/jenkins/workspace/lldb-cmake-standalone/clang-build/lib/libclangDriver.a(DarwinSDKInfo.cpp.o)) was built for newer OSX version (10.14) than being linked (10.12)
ld: warning: object file (/Users/buildslave/jenkins/workspace/lldb-cmake-standalone/clang-build/lib/libclangAST.a(Descriptor.cpp.o)) was built for newer OSX version (10.14) than being linked (10.12)
ld: warning: object file (/Users/buildslave/jenkins/workspace/lldb-cmake-standalone/clang-build/lib/libclangAST.a(Block.cpp.o)) was built for newer OSX version (10.14) than being linked (10.12)
ld: warning: object file (/Users/buildslave/jenkins/workspace/lldb-cmake-standalone/clang-build/lib/libclangAST.a(Record.cpp.o)) was built for newer OSX version (10.14) than being linked (10.12)
ld: warning: object file (/Users/buildslave/jenkins/workspace/lldb-cmake-standalone/clang-build/lib/libclangAST.a(PrimType.cpp.o)) was built for newer OSX version (10.14) than being linked (10.12)
ld: warning: object file (/Users/buildslave/jenkins/workspace/lldb-cmake-standalone/clang-build/lib/libclangCodeGen.a(CGDebugInfo.cpp.o)) was built for newer OSX version (10.14) than being linked (10.12)
ld: warning: object file (/Users/buildslave/jenkins/workspace/lldb-cmake-standalone/clang-build/lib/libclangCodeGen.a(CodeGenModule.cpp.o)) was built for newer OSX version (10.14) than being linked (10.12)
ld: warning: object file (/Users/buildslave/jenkins/workspace/lldb-cmake-standalone/clang-build/lib/libclangCodeGen.a(CGVTables.cpp.o)) was built for newer OSX version (10.14) than being linked (10.12)
ld: warning: object file (/Users/buildslave/jenkins/workspace/lldb-cmake-standalone/clang-build/lib/libclangAnalysis.a(CFG.cpp.o)) was built for newer OSX version (10.14) than being linked (10.12)
ld: warning: object file (/Users/buildslave/jenkins/workspace/lldb-cmake-standalone/clang-build/lib/libclangAST.a(QualTypeNames.cpp.o)) was built for newer OSX version (10.14) than being linked (10.12)
ld: warning: object file (/Users/buildslave/jenkins/workspace/lldb-cmake-standalone/clang-build/lib/libclangAnalysis.a(Consumed.cpp.o)) was built for newer OSX version (10.14) than being linked (10.12)
ld: warning: object file (/Users/buildslave/jenkins/workspace/lldb-cmake-standalone/clang-build/lib/libclangSerialization.a(ASTReaderStmt.cpp.o)) was built for newer OSX version (10.14) than being linked (10.12)
ld: warning: object file (/Users/buildslave/jenkins/workspace/lldb-cmake-standalone/clang-build/lib/libclangSerialization.a(ASTWriter.cpp.o)) was built for newer OSX version (10.14) than being linked (10.12)
ld: warning: object file (/Users/buildslave/jenkins/workspace/lldb-cmake-standalone/clang-build/lib/libLLVMVectorize.a(VPlanVerifier.cpp.o)) was built for newer OSX version (10.14) than being linked (10.12)
ld: warning: object file (/Users/buildslave/jenkins/workspace/lldb-cmake-standalone/clang-build/lib/libLLVMMC.a(MCLinkerOptimizationHint.cpp.o)) was built for newer OSX version (10.14) than being linked (10.12)
ld: warning: object file (/Users/buildslave/jenkins/workspace/lldb-cmake-standalone/clang-build/lib/libclangLex.a(PPConditionalDirectiveRecord.cpp.o)) was built for newer OSX version (10.14) than being linked (10.12)
ld: warning: object file (/Users/buildslave/jenkins/workspace/lldb-cmake-standalone/clang-build/lib/libclangAST.a(StmtViz.cpp.o)) was built for newer OSX version (10.14) than being linked (10.12)
ld: warning: object file (/Users/buildslave/jenkins/workspace/lldb-cmake-standalone/clang-build/lib/libclangAST.a(ParentMap.cpp.o)) was built for newer OSX version (10.14) than being linked (10.12)
ld: warning: object file (/Users/buildslave/jenkins/workspace/lldb-cmake-standalone/clang-build/lib/libclangFrontend.a(TextDiagnosticBuffer.cpp.o)) was built for newer OSX version (10.14) than being linked (10.12)
ld: warning: object file (/Users/buildslave/jenkins/workspace/lldb-cmake-standalone/clang-build/lib/libLLVMCore.a(GVMaterializer.cpp.o)) was built for newer OSX version (10.14) than being linked (10.12)
ld: warning: object file (/Users/buildslave/jenkins/workspace/lldb-cmake-standalone/clang-build/lib/libLLVMBitReader.a(MetadataLoader.cpp.o)) was built for newer OSX version (10.14) than being linked (10.12)
ld: warning: object file (/Users/buildslave/jenkins/workspace/lldb-cmake-standalone/clang-build/lib/libLLVMObject.a(RecordStreamer.cpp.o)) was built for newer OSX version (10.14) than being linked (10.12)
ld: warning: object file (/Users/buildslave/jenkins/workspace/lldb-cmake-standalone/clang-build/lib/libLLVMRuntimeDyld.a(RuntimeDyldELF.cpp.o)) was built for newer OSX version (10.14) than being linked (10.12)
ld: warning: object file (/Users/buildslave/jenkins/workspace/lldb-cmake-standalone/clang-build/lib/libLLVMFrontendOpenMP.a(OMPIRBuilder.cpp.o)) was built for newer OSX version (10.14) than being linked (10.12)
ld: warning: object file (/Users/buildslave/jenkins/workspace/lldb-cmake-standalone/clang-build/lib/libLLVMRuntimeDyld.a(RuntimeDyldCOFF.cpp.o)) was built for newer OSX version (10.14) than being linked (10.12)
ld: warning: object file (/Users/buildslave/jenkins/workspace/lldb-cmake-standalone/clang-build/lib/libLLVMSelectionDAG.a(LegalizeTypesGeneric.cpp.o)) was built for newer OSX version (10.14) than being linked (10.12)
ld: warning: object file (/Users/buildslave/jenkins/workspace/lldb-cmake-standalone/clang-build/lib/libLLVMRuntimeDyld.a(RuntimeDyldMachO.cpp.o)) was built for newer OSX version (10.14) than being linked (10.12)
ld: warning: object file (/Users/buildslave/jenkins/workspace/lldb-cmake-standalone/clang-build/lib/libLLVMTransformUtils.a(SanitizerStats.cpp.o)) was built for newer OSX version (10.14) than being linked (10.12)
ld: warning: object file (/Users/buildslave/jenkins/workspace/lldb-cmake-standalone/clang-build/lib/libLLVMBitReader.a(ValueList.cpp.o)) was built for newer OSX version (10.14) than being linked (10.12)
ld: warning: object file (/Users/buildslave/jenkins/workspace/lldb-cmake-standalone/clang-build/lib/libLLVMDebugInfoPDB.a(NativeSymbolEnumerator.cpp.o)) was built for newer OSX version (10.14) than being linked (10.12)
ld: warning: object file (/Users/buildslave/jenkins/workspace/lldb-cmake-standalone/clang-build/lib/libLLVMSupport.a(Valgrind.cpp.o)) was built for newer OSX version (10.14) than being linked (10.12)
ld: warning: object file (/Users/buildslave/jenkins/workspace/lldb-cmake-standalone/clang-build/lib/libLLVMSupport.a(SHA1.cpp.o)) was built for newer OSX version (10.14) than being linked (10.12)
ld: warning: object file (/Users/buildslave/jenkins/workspace/lldb-cmake-standalone/clang-build/lib/libLLVMTextAPI.a(PackedVersion.cpp.o)) was built for newer OSX version (10.14) than being linked (10.12)
ld: warning: object file (/Users/buildslave/jenkins/workspace/lldb-cmake-standalone/clang-build/lib/libLLVMRemarks.a(RemarkStringTable.cpp.o)) was built for newer OSX version (10.14) than being linked (10.12)
ld: warning: object file (/Users/buildslave/jenkins/workspace/lldb-cmake-standalone/clang-build/lib/libclangAnalysis.a(CFGStmtMap.cpp.o)) was built for newer OSX version (10.14) than being linked (10.12)
ld: warning: object file (/Users/buildslave/jenkins/workspace/lldb-cmake-standalone/clang-build/lib/libclangAnalysis.a(ObjCNoReturn.cpp.o)) was built for newer OSX version (10.14) than being linked (10.12)
ld: warning: object file (/Users/buildslave/jenkins/workspace/lldb-cmake-standalone/clang-build/lib/libclangAST.a(ScanfFormatString.cpp.o)) was built for newer OSX version (10.14) than being linked (10.12)
ld: warning: object file (/Users/buildslave/jenkins/workspace/lldb-cmake-standalone/clang-build/lib/libclangSerialization.a(ASTWriterStmt.cpp.o)) was built for newer OSX version (10.14) than being linked (10.12)
ld: warning: object file (/Users/buildslave/jenkins/workspace/lldb-cmake-standalone/clang-build/lib/libclangSerialization.a(ASTWriterDecl.cpp.o)) was built for newer OSX version (10.14) than being linked (10.12)
ld: warning: object file (/Users/buildslave/jenkins/workspace/lldb-cmake-standalone/clang-build/lib/libclangAnalysis.a(ConstructionContext.cpp.o)) was built for newer OSX version (10.14) than being linked (10.12)
ld: warning: object file (/Users/buildslave/jenkins/workspace/lldb-cmake-standalone/clang-build/lib/libclangEdit.a(RewriteObjCFoundationAPI.cpp.o)) was built for newer OSX version (10.14) than being linked (10.12)
ld: warning: object file (/Users/buildslave/jenkins/workspace/lldb-cmake-standalone/clang-build/lib/libclangAnalysis.a(CocoaConventions.cpp.o)) was built for newer OSX version (10.14) than being linked (10.12)
ld: warning: object file (/Users/buildslave/jenkins/workspace/lldb-cmake-standalone/clang-build/lib/libclangCodeGen.a(CodeGenPGO.cpp.o)) was built for newer OSX version (10.14) than being linked (10.12)
ld: warning: object file (/Users/buildslave/jenkins/workspace/lldb-cmake-standalone/clang-build/lib/libclangCodeGen.a(CodeGenTBAA.cpp.o)) was built for newer OSX version (10.14) than being linked (10.12)
ld: warning: object file (/Users/buildslave/jenkins/workspace/lldb-cmake-standalone/clang-build/lib/libclangCodeGen.a(CodeGenTypes.cpp.o)) was built for newer OSX version (10.14) than being linked (10.12)
ld: warning: object file (/Users/buildslave/jenkins/workspace/lldb-cmake-standalone/clang-build/lib/libclangCodeGen.a(CGCall.cpp.o)) was built for newer OSX version (10.14) than being linked (10.12)
ld: warning: object file (/Users/buildslave/jenkins/workspace/lldb-cmake-standalone/clang-build/lib/libclangCodeGen.a(CGObjCRuntime.cpp.o)) was built for newer OSX version (10.14) than being linked (10.12)
ld: warning: object file (/Users/buildslave/jenkins/workspace/lldb-cmake-standalone/clang-build/lib/libclangCodeGen.a(CGExprConstant.cpp.o)) was built for newer OSX version (10.14) than being linked (10.12)
ld: warning: object file (/Users/buildslave/jenkins/workspace/lldb-cmake-standalone/clang-build/lib/libclangCodeGen.a(CGDecl.cpp.o)) was built for newer OSX version (10.14) than being linked (10.12)
ld: warning: object file (/Users/buildslave/jenkins/workspace/lldb-cmake-standalone/clang-build/lib/libclangCodeGen.a(CGException.cpp.o)) was built for newer OSX version (10.14) than being linked (10.12)
ld: warning: object file (/Users/buildslave/jenkins/workspace/lldb-cmake-standalone/clang-build/lib/libclangCodeGen.a(TargetInfo.cpp.o)) was built for newer OSX version (10.14) than being linked (10.12)
ld: warning: object file (/Users/buildslave/jenkins/workspace/lldb-cmake-standalone/clang-build/lib/libclangCodeGen.a(CGDeclCXX.cpp.o)) was built for newer OSX version (10.14) than being linked (10.12)
ld: warning: object file (/Users/buildslave/jenkins/workspace/lldb-cmake-standalone/clang-build/lib/libclangCodeGen.a(CGObjC.cpp.o)) was built for newer OSX version (10.14) than being linked (10.12)
ld: warning: object file (/Users/buildslave/jenkins/workspace/lldb-cmake-standalone/clang-build/lib/libclangCodeGen.a(CGClass.cpp.o)) was built for newer OSX version (10.14) than being linked (10.12)
ld: warning: object file (/Users/buildslave/jenkins/workspace/lldb-cmake-standalone/clang-build/lib/libclangCodeGen.a(CGCXX.cpp.o)) was built for newer OSX version (10.14) than being linked (10.12)
ld: warning: object file (/Users/buildslave/jenkins/workspace/lldb-cmake-standalone/clang-build/lib/libclangCodeGen.a(ItaniumCXXABI.cpp.o)) was built for newer OSX version (10.14) than being linked (10.12)
ld: warning: object file (/Users/buildslave/jenkins/workspace/lldb-cmake-standalone/clang-build/lib/libclangCodeGen.a(CGOpenCLRuntime.cpp.o)) was built for newer OSX version (10.14) than being linked (10.12)
ld: warning: object file (/Users/buildslave/jenkins/workspace/lldb-cmake-standalone/clang-build/lib/libclangCodeGen.a(CGOpenMPRuntime.cpp.o)) was built for newer OSX version (10.14) than being linked (10.12)
ld: warning: object file (/Users/buildslave/jenkins/workspace/lldb-cmake-standalone/clang-build/lib/libclangCodeGen.a(CodeGenFunction.cpp.o)) was built for newer OSX version (10.14) than being linked (10.12)
ld: warning: object file (/Users/buildslave/jenkins/workspace/lldb-cmake-standalone/clang-build/lib/libclangCodeGen.a(CGExpr.cpp.o)) was built for newer OSX version (10.14) than being linked (10.12)
ld: warning: object file (/Users/buildslave/jenkins/workspace/lldb-cmake-standalone/clang-build/lib/libclangCodeGen.a(CGBuiltin.cpp.o)) was built for newer OSX version (10.14) than being linked (10.12)
ld: warning: object file (/Users/buildslave/jenkins/workspace/lldb-cmake-standalone/clang-build/lib/libclangCodeGen.a(CGStmt.cpp.o)) was built for newer OSX version (10.14) than being linked (10.12)
ld: warning: object file (/Users/buildslave/jenkins/workspace/lldb-cmake-standalone/clang-build/lib/libclangCodeGen.a(SanitizerMetadata.cpp.o)) was built for newer OSX version (10.14) than being linked (10.12)
ld: warning: object file (/Users/buildslave/jenkins/workspace/lldb-cmake-standalone/clang-build/lib/libclangCodeGen.a(CGCUDANV.cpp.o)) was built for newer OSX version (10.14) than being linked (10.12)
ld: warning: object file (/Users/buildslave/jenkins/workspace/lldb-cmake-standalone/clang-build/lib/libclangCodeGen.a(CGOpenMPRuntimeNVPTX.cpp.o)) was built for newer OSX version (10.14) than being linked (10.12)
ld: warning: object file (/Users/buildslave/jenkins/workspace/lldb-cmake-standalone/clang-build/lib/libclangCodeGen.a(CGObjCGNU.cpp.o)) was built for newer OSX version (10.14) than being linked (10.12)
ld: warning: object file (/Users/buildslave/jenkins/workspace/lldb-cmake-standalone/clang-build/lib/libclangCodeGen.a(CGObjCMac.cpp.o)) was built for newer OSX version (10.14) than being linked (10.12)
ld: warning: object file (/Users/buildslave/jenkins/workspace/lldb-cmake-standalone/clang-build/lib/libclangCodeGen.a(MicrosoftCXXABI.cpp.o)) was built for newer OSX version (10.14) than being linked (10.12)
ld: warning: object file (/Users/buildslave/jenkins/workspace/lldb-cmake-standalone/clang-build/lib/libclangCodeGen.a(ConstantInitBuilder.cpp.o)) was built for newer OSX version (10.14) than being linked (10.12)
ld: warning: object file (/Users/buildslave/jenkins/workspace/lldb-cmake-standalone/clang-build/lib/libclangCodeGen.a(CoverageMappingGen.cpp.o)) was built for newer OSX version (10.14) than being linked (10.12)
ld: warning: object file (/Users/buildslave/jenkins/workspace/lldb-cmake-standalone/clang-build/lib/libclangCodeGen.a(CGCXXABI.cpp.o)) was built for newer OSX version (10.14) than being linked (10.12)
ld: warning: object file (/Users/buildslave/jenkins/workspace/lldb-cmake-standalone/clang-build/lib/libclangAnalysis.a(BodyFarm.cpp.o)) was built for newer OSX version (10.14) than being linked (10.12)
ld: warning: object file (/Users/buildslave/jenkins/workspace/lldb-cmake-standalone/clang-build/lib/libLLVMCoverage.a(CoverageMappingWriter.cpp.o)) was built for newer OSX version (10.14) than being linked (10.12)
ld: warning: object file (/Users/buildslave/jenkins/workspace/lldb-cmake-standalone/clang-build/lib/libLLVMCoverage.a(CoverageMapping.cpp.o)) was built for newer OSX version (10.14) than being linked (10.12)
ld: warning: object file (/Users/buildslave/jenkins/workspace/lldb-cmake-standalone/clang-build/lib/libLLVMCoverage.a(CoverageMappingReader.cpp.o)) was built for newer OSX version (10.14) than being linked (10.12)
ld: warning: object file (/Users/buildslave/jenkins/workspace/lldb-cmake-standalone/clang-build/lib/libclangCodeGen.a(CGRecordLayoutBuilder.cpp.o)) was built for newer OSX version (10.14) than being linked (10.12)
ld: warning: object file (/Users/buildslave/jenkins/workspace/lldb-cmake-standalone/clang-build/lib/libclangCodeGen.a(CGCleanup.cpp.o)) was built for newer OSX version (10.14) than being linked (10.12)
ld: warning: object file (/Users/buildslave/jenkins/workspace/lldb-cmake-standalone/clang-build/lib/libclangCodeGen.a(CGCUDARuntime.cpp.o)) was built for newer OSX version (10.14) than being linked (10.12)
ld: warning: object file (/Users/buildslave/jenkins/workspace/lldb-cmake-standalone/clang-build/lib/libclangCodeGen.a(CGBlocks.cpp.o)) was built for newer OSX version (10.14) than being linked (10.12)
ld: warning: object file (/Users/buildslave/jenkins/workspace/lldb-cmake-standalone/clang-build/lib/libclangCodeGen.a(CGLoopInfo.cpp.o)) was built for newer OSX version (10.14) than being linked (10.12)
ld: warning: object file (/Users/buildslave/jenkins/workspace/lldb-cmake-standalone/clang-build/lib/libclangCodeGen.a(CGVTT.cpp.o)) was built for newer OSX version (10.14) than being linked (10.12)
ld: warning: object file (/Users/buildslave/jenkins/workspace/lldb-cmake-standalone/clang-build/lib/libclangCodeGen.a(CGCoroutine.cpp.o)) was built for newer OSX version (10.14) than being linked (10.12)
ld: warning: object file (/Users/buildslave/jenkins/workspace/lldb-cmake-standalone/clang-build/lib/libclangCodeGen.a(CGExprAgg.cpp.o)) was built for newer OSX version (10.14) than being linked (10.12)
ld: warning: object file (/Users/buildslave/jenkins/workspace/lldb-cmake-standalone/clang-build/lib/libclangCodeGen.a(CGStmtOpenMP.cpp.o)) was built for newer OSX version (10.14) than being linked (10.12)
ld: warning: object file (/Users/buildslave/jenkins/workspace/lldb-cmake-standalone/clang-build/lib/libclangCodeGen.a(CGAtomic.cpp.o)) was built for newer OSX version (10.14) than being linked (10.12)
ld: warning: object file (/Users/buildslave/jenkins/workspace/lldb-cmake-standalone/clang-build/lib/libclangCodeGen.a(CGExprCXX.cpp.o)) was built for newer OSX version (10.14) than being linked (10.12)
ld: warning: object file (/Users/buildslave/jenkins/workspace/lldb-cmake-standalone/clang-build/lib/libclangCodeGen.a(CGExprScalar.cpp.o)) was built for newer OSX version (10.14) than being linked (10.12)
ld: warning: object file (/Users/buildslave/jenkins/workspace/lldb-cmake-standalone/clang-build/lib/libclangCodeGen.a(CGExprComplex.cpp.o)) was built for newer OSX version (10.14) than being linked (10.12)
ld: warning: object file (/Users/buildslave/jenkins/workspace/lldb-cmake-standalone/clang-build/lib/libclangCodeGen.a(CGNonTrivialStruct.cpp.o)) was built for newer OSX version (10.14) than being linked (10.12)
ld: warning: object file (/Users/buildslave/jenkins/workspace/lldb-cmake-standalone/clang-build/lib/libclangCodeGen.a(CGGPUBuiltin.cpp.o)) was built for newer OSX version (10.14) than being linked (10.12)
ld: warning: object file (/Users/buildslave/jenkins/workspace/lldb-cmake-standalone/clang-build/lib/libclangCodeGen.a(VarBypassDetector.cpp.o)) was built for newer OSX version (10.14) than being linked (10.12)
ld: warning: object file (/Users/buildslave/jenkins/workspace/lldb-cmake-standalone/clang-build/lib/libclangCodeGen.a(PatternInit.cpp.o)) was built for newer OSX version (10.14) than being linked (10.12)
ld: warning: object file (/Users/buildslave/jenkins/workspace/lldb-cmake-standalone/clang-build/lib/libclangCodeGen.a(SwiftCallingConv.cpp.o)) was built for newer OSX version (10.14) than being linked (10.12)
ld: warning: object file (/Users/buildslave/jenkins/workspace/lldb-cmake-standalone/clang-build/lib/libLLVMRemarks.a(RemarkParser.cpp.o)) was built for newer OSX version (10.14) than being linked (10.12)
ld: warning: object file (/Users/buildslave/jenkins/workspace/lldb-cmake-standalone/clang-build/lib/libLLVMRuntimeDyld.a(RuntimeDyldELFMips.cpp.o)) was built for newer OSX version (10.14) than being linked (10.12)
ld: warning: object file (/Users/buildslave/jenkins/workspace/lldb-cmake-standalone/clang-build/lib/libLLVMTransformUtils.a(AMDGPUEmitPrintf.cpp.o)) was built for newer OSX version (10.14) than being linked (10.12)
ld: warning: object file (/Users/buildslave/jenkins/workspace/lldb-cmake-standalone/clang-build/lib/libLLVMRemarks.a(YAMLRemarkParser.cpp.o)) was built for newer OSX version (10.14) than being linked (10.12)
ld: warning: object file (/Users/buildslave/jenkins/workspace/lldb-cmake-standalone/clang-build/lib/libLLVMRemarks.a(BitstreamRemarkParser.cpp.o)) was built for newer OSX version (10.14) than being linked (10.12)
ld: warning: object file (/Users/buildslave/jenkins/workspace/lldb-cmake-standalone/clang-build/lib/libclangAST.a(VTTBuilder.cpp.o)) was built for newer OSX version (10.14) than being linked (10.12)
ld: warning: direct access in function 'llvm::yaml::needsQuotes(llvm::StringRef)' from file '/Users/buildslave/jenkins/workspace/lldb-cmake-standalone/lldb-xcode-build/Release/lib/liblldbPluginProcessGDBRemote.a(ProcessGDBRemote.o)' to global weak symbol 'llvm::yaml::needsQuotes(llvm::StringRef)::Indicators' from file '/Users/buildslave/jenkins/workspace/lldb-cmake-standalone/clang-build/lib/libLLVMSupport.a(Statistic.cpp.o)' means the weak symbol cannot be overridden at runtime. This was likely caused by different translation units being compiled with different visibility settings.
ld: warning: direct access in function 'bool llvm::DenseMapBase<llvm::DenseMap<std::__1::pair<std::__1::basic_string<char, std::__1::char_traits<char>, std::__1::allocator<char> >, std::__1::basic_string<char, std::__1::char_traits<char>, std::__1::allocator<char> > >, lldb_private::ModuleSpec, lldb_private::process_gdb_remote::ProcessGDBRemote::ModuleCacheInfo, llvm::detail::DenseMapPair<std::__1::pair<std::__1::basic_string<char, std::__1::char_traits<char>, std::__1::allocator<char> >, std::__1::basic_string<char, std::__1::char_traits<char>, std::__1::allocator<char> > >, lldb_private::ModuleSpec> >, std::__1::pair<std::__1::basic_string<char, std::__1::char_traits<char>, std::__1::allocator<char> >, std::__1::basic_string<char, std::__1::char_traits<char>, std::__1::allocator<char> > >, lldb_private::ModuleSpec, lldb_private::process_gdb_remote::ProcessGDBRemote::ModuleCacheInfo, llvm::detail::DenseMapPair<std::__1::pair<std::__1::basic_string<char, std::__1::char_traits<char>, std::__1::allocator<char> >, std::__1::basic_string<char, std::__1::char_traits<char>, std::__1::allocator<char> > >, lldb_private::ModuleSpec> >::LookupBucketFor<std::__1::pair<std::__1::basic_string<char, std::__1::char_traits<char>, std::__1::allocator<char> >, std::__1::basic_string<char, std::__1::char_traits<char>, std::__1::allocator<char> > > >(std::__1::pair<std::__1::basic_string<char, std::__1::char_traits<char>, std::__1::allocator<char> >, std::__1::basic_string<char, std::__1::char_traits<char>, std::__1::allocator<char> > > const&, llvm::detail::DenseMapPair<std::__1::pair<std::__1::basic_string<char, std::__1::char_traits<char>, std::__1::allocator<char> >, std::__1::basic_string<char, std::__1::char_traits<char>, std::__1::allocator<char> > >, lldb_private::ModuleSpec> const*&) const' from file '/Users/buildslave/jenkins/workspace/lldb-cmake-standalone/lldb-xcode-build/Release/lib/liblldbPluginProcessGDBRemote.a(ProcessGDBRemote.o)' to global weak symbol 'guard variable for llvm::hashing::detail::get_execution_seed()::seed' from file '/Users/buildslave/jenkins/workspace/lldb-cmake-standalone/clang-build/lib/libLLVMSupport.a(StringRef.cpp.o)' means the weak symbol cannot be overridden at runtime. This was likely caused by different translation units being compiled with different visibility settings.
ld: warning: direct access in function 'bool llvm::DenseMapBase<llvm::DenseMap<std::__1::pair<std::__1::basic_string<char, std::__1::char_traits<char>, std::__1::allocator<char> >, std::__1::basic_string<char, std::__1::char_traits<char>, std::__1::allocator<char> > >, lldb_private::ModuleSpec, lldb_private::process_gdb_remote::ProcessGDBRemote::ModuleCacheInfo, llvm::detail::DenseMapPair<std::__1::pair<std::__1::basic_string<char, std::__1::char_traits<char>, std::__1::allocator<char> >, std::__1::basic_string<char, std::__1::char_traits<char>, std::__1::allocator<char> > >, lldb_private::ModuleSpec> >, std::__1::pair<std::__1::basic_string<char, std::__1::char_traits<char>, std::__1::allocator<char> >, std::__1::basic_string<char, std::__1::char_traits<char>, std::__1::allocator<char> > >, lldb_private::ModuleSpec, lldb_private::process_gdb_remote::ProcessGDBRemote::ModuleCacheInfo, llvm::detail::DenseMapPair<std::__1::pair<std::__1::basic_string<char, std::__1::char_traits<char>, std::__1::allocator<char> >, std::__1::basic_string<char, std::__1::char_traits<char>, std::__1::allocator<char> > >, lldb_private::ModuleSpec> >::LookupBucketFor<std::__1::pair<std::__1::basic_string<char, std::__1::char_traits<char>, std::__1::allocator<char> >, std::__1::basic_string<char, std::__1::char_traits<char>, std::__1::allocator<char> > > >(std::__1::pair<std::__1::basic_string<char, std::__1::char_traits<char>, std::__1::allocator<char> >, std::__1::basic_string<char, std::__1::char_traits<char>, std::__1::allocator<char> > > const&, llvm::detail::DenseMapPair<std::__1::pair<std::__1::basic_string<char, std::__1::char_traits<char>, std::__1::allocator<char> >, std::__1::basic_string<char, std::__1::char_traits<char>, std::__1::allocator<char> > >, lldb_private::ModuleSpec> const*&) const' from file '/Users/buildslave/jenkins/workspace/lldb-cmake-standalone/lldb-xcode-build/Release/lib/liblldbPluginProcessGDBRemote.a(ProcessGDBRemote.o)' to global weak symbol 'llvm::hashing::detail::get_execution_seed()::seed' from file '/Users/buildslave/jenkins/workspace/lldb-cmake-standalone/clang-build/lib/libLLVMCodeGen.a(MachineOperand.cpp.o)' means the weak symbol cannot be overridden at runtime. This was likely caused by different translation units being compiled with different visibility settings.
ld: warning: direct access in function 'bool llvm::DenseMapBase<llvm::DenseMap<std::__1::pair<std::__1::basic_string<char, std::__1::char_traits<char>, std::__1::allocator<char> >, std::__1::basic_string<char, std::__1::char_traits<char>, std::__1::allocator<char> > >, lldb_private::ModuleSpec, lldb_private::process_gdb_remote::ProcessGDBRemote::ModuleCacheInfo, llvm::detail::DenseMapPair<std::__1::pair<std::__1::basic_string<char, std::__1::char_traits<char>, std::__1::allocator<char> >, std::__1::basic_string<char, std::__1::char_traits<char>, std::__1::allocator<char> > >, lldb_private::ModuleSpec> >, std::__1::pair<std::__1::basic_string<char, std::__1::char_traits<char>, std::__1::allocator<char> >, std::__1::basic_string<char, std::__1::char_traits<char>, std::__1::allocator<char> > >, lldb_private::ModuleSpec, lldb_private::process_gdb_remote::ProcessGDBRemote::ModuleCacheInfo, llvm::detail::DenseMapPair<std::__1::pair<std::__1::basic_string<char, std::__1::char_traits<char>, std::__1::allocator<char> >, std::__1::basic_string<char, std::__1::char_traits<char>, std::__1::allocator<char> > >, lldb_private::ModuleSpec> >::LookupBucketFor<std::__1::pair<std::__1::basic_string<char, std::__1::char_traits<char>, std::__1::allocator<char> >, std::__1::basic_string<char, std::__1::char_traits<char>, std::__1::allocator<char> > > >(std::__1::pair<std::__1::basic_string<char, std::__1::char_traits<char>, std::__1::allocator<char> >, std::__1::basic_string<char, std::__1::char_traits<char>, std::__1::allocator<char> > > const&, llvm::detail::DenseMapPair<std::__1::pair<std::__1::basic_string<char, std::__1::char_traits<char>, std::__1::allocator<char> >, std::__1::basic_string<char, std::__1::char_traits<char>, std::__1::allocator<char> > >, lldb_private::ModuleSpec> const*&) const' from file '/Users/buildslave/jenkins/workspace/lldb-cmake-standalone/lldb-xcode-build/Release/lib/liblldbPluginProcessGDBRemote.a(ProcessGDBRemote.o)' to global weak symbol 'guard variable for llvm::hashing::detail::get_execution_seed()::seed' from file '/Users/buildslave/jenkins/workspace/lldb-cmake-standalone/clang-build/lib/libLLVMSupport.a(StringRef.cpp.o)' means the weak symbol cannot be overridden at runtime. This was likely caused by different translation units being compiled with different visibility settings.
ld: warning: direct access in function 'bool llvm::DenseMapBase<llvm::DenseMap<std::__1::pair<std::__1::basic_string<char, std::__1::char_traits<char>, std::__1::allocator<char> >, std::__1::basic_string<char, std::__1::char_traits<char>, std::__1::allocator<char> > >, lldb_private::ModuleSpec, lldb_private::process_gdb_remote::ProcessGDBRemote::ModuleCacheInfo, llvm::detail::DenseMapPair<std::__1::pair<std::__1::basic_string<char, std::__1::char_traits<char>, std::__1::allocator<char> >, std::__1::basic_string<char, std::__1::char_traits<char>, std::__1::allocator<char> > >, lldb_private::ModuleSpec> >, std::__1::pair<std::__1::basic_string<char, std::__1::char_traits<char>, std::__1::allocator<char> >, std::__1::basic_string<char, std::__1::char_traits<char>, std::__1::allocator<char> > >, lldb_private::ModuleSpec, lldb_private::process_gdb_remote::ProcessGDBRemote::ModuleCacheInfo, llvm::detail::DenseMapPair<std::__1::pair<std::__1::basic_string<char, std::__1::char_traits<char>, std::__1::allocator<char> >, std::__1::basic_string<char, std::__1::char_traits<char>, std::__1::allocator<char> > >, lldb_private::ModuleSpec> >::LookupBucketFor<std::__1::pair<std::__1::basic_string<char, std::__1::char_traits<char>, std::__1::allocator<char> >, std::__1::basic_string<char, std::__1::char_traits<char>, std::__1::allocator<char> > > >(std::__1::pair<std::__1::basic_string<char, std::__1::char_traits<char>, std::__1::allocator<char> >, std::__1::basic_string<char, std::__1::char_traits<char>, std::__1::allocator<char> > > const&, llvm::detail::DenseMapPair<std::__1::pair<std::__1::basic_string<char, std::__1::char_traits<char>, std::__1::allocator<char> >, std::__1::basic_string<char, std::__1::char_traits<char>, std::__1::allocator<char> > >, lldb_private::ModuleSpec> const*&) const' from file '/Users/buildslave/jenkins/workspace/lldb-cmake-standalone/lldb-xcode-build/Release/lib/liblldbPluginProcessGDBRemote.a(ProcessGDBRemote.o)' to global weak symbol 'llvm::hashing::detail::get_execution_seed()::seed' from file '/Users/buildslave/jenkins/workspace/lldb-cmake-standalone/clang-build/lib/libLLVMCodeGen.a(MachineOperand.cpp.o)' means the weak symbol cannot be overridden at runtime. This was likely caused by different translation units being compiled with different visibility settings.
ld: warning: direct access in function 'bool llvm::DenseMapBase<llvm::DenseMap<std::__1::pair<std::__1::basic_string<char, std::__1::char_traits<char>, std::__1::allocator<char> >, std::__1::basic_string<char, std::__1::char_traits<char>, std::__1::allocator<char> > >, lldb_private::ModuleSpec, lldb_private::process_gdb_remote::ProcessGDBRemote::ModuleCacheInfo, llvm::detail::DenseMapPair<std::__1::pair<std::__1::basic_string<char, std::__1::char_traits<char>, std::__1::allocator<char> >, std::__1::basic_string<char, std::__1::char_traits<char>, std::__1::allocator<char> > >, lldb_private::ModuleSpec> >, std::__1::pair<std::__1::basic_string<char, std::__1::char_traits<char>, std::__1::allocator<char> >, std::__1::basic_string<char, std::__1::char_traits<char>, std::__1::allocator<char> > >, lldb_private::ModuleSpec, lldb_private::process_gdb_remote::ProcessGDBRemote::ModuleCacheInfo, llvm::detail::DenseMapPair<std::__1::pair<std::__1::basic_string<char, std::__1::char_traits<char>, std::__1::allocator<char> >, std::__1::basic_string<char, std::__1::char_traits<char>, std::__1::allocator<char> > >, lldb_private::ModuleSpec> >::LookupBucketFor<std::__1::pair<std::__1::basic_string<char, std::__1::char_traits<char>, std::__1::allocator<char> >, std::__1::basic_string<char, std::__1::char_traits<char>, std::__1::allocator<char> > > >(std::__1::pair<std::__1::basic_string<char, std::__1::char_traits<char>, std::__1::allocator<char> >, std::__1::basic_string<char, std::__1::char_traits<char>, std::__1::allocator<char> > > const&, llvm::detail::DenseMapPair<std::__1::pair<std::__1::basic_string<char, std::__1::char_traits<char>, std::__1::allocator<char> >, std::__1::basic_string<char, std::__1::char_traits<char>, std::__1::allocator<char> > >, lldb_private::ModuleSpec> const*&) const' from file '/Users/buildslave/jenkins/workspace/lldb-cmake-standalone/lldb-xcode-build/Release/lib/liblldbPluginProcessGDBRemote.a(ProcessGDBRemote.o)' to global weak symbol 'guard variable for llvm::hashing::detail::get_execution_seed()::seed' from file '/Users/buildslave/jenkins/workspace/lldb-cmake-standalone/clang-build/lib/libLLVMSupport.a(StringRef.cpp.o)' means the weak symbol cannot be overridden at runtime. This was likely caused by different translation units being compiled with different visibility settings.
ld: warning: direct access in function 'llvm::hash_code llvm::hashing::detail::hash_combine_range_impl<std::__1::__wrap_iter<char const*> >(std::__1::__wrap_iter<char const*>, std::__1::__wrap_iter<char const*>)' from file '/Users/buildslave/jenkins/workspace/lldb-cmake-standalone/lldb-xcode-build/Release/lib/liblldbPluginProcessGDBRemote.a(ProcessGDBRemote.o)' to global weak symbol 'llvm::hashing::detail::get_execution_seed()::seed' from file '/Users/buildslave/jenkins/workspace/lldb-cmake-standalone/clang-build/lib/libLLVMCodeGen.a(MachineOperand.cpp.o)' means the weak symbol cannot be overridden at runtime. This was likely caused by different translation units being compiled with different visibility settings.
ld: warning: direct access in function 'llvm::hash_code llvm::hashing::detail::hash_combine_range_impl<std::__1::__wrap_iter<char const*> >(std::__1::__wrap_iter<char const*>, std::__1::__wrap_iter<char const*>)' from file '/Users/buildslave/jenkins/workspace/lldb-cmake-standalone/lldb-xcode-build/Release/lib/liblldbPluginProcessGDBRemote.a(ProcessGDBRemote.o)' to global weak symbol 'guard variable for llvm::hashing::detail::get_execution_seed()::seed' from file '/Users/buildslave/jenkins/workspace/lldb-cmake-standalone/clang-build/lib/libLLVMSupport.a(StringRef.cpp.o)' means the weak symbol cannot be overridden at runtime. This was likely caused by different translation units being compiled with different visibility settings.
ld: warning: direct access in function 'llvm::hash_code llvm::hashing::detail::hash_combine_range_impl<std::__1::__wrap_iter<char const*> >(std::__1::__wrap_iter<char const*>, std::__1::__wrap_iter<char const*>)' from file '/Users/buildslave/jenkins/workspace/lldb-cmake-standalone/lldb-xcode-build/Release/lib/liblldbPluginProcessGDBRemote.a(ProcessGDBRemote.o)' to global weak symbol 'llvm::hashing::detail::get_execution_seed()::seed' from file '/Users/buildslave/jenkins/workspace/lldb-cmake-standalone/clang-build/lib/libLLVMCodeGen.a(MachineOperand.cpp.o)' means the weak symbol cannot be overridden at runtime. This was likely caused by different translation units being compiled with different visibility settings.
ld: warning: direct access in function 'llvm::hash_code llvm::hashing::detail::hash_combine_range_impl<std::__1::__wrap_iter<char const*> >(std::__1::__wrap_iter<char const*>, std::__1::__wrap_iter<char const*>)' from file '/Users/buildslave/jenkins/workspace/lldb-cmake-standalone/lldb-xcode-build/Release/lib/liblldbPluginProcessGDBRemote.a(ProcessGDBRemote.o)' to global weak symbol 'guard variable for llvm::hashing::detail::get_execution_seed()::seed' from file '/Users/buildslave/jenkins/workspace/lldb-cmake-standalone/clang-build/lib/libLLVMSupport.a(StringRef.cpp.o)' means the weak symbol cannot be overridden at runtime. This was likely caused by different translation units being compiled with different visibility settings.
ld: warning: direct access in function 'llvm::hash_code llvm::hashing::detail::hash_combine_range_impl<std::__1::__wrap_iter<char const*> >(std::__1::__wrap_iter<char const*>, std::__1::__wrap_iter<char const*>)' from file '/Users/buildslave/jenkins/workspace/lldb-cmake-standalone/lldb-xcode-build/Release/lib/liblldbPluginProcessGDBRemote.a(ProcessGDBRemote.o)' to global weak symbol 'llvm::hashing::detail::get_execution_seed()::seed' from file '/Users/buildslave/jenkins/workspace/lldb-cmake-standalone/clang-build/lib/libLLVMCodeGen.a(MachineOperand.cpp.o)' means the weak symbol cannot be overridden at runtime. This was likely caused by different translation units being compiled with different visibility settings.
ld: warning: direct access in function 'llvm::hash_code llvm::hashing::detail::hash_combine_range_impl<std::__1::__wrap_iter<char const*> >(std::__1::__wrap_iter<char const*>, std::__1::__wrap_iter<char const*>)' from file '/Users/buildslave/jenkins/workspace/lldb-cmake-standalone/lldb-xcode-build/Release/lib/liblldbPluginProcessGDBRemote.a(ProcessGDBRemote.o)' to global weak symbol 'guard variable for llvm::hashing::detail::get_execution_seed()::seed' from file '/Users/buildslave/jenkins/workspace/lldb-cmake-standalone/clang-build/lib/libLLVMSupport.a(StringRef.cpp.o)' means the weak symbol cannot be overridden at runtime. This was likely caused by different translation units being compiled with different visibility settings.
Showing first 200 warnings only

Hide Details

=== BUILD TARGET lldb-instr OF PROJECT lldb WITH CONFIGURATION Release ===

Hide Details

Check dependencies

Hide Details

=== BUILD TARGET lit-cpuid OF PROJECT lldb WITH CONFIGURATION Release ===

Hide Details

Check dependencies

Hide Details

=== BUILD AGGREGATE TARGET lldb-test-deps OF PROJECT lldb WITH CONFIGURATION Release ===

Hide Details

Check dependencies

Hide Details

=== BUILD AGGREGATE TARGET check-lldb-shell OF PROJECT lldb WITH CONFIGURATION Release ===

Hide Details

Check dependencies

Hide Details

Write auxiliary files write-file /Users/buildslave/jenkins/workspace/lldb-cmake-standalone/lldb-xcode-build/test/Shell/lldb.build/Release/check-lldb-shell.build/Script-76A0D2BBDD5F4135B9B43A13.sh chmod 0755 /Users/buildslave/jenkins/workspace/lldb-cmake-standalone/lldb-xcode-build/test/Shell/lldb.build/Release/check-lldb-shell.build/Script-76A0D2BBDD5F4135B9B43A13.sh

Hide Details

PhaseScriptExecution CMake\ Rules /Users/buildslave/jenkins/workspace/lldb-cmake-standalone/lldb-xcode-build/test/Shell/lldb.build/Release/check-lldb-shell.build/Script-76A0D2BBDD5F4135B9B43A13.sh cd /Users/buildslave/jenkins/workspace/lldb-cmake-standalone/llvm-project/lldb /bin/sh -c /Users/buildslave/jenkins/workspace/lldb-cmake-standalone/lldb-xcode-build/test/Shell/lldb.build/Release/check-lldb-shell.build/Script-76A0D2BBDD5F4135B9B43A13.sh echo "Running lldb shell test suite" Running lldb shell test suite /usr/local/bin/python /Users/buildslave/jenkins/workspace/lldb-cmake-standalone/clang-build/bin/llvm-lit --param build_mode=Release /Users/buildslave/jenkins/workspace/lldb-cmake-standalone/lldb-xcode-build/test/Shell -- Testing: 304 tests, 16 workers -- llvm-lit: /Users/buildslave/jenkins/workspace/lldb-cmake-standalone/llvm-project/lldb/test/Shell/helper/toolchain.py:102: note: using SDKROOT: '/Applications/Xcode.app/Contents/Developer/Platforms/MacOSX.platform/Developer/SDKs/MacOSX10.14.sdk' llvm-lit: /Users/buildslave/jenkins/workspace/lldb-cmake-standalone/llvm-project/llvm/utils/lit/lit/llvm/config.py:342: note: using clang: /Users/buildslave/jenkins/workspace/lldb-cmake-standalone/clang-build/bin/clang UNSUPPORTED: lldb-shell :: Breakpoint/case-insensitive.test (1 of 304) PASS: lldb-shell :: Breakpoint/debug_addrx.test (2 of 304) PASS: lldb-shell :: Breakpoint/debug_rnglist_offset_pair.test (3 of 304) PASS: lldb-shell :: Breakpoint/debug_rnglist_basic.test (4 of 304) PASS: lldb-shell :: Breakpoint/debug_rnglist_rlestartend.test (5 of 304) PASS: lldb-shell :: Breakpoint/implicit_const_form_support.test (6 of 304) PASS: lldb-shell :: Breakpoint/debug_rnglistx_rlex.test (7 of 304) UNSUPPORTED: lldb-shell :: BuildScript/toolchain-clang-cl.test (8 of 304) UNSUPPORTED: lldb-shell :: BuildScript/toolchain-msvc.test (9 of 304) PASS: lldb-shell :: Breakpoint/split-dwarf-5-addrbase.test (10 of 304) PASS: lldb-shell :: Breakpoint/single-file-split-dwarf.test (11 of 304) PASS: lldb-shell :: Breakpoint/split-dwarf5-debug-stroffsets.test (12 of 304) PASS: lldb-shell :: Breakpoint/ppc64-localentry.test (13 of 304) PASS: lldb-shell :: Commands/command-regex-unalias.test (14 of 304) PASS: lldb-shell :: Commands/command-backtrace.test (15 of 304) PASS: lldb-shell :: Commands/command-regex-delete.test (16 of 304) PASS: lldb-shell :: BuildScript/script-args.test (17 of 304) PASS: lldb-shell :: BuildScript/compiler-full-path.test (18 of 304) PASS: lldb-shell :: Driver/TestCore.test (19 of 304) PASS: lldb-shell :: Driver/TestFile.test (20 of 304) PASS: lldb-shell :: Breakpoint/case-sensitive.test (21 of 304) PASS: lldb-shell :: Driver/TestProcessAttach.test (22 of 304) PASS: lldb-shell :: Driver/TestNoUseColor.test (23 of 304) UNSUPPORTED: lldb-shell :: ExecControl/StopHook/stop-hook-threads.test (24 of 304) PASS: lldb-shell :: Driver/TestRepl.test (25 of 304) UNSUPPORTED: lldb-shell :: Expr/TestIRMemoryMapWindows.test (26 of 304) PASS: lldb-shell :: BuildScript/toolchain-clang.test (27 of 304) PASS: lldb-shell :: Commands/command-source.test (28 of 304) PASS: lldb-shell :: Expr/TestMultilineExpr.test (29 of 304) PASS: lldb-shell :: Expr/TestTypeOfDeclTypeExpr.test (30 of 304) PASS: lldb-shell :: Driver/TestCommands.test (31 of 304) PASS: lldb-shell :: Breakpoint/dummy-target.test (32 of 304) PASS: lldb-shell :: Minidump/Windows/Sigsegv/sigsegv.test (33 of 304) PASS: lldb-shell :: Minidump/Windows/arm-fp-unwind.test (34 of 304) PASS: lldb-shell :: Minidump/Windows/broken-unwind.test (35 of 304) PASS: lldb-shell :: Minidump/Windows/find-module.test (36 of 304) PASS: lldb-shell :: BuildScript/modes.test (37 of 304) PASS: lldb-shell :: Minidump/breakpad-symbols.test (38 of 304) PASS: lldb-shell :: Minidump/disassemble-no-module.yaml (39 of 304) PASS: lldb-shell :: Minidump/memory-region.yaml (40 of 304) PASS: lldb-shell :: Minidump/memory-region-from-module.yaml (41 of 304) PASS: lldb-shell :: Minidump/no-process-id.yaml (42 of 304) PASS: lldb-shell :: Commands/CommandScriptImmediateOutput/CommandScriptImmediateOutputConsole.test (43 of 304) PASS: lldb-shell :: ObjectFile/Breakpad/discontiguous-sections.test (44 of 304) PASS: lldb-shell :: Driver/LocalLLDBInit.test (45 of 304) PASS: lldb-shell :: ObjectFile/Breakpad/sections-trailing-func.test (46 of 304) PASS: lldb-shell :: Commands/CommandScriptImmediateOutput/CommandScriptImmediateOutputFile.test (47 of 304) PASS: lldb-shell :: ObjectFile/Breakpad/sections.test (48 of 304) PASS: lldb-shell :: ObjectFile/ELF/PT_LOAD-empty.yaml (49 of 304) PASS: lldb-shell :: ObjectFile/Breakpad/uuid-matching-mac.test (50 of 304) PASS: lldb-shell :: ObjectFile/ELF/PT_LOAD-overlap-PT_INTERP.yaml (51 of 304) PASS: lldb-shell :: ObjectFile/ELF/PT_LOAD-overlap-section.yaml (52 of 304) PASS: lldb-shell :: ObjectFile/ELF/PT_LOAD-overlap.yaml (53 of 304) PASS: lldb-shell :: ObjectFile/ELF/PT_LOAD.yaml (54 of 304) PASS: lldb-shell :: Driver/TestSingleQuote.test (55 of 304) UNSUPPORTED: lldb-shell :: ObjectFile/ELF/basic-info.yaml (56 of 304) PASS: lldb-shell :: ObjectFile/ELF/aarch64-relocations.yaml (57 of 304) PASS: lldb-shell :: ObjectFile/ELF/base-address.yaml (58 of 304) PASS: lldb-shell :: Driver/TestTarget.test (59 of 304) PASS: lldb-shell :: ObjectFile/ELF/compressed-sections.yaml (60 of 304) PASS: lldb-shell :: ObjectFile/Breakpad/breakpad-identification.test (61 of 304) PASS: lldb-shell :: ObjectFile/ELF/build-id-case.yaml (62 of 304) PASS: lldb-shell :: ObjectFile/ELF/duplicate-section.yaml (63 of 304) UNSUPPORTED: lldb-shell :: ObjectFile/ELF/minidebuginfo-no-lzma.yaml (64 of 304) UNSUPPORTED: lldb-shell :: ObjectFile/ELF/minidebuginfo-set-and-hit-breakpoint.test (65 of 304) PASS: lldb-shell :: ObjectFile/ELF/gnu-debuglink.yaml (66 of 304) PASS: lldb-shell :: ObjectFile/ELF/minidebuginfo-corrupt-xz.yaml (67 of 304) PASS: lldb-shell :: ObjectFile/ELF/netbsd-core-amd64.test (68 of 304) PASS: lldb-shell :: ObjectFile/ELF/minidebuginfo-find-symbols.yaml (69 of 304) PASS: lldb-shell :: ObjectFile/ELF/netbsd-exec-8.99.30-amd64.yaml (70 of 304) PASS: lldb-shell :: ObjectFile/ELF/section-permissions.yaml (71 of 304) PASS: lldb-shell :: ObjectFile/ELF/section-addresses.yaml (72 of 304) PASS: lldb-shell :: ObjectFile/ELF/section-overlap.yaml (73 of 304) PASS: lldb-shell :: ObjectFile/ELF/section-types-edgecases.yaml (74 of 304) PASS: lldb-shell :: Driver/TestConvenienceVariables.test (75 of 304) PASS: lldb-shell :: ObjectFile/MachO/lc_build_version.yaml (76 of 304) PASS: lldb-shell :: ObjectFile/ELF/section-types.yaml (77 of 304) PASS: lldb-shell :: ObjectFile/ELF/short-build-id.yaml (78 of 304) PASS: lldb-shell :: ObjectFile/MachO/lc_build_version_notools.yaml (79 of 304) PASS: lldb-shell :: Minidump/fb-dump.test (80 of 304) PASS: lldb-shell :: ObjectFile/MachO/lc_version_min.yaml (81 of 304) UNSUPPORTED: lldb-shell :: ObjectFile/PECOFF/dep-modules.yaml (82 of 304) PASS: lldb-shell :: Commands/command-script-import.test (83 of 304) UNSUPPORTED: lldb-shell :: ObjectFile/PECOFF/export-dllfunc.yaml (84 of 304) PASS: lldb-shell :: Breakpoint/jitbp_elf.test (85 of 304) PASS: lldb-shell :: ObjectFile/PECOFF/basic-info-arm64.yaml (86 of 304) PASS: lldb-shell :: ObjectFile/MachO/subsections.yaml (87 of 304) PASS: lldb-shell :: ObjectFile/PECOFF/basic-info-arm.yaml (88 of 304) PASS: lldb-shell :: ObjectFile/PECOFF/basic-info.yaml (89 of 304) UNSUPPORTED: lldb-shell :: ObjectFile/PECOFF/uuid.yaml (90 of 304) PASS: lldb-shell :: ObjectFile/PECOFF/disassemble-thumb.yaml (91 of 304) PASS: lldb-shell :: ObjectFile/PECOFF/section-types.yaml (92 of 304) FAIL: lldb-shell :: ObjectFile/ELF/PT_TLS-overlap-PT_LOAD.yaml (93 of 304) FAIL: lldb-shell :: ObjectFile/ELF/PT_LOAD-overlap-PT_TLS.yaml (94 of 304) PASS: lldb-shell :: ObjectFile/PECOFF/invalid-export-table.yaml (95 of 304) UNSUPPORTED: lldb-shell :: Process/Windows/exception_access_violation.cpp (96 of 304) PASS: lldb-shell :: ObjectFile/PECOFF/sections-names.yaml (97 of 304) PASS: lldb-shell :: ObjectFile/wasm/basic.yaml (98 of 304) PASS: lldb-shell :: ObjectFile/PECOFF/sections.yaml (99 of 304) PASS: lldb-shell :: ObjectFile/PECOFF/symbol.yaml (100 of 304) PASS: lldb-shell :: ObjectFile/wasm/stripped-debug-sections.yaml (101 of 304) PASS: lldb-shell :: ObjectFile/wasm/embedded-debug-sections.yaml (102 of 304) PASS: lldb-shell :: ObjectFile/wasm/unified-debug-sections.yaml (103 of 304) PASS: lldb-shell :: ObjectFile/MachO/symtab.yaml (104 of 304) UNSUPPORTED: lldb-shell :: Register/aarch64-fp-read.test (105 of 304) UNSUPPORTED: lldb-shell :: Register/aarch64-gp-read.test (106 of 304) UNSUPPORTED: lldb-shell :: Register/arm-fp-read.test (107 of 304) UNSUPPORTED: lldb-shell :: Register/arm-gp-read.test (108 of 304) PASS: lldb-shell :: Quit/TestQuitExitCode0.test (109 of 304) PASS: lldb-shell :: Quit/TestQuitExitCodeHex0.test (110 of 304) UNSUPPORTED: lldb-shell :: Register/x86-64-gp-write.test (111 of 304) PASS: lldb-shell :: Quit/TestQuitExitCodeImplicit0.test (112 of 304) PASS: lldb-shell :: Quit/TestQuitExitCodeNonInt.test (113 of 304) UNSUPPORTED: lldb-shell :: Register/x86-64-xmm16-read.test (114 of 304) UNSUPPORTED: lldb-shell :: Register/x86-64-xmm16-write.test (115 of 304) PASS: lldb-shell :: Quit/TestQuitExitCode-30.test (116 of 304) UNSUPPORTED: lldb-shell :: Register/x86-64-ymm16-read.test (117 of 304) UNSUPPORTED: lldb-shell :: Register/x86-64-ymm16-write.test (118 of 304) UNSUPPORTED: lldb-shell :: Register/x86-64-zmm-read.test (119 of 304) UNSUPPORTED: lldb-shell :: Register/x86-64-zmm-write.test (120 of 304) UNSUPPORTED: lldb-shell :: Register/x86-gp-read.test (121 of 304) UNSUPPORTED: lldb-shell :: Register/x86-gp-write.test (122 of 304) PASS: lldb-shell :: Quit/TestQuitExitCodeTooManyArgs.test (123 of 304) PASS: lldb-shell :: Quit/TestQuitExitCodeHexA.test (124 of 304) PASS: lldb-shell :: Quit/TestQuitExitCode30.test (125 of 304) UNSUPPORTED: lldb-shell :: Register/x86-ymm-read.test (126 of 304) UNSUPPORTED: lldb-shell :: Register/x86-ymm-write.test (127 of 304) UNSUPPORTED: lldb-shell :: Register/x86-zmm-read.test (128 of 304) UNSUPPORTED: lldb-shell :: Register/x86-zmm-write.test (129 of 304) PASS: lldb-shell :: Minidump/dump-all.test (130 of 304) PASS: lldb-shell :: Register/x86-64-read.test (131 of 304) PASS: lldb-shell :: Register/x86-64-gp-read.test (132 of 304) XFAIL: lldb-shell :: Register/x86-mm-xmm-read.test (133 of 304) PASS: lldb-shell :: Register/x86-64-ymm-read.test (134 of 304) XFAIL: lldb-shell :: Register/x86-64-write.test (135 of 304) XFAIL: lldb-shell :: Register/x86-mm-xmm-write.test (136 of 304) PASS: lldb-shell :: Heap/heap-cstr.test (137 of 304) PASS: lldb-shell :: Host/TestCustomShell.test (138 of 304) PASS: lldb-shell :: Reproducer/TestCrash.test (139 of 304) XFAIL: lldb-shell :: Register/x86-64-ymm-write.test (140 of 304) PASS: lldb-shell :: Reproducer/TestDriverOptions.test (141 of 304) PASS: lldb-shell :: Reproducer/TestCaptureEnvOverride.test (142 of 304) PASS: lldb-shell :: Reproducer/TestDiscard.test (143 of 304) PASS: lldb-shell :: Reproducer/Functionalities/TestDataFormatter.test (144 of 304) PASS: lldb-shell :: ObjectFile/ELF/many-sections.s (145 of 304) PASS: lldb-shell :: Reproducer/TestSynchronous.test (146 of 304) UNSUPPORTED: lldb-shell :: ScriptInterpreter/Lua/bindings.test (147 of 304) UNSUPPORTED: lldb-shell :: ScriptInterpreter/Lua/breakpoint_callback.test (148 of 304) UNSUPPORTED: lldb-shell :: ScriptInterpreter/Lua/command_script_import.test (149 of 304) UNSUPPORTED: lldb-shell :: ScriptInterpreter/Lua/convenience_variables.test (150 of 304) UNSUPPORTED: lldb-shell :: ScriptInterpreter/Lua/independent_state.test (151 of 304) UNSUPPORTED: lldb-shell :: ScriptInterpreter/Lua/lua.test (152 of 304) UNSUPPORTED: lldb-shell :: ScriptInterpreter/Lua/nested_sessions.test (153 of 304) UNSUPPORTED: lldb-shell :: ScriptInterpreter/Lua/persistent_state.test (154 of 304) UNSUPPORTED: lldb-shell :: ScriptInterpreter/Lua/watchpoint_callback.test (155 of 304) PASS: lldb-shell :: Reproducer/Functionalities/TestImageList.test (156 of 304) PASS: lldb-shell :: ScriptInterpreter/None/import_module.test (157 of 304) PASS: lldb-shell :: ScriptInterpreter/None/none.test (158 of 304) PASS: lldb-shell :: Reproducer/Functionalities/TestStepping.test (159 of 304) PASS: lldb-shell :: Settings/TestDisableColor.test (160 of 304) PASS: lldb-shell :: Reproducer/Functionalities/TestExpressionEvaluation.test (161 of 304) PASS: lldb-shell :: Settings/TestDisassemblyFormat.test (162 of 304) PASS: lldb-shell :: Reproducer/TestDump.test (163 of 304) PASS: lldb-shell :: Reproducer/TestFileRepro.test (164 of 304) PASS: lldb-shell :: ScriptInterpreter/Python/scripted_breakpoint.test (165 of 304) PASS: lldb-shell :: Reproducer/Modules/TestModuleCXX.test (166 of 304) PASS: lldb-shell :: Settings/TestModuleCacheSanity.test (167 of 304) PASS: lldb-shell :: Process/TestEnvironment.test (168 of 304) PASS: lldb-shell :: ExecControl/StopHook/stop-hook.test (169 of 304) PASS: lldb-shell :: Settings/TestSettingsSet.test (170 of 304) PASS: lldb-shell :: Reproducer/TestRelativePath.test (171 of 304) PASS: lldb-shell :: SymbolFile/Breakpad/line-table-discontinuous-file-ids.test (172 of 304) PASS: lldb-shell :: SymbolFile/Breakpad/line-table-edgecases.test (173 of 304) PASS: lldb-shell :: Settings/TestEchoCommands.test (174 of 304) PASS: lldb-shell :: SymbolFile/Breakpad/line-table-missing-file.test (175 of 304) PASS: lldb-shell :: ScriptInterpreter/Python/crashlog.test (176 of 304) PASS: lldb-shell :: SymbolFile/Breakpad/line-table-mixed-path-styles.test (177 of 304) PASS: lldb-shell :: SymbolFile/Breakpad/line-table.test (178 of 304) PASS: lldb-shell :: Reproducer/TestMultipleTargets.test (179 of 304) PASS: lldb-shell :: SymbolFile/Breakpad/stack-cfi-parsing.test (180 of 304) PASS: lldb-shell :: SymbolFile/Breakpad/symtab-macho.test (181 of 304) PASS: lldb-shell :: SymbolFile/Breakpad/symtab.test (182 of 304) PASS: lldb-shell :: SymbolFile/Breakpad/unwind-via-raSearch.test (183 of 304) PASS: lldb-shell :: SymbolFile/Breakpad/unwind-via-stack-cfi.test (184 of 304) PASS: lldb-shell :: SymbolFile/Breakpad/unwind-via-stack-win.test (185 of 304) UNSUPPORTED: lldb-shell :: SymbolFile/DWARF/array-sizes.s (186 of 304) PASS: lldb-shell :: Settings/TestStopCommandSourceOnError.test (187 of 304) PASS: lldb-shell :: SymbolFile/DWARF/DW_OP_piece-struct.s (188 of 304) PASS: lldb-shell :: SymbolFile/DWARF/DW_AT_low_pc-addrx.s (189 of 304) PASS: lldb-shell :: SymbolFile/DWARF/DW_AT_loclists_base.s (190 of 304) UNSUPPORTED: lldb-shell :: SymbolFile/DWARF/debug-line-basic.s (191 of 304) UNSUPPORTED: lldb-shell :: SymbolFile/DWARF/debug-names-compressed.cpp (192 of 304) UNSUPPORTED: lldb-shell :: SymbolFile/DWARF/debug-types-address-ranges.s (193 of 304) UNSUPPORTED: lldb-shell :: SymbolFile/DWARF/debug-types-basic.test (194 of 304) PASS: lldb-shell :: Settings/TestSettingsWrite.test (195 of 304) UNSUPPORTED: lldb-shell :: SymbolFile/DWARF/debug-types-dwo-cross-reference.cpp (196 of 304) UNSUPPORTED: lldb-shell :: SymbolFile/DWARF/debug-types-expressions.test (197 of 304) PASS: lldb-shell :: SymbolFile/DWARF/anon_class_w_and_wo_export_symbols.ll (198 of 304) PASS: lldb-shell :: SymbolFile/DWARF/apple-index-is-used.cpp (199 of 304) UNSUPPORTED: lldb-shell :: SymbolFile/DWARF/debug-types-signature-loop.s (200 of 304) PASS: lldb-shell :: SymbolFile/DWARF/childless-compile-unit.s (201 of 304) PASS: lldb-shell :: SymbolFile/DWARF/debug-types-dwarf5.s (202 of 304) PASS: lldb-shell :: SymbolFile/DWARF/clang-ast-from-dwarf-unamed-and-anon-structs.cpp (203 of 304) PASS: lldb-shell :: SymbolFile/DWARF/clang-ast-from-dwarf-objc-property.m (204 of 304) PASS: lldb-shell :: SymbolFile/DWARF/debug-types-line-tables.s (205 of 304) PASS: lldb-shell :: SymbolFile/DWARF/debug_line-relative_path.s (206 of 304) PASS: lldb-shell :: SymbolFile/DWARF/debug_loc_and_loclists.s (207 of 304) PASS: lldb-shell :: SymbolFile/DWARF/debug_loc-aslr.s (208 of 304) UNSUPPORTED: lldb-shell :: SymbolFile/DWARF/debug_ranges_and_rnglists.test (209 of 304) PASS: lldb-shell :: SymbolFile/DWARF/debug_loclists-dwo.s (210 of 304) PASS: lldb-shell :: SymbolFile/DWARF/debug_ranges-missing-section.s (211 of 304) PASS: lldb-shell :: SymbolFile/DWARF/debug_ranges.s (212 of 304) PASS: lldb-shell :: SymbolFile/DWARF/debug_loc.s (213 of 304) PASS: lldb-shell :: SymbolFile/DWARF/debug_rnglists-dwo.s (214 of 304) UNSUPPORTED: lldb-shell :: SymbolFile/DWARF/dir-separator-no-comp-dir.s (215 of 304) UNSUPPORTED: lldb-shell :: SymbolFile/DWARF/dir-separator-no-comp-dir-relative-name.s (216 of 304) UNSUPPORTED: lldb-shell :: SymbolFile/DWARF/dir-separator-posix.s (217 of 304) UNSUPPORTED: lldb-shell :: SymbolFile/DWARF/dir-separator-windows.s (218 of 304) UNSUPPORTED: lldb-shell :: SymbolFile/DWARF/dwarf5-index-is-used.cpp (219 of 304) UNSUPPORTED: lldb-shell :: SymbolFile/DWARF/dwarf5-partial-index.cpp (220 of 304) UNSUPPORTED: lldb-shell :: SymbolFile/DWARF/dwarf5_locations.s (221 of 304) UNSUPPORTED: lldb-shell :: SymbolFile/DWARF/find-basic-function.cpp (222 of 304) UNSUPPORTED: lldb-shell :: SymbolFile/DWARF/find-basic-namespace.cpp (223 of 304) UNSUPPORTED: lldb-shell :: SymbolFile/DWARF/find-basic-type.cpp (224 of 304) UNSUPPORTED: lldb-shell :: SymbolFile/DWARF/find-basic-variable.cpp (225 of 304) UNSUPPORTED: lldb-shell :: SymbolFile/DWARF/find-function-regex.cpp (226 of 304) UNSUPPORTED: lldb-shell :: SymbolFile/DWARF/find-inline-method.s (227 of 304) PASS: lldb-shell :: SymbolFile/DWARF/debug_rnglists.s (228 of 304) UNSUPPORTED: lldb-shell :: SymbolFile/DWARF/find-method.cpp (229 of 304) PASS: lldb-shell :: SymbolFile/DWARF/debug_aranges-empty-section.s (230 of 304) UNSUPPORTED: lldb-shell :: SymbolFile/DWARF/find-type-in-function.cpp (231 of 304) UNSUPPORTED: lldb-shell :: SymbolFile/DWARF/find-variable-dwo.cpp (232 of 304) UNSUPPORTED: lldb-shell :: SymbolFile/DWARF/find-variable-file.cpp (233 of 304) PASS: lldb-shell :: SymbolFile/DWARF/dwarf5-debug_line.s (234 of 304) PASS: lldb-shell :: SymbolFile/DWARF/dwarf5-atomic.s (235 of 304) UNSUPPORTED: lldb-shell :: SymbolFile/DWARF/inline-function-address-shared.test (236 of 304) UNSUPPORTED: lldb-shell :: SymbolFile/DWARF/inline-function-address.ll (237 of 304) PASS: lldb-shell :: SymbolFile/DWARF/find-method-local-struct.cpp (238 of 304) PASS: lldb-shell :: SymbolFile/DWARF/find-qualified-variable.cpp (239 of 304) PASS: lldb-shell :: SymbolFile/DWARF/forward-declarations.s (240 of 304) UNSUPPORTED: lldb-shell :: SymbolFile/DWARF/win-i386-line-table.s (241 of 304) UNSUPPORTED: lldb-shell :: SymbolFile/NativePDB/ast-functions-msvc.cpp (242 of 304) UNSUPPORTED: lldb-shell :: SymbolFile/NativePDB/ast-functions.cpp (243 of 304) UNSUPPORTED: lldb-shell :: SymbolFile/NativePDB/ast-methods.cpp (244 of 304) UNSUPPORTED: lldb-shell :: SymbolFile/NativePDB/ast-types.cpp (245 of 304) UNSUPPORTED: lldb-shell :: SymbolFile/NativePDB/bitfields.cpp (246 of 304) UNSUPPORTED: lldb-shell :: SymbolFile/NativePDB/break-by-function.cpp (247 of 304) UNSUPPORTED: lldb-shell :: SymbolFile/NativePDB/break-by-line.cpp (248 of 304) UNSUPPORTED: lldb-shell :: SymbolFile/NativePDB/disassembly.cpp (249 of 304) UNSUPPORTED: lldb-shell :: SymbolFile/NativePDB/function-types-builtins.cpp (250 of 304) UNSUPPORTED: lldb-shell :: SymbolFile/NativePDB/function-types-calling-conv.cpp (251 of 304) UNSUPPORTED: lldb-shell :: SymbolFile/NativePDB/function-types-classes.cpp (252 of 304) UNSUPPORTED: lldb-shell :: SymbolFile/NativePDB/global-classes.cpp (253 of 304) UNSUPPORTED: lldb-shell :: SymbolFile/NativePDB/globals-bss.cpp (254 of 304) UNSUPPORTED: lldb-shell :: SymbolFile/NativePDB/globals-fundamental.cpp (255 of 304) UNSUPPORTED: lldb-shell :: SymbolFile/NativePDB/local-variables.cpp (256 of 304) UNSUPPORTED: lldb-shell :: SymbolFile/NativePDB/nested-types.cpp (257 of 304) UNSUPPORTED: lldb-shell :: SymbolFile/NativePDB/s_constant.cpp (258 of 304) UNSUPPORTED: lldb-shell :: SymbolFile/NativePDB/source-list.cpp (259 of 304) UNSUPPORTED: lldb-shell :: SymbolFile/NativePDB/stack_unwinding01.cpp (260 of 304) UNSUPPORTED: lldb-shell :: SymbolFile/NativePDB/tag-types.cpp (261 of 304) UNSUPPORTED: lldb-shell :: SymbolFile/NativePDB/typedefs.cpp (262 of 304) UNSUPPORTED: lldb-shell :: SymbolFile/PDB/ast-restore.test (263 of 304) UNSUPPORTED: lldb-shell :: SymbolFile/PDB/calling-conventions.test (264 of 304) UNSUPPORTED: lldb-shell :: SymbolFile/PDB/class-layout.test (265 of 304) UNSUPPORTED: lldb-shell :: SymbolFile/PDB/compilands.test (266 of 304) UNSUPPORTED: lldb-shell :: SymbolFile/PDB/enums-layout.test (267 of 304) PASS: lldb-shell :: SymbolFile/DWARF/gnu-style-compression.cpp (268 of 304) UNSUPPORTED: lldb-shell :: SymbolFile/PDB/expressions.test (269 of 304) UNSUPPORTED: lldb-shell :: SymbolFile/PDB/func-symbols.test (270 of 304) UNSUPPORTED: lldb-shell :: SymbolFile/PDB/function-level-linking.test (271 of 304) UNSUPPORTED: lldb-shell :: SymbolFile/PDB/function-nested-block.test (272 of 304) UNSUPPORTED: lldb-shell :: SymbolFile/PDB/pointers.test (273 of 304) UNSUPPORTED: lldb-shell :: SymbolFile/PDB/type-quals.test (274 of 304) UNSUPPORTED: lldb-shell :: SymbolFile/PDB/typedefs.test (275 of 304) UNSUPPORTED: lldb-shell :: SymbolFile/PDB/udt-layout.test (276 of 304) UNSUPPORTED: lldb-shell :: SymbolFile/PDB/variables-locations.test (277 of 304) UNSUPPORTED: lldb-shell :: SymbolFile/PDB/variables.test (278 of 304) UNSUPPORTED: lldb-shell :: SymbolFile/PDB/vbases.test (279 of 304) UNSUPPORTED: lldb-shell :: SymbolFile/dissassemble-entry-point.s (280 of 304) UNSUPPORTED: lldb-shell :: SymbolFile/target-symbols-add-unwind.test (281 of 304) PASS: lldb-shell :: SymbolFile/DWARF/parallel-indexing-stress.s (282 of 304) UNSUPPORTED: lldb-shell :: Unwind/eh-frame-small-fde.test (283 of 304) PASS: lldb-shell :: SymbolFile/DWARF/split-dwarf-multiple-cu.ll (284 of 304) PASS: lldb-shell :: SymbolFile/DWARF/split-dwarf-inlining.cpp (285 of 304) PASS: lldb-shell :: SymbolFile/DWARF/debug-types-missing-signature.test (286 of 304) UNSUPPORTED: lldb-shell :: Unwind/unwind-plan-dwarf-dump.test (287 of 304) PASS: lldb-shell :: SymbolFile/symbol-binding.test (288 of 304) UNSUPPORTED: lldb-shell :: Watchpoint/netbsd-nouserdbregs.test (289 of 304) PASS: lldb-shell :: SymbolFile/DWARF/compilercontext.ll (290 of 304) PASS: lldb-shell :: Settings/TestFrameFormatColor.test (291 of 304) PASS: lldb-shell :: Reproducer/TestWorkingDir.test (292 of 304) PASS: lldb-shell :: Settings/TestFrameFormatNoColor.test (293 of 304) PASS: lldb-shell :: Settings/TestFrameFormatMangling.test (294 of 304) PASS: lldb-shell :: SymbolFile/DWARF/deterministic-build.cpp (295 of 304) PASS: lldb-shell :: Unwind/eh-frame-dwarf-unwind.test (296 of 304) PASS: lldb-shell :: Unwind/thread-step-out-ret-addr-check.test (297 of 304) PASS: lldb-shell :: Unwind/trap_frame_sym_ctx.test (298 of 304) PASS: lldb-shell :: Reproducer/TestVersionCheck.test (299 of 304) PASS: lldb-shell :: Reproducer/TestGDBRemoteRepro.test (300 of 304) PASS: lldb-shell :: Expr/TestIRMemoryMap.test (301 of 304) XFAIL: lldb-shell :: Unwind/prefer-debug-over-eh-frame.test (302 of 304) PASS: lldb-shell :: Reproducer/TestReuseDirectory.test (303 of 304) PASS: lldb-shell :: Watchpoint/SetErrorCases.test (304 of 304)

Hide Details

Testing Time: 7.26s ******************** Failing Tests (2): lldb-shell :: ObjectFile/ELF/PT_LOAD-overlap-PT_TLS.yaml lldb-shell :: ObjectFile/ELF/PT_TLS-overlap-PT_LOAD.yaml

Hide Details

Expected Passes : 188 Expected Failures : 5 Unsupported Tests : 109 Unexpected Failures: 2 make: *** [/Users/buildslave/jenkins/workspace/lldb-cmake-standalone/lldb-xcode-build/test/Shell/CMakeFiles/check-lldb-shell] Error 1

Hide Details

** BUILD FAILED **

Hide Details

Hide Details

The following build commands failed: PhaseScriptExecution CMake\ Rules /Users/buildslave/jenkins/workspace/lldb-cmake-standalone/lldb-xcode-build/test/Shell/lldb.build/Release/check-lldb-shell.build/Script-76A0D2BBDD5F4135B9B43A13.sh (1 failure) Command failed: Command '['/usr/bin/env', 'TERM=vt100', '/usr/local/bin/cmake', '--build', '.', '--config', 'Release', '--target', 'check-lldb-shell']' returned non-zero exit status 65. Command: ['/usr/bin/env', 'TERM=vt100', '/usr/local/bin/cmake', '--build', '.', '--config', 'Release', '--target', 'check-lldb-shell'] [Pipeline] } [Pipeline] // timeout [Pipeline] } [Pipeline] // stage [Pipeline] } [Pipeline] // withEnv [Pipeline] } [Pipeline] // node sh: line 1: 13138 Terminated: 15 sleep 3 [Pipeline] End of Pipeline ERROR: script returned exit code 1 Finished: FAILURE