FailedConsole Output

Skipping 8,286 KB.. Full Log
 (315 of 1909)
PASS: lldb-api :: functionalities/data-formatter/synthcapping/TestSyntheticCapping.py (316 of 1909)
PASS: lldb-api :: functionalities/data-formatter/parray/TestPrintArray.py (317 of 1909)
PASS: lldb-api :: functionalities/data-formatter/data-formatter-stl/libcxx/vector/TestDataFormatterLibcxxVector.py (318 of 1909)
PASS: lldb-api :: functionalities/data-formatter/stringprinter/TestStringPrinter.py (319 of 1909)
PASS: lldb-api :: functionalities/data-formatter/typedef_array/TestTypedefArray.py (320 of 1909)
PASS: lldb-api :: functionalities/data-formatter/type_summary_list_script/TestTypeSummaryListScript.py (321 of 1909)
PASS: lldb-api :: functionalities/data-formatter/user-format-vs-summary/TestUserFormatVsSummary.py (322 of 1909)
PASS: lldb-api :: functionalities/data-formatter/var-in-aggregate-misuse/TestVarInAggregateMisuse.py (323 of 1909)
PASS: lldb-api :: functionalities/data-formatter/varscript_formatting/TestDataFormatterVarScriptFormatting.py (324 of 1909)
PASS: lldb-api :: functionalities/fat_archives/TestFatArchives.py (325 of 1909)
PASS: lldb-api :: functionalities/gdb_remote_client/TestArmRegisterDefinition.py (326 of 1909)
PASS: lldb-api :: functionalities/gdb_remote_client/TestGDBRemoteClient.py (327 of 1909)
PASS: lldb-api :: functionalities/gdb_remote_client/TestGDBRemoteLoad.py (328 of 1909)
PASS: lldb-api :: functionalities/gdb_remote_client/TestJLink6Armv7RegisterDefinition.py (329 of 1909)
PASS: lldb-api :: functionalities/dead-strip/TestDeadStrip.py (330 of 1909)
PASS: lldb-api :: functionalities/data-formatter/vector-types/TestVectorTypesFormatting.py (331 of 1909)
PASS: lldb-api :: functionalities/gdb_remote_client/TestNestedRegDefinitions.py (332 of 1909)
PASS: lldb-api :: functionalities/gdb_remote_client/TestNoGPacketSupported.py (333 of 1909)
PASS: lldb-api :: functionalities/gdb_remote_client/TestPlatformClient.py (334 of 1909)
PASS: lldb-api :: functionalities/gdb_remote_client/TestNoWatchpointSupportInfo.py (335 of 1909)
PASS: lldb-api :: functionalities/gdb_remote_client/TestRegDefinitionInParts.py (336 of 1909)
PASS: lldb-api :: functionalities/data-formatter/nsarraysynth/TestNSArraySynthetic.py (337 of 1909)
PASS: lldb-api :: functionalities/gdb_remote_client/TestStopPCs.py (338 of 1909)
PASS: lldb-api :: functionalities/gdb_remote_client/TestRestartBug.py (339 of 1909)
PASS: lldb-api :: functionalities/gdb_remote_client/TestRecognizeBreakpoint.py (340 of 1909)
PASS: lldb-api :: functionalities/gdb_remote_client/TestTargetXMLArch.py (341 of 1909)
PASS: lldb-api :: functionalities/deleted-executable/TestDeletedExecutable.py (342 of 1909)
PASS: lldb-api :: functionalities/gdb_remote_client/TestWriteMemory.py (343 of 1909)
PASS: lldb-api :: functionalities/gdb_remote_client/TestThreadSelectionBug.py (344 of 1909)
PASS: lldb-api :: functionalities/history/TestHistoryRecall.py (345 of 1909)
PASS: lldb-api :: functionalities/data-formatter/nsdictionarysynth/TestNSDictionarySynthetic.py (346 of 1909)
PASS: lldb-api :: functionalities/float-display/TestFloatDisplay.py (347 of 1909)
PASS: lldb-api :: functionalities/data-formatter/nssetsynth/TestNSSetSynthetic.py (348 of 1909)
PASS: lldb-api :: functionalities/data-formatter/ostypeformatting/TestFormattersOsType.py (349 of 1909)
PASS: lldb-api :: functionalities/dynamic_value_child_count/TestDynamicValueChildCount.py (350 of 1909)
UNSUPPORTED: lldb-api :: functionalities/longjmp/TestLongjmp.py (351 of 1909)
PASS: lldb-api :: functionalities/exec/TestExec.py (352 of 1909)
PASS: lldb-api :: functionalities/data-formatter/setvaluefromcstring/TestSetValueFromCString.py (353 of 1909)
PASS: lldb-api :: functionalities/load_using_paths/TestLoadUsingPaths.py (354 of 1909)
PASS: lldb-api :: functionalities/data-formatter/poarray/TestPrintObjectArray.py (355 of 1909)
PASS: lldb-api :: functionalities/inferior-changed/TestInferiorChanged.py (356 of 1909)
PASS: lldb-api :: functionalities/memory-region/TestMemoryRegion.py (357 of 1909)
PASS: lldb-api :: functionalities/multidebugger_commands/TestMultipleDebuggersCommands.py (358 of 1909)
PASS: lldb-api :: functionalities/multiword-commands/TestMultiWordCommands.py (359 of 1909)
PASS: lldb-api :: functionalities/object-file/TestImageListMultiArchitecture.py (360 of 1909)
PASS: lldb-api :: functionalities/data-formatter/synthupdate/TestSyntheticFilterRecompute.py (361 of 1909)
PASS: lldb-api :: functionalities/lazy-loading/TestLazyLoading.py (362 of 1909)
PASS: lldb-api :: functionalities/paths/TestPaths.py (363 of 1909)
PASS: lldb-api :: functionalities/memory/cache/TestMemoryCache.py (364 of 1909)
PASS: lldb-api :: functionalities/memory/find/TestMemoryFind.py (365 of 1909)
PASS: lldb-api :: functionalities/postmortem/elf-core/gcore/TestGCore.py (366 of 1909)
PASS: lldb-api :: functionalities/plugins/python_os_plugin/TestPythonOSPlugin.py (367 of 1909)
PASS: lldb-api :: functionalities/memory/read/TestMemoryRead.py (368 of 1909)
PASS: lldb-api :: functionalities/postmortem/elf-core/thread_crash/TestLinuxCoreThreads.py (369 of 1909)
PASS: lldb-api :: functionalities/jitloader_gdb/TestJITLoaderGDB.py (370 of 1909)
PASS: lldb-api :: functionalities/non-overlapping-index-variable-i/TestIndexVariable.py (371 of 1909)
PASS: lldb-api :: functionalities/postmortem/minidump-new/TestMiniDumpUUID.py (372 of 1909)
PASS: lldb-api :: functionalities/postmortem/minidump-new/TestMiniDumpNew.py (373 of 1909)
PASS: lldb-api :: functionalities/postmortem/minidump/TestMiniDump.py (374 of 1909)
PASS: lldb-api :: functionalities/postmortem/wow64_minidump/TestWow64MiniDump.py (375 of 1909)
UNSUPPORTED: lldb-api :: functionalities/process_save_core/TestProcessSaveCore.py (376 of 1909)
PASS: lldb-api :: functionalities/pre_run_dylibs/TestPreRunDylibs.py (377 of 1909)
PASS: lldb-api :: functionalities/plugins/command_plugin/TestPluginCommands.py (378 of 1909)
PASS: lldb-api :: functionalities/postmortem/netbsd-core/TestNetBSDCore.py (379 of 1909)
PASS: lldb-api :: functionalities/inferior-crashing/recursive-inferior/TestRecursiveInferiorStep.py (380 of 1909)
PASS: lldb-api :: functionalities/process_group/TestChangeProcessGroup.py (381 of 1909)
PASS: lldb-api :: functionalities/inferior-crashing/recursive-inferior/TestRecursiveInferior.py (382 of 1909)
PASS: lldb-api :: functionalities/param_entry_vals/basic_entry_values_x86_64/TestBasicEntryValuesX86_64.py (383 of 1909)
PASS: lldb-api :: functionalities/postmortem/mach-core/TestMachCore.py (384 of 1909)
PASS: lldb-api :: functionalities/show_location/TestShowLocationDwarf5.py (385 of 1909)
UNSUPPORTED: lldb-api :: functionalities/signal/handle-segv/TestHandleSegv.py (386 of 1909)
PASS: lldb-api :: functionalities/source-map/TestTargetSourceMap.py (387 of 1909)
PASS: lldb-api :: functionalities/signal/handle-abrt/TestHandleAbort.py (388 of 1909)
PASS: lldb-api :: functionalities/inferior-crashing/TestInferiorCrashing.py (389 of 1909)
PASS: lldb-api :: functionalities/stats_api/TestStatisticsAPI.py (390 of 1909)
PASS: lldb-api :: functionalities/rerun/TestRerun.py (391 of 1909)
PASS: lldb-api :: functionalities/signal/TestSendSignal.py (392 of 1909)
PASS: lldb-api :: functionalities/postmortem/elf-core/TestLinuxCore.py (393 of 1909)
PASS: lldb-api :: functionalities/ptr_refs/TestPtrRefs.py (394 of 1909)
PASS: lldb-api :: functionalities/signal/raise/TestRaise.py (395 of 1909)
PASS: lldb-api :: functionalities/inline-stepping/TestInlineStepping.py (396 of 1909)
PASS: lldb-api :: functionalities/mtc/simple/TestMTCSimple.py (397 of 1909)
PASS: lldb-api :: functionalities/tail_call_frames/ambiguous_tail_call_seq1/TestAmbiguousTailCallSeq1.py (398 of 1909)
PASS: lldb-api :: functionalities/tail_call_frames/ambiguous_tail_call_seq2/TestAmbiguousTailCallSeq2.py (399 of 1909)
PASS: lldb-api :: functionalities/step_scripted/TestStepScripted.py (400 of 1909)
PASS: lldb-api :: functionalities/tail_call_frames/disambiguate_call_site/TestDisambiguateCallSite.py (401 of 1909)
PASS: lldb-api :: functionalities/tail_call_frames/cross_object/TestCrossObjectTailCalls.py (402 of 1909)
PASS: lldb-api :: functionalities/inferior-assert/TestInferiorAssert.py (403 of 1909)
PASS: lldb-api :: functionalities/tail_call_frames/cross_dso/TestCrossDSOTailCalls.py (404 of 1909)
PASS: lldb-api :: functionalities/testid/TestTestId.py (405 of 1909)
PASS: lldb-api :: functionalities/target-new-solib-notifications/TestModuleLoadedNotifys.py (406 of 1909)
PASS: lldb-api :: functionalities/tail_call_frames/disambiguate_paths_to_common_sink/TestDisambiguatePathsToCommonSink.py (407 of 1909)
PASS: lldb-api :: functionalities/tail_call_frames/disambiguate_tail_call_seq/TestDisambiguateTailCallSeq.py (408 of 1909)
PASS: lldb-api :: functionalities/tail_call_frames/inlining_and_tail_calls/TestInliningAndTailCalls.py (409 of 1909)
PASS: lldb-api :: functionalities/tail_call_frames/thread_step_out_or_return/TestSteppingOutWithArtificialFrames.py (410 of 1909)
PASS: lldb-api :: functionalities/tail_call_frames/sbapi_support/TestTailCallFrameSBAPI.py (411 of 1909)
PASS: lldb-api :: functionalities/tail_call_frames/thread_step_out_message/TestArtificialFrameStepOutMessage.py (412 of 1909)
PASS: lldb-api :: functionalities/target_var/TestTargetVar.py (413 of 1909)
PASS: lldb-api :: functionalities/thread/backtrace_limit/TestBacktraceLimit.py (414 of 1909)
PASS: lldb-api :: functionalities/tail_call_frames/unambiguous_sequence/TestUnambiguousTailCalls.py (415 of 1909)
PASS: lldb-api :: functionalities/load_unload/TestLoadUnload.py (416 of 1909)
PASS: lldb-api :: functionalities/step-avoids-no-debug/TestStepNoDebug.py (417 of 1909)
PASS: lldb-api :: functionalities/set-data/TestSetData.py (418 of 1909)
PASS: lldb-api :: functionalities/thread/concurrent_events/TestConcurrentCrashWithBreak.py (419 of 1909)
PASS: lldb-api :: functionalities/inferior-crashing/TestInferiorCrashingStep.py (420 of 1909)
PASS: lldb-api :: functionalities/thread/concurrent_events/TestConcurrentCrashWithSignal.py (421 of 1909)
PASS: lldb-api :: functionalities/thread/concurrent_events/TestConcurrentCrashWithWatchpoint.py (422 of 1909)
PASS: lldb-api :: functionalities/return-value/TestReturnValue.py (423 of 1909)
PASS: lldb-api :: functionalities/thread/concurrent_events/TestConcurrentBreakpointDelayBreakpointOneSignal.py (424 of 1909)
PASS: lldb-api :: functionalities/thread/concurrent_events/TestConcurrentCrashWithWatchpointBreakpointSignal.py (425 of 1909)
PASS: lldb-api :: functionalities/thread/concurrent_events/TestConcurrentBreakpointOneDelayBreakpointThreads.py (426 of 1909)
PASS: lldb-api :: functionalities/thread/concurrent_events/TestConcurrentBreakpointsDelayedBreakpointOneWatchpoint.py (427 of 1909)
UNSUPPORTED: lldb-api :: functionalities/thread/concurrent_events/TestConcurrentManySignals.py (428 of 1909)
PASS: lldb-api :: functionalities/thread/concurrent_events/TestConcurrentDelaySignalBreak.py (429 of 1909)
PASS: lldb-api :: functionalities/thread/concurrent_events/TestConcurrentDelaySignalWatch.py (430 of 1909)
PASS: lldb-api :: functionalities/thread/concurrent_events/TestConcurrentDelayWatchBreak.py (431 of 1909)
UNSUPPORTED: lldb-api :: functionalities/thread/break_after_join/TestBreakAfterJoin.py (432 of 1909)
PASS: lldb-api :: functionalities/thread/concurrent_events/TestConcurrentDelayedCrashWithBreakpointSignal.py (433 of 1909)
PASS: lldb-api :: functionalities/thread/concurrent_events/TestConcurrentDelayedCrashWithBreakpointWatchpoint.py (434 of 1909)
PASS: lldb-api :: functionalities/thread/concurrent_events/TestConcurrentManyCrash.py (435 of 1909)
PASS: lldb-api :: functionalities/thread/concurrent_events/TestConcurrentNWatchNBreak.py (436 of 1909)
PASS: lldb-api :: functionalities/thread/concurrent_events/TestConcurrentManyBreakpoints.py (437 of 1909)
PASS: lldb-api :: functionalities/thread/concurrent_events/TestConcurrentSignalBreak.py (438 of 1909)
PASS: lldb-api :: functionalities/thread/concurrent_events/TestConcurrentManyWatchpoints.py (439 of 1909)
PASS: lldb-api :: functionalities/thread/concurrent_events/TestConcurrentSignalNWatchNBreak.py (440 of 1909)
PASS: lldb-api :: functionalities/thread/concurrent_events/TestConcurrentSignalWatch.py (441 of 1909)
PASS: lldb-api :: functionalities/thread/concurrent_events/TestConcurrentSignalDelayBreak.py (442 of 1909)
PASS: lldb-api :: functionalities/thread/concurrent_events/TestConcurrentSignalDelayWatch.py (443 of 1909)
PASS: lldb-api :: functionalities/thread/concurrent_events/TestConcurrentSignalWatchBreak.py (444 of 1909)
PASS: lldb-api :: functionalities/thread/concurrent_events/TestConcurrentTwoBreakpointThreads.py (445 of 1909)
PASS: lldb-api :: functionalities/thread/concurrent_events/TestConcurrentTwoBreakpointsOneSignal.py (446 of 1909)
PASS: lldb-api :: functionalities/thread/concurrent_events/TestConcurrentTwoBreakpointsOneWatchpoint.py (447 of 1909)
PASS: lldb-api :: functionalities/thread/concurrent_events/TestConcurrentTwoWatchpointThreads.py (448 of 1909)
PASS: lldb-api :: functionalities/thread/concurrent_events/TestConcurrentTwoWatchpointsOneBreakpoint.py (449 of 1909)
PASS: lldb-api :: functionalities/thread/concurrent_events/TestConcurrentTwoWatchpointsOneSignal.py (450 of 1909)
PASS: lldb-api :: functionalities/thread/concurrent_events/TestConcurrentWatchBreak.py (451 of 1909)
PASS: lldb-api :: functionalities/thread/concurrent_events/TestConcurrentTwoBreakpointsOneDelaySignal.py (452 of 1909)
UNSUPPORTED: lldb-api :: functionalities/thread/state/TestThreadStates.py (453 of 1909)
PASS: lldb-api :: functionalities/thread/crash_during_step/TestCrashDuringStep.py (454 of 1909)
PASS: lldb-api :: functionalities/thread/concurrent_events/TestConcurrentTwoWatchpointsOneDelayBreakpoint.py (455 of 1909)
PASS: lldb-api :: functionalities/thread/concurrent_events/TestConcurrentWatchBreakDelay.py (456 of 1909)
UNSUPPORTED: lldb-api :: functionalities/thread/thread_specific_break_plus_condition/TestThreadSpecificBpPlusCondition.py (457 of 1909)
PASS: lldb-api :: functionalities/thread/concurrent_events/TestConcurrentWatchpointDelayWatchpointOneBreakpoint.py (458 of 1909)
PASS: lldb-api :: functionalities/thread/concurrent_events/TestConcurrentWatchpointWithDelayWatchpointThreads.py (459 of 1909)
UNSUPPORTED: lldb-api :: functionalities/tsan/basic/TestTsanBasic.py (460 of 1909)
UNSUPPORTED: lldb-api :: functionalities/tsan/cpp_global_location/TestTsanCPPGlobalLocation.py (461 of 1909)
UNSUPPORTED: lldb-api :: functionalities/tsan/global_location/TestTsanGlobalLocation.py (462 of 1909)
PASS: lldb-api :: functionalities/thread/num_threads/TestNumThreads.py (463 of 1909)
UNSUPPORTED: lldb-api :: functionalities/tsan/multiple/TestTsanMultiple.py (464 of 1909)
UNSUPPORTED: lldb-api :: functionalities/tsan/thread_leak/TestTsanThreadLeak.py (465 of 1909)
UNSUPPORTED: lldb-api :: functionalities/tsan/thread_numbers/TestTsanThreadNumbers.py (466 of 1909)
UNSUPPORTED: lldb-api :: functionalities/tty/TestTerminal.py (467 of 1909)
PASS: lldb-api :: functionalities/thread/jump/TestThreadJump.py (468 of 1909)
UNSUPPORTED: lldb-api :: functionalities/ubsan/basic/TestUbsanBasic.py (469 of 1909)
UNSUPPORTED: lldb-api :: functionalities/ubsan/user-expression/TestUbsanUserExpression.py (470 of 1909)
UNSUPPORTED: lldb-api :: functionalities/unwind/ehframe/TestEhFrameUnwind.py (471 of 1909)
PASS: lldb-api :: functionalities/unwind/noreturn/module-end/TestNoReturnModuleEnd.py (472 of 1909)
UNSUPPORTED: lldb-api :: functionalities/unwind/standard/TestStandardUnwind.py (473 of 1909)
PASS: lldb-api :: functionalities/thread/thread_specific_break/TestThreadSpecificBreakpoint.py (474 of 1909)
PASS: lldb-api :: functionalities/thread/exit_during_break/TestExitDuringBreak.py (475 of 1909)
UNSUPPORTED: lldb-api :: functionalities/thread/multi_break/TestMultipleBreakpoints.py (476 of 1909)
PASS: lldb-api :: functionalities/wrong_commands/TestWrongCommands.py (477 of 1909)
PASS: lldb-api :: functionalities/thread/backtrace_all/TestBacktraceAll.py (478 of 1909)
PASS: lldb-api :: iohandler/unicode/TestUnicode.py (479 of 1909)
PASS: lldb-api :: functionalities/thread/thread_exit/TestThreadExit.py (480 of 1909)
PASS: lldb-api :: iohandler/completion/TestIOHandlerCompletion.py (481 of 1909)
PASS: lldb-api :: functionalities/unwind/sigtramp/TestSigtrampUnwind.py (482 of 1909)
PASS: lldb-api :: functionalities/var_path/TestVarPath.py (483 of 1909)
PASS: lldb-api :: functionalities/unwind/noreturn/TestNoreturnUnwind.py (484 of 1909)
PASS: lldb-api :: functionalities/value_md5_crash/TestValueMD5Crash.py (485 of 1909)
PASS: lldb-api :: functionalities/recursion/TestValueObjectRecursion.py (486 of 1909)
PASS: lldb-api :: lang/c/find_struct_type/TestFindStructTypes.py (487 of 1909)
PASS: lldb-api :: functionalities/type_completion/TestTypeCompletion.py (488 of 1909)
PASS: lldb-api :: functionalities/thread/step_until/TestStepUntil.py (489 of 1909)
PASS: lldb-api :: lang/c/conflicting-symbol/TestConflictingSymbol.py (490 of 1909)
PASS: lldb-api :: lang/c/array_types/TestArrayTypes.py (491 of 1909)
PASS: lldb-api :: lang/c/local_types/TestUseClosestType.py (492 of 1909)
PASS: lldb-api :: functionalities/thread/create_after_attach/TestCreateAfterAttach.py (493 of 1909)
PASS: lldb-api :: lang/c/enum_types/TestEnumTypes.py (494 of 1909)
PASS: lldb-api :: lang/c/forward/TestForwardDeclaration.py (495 of 1909)
PASS: lldb-api :: lang/c/offsetof/TestOffsetof.py (496 of 1909)
PASS: lldb-api :: lang/c/const_variables/TestConstVariables.py (497 of 1909)
PASS: lldb-api :: lang/c/local_variables/TestLocalVariables.py (498 of 1909)
PASS: lldb-api :: lang/c/function_types/TestFunctionTypes.py (499 of 1909)
PASS: lldb-api :: lang/c/inlines/TestRedefinitionsInInlines.py (500 of 1909)
PASS: lldb-api :: lang/c/blocks/TestBlocks.py (501 of 1909)
PASS: lldb-api :: lang/c/global_variables/TestGlobalVariables.py (502 of 1909)
UNSUPPORTED: lldb-api :: functionalities/thread/create_during_step/TestCreateDuringStep.py (503 of 1909)
PASS: lldb-api :: lang/c/bitfields/TestBitfields.py (504 of 1909)
PASS: lldb-api :: functionalities/thread/exit_during_step/TestExitDuringStep.py (505 of 1909)
PASS: lldb-api :: functionalities/type_lookup/TestTypeLookup.py (506 of 1909)
PASS: lldb-api :: functionalities/thread/step_out/TestThreadStepOut.py (507 of 1909)
PASS: lldb-api :: lang/c/modules/TestCModules.py (508 of 1909)
PASS: lldb-api :: lang/c/unicode/TestUnicodeSymbols.py (509 of 1909)
PASS: lldb-api :: lang/c/register_variables/TestRegisterVariables.py (510 of 1909)
PASS: lldb-api :: lang/c/set_values/TestSetValues.py (511 of 1909)
PASS: lldb-api :: lang/c/stepping/TestThreadStepping.py (512 of 1909)
UNSUPPORTED: lldb-api :: lang/c/typedef/Testtypedef.py (513 of 1909)
PASS: lldb-api :: lang/cpp/accelerator-table/TestCPPAccelerator.py (514 of 1909)
PASS: lldb-api :: lang/c/struct_types/TestStructTypes.py (515 of 1909)
PASS: lldb-api :: lang/c/stepping/TestStepAndBreakpoints.py (516 of 1909)
PASS: lldb-api :: lang/cpp/breakpoint-commands/TestCPPBreakpointCommands.py (517 of 1909)
PASS: lldb-api :: lang/c/strings/TestCStrings.py (518 of 1909)
PASS: lldb-api :: lang/c/unions/TestUnionMembers.py (519 of 1909)
PASS: lldb-api :: lang/cpp/breakpoint_in_member_func_w_non_primitive_params/TestBreakpointInMemberFuncWNonPrimitiveParams.py (520 of 1909)
PASS: lldb-api :: lang/c/step_over_no_deadlock/TestStepOverDoesntBlock.py (521 of 1909)
PASS: lldb-api :: lang/c/tls_globals/TestTlsGlobals.py (522 of 1909)
PASS: lldb-api :: lang/cpp/bool/TestCPPBool.py (523 of 1909)
PASS: lldb-api :: lang/c/shared_lib_stripped_symbols/TestSharedLibStrippedSymbols.py (524 of 1909)
PASS: lldb-api :: lang/c/vla/TestVLA.py (525 of 1909)
PASS: lldb-api :: lang/cpp/call-function/TestCallCPPFunction.py (526 of 1909)
PASS: lldb-api :: lang/cpp/auto/TestCPPAuto.py (527 of 1909)
PASS: lldb-api :: lang/cpp/char8_t/TestCxxChar8_t.py (528 of 1909)
PASS: lldb-api :: lang/cpp/dynamic-value-same-basename/TestDynamicValueSameBase.py (529 of 1909)
PASS: lldb-api :: lang/cpp/chained-calls/TestCppChainedCalls.py (530 of 1909)
PASS: lldb-api :: lang/cpp/class-template-parameter-pack/TestClassTemplateParameterPack.py (531 of 1909)
PASS: lldb-api :: lang/cpp/const_this/TestConstThis.py (532 of 1909)
PASS: lldb-api :: lang/cpp/diamond/TestDiamond.py (533 of 1909)
UNSUPPORTED: lldb-api :: lang/cpp/function-template-parameter-pack/TestFunctionTemplateParameterPack.py (534 of 1909)
PASS: lldb-api :: lang/cpp/dynamic-value/TestCppValueCast.py (535 of 1909)
PASS: lldb-api :: lang/cpp/class_types/TestClassTypesDisassembly.py (536 of 1909)
PASS: lldb-api :: lang/cpp/frame-var-anon-unions/TestFrameVariableAnonymousUnions.py (537 of 1909)
PASS: lldb-api :: lang/c/shared_lib/TestSharedLib.py (538 of 1909)
PASS: lldb-api :: lang/cpp/function_refs/TestFunctionRefs.py (539 of 1909)
PASS: lldb-api :: lang/cpp/class_static/TestStaticVariables.py (540 of 1909)
PASS: lldb-api :: lang/cpp/exceptions/TestCPPExceptionBreakpoints.py (541 of 1909)
PASS: lldb-api :: lang/c/step-target/TestStepTarget.py (542 of 1909)
PASS: lldb-api :: lang/cpp/dynamic-value/TestDynamicValue.py (543 of 1909)
PASS: lldb-api :: lang/cpp/extern_c/TestExternCSymbols.py (544 of 1909)
PASS: lldb-api :: lang/cpp/gmodules/TestWithModuleDebugging.py (545 of 1909)
PASS: lldb-api :: lang/cpp/limit-debug-info/TestWithLimitDebugInfo.py (546 of 1909)
PASS: lldb-api :: lang/cpp/global_variables/TestCPPGlobalVariables.py (547 of 1909)
PASS: lldb-api :: lang/cpp/gmodules-templates/TestGModules.py (548 of 1909)
PASS: lldb-api :: lang/c/anonymous/TestAnonymous.py (549 of 1909)
PASS: lldb-api :: lang/cpp/llvm-style/TestLLVMStyle.py (550 of 1909)
PASS: lldb-api :: lang/cpp/inlines/TestInlines.py (551 of 1909)
PASS: lldb-api :: lang/cpp/lambdas/TestLambdas.py (552 of 1909)
PASS: lldb-api :: lang/cpp/char1632_t/TestChar1632T.py (553 of 1909)
PASS: lldb-api :: lang/cpp/offsetof/TestOffsetofCpp.py (554 of 1909)
PASS: lldb-api :: lang/cpp/class_types/TestClassTypes.py (555 of 1909)
PASS: lldb-api :: lang/cpp/namespace_conflicts/TestNamespaceConflicts.py (556 of 1909)
PASS: lldb-api :: lang/cpp/global_operators/TestCppGlobalOperators.py (557 of 1909)
PASS: lldb-api :: lang/cpp/nested-class-other-compilation-unit/TestNestedClassWithParentInAnotherCU.py (558 of 1909)
PASS: lldb-api :: lang/cpp/nsimport/TestCppNsImport.py (559 of 1909)
PASS: lldb-api :: lang/cpp/namespace_definitions/TestNamespaceDefinitions.py (560 of 1909)
UNSUPPORTED: lldb-api :: lang/cpp/printf/TestPrintf.py (561 of 1909)
PASS: lldb-api :: lang/cpp/modules-import/TestCXXModulesImport.py (562 of 1909)
PASS: lldb-api :: lang/cpp/operator-overload/TestOperatorOverload.py (563 of 1909)
PASS: lldb-api :: lang/cpp/member-and-local-vars-with-same-name/TestMembersAndLocalsWithSameName.py (564 of 1909)
PASS: lldb-api :: lang/cpp/rvalue-references/TestRvalueReferences.py (565 of 1909)
PASS: lldb-api :: lang/cpp/overloaded-functions/TestOverloadedFunctions.py (566 of 1909)
PASS: lldb-api :: lang/cpp/incomplete-types/TestCppIncompleteTypes.py (567 of 1909)
PASS: lldb-api :: lang/cpp/signed_types/TestSignedTypes.py (568 of 1909)
PASS: lldb-api :: lang/cpp/std-function-step-into-callable/TestStdFunctionStepIntoCallable.py (569 of 1909)
UNSUPPORTED: lldb-api :: lang/cpp/static_members/TestCPPStaticMembers.py (570 of 1909)
PASS: lldb-api :: lang/cpp/operators/TestCppOperators.py (571 of 1909)
PASS: lldb-api :: lang/cpp/static_methods/TestCPPStaticMethods.py (572 of 1909)
PASS: lldb-api :: lang/cpp/scope/TestCppScope.py (573 of 1909)
PASS: lldb-api :: lang/cpp/symbols/TestSymbols.py (574 of 1909)
PASS: lldb-api :: lang/cpp/trivial_abi/TestTrivialABI.py (575 of 1909)
PASS: lldb-api :: lang/cpp/thread_local/TestThreadLocal.py (576 of 1909)
PASS: lldb-api :: lang/cpp/this/TestCPPThis.py (577 of 1909)
PASS: lldb-api :: lang/cpp/unsigned_types/TestUnsignedTypes.py (578 of 1909)
PASS: lldb-api :: lang/cpp/virtual-overload/TestVirtualOverload.py (579 of 1909)
PASS: lldb-api :: lang/cpp/type_lookup/TestCppTypeLookup.py (580 of 1909)
PASS: lldb-api :: lang/cpp/stl/TestSTL.py (581 of 1909)
PASS: lldb-api :: lang/cpp/stl/TestStdCXXDisassembly.py (582 of 1909)
PASS: lldb-api :: lang/cpp/template-function/TestTemplateFunctions.py (583 of 1909)
PASS: lldb-api :: lang/cpp/wchar_t/TestCxxWCharT.py (584 of 1909)
PASS: lldb-api :: lang/cpp/unique-types/TestUniqueTypes.py (585 of 1909)
PASS: lldb-api :: lang/cpp/virtual/TestVirtual.py (586 of 1909)
PASS: lldb-api :: lang/mixed/TestMixedLanguages.py (587 of 1909)
PASS: lldb-api :: lang/cpp/namespace/TestNamespace.py (588 of 1909)
PASS: lldb-api :: lang/cpp/unicode-literals/TestUnicodeLiterals.py (589 of 1909)
PASS: lldb-api :: lang/cpp/template/TestTemplateArgs.py (590 of 1909)
PASS: lldb-api :: lang/objc/foundation/TestObjCMethods2.py (591 of 1909)
UNSUPPORTED: lldb-api :: lang/objc/bitfield_ivars/TestBitfieldIvars.py (592 of 1909)
PASS: lldb-api :: lang/objc/foundation/TestConstStrings.py (593 of 1909)
PASS: lldb-api :: lang/objc/blocks/TestObjCIvarsInBlocks.py (594 of 1909)
PASS: lldb-api :: lang/objc/foundation/TestObjectDescriptionAPI.py (595 of 1909)
PASS: lldb-api :: lang/objc/foundation/TestObjCMethodsNSArray.py (596 of 1909)
PASS: lldb-api :: lang/objc/ivar-IMP/TestObjCiVarIMP.py (597 of 1909)
PASS: lldb-api :: lang/objc/global_ptrs/TestGlobalObjects.py (598 of 1909)
PASS: lldb-api :: lang/objc/foundation/TestSymbolTable.py (599 of 1909)
PASS: lldb-api :: lang/objc/forward-decl/TestForwardDecl.py (600 of 1909)
PASS: lldb-api :: lang/objc/modules-cache/TestClangModulesCache.py (601 of 1909)
PASS: lldb-api :: lang/objc/conflicting-definition/TestConflictingDefinition.py (602 of 1909)
PASS: lldb-api :: lang/objc/modules-hash-mismatch/TestClangModulesHashMismatch.py (603 of 1909)
PASS: lldb-api :: lang/objc/modules-auto-import/TestModulesAutoImport.py (604 of 1909)
PASS: lldb-api :: lang/objc/foundation/TestRuntimeTypes.py (605 of 1909)
PASS: lldb-api :: lang/objc/modules-update/TestClangModulesUpdate.py (606 of 1909)
PASS: lldb-api :: lang/objc/modules-incomplete/TestIncompleteModules.py (607 of 1909)
PASS: lldb-api :: lang/objc/modules-app-update/TestClangModulesAppUpdate.py (608 of 1909)
PASS: lldb-api :: lang/objc/objc-builtin-types/TestObjCBuiltinTypes.py (609 of 1909)
PASS: lldb-api :: lang/objc/modules-inline-functions/TestModulesInlineFunctions.py (610 of 1909)
PASS: lldb-api :: lang/objc/objc-checker/TestObjCCheckers.py (611 of 1909)
PASS: lldb-api :: lang/objc/objc++/TestObjCXX.py (612 of 1909)
PASS: lldb-api :: lang/cpp/namespace/TestNamespaceLookup.py (613 of 1909)
PASS: lldb-api :: lang/objc/objc-baseclass-sbtype/TestObjCBaseClassSBType.py (614 of 1909)
PASS: lldb-api :: lang/objc/foundation/TestObjCMethodsNSError.py (615 of 1909)
PASS: lldb-api :: lang/objc/foundation/TestObjCMethodsString.py (616 of 1909)
PASS: lldb-api :: lang/objc/objc-class-method/TestObjCClassMethod.py (617 of 1909)
PASS: lldb-api :: lang/objc/modules/TestObjCModules.py (618 of 1909)
PASS: lldb-api :: lang/objc/objc-ivar-stripped/TestObjCIvarStripped.py (619 of 1909)
PASS: lldb-api :: lang/objc/objc-dyn-sbtype/TestObjCDynamicSBType.py (620 of 1909)
UNSUPPORTED: lldb-api :: lang/objc/objc-dynamic-value/TestObjCDynamicValue.py (621 of 1909)
PASS: lldb-api :: lang/objc/objc-foundation-dictionary-empty/TestNSDictionary0.py (622 of 1909)
PASS: lldb-api :: lang/objc/exceptions/TestObjCExceptions.py (623 of 1909)
PASS: lldb-api :: lang/objc/objc-static-method-stripped/TestObjCStaticMethodStripped.py (624 of 1909)
PASS: lldb-api :: lang/cpp/enum_types/TestCPP11EnumTypes.py (625 of 1909)
PASS: lldb-api :: lang/objc/objc-ivar-protocols/TestIvarProtocols.py (626 of 1909)
PASS: lldb-api :: lang/objc/objc-ivar-offsets/TestObjCIvarOffsets.py (627 of 1909)
PASS: lldb-api :: lang/objc/objc-runtime-ivars/TestRuntimeIvars.py (628 of 1909)
PASS: lldb-api :: lang/objc/objc-property/TestObjCProperty.py (629 of 1909)
PASS: lldb-api :: lang/objc/objc-static-method/TestObjCStaticMethod.py (630 of 1909)
PASS: lldb-api :: lang/objc/objc-stepping/TestObjCStepping.py (631 of 1909)
PASS: lldb-api :: lang/objc/objc-struct-argument/TestObjCStructArgument.py (632 of 1909)
PASS: lldb-api :: lang/objc/objc-struct-return/TestObjCStructReturn.py (633 of 1909)
PASS: lldb-api :: lang/objc/objc-optimized/TestObjcOptimized.py (634 of 1909)
UNSUPPORTED: lldb-api :: lang/objc/rdar-12408181/TestRdar12408181.py (635 of 1909)
PASS: lldb-api :: lang/objc/objc-super/TestObjCSuper.py (636 of 1909)
PASS: lldb-api :: lang/objc/orderedset/TestOrderedSet.py (637 of 1909)
PASS: lldb-api :: lang/objc/objc_direct-methods/TestObjCDirectMethods.py (638 of 1909)
PASS: lldb-api :: lang/objc/ptr_refs/TestPtrRefsObjC.py (639 of 1909)
PASS: lldb-api :: lang/objc/foundation/TestObjCMethods.py (640 of 1909)
PASS: lldb-api :: lang/objc/rdar-10967107/TestRdar10967107.py (641 of 1909)
PASS: lldb-api :: lang/objc/print-obj/TestPrintObj.py (642 of 1909)
PASS: lldb-api :: lang/objc/radar-9691614/TestObjCMethodReturningBOOL.py (643 of 1909)
UNSUPPORTED: lldb-api :: linux/add-symbols/TestTargetSymbolsAddCommand.py (644 of 1909)
PASS: lldb-api :: lang/objc/single-entry-dictionary/TestObjCSingleEntryDictionary.py (645 of 1909)
PASS: lldb-api :: lang/objc/rdar-11355592/TestRdar11355592.py (646 of 1909)
UNSUPPORTED: lldb-api :: linux/mix-dwo-and-regular-objects/TestMixedDwarfBinary.py (647 of 1909)
UNSUPPORTED: lldb-api :: linux/sepdebugsymlink/TestTargetSymbolsSepDebugSymlink.py (648 of 1909)
PASS: lldb-api :: lang/objcxx/cxx-bridged-po/TestObjCXXBridgedPO.py (649 of 1909)
PASS: lldb-api :: lang/objc/self/TestObjCSelf.py (650 of 1909)
PASS: lldb-api :: linux/builtin_trap/TestBuiltinTrap.py (651 of 1909)
UNSUPPORTED: lldb-api :: linux/thread/create_during_instruction_step/TestCreateDuringInstructionStep.py (652 of 1909)
PASS: lldb-api :: lang/objc/unicode-string/TestUnicodeString.py (653 of 1909)
PASS: lldb-api :: macosx/DBGSourcePathRemapping/TestDSYMSourcePathRemapping.py (654 of 1909)
PASS: lldb-api :: macosx/find-app-in-bundle/TestFindAppInBundle.py (655 of 1909)
PASS: lldb-api :: lang/objc/objc-new-syntax/TestObjCNewSyntaxArray.py (656 of 1909)
PASS: lldb-api :: macosx/add-dsym/TestAddDsymMidExecutionCommand.py (657 of 1909)
PASS: lldb-api :: macosx/load-kext/TestLoadKext.py (658 of 1909)
PASS: lldb-api :: lang/objc/objc-new-syntax/TestObjCNewSyntaxDictionary.py (659 of 1909)
UNSUPPORTED: lldb-api :: macosx/macabi/TestMacABImacOSFramework.py (660 of 1909)
PASS: lldb-api :: lang/objc/variadic_methods/TestVariadicMethods.py (661 of 1909)
PASS: lldb-api :: macosx/lc-note/kern-ver-str/TestKernVerStrLCNOTE.py (662 of 1909)
PASS: lldb-api :: macosx/duplicate-archive-members/TestDuplicateMembers.py (663 of 1909)
PASS: lldb-api :: macosx/indirect_symbol/TestIndirectSymbols.py (664 of 1909)
PASS: lldb-api :: macosx/order/TestOrderFile.py (665 of 1909)
PASS: lldb-api :: macosx/version_zero/TestGetVersionZeroVersion.py (666 of 1909)
PASS: lldb-api :: macosx/universal/TestUniversal.py (667 of 1909)
PASS: lldb-api :: lang/objcxx/hide-runtime-values/TestObjCXXHideRuntimeValues.py (668 of 1909)
PASS: lldb-api :: lang/objcxx/class-name-clash/TestNameClash.py (669 of 1909)
PASS: lldb-api :: python_api/breakpoint/TestBreakpointAPI.py (670 of 1909)
PASS: lldb-api :: python_api/debugger/TestDebuggerAPI.py (671 of 1909)
PASS: lldb-api :: macosx/function-starts/TestFunctionStarts.py (672 of 1909)
PASS: lldb-api :: python_api/disassemble-raw-data/TestDisassembleRawData.py (673 of 1909)
PASS: lldb-api :: python_api/disassemble-raw-data/TestDisassemble_VST1_64.py (674 of 1909)
UNSUPPORTED: lldb-api :: python_api/event/TestEvents.py (675 of 1909)
PASS: lldb-api :: python_api/default-constructor/TestDefaultConstructorForAPIObjects.py (676 of 1909)
PASS: lldb-api :: lang/objc/hidden-ivars/TestHiddenIvars.py (677 of 1909)
PASS: lldb-api :: python_api/file_handle/TestFileHandle.py (678 of 1909)
PASS: lldb-api :: python_api/findvalue_duplist/TestSBFrameFindValue.py (679 of 1909)
PASS: lldb-api :: macosx/safe-to-func-call/TestSafeFuncCalls.py (680 of 1909)
PASS: lldb-api :: macosx/queues/TestQueues.py (681 of 1909)
PASS: lldb-api :: lang/objcxx/objcxx-ivar-vector/TestIvarVector.py (682 of 1909)
PASS: lldb-api :: macosx/thread-names/TestInterruptThreadNames.py (683 of 1909)
PASS: lldb-api :: python_api/get-value-32bit-int/TestGetValue32BitInt.py (684 of 1909)
PASS: lldb-api :: python_api/formatters/TestFormattersSBAPI.py (685 of 1909)
PASS: lldb-api :: python_api/frame/get-variables/TestGetVariables.py (686 of 1909)
PASS: lldb-api :: macosx/nslog/TestDarwinNSLogOutput.py (687 of 1909)
PASS: lldb-api :: python_api/frame/inlines/TestInlinedFrame.py (688 of 1909)
PASS: lldb-api :: python_api/interpreter/TestRunCommandInterpreterAPI.py (689 of 1909)
PASS: lldb-api :: python_api/lldbutil/TestSwigVersion.py (690 of 1909)
PASS: lldb-api :: python_api/function_symbol/TestDisasmAPI.py (691 of 1909)
PASS: lldb-api :: python_api/interpreter/TestCommandInterpreterAPI.py (692 of 1909)
PASS: lldb-api :: python_api/function_symbol/TestSymbolAPI.py (693 of 1909)
PASS: lldb-api :: python_api/hello_world/TestHelloWorld.py (694 of 1909)
PASS: lldb-api :: python_api/class_members/TestSBTypeClassMembers.py (695 of 1909)
PASS: lldb-api :: lang/objc/objc-new-syntax/TestObjCNewSyntaxLiteral.py (696 of 1909)
PASS: lldb-api :: python_api/lldbutil/frame/TestFrameUtils.py (697 of 1909)
PASS: lldb-api :: python_api/name_lookup/TestNameLookup.py (698 of 1909)
PASS: lldb-api :: python_api/lldbutil/process/TestPrintStackTraces.py (699 of 1909)
PASS: lldb-api :: python_api/sblaunchinfo/TestSBLaunchInfo.py (700 of 1909)
PASS: lldb-api :: python_api/sbstructureddata/TestStructuredDataAPI.py (701 of 1909)
PASS: lldb-api :: python_api/process/read-mem-cstring/TestReadMemCString.py (702 of 1909)
PASS: lldb-api :: python_api/sbdata/TestSBData.py (703 of 1909)
PASS: lldb-api :: python_api/frame/TestFrames.py (704 of 1909)
PASS: lldb-api :: python_api/signals/TestSignalsAPI.py (705 of 1909)
PASS: lldb-api :: macosx/find-dsym/bundle-with-dot-in-filename/TestBundleWithDotInFilename.py (706 of 1909)
PASS: lldb-api :: python_api/section/TestSectionAPI.py (707 of 1909)
PASS: lldb-api :: python_api/sbvalue_persist/TestSBValuePersist.py (708 of 1909)
PASS: lldb-api :: macosx/find-dsym/deep-bundle/TestDeepBundle.py (709 of 1909)
PASS: lldb-api :: python_api/sbvalue_const_addrof/TestSBValueConstAddrOf.py (710 of 1909)
PASS: lldb-api :: python_api/process/io/TestProcessIO.py (711 of 1909)
PASS: lldb-api :: python_api/symbol-context/TestSymbolContext.py (712 of 1909)
PASS: lldb-api :: python_api/module_section/TestModuleAndSection.py (713 of 1909)
PASS: lldb-api :: python_api/value/change_values/TestChangeValueAPI.py (714 of 1909)
PASS: lldb-api :: python_api/exprpath_synthetic/TestExprPathSynthetic.py (715 of 1909)
PASS: lldb-api :: python_api/symbol-context/two-files/TestSymbolContextTwoFiles.py (716 of 1909)
PASS: lldb-api :: python_api/type/TestTypeList.py (717 of 1909)
PASS: lldb-api :: python_api/value/linked_list/TestValueAPILinkedList.py (718 of 1909)
PASS: lldb-api :: python_api/value/TestValueAPI.py (719 of 1909)
PASS: lldb-api :: python_api/objc_type/TestObjCType.py (720 of 1909)
PASS: lldb-api :: python_api/value/empty_class/TestValueAPIEmptyClass.py (721 of 1909)
PASS: lldb-api :: python_api/lldbutil/iter/TestRegistersIterator.py (722 of 1909)
PASS: lldb-api :: python_api/watchpoint/TestSetWatchpoint.py (723 of 1909)
PASS: lldb-api :: python_api/watchpoint/TestWatchpointIgnoreCount.py (724 of 1909)
PASS: lldb-api :: python_api/watchpoint/TestWatchpointIter.py (725 of 1909)
PASS: lldb-api :: sanity/TestModuleCacheSanity.py (726 of 1909)
PASS: lldb-api :: python_api/watchpoint/condition/TestWatchpointConditionAPI.py (727 of 1909)
PASS: lldb-api :: python_api/value_var_update/TestValueVarUpdate.py (728 of 1909)
PASS: lldb-api :: terminal/TestEditline.py (729 of 1909)
PASS: lldb-api :: sample_test/TestSampleTest.py (730 of 1909)
PASS: lldb-api :: terminal/TestSTTYBeforeAndAfter.py (731 of 1909)
PASS: lldb-api :: lang/objc/real-definition/TestRealDefinition.py (732 of 1909)
PASS: lldb-api :: sample_test/TestSampleInlineTest.py (733 of 1909)
PASS: lldb-api :: python_api/sbtype_typeclass/TestSBTypeTypeClass.py (734 of 1909)
UNSUPPORTED: lldb-api :: tools/lldb-server/TestGdbRemoteModuleInfo.py (735 of 1909)
PASS: lldb-api :: tools/lldb-server/TestGdbRemoteAttach.py (736 of 1909)
PASS: lldb-api :: python_api/process/TestProcessAPI.py (737 of 1909)
PASS: lldb-api :: tools/lldb-server/TestGdbRemoteHostInfo.py (738 of 1909)
UNSUPPORTED: lldb-api :: tools/lldb-server/TestGdbRemoteAuxvSupport.py (739 of 1909)
PASS: lldb-api :: source-manager/TestSourceManager.py (740 of 1909)
PASS: lldb-api :: tools/lldb-server/TestGdbRemoteExitCode.py (741 of 1909)
UNSUPPORTED: lldb-api :: tools/lldb-server/TestGdbRemote_vContThreads.py (742 of 1909)
PASS: lldb-api :: tools/lldb-server/TestGdbRemoteSingleStep.py (743 of 1909)
PASS: lldb-api :: tools/lldb-server/TestGdbRemoteRegisterState.py (744 of 1909)
PASS: lldb-api :: tools/lldb-server/commandline/TestStubReverseConnect.py (745 of 1909)
PASS: lldb-api :: python_api/thread/TestThreadAPI.py (746 of 1909)
PASS: lldb-api :: tools/lldb-server/commandline/TestStubSetSID.py (747 of 1909)
PASS: lldb-api :: python_api/watchpoint/watchlocation/TestSetWatchlocation.py (748 of 1909)
UNSUPPORTED: lldb-api :: tools/lldb-server/libraries-svr4/TestGdbRemoteLibrariesSvr4Support.py (749 of 1909)
PASS: lldb-api :: tools/lldb-server/TestGdbRemoteKill.py (750 of 1909)
UNSUPPORTED: lldb-api :: tools/lldb-server/platform-process-connect/TestPlatformProcessConnect.py (751 of 1909)
UNSUPPORTED: lldb-api :: tools/lldb-server/signal-filtering/TestGdbRemote_QPassSignals.py (752 of 1909)
UNSUPPORTED: lldb-api :: tools/lldb-server/thread-name/TestGdbRemoteThreadName.py (753 of 1909)
PASS: lldb-api :: tools/lldb-server/inferior-crash/TestGdbRemoteAbort.py (754 of 1909)
PASS: lldb-api :: tools/lldb-server/register-reading/TestGdbRemoteGPacket.py (755 of 1909)
PASS: lldb-api :: tools/lldb-server/inferior-crash/TestGdbRemoteSegFault.py (756 of 1909)
PASS: lldb-api :: tools/lldb-server/TestGdbRemoteExpeditedRegisters.py (757 of 1909)
PASS: lldb-api :: python_api/lldbutil/iter/TestLLDBIterator.py (758 of 1909)
UNSUPPORTED: lldb-api :: tools/lldb-vscode/completions/TestVSCode_completions.py (759 of 1909)
PASS: lldb-api :: python_api/target/TestTargetAPI.py (760 of 1909)
PASS: lldb-api :: tools/lldb-vscode/breakpoint/TestVSCode_setExceptionBreakpoints.py (761 of 1909)
PASS: lldb-api :: tools/lldb-vscode/attach/TestVSCode_attach.py (762 of 1909)
PASS: lldb-api :: tools/lldb-server/TestGdbRemoteProcessInfo.py (763 of 1909)
PASS: lldb-api :: tools/lldb-vscode/stackTrace/TestVSCode_stackTrace.py (764 of 1909)
PASS: lldb-api :: python_api/watchpoint/watchlocation/TestTargetWatchAddress.py (765 of 1909)
PASS: lldb-api :: tools/lldb-vscode/step/TestVSCode_step.py (766 of 1909)
PASS: lldb-api :: tools/lldb-vscode/variables/TestVSCode_variables.py (767 of 1909)
PASS: lldb-api :: tools/lldb-vscode/breakpoint/TestVSCode_setBreakpoints.py (768 of 1909)
PASS: lldb-api :: tools/lldb-vscode/breakpoint/TestVSCode_setFunctionBreakpoints.py (769 of 1909)
PASS: lldb-api :: tools/lldb-server/TestGdbRemote_vCont.py (770 of 1909)
PASS: lldb-api :: tools/lldb-server/TestGdbRemote_qThreadStopInfo.py (771 of 1909)
PASS: lldb-api :: tools/lldb-server/TestAppleSimulatorOSType.py (772 of 1909)
PASS: lldb-api :: tools/lldb-vscode/launch/TestVSCode_launch.py (773 of 1909)
PASS: lldb-api :: types/TestDoubleTypesExpr.py (774 of 1909)
UNSUPPORTED: lldb-shell :: Breakpoint/case-insensitive.test (775 of 1909)
PASS: lldb-shell :: Breakpoint/case-sensitive.test (776 of 1909)
PASS: lldb-shell :: Breakpoint/debug_addrx.test (777 of 1909)
PASS: lldb-shell :: Breakpoint/debug_rnglist_basic.test (778 of 1909)
PASS: lldb-api :: types/TestDoubleTypes.py (779 of 1909)
PASS: lldb-api :: types/TestFloatTypes.py (780 of 1909)
PASS: lldb-shell :: Breakpoint/debug_rnglist_offset_pair.test (781 of 1909)
PASS: lldb-shell :: Breakpoint/debug_rnglist_rlestartend.test (782 of 1909)
PASS: lldb-shell :: Breakpoint/debug_rnglistx_rlex.test (783 of 1909)
PASS: lldb-shell :: Breakpoint/implicit_const_form_support.test (784 of 1909)
PASS: lldb-shell :: Breakpoint/ppc64-localentry.test (785 of 1909)
PASS: lldb-shell :: Breakpoint/single-file-split-dwarf.test (786 of 1909)
PASS: lldb-shell :: Breakpoint/split-dwarf-5-addrbase.test (787 of 1909)
PASS: lldb-shell :: Breakpoint/dummy-target.test (788 of 1909)
PASS: lldb-shell :: Breakpoint/split-dwarf5-debug-stroffsets.test (789 of 1909)
PASS: lldb-api :: types/TestFloatTypesExpr.py (790 of 1909)
PASS: lldb-shell :: BuildScript/compiler-full-path.test (791 of 1909)
UNSUPPORTED: lldb-shell :: BuildScript/toolchain-clang-cl.test (792 of 1909)
PASS: lldb-shell :: BuildScript/script-args.test (793 of 1909)
UNSUPPORTED: lldb-shell :: BuildScript/toolchain-msvc.test (794 of 1909)
PASS: lldb-shell :: BuildScript/toolchain-clang.test (795 of 1909)
PASS: lldb-shell :: Commands/CommandScriptImmediateOutput/CommandScriptImmediateOutputConsole.test (796 of 1909)
PASS: lldb-shell :: Commands/command-backtrace.test (797 of 1909)
PASS: lldb-shell :: BuildScript/modes.test (798 of 1909)
PASS: lldb-shell :: Breakpoint/jitbp_elf.test (799 of 1909)
PASS: lldb-shell :: Commands/command-regex-unalias.test (800 of 1909)
PASS: lldb-shell :: Commands/command-regex-delete.test (801 of 1909)
PASS: lldb-shell :: Commands/CommandScriptImmediateOutput/CommandScriptImmediateOutputFile.test (802 of 1909)
PASS: lldb-shell :: Commands/command-source.test (803 of 1909)
PASS: lldb-shell :: Driver/TestCommands.test (804 of 1909)
PASS: lldb-shell :: Driver/LocalLLDBInit.test (805 of 1909)
PASS: lldb-shell :: Driver/TestCore.test (806 of 1909)
PASS: lldb-shell :: Driver/TestFile.test (807 of 1909)
PASS: lldb-shell :: Driver/TestNoUseColor.test (808 of 1909)
PASS: lldb-shell :: Driver/TestProcessAttach.test (809 of 1909)
PASS: lldb-shell :: Driver/TestRepl.test (810 of 1909)
PASS: lldb-shell :: Commands/command-script-import.test (811 of 1909)
UNSUPPORTED: lldb-shell :: ExecControl/StopHook/stop-hook-threads.test (812 of 1909)
PASS: lldb-api :: types/TestRecursiveTypes.py (813 of 1909)
PASS: lldb-shell :: Driver/TestSingleQuote.test (814 of 1909)
UNSUPPORTED: lldb-shell :: Expr/TestIRMemoryMapWindows.test (815 of 1909)
PASS: lldb-shell :: Driver/TestTarget.test (816 of 1909)
PASS: lldb-shell :: Expr/TestMultilineExpr.test (817 of 1909)
PASS: lldb-shell :: Expr/TestTypeOfDeclTypeExpr.test (818 of 1909)
PASS: lldb-shell :: Driver/TestConvenienceVariables.test (819 of 1909)
PASS: lldb-shell :: Minidump/Windows/Sigsegv/sigsegv.test (820 of 1909)
PASS: lldb-shell :: Minidump/Windows/arm-fp-unwind.test (821 of 1909)
PASS: lldb-shell :: Minidump/Windows/broken-unwind.test (822 of 1909)
PASS: lldb-shell :: Minidump/Windows/find-module.test (823 of 1909)
PASS: lldb-shell :: Minidump/breakpad-symbols.test (824 of 1909)
PASS: lldb-shell :: Minidump/disassemble-no-module.yaml (825 of 1909)
PASS: lldb-shell :: Host/TestCustomShell.test (826 of 1909)
PASS: lldb-shell :: Heap/heap-cstr.test (827 of 1909)
PASS: lldb-shell :: Minidump/memory-region-from-module.yaml (828 of 1909)
PASS: lldb-shell :: Minidump/memory-region.yaml (829 of 1909)
PASS: lldb-shell :: Minidump/dump-all.test (830 of 1909)
PASS: lldb-shell :: ObjectFile/Breakpad/discontiguous-sections.test (831 of 1909)
PASS: lldb-shell :: ObjectFile/Breakpad/sections-trailing-func.test (832 of 1909)
PASS: lldb-shell :: Minidump/fb-dump.test (833 of 1909)
PASS: lldb-shell :: ObjectFile/Breakpad/sections.test (834 of 1909)
PASS: lldb-shell :: ObjectFile/ELF/PT_LOAD-empty.yaml (835 of 1909)
PASS: lldb-shell :: ObjectFile/Breakpad/uuid-matching-mac.test (836 of 1909)
PASS: lldb-shell :: ObjectFile/Breakpad/breakpad-identification.test (837 of 1909)
PASS: lldb-shell :: ObjectFile/ELF/PT_LOAD-overlap-section.yaml (838 of 1909)
PASS: lldb-shell :: ObjectFile/ELF/PT_LOAD-overlap-PT_INTERP.yaml (839 of 1909)
PASS: lldb-shell :: ObjectFile/ELF/PT_LOAD.yaml (840 of 1909)
PASS: lldb-shell :: ObjectFile/ELF/PT_LOAD-overlap.yaml (841 of 1909)
PASS: lldb-shell :: ObjectFile/ELF/aarch64-relocations.yaml (842 of 1909)
PASS: lldb-shell :: ObjectFile/ELF/base-address.yaml (843 of 1909)
UNSUPPORTED: lldb-shell :: ObjectFile/ELF/basic-info.yaml (844 of 1909)
PASS: lldb-shell :: ObjectFile/ELF/build-id-case.yaml (845 of 1909)
PASS: lldb-api :: types/TestIntegerType.py (846 of 1909)
PASS: lldb-shell :: ObjectFile/ELF/compressed-sections.yaml (847 of 1909)
PASS: lldb-shell :: ObjectFile/ELF/duplicate-section.yaml (848 of 1909)
PASS: lldb-shell :: ObjectFile/ELF/gnu-debuglink.yaml (849 of 1909)
FAIL: lldb-shell :: ObjectFile/ELF/PT_LOAD-overlap-PT_TLS.yaml (850 of 1909)
FAIL: lldb-shell :: ObjectFile/ELF/PT_TLS-overlap-PT_LOAD.yaml (851 of 1909)
UNSUPPORTED: lldb-shell :: ObjectFile/ELF/minidebuginfo-no-lzma.yaml (852 of 1909)
UNSUPPORTED: lldb-shell :: ObjectFile/ELF/minidebuginfo-set-and-hit-breakpoint.test (853 of 1909)
PASS: lldb-shell :: ObjectFile/ELF/minidebuginfo-corrupt-xz.yaml (854 of 1909)
PASS: lldb-shell :: ObjectFile/ELF/netbsd-core-amd64.test (855 of 1909)
PASS: lldb-shell :: ObjectFile/ELF/minidebuginfo-find-symbols.yaml (856 of 1909)
PASS: lldb-shell :: ObjectFile/ELF/netbsd-exec-8.99.30-amd64.yaml (857 of 1909)
PASS: lldb-shell :: ObjectFile/ELF/section-addresses.yaml (858 of 1909)
PASS: lldb-shell :: ObjectFile/ELF/section-overlap.yaml (859 of 1909)
PASS: lldb-shell :: ObjectFile/ELF/section-permissions.yaml (860 of 1909)
PASS: lldb-shell :: ObjectFile/ELF/section-types.yaml (861 of 1909)
PASS: lldb-shell :: ObjectFile/ELF/section-types-edgecases.yaml (862 of 1909)
PASS: lldb-shell :: ObjectFile/ELF/short-build-id.yaml (863 of 1909)
PASS: lldb-shell :: ExecControl/StopHook/stop-hook.test (864 of 1909)
PASS: lldb-shell :: ObjectFile/MachO/lc_build_version.yaml (865 of 1909)
PASS: lldb-shell :: ObjectFile/MachO/lc_version_min.yaml (866 of 1909)
PASS: lldb-shell :: ObjectFile/MachO/lc_build_version_notools.yaml (867 of 1909)
PASS: lldb-shell :: ObjectFile/MachO/subsections.yaml (868 of 1909)
PASS: lldb-shell :: ObjectFile/PECOFF/basic-info-arm.yaml (869 of 1909)
UNSUPPORTED: lldb-shell :: ObjectFile/PECOFF/dep-modules.yaml (870 of 1909)
PASS: lldb-shell :: ObjectFile/PECOFF/basic-info-arm64.yaml (871 of 1909)
UNSUPPORTED: lldb-shell :: ObjectFile/PECOFF/export-dllfunc.yaml (872 of 1909)
PASS: lldb-shell :: ObjectFile/PECOFF/basic-info.yaml (873 of 1909)
PASS: lldb-shell :: ObjectFile/PECOFF/disassemble-thumb.yaml (874 of 1909)
PASS: lldb-shell :: ObjectFile/PECOFF/invalid-export-table.yaml (875 of 1909)
PASS: lldb-shell :: ObjectFile/PECOFF/section-types.yaml (876 of 1909)
PASS: lldb-shell :: ObjectFile/MachO/symtab.yaml (877 of 1909)
UNSUPPORTED: lldb-shell :: ObjectFile/PECOFF/uuid.yaml (878 of 1909)
PASS: lldb-shell :: ObjectFile/PECOFF/sections.yaml (879 of 1909)
PASS: lldb-shell :: ObjectFile/PECOFF/sections-names.yaml (880 of 1909)
PASS: lldb-shell :: ObjectFile/PECOFF/symbol.yaml (881 of 1909)
PASS: lldb-shell :: ObjectFile/wasm/basic.yaml (882 of 1909)
PASS: lldb-shell :: ObjectFile/wasm/stripped-debug-sections.yaml (883 of 1909)
PASS: lldb-shell :: ObjectFile/wasm/embedded-debug-sections.yaml (884 of 1909)
UNSUPPORTED: lldb-shell :: Process/Windows/exception_access_violation.cpp (885 of 1909)
PASS: lldb-shell :: ObjectFile/wasm/unified-debug-sections.yaml (886 of 1909)
PASS: lldb-shell :: Quit/TestQuitExitCode0.test (887 of 1909)
PASS: lldb-shell :: Quit/TestQuitExitCodeHex0.test (888 of 1909)
PASS: lldb-shell :: Quit/TestQuitExitCode-30.test (889 of 1909)
PASS: lldb-shell :: Quit/TestQuitExitCode30.test (890 of 1909)
PASS: lldb-shell :: Quit/TestQuitExitCodeImplicit0.test (891 of 1909)
PASS: lldb-shell :: Quit/TestQuitExitCodeNonInt.test (892 of 1909)
UNSUPPORTED: lldb-shell :: Register/aarch64-fp-read.test (893 of 1909)
UNSUPPORTED: lldb-shell :: Register/aarch64-gp-read.test (894 of 1909)
UNSUPPORTED: lldb-shell :: Register/arm-fp-read.test (895 of 1909)
UNSUPPORTED: lldb-shell :: Register/arm-gp-read.test (896 of 1909)
PASS: lldb-shell :: Quit/TestQuitExitCodeHexA.test (897 of 1909)
UNSUPPORTED: lldb-shell :: Register/x86-64-gp-write.test (898 of 1909)
PASS: lldb-shell :: Quit/TestQuitExitCodeTooManyArgs.test (899 of 1909)
PASS: lldb-shell :: Register/x86-64-gp-read.test (900 of 1909)
UNSUPPORTED: lldb-shell :: Register/x86-64-xmm16-read.test (901 of 1909)
PASS: lldb-shell :: Register/x86-64-read.test (902 of 1909)
UNSUPPORTED: lldb-shell :: Register/x86-64-xmm16-write.test (903 of 1909)
XFAIL: lldb-shell :: Register/x86-64-write.test (904 of 1909)
UNSUPPORTED: lldb-shell :: Register/x86-64-ymm16-read.test (905 of 1909)
UNSUPPORTED: lldb-shell :: Register/x86-64-ymm16-write.test (906 of 1909)
UNSUPPORTED: lldb-shell :: Register/x86-64-zmm-read.test (907 of 1909)
UNSUPPORTED: lldb-shell :: Register/x86-64-zmm-write.test (908 of 1909)
UNSUPPORTED: lldb-shell :: Register/x86-gp-read.test (909 of 1909)
UNSUPPORTED: lldb-shell :: Register/x86-gp-write.test (910 of 1909)
PASS: lldb-shell :: ObjectFile/ELF/many-sections.s (911 of 1909)
PASS: lldb-shell :: Register/x86-64-ymm-read.test (912 of 1909)
UNSUPPORTED: lldb-shell :: Register/x86-ymm-read.test (913 of 1909)
UNSUPPORTED: lldb-shell :: Register/x86-ymm-write.test (914 of 1909)
UNSUPPORTED: lldb-shell :: Register/x86-zmm-read.test (915 of 1909)
UNSUPPORTED: lldb-shell :: Register/x86-zmm-write.test (916 of 1909)
XFAIL: lldb-shell :: Register/x86-mm-xmm-read.test (917 of 1909)
XFAIL: lldb-shell :: Register/x86-mm-xmm-write.test (918 of 1909)
XFAIL: lldb-shell :: Register/x86-64-ymm-write.test (919 of 1909)
PASS: lldb-shell :: Expr/TestIRMemoryMap.test (920 of 1909)
PASS: lldb-shell :: Process/TestEnvironment.test (921 of 1909)
PASS: lldb-api :: types/TestCharType.py (922 of 1909)
PASS: lldb-shell :: Reproducer/TestCrash.test (923 of 1909)
PASS: lldb-shell :: Reproducer/Functionalities/TestDataFormatter.test (924 of 1909)
PASS: lldb-shell :: Reproducer/TestCaptureEnvOverride.test (925 of 1909)
PASS: lldb-shell :: Reproducer/Functionalities/TestImageList.test (926 of 1909)
PASS: lldb-shell :: Reproducer/Functionalities/TestStepping.test (927 of 1909)
PASS: lldb-shell :: Reproducer/TestDriverOptions.test (928 of 1909)
PASS: lldb-shell :: Reproducer/Modules/TestModuleCXX.test (929 of 1909)
PASS: lldb-shell :: Reproducer/TestDiscard.test (930 of 1909)
PASS: lldb-shell :: Reproducer/Functionalities/TestExpressionEvaluation.test (931 of 1909)
PASS: lldb-api :: tools/lldb-server/TestGdbRemoteThreadsInStopReply.py (932 of 1909)
PASS: lldb-shell :: Reproducer/TestSynchronous.test (933 of 1909)
PASS: lldb-shell :: Reproducer/TestFileRepro.test (934 of 1909)
UNSUPPORTED: lldb-shell :: ScriptInterpreter/Lua/bindings.test (935 of 1909)
UNSUPPORTED: lldb-shell :: ScriptInterpreter/Lua/breakpoint_callback.test (936 of 1909)
UNSUPPORTED: lldb-shell :: ScriptInterpreter/Lua/command_script_import.test (937 of 1909)
UNSUPPORTED: lldb-shell :: ScriptInterpreter/Lua/convenience_variables.test (938 of 1909)
UNSUPPORTED: lldb-shell :: ScriptInterpreter/Lua/independent_state.test (939 of 1909)
UNSUPPORTED: lldb-shell :: ScriptInterpreter/Lua/lua.test (940 of 1909)
UNSUPPORTED: lldb-shell :: ScriptInterpreter/Lua/nested_sessions.test (941 of 1909)
UNSUPPORTED: lldb-shell :: ScriptInterpreter/Lua/persistent_state.test (942 of 1909)
UNSUPPORTED: lldb-shell :: ScriptInterpreter/Lua/watchpoint_callback.test (943 of 1909)
PASS: lldb-shell :: ScriptInterpreter/None/import_module.test (944 of 1909)
PASS: lldb-api :: lang/objc/foundation/TestFoundationDisassembly.py (945 of 1909)
PASS: lldb-shell :: ScriptInterpreter/None/none.test (946 of 1909)
PASS: lldb-shell :: Reproducer/TestDump.test (947 of 1909)
PASS: lldb-shell :: Settings/TestDisableColor.test (948 of 1909)
PASS: lldb-shell :: Settings/TestDisassemblyFormat.test (949 of 1909)
PASS: lldb-shell :: Reproducer/TestRelativePath.test (950 of 1909)
PASS: lldb-shell :: ScriptInterpreter/Python/scripted_breakpoint.test (951 of 1909)
PASS: lldb-shell :: ScriptInterpreter/Python/crashlog.test (952 of 1909)
PASS: lldb-shell :: Settings/TestEchoCommands.test (953 of 1909)
PASS: lldb-shell :: Reproducer/TestMultipleTargets.test (954 of 1909)
PASS: lldb-shell :: Settings/TestModuleCacheSanity.test (955 of 1909)
PASS: lldb-shell :: Settings/TestSettingsSet.test (956 of 1909)
PASS: lldb-shell :: Settings/TestStopCommandSourceOnError.test (957 of 1909)
PASS: lldb-shell :: Settings/TestSettingsWrite.test (958 of 1909)
PASS: lldb-shell :: SymbolFile/Breakpad/line-table-edgecases.test (959 of 1909)
PASS: lldb-shell :: SymbolFile/Breakpad/line-table-discontinuous-file-ids.test (960 of 1909)
PASS: lldb-shell :: SymbolFile/Breakpad/line-table-missing-file.test (961 of 1909)
PASS: lldb-shell :: SymbolFile/Breakpad/line-table-mixed-path-styles.test (962 of 1909)
PASS: lldb-shell :: Settings/TestFrameFormatColor.test (963 of 1909)
PASS: lldb-shell :: SymbolFile/Breakpad/line-table.test (964 of 1909)
PASS: lldb-shell :: Settings/TestFrameFormatMangling.test (965 of 1909)
PASS: lldb-shell :: SymbolFile/Breakpad/stack-cfi-parsing.test (966 of 1909)
PASS: lldb-shell :: SymbolFile/Breakpad/symtab-macho.test (967 of 1909)
PASS: lldb-shell :: Settings/TestFrameFormatNoColor.test (968 of 1909)
PASS: lldb-shell :: Reproducer/TestWorkingDir.test (969 of 1909)
PASS: lldb-shell :: SymbolFile/Breakpad/symtab.test (970 of 1909)
PASS: lldb-shell :: SymbolFile/Breakpad/unwind-via-stack-cfi.test (971 of 1909)
PASS: lldb-shell :: SymbolFile/Breakpad/unwind-via-raSearch.test (972 of 1909)
PASS: lldb-shell :: SymbolFile/Breakpad/unwind-via-stack-win.test (973 of 1909)
UNSUPPORTED: lldb-shell :: SymbolFile/DWARF/array-sizes.s (974 of 1909)
PASS: lldb-shell :: Reproducer/TestVersionCheck.test (975 of 1909)
PASS: lldb-shell :: SymbolFile/DWARF/DW_AT_loclists_base.s (976 of 1909)
PASS: lldb-shell :: SymbolFile/DWARF/DW_AT_low_pc-addrx.s (977 of 1909)
PASS: lldb-shell :: SymbolFile/DWARF/DW_OP_piece-struct.s (978 of 1909)
UNSUPPORTED: lldb-shell :: SymbolFile/DWARF/debug-line-basic.s (979 of 1909)
UNSUPPORTED: lldb-shell :: SymbolFile/DWARF/debug-names-compressed.cpp (980 of 1909)
UNSUPPORTED: lldb-shell :: SymbolFile/DWARF/debug-types-address-ranges.s (981 of 1909)
UNSUPPORTED: lldb-shell :: SymbolFile/DWARF/debug-types-basic.test (982 of 1909)
PASS: lldb-shell :: SymbolFile/DWARF/childless-compile-unit.s (983 of 1909)
PASS: lldb-shell :: SymbolFile/DWARF/apple-index-is-used.cpp (984 of 1909)
UNSUPPORTED: lldb-shell :: SymbolFile/DWARF/debug-types-dwo-cross-reference.cpp (985 of 1909)
UNSUPPORTED: lldb-shell :: SymbolFile/DWARF/debug-types-expressions.test (986 of 1909)
PASS: lldb-shell :: SymbolFile/DWARF/anon_class_w_and_wo_export_symbols.ll (987 of 1909)
UNSUPPORTED: lldb-shell :: SymbolFile/DWARF/debug-types-signature-loop.s (988 of 1909)
PASS: lldb-shell :: SymbolFile/DWARF/clang-ast-from-dwarf-objc-property.m (989 of 1909)
PASS: lldb-shell :: SymbolFile/DWARF/clang-ast-from-dwarf-unamed-and-anon-structs.cpp (990 of 1909)
PASS: lldb-shell :: SymbolFile/DWARF/debug-types-dwarf5.s (991 of 1909)
PASS: lldb-shell :: SymbolFile/DWARF/debug-types-line-tables.s (992 of 1909)
PASS: lldb-shell :: SymbolFile/DWARF/debug_line-relative_path.s (993 of 1909)
PASS: lldb-shell :: SymbolFile/DWARF/debug_loc-aslr.s (994 of 1909)
PASS: lldb-shell :: SymbolFile/DWARF/debug_loc_and_loclists.s (995 of 1909)
PASS: lldb-shell :: Reproducer/TestGDBRemoteRepro.test (996 of 1909)
UNSUPPORTED: lldb-shell :: SymbolFile/DWARF/debug_ranges_and_rnglists.test (997 of 1909)
PASS: lldb-shell :: SymbolFile/DWARF/debug_loclists-dwo.s (998 of 1909)
PASS: lldb-shell :: SymbolFile/DWARF/debug_ranges-missing-section.s (999 of 1909)
PASS: lldb-shell :: SymbolFile/DWARF/debug_ranges.s (1000 of 1909)
UNSUPPORTED: lldb-shell :: SymbolFile/DWARF/dir-separator-no-comp-dir-relative-name.s (1001 of 1909)
PASS: lldb-shell :: SymbolFile/DWARF/debug_loc.s (1002 of 1909)
UNSUPPORTED: lldb-shell :: SymbolFile/DWARF/dir-separator-no-comp-dir.s (1003 of 1909)
UNSUPPORTED: lldb-shell :: SymbolFile/DWARF/dir-separator-posix.s (1004 of 1909)
UNSUPPORTED: lldb-shell :: SymbolFile/DWARF/dir-separator-windows.s (1005 of 1909)
PASS: lldb-shell :: SymbolFile/DWARF/debug_rnglists-dwo.s (1006 of 1909)
UNSUPPORTED: lldb-shell :: SymbolFile/DWARF/dwarf5-index-is-used.cpp (1007 of 1909)
UNSUPPORTED: lldb-shell :: SymbolFile/DWARF/dwarf5-partial-index.cpp (1008 of 1909)
UNSUPPORTED: lldb-shell :: SymbolFile/DWARF/dwarf5_locations.s (1009 of 1909)
UNSUPPORTED: lldb-shell :: SymbolFile/DWARF/find-basic-function.cpp (1010 of 1909)
UNSUPPORTED: lldb-shell :: SymbolFile/DWARF/find-basic-namespace.cpp (1011 of 1909)
UNSUPPORTED: lldb-shell :: SymbolFile/DWARF/find-basic-type.cpp (1012 of 1909)
UNSUPPORTED: lldb-shell :: SymbolFile/DWARF/find-basic-variable.cpp (1013 of 1909)
UNSUPPORTED: lldb-shell :: SymbolFile/DWARF/find-function-regex.cpp (1014 of 1909)
UNSUPPORTED: lldb-shell :: SymbolFile/DWARF/find-inline-method.s (1015 of 1909)
PASS: lldb-shell :: SymbolFile/DWARF/debug_aranges-empty-section.s (1016 of 1909)
UNSUPPORTED: lldb-shell :: SymbolFile/DWARF/find-method.cpp (1017 of 1909)
PASS: lldb-shell :: SymbolFile/DWARF/debug_rnglists.s (1018 of 1909)
UNSUPPORTED: lldb-shell :: SymbolFile/DWARF/find-type-in-function.cpp (1019 of 1909)
UNSUPPORTED: lldb-shell :: SymbolFile/DWARF/find-variable-dwo.cpp (1020 of 1909)
UNSUPPORTED: lldb-shell :: SymbolFile/DWARF/find-variable-file.cpp (1021 of 1909)
PASS: lldb-shell :: SymbolFile/DWARF/compilercontext.ll (1022 of 1909)
PASS: lldb-shell :: SymbolFile/DWARF/dwarf5-debug_line.s (1023 of 1909)
UNSUPPORTED: lldb-shell :: SymbolFile/DWARF/inline-function-address-shared.test (1024 of 1909)
UNSUPPORTED: lldb-shell :: SymbolFile/DWARF/inline-function-address.ll (1025 of 1909)
PASS: lldb-shell :: SymbolFile/DWARF/dwarf5-atomic.s (1026 of 1909)
PASS: lldb-shell :: SymbolFile/DWARF/find-method-local-struct.cpp (1027 of 1909)
PASS: lldb-shell :: SymbolFile/DWARF/forward-declarations.s (1028 of 1909)
UNSUPPORTED: lldb-shell :: SymbolFile/DWARF/win-i386-line-table.s (1029 of 1909)
UNSUPPORTED: lldb-shell :: SymbolFile/NativePDB/ast-functions-msvc.cpp (1030 of 1909)
UNSUPPORTED: lldb-shell :: SymbolFile/NativePDB/ast-functions.cpp (1031 of 1909)
UNSUPPORTED: lldb-shell :: SymbolFile/NativePDB/ast-methods.cpp (1032 of 1909)
UNSUPPORTED: lldb-shell :: SymbolFile/NativePDB/ast-types.cpp (1033 of 1909)
UNSUPPORTED: lldb-shell :: SymbolFile/NativePDB/bitfields.cpp (1034 of 1909)
UNSUPPORTED: lldb-shell :: SymbolFile/NativePDB/break-by-function.cpp (1035 of 1909)
PASS: lldb-shell :: SymbolFile/DWARF/find-qualified-variable.cpp (1036 of 1909)
UNSUPPORTED: lldb-shell :: SymbolFile/NativePDB/break-by-line.cpp (1037 of 1909)
UNSUPPORTED: lldb-shell :: SymbolFile/NativePDB/function-types-builtins.cpp (1038 of 1909)
UNSUPPORTED: lldb-shell :: SymbolFile/NativePDB/disassembly.cpp (1039 of 1909)
UNSUPPORTED: lldb-shell :: SymbolFile/NativePDB/function-types-calling-conv.cpp (1040 of 1909)
UNSUPPORTED: lldb-shell :: SymbolFile/NativePDB/function-types-classes.cpp (1041 of 1909)
UNSUPPORTED: lldb-shell :: SymbolFile/NativePDB/globals-bss.cpp (1042 of 1909)
UNSUPPORTED: lldb-shell :: SymbolFile/NativePDB/global-classes.cpp (1043 of 1909)
UNSUPPORTED: lldb-shell :: SymbolFile/NativePDB/local-variables.cpp (1044 of 1909)
UNSUPPORTED: lldb-shell :: SymbolFile/NativePDB/globals-fundamental.cpp (1045 of 1909)
UNSUPPORTED: lldb-shell :: SymbolFile/NativePDB/nested-types.cpp (1046 of 1909)
UNSUPPORTED: lldb-shell :: SymbolFile/NativePDB/s_constant.cpp (1047 of 1909)
UNSUPPORTED: lldb-shell :: SymbolFile/NativePDB/source-list.cpp (1048 of 1909)
UNSUPPORTED: lldb-shell :: SymbolFile/NativePDB/stack_unwinding01.cpp (1049 of 1909)
UNSUPPORTED: lldb-shell :: SymbolFile/NativePDB/tag-types.cpp (1050 of 1909)
UNSUPPORTED: lldb-shell :: SymbolFile/NativePDB/typedefs.cpp (1051 of 1909)
UNSUPPORTED: lldb-shell :: SymbolFile/PDB/calling-conventions.test (1052 of 1909)
UNSUPPORTED: lldb-shell :: SymbolFile/PDB/ast-restore.test (1053 of 1909)
UNSUPPORTED: lldb-shell :: SymbolFile/PDB/class-layout.test (1054 of 1909)
UNSUPPORTED: lldb-shell :: SymbolFile/PDB/compilands.test (1055 of 1909)
UNSUPPORTED: lldb-shell :: SymbolFile/PDB/expressions.test (1056 of 1909)
UNSUPPORTED: lldb-shell :: SymbolFile/PDB/enums-layout.test (1057 of 1909)
UNSUPPORTED: lldb-shell :: SymbolFile/PDB/function-level-linking.test (1058 of 1909)
UNSUPPORTED: lldb-shell :: SymbolFile/PDB/func-symbols.test (1059 of 1909)
UNSUPPORTED: lldb-shell :: SymbolFile/PDB/function-nested-block.test (1060 of 1909)
UNSUPPORTED: lldb-shell :: SymbolFile/PDB/pointers.test (1061 of 1909)
UNSUPPORTED: lldb-shell :: SymbolFile/PDB/type-quals.test (1062 of 1909)
UNSUPPORTED: lldb-shell :: SymbolFile/PDB/typedefs.test (1063 of 1909)
UNSUPPORTED: lldb-shell :: SymbolFile/PDB/udt-layout.test (1064 of 1909)
UNSUPPORTED: lldb-shell :: SymbolFile/PDB/variables-locations.test (1065 of 1909)
UNSUPPORTED: lldb-shell :: SymbolFile/PDB/variables.test (1066 of 1909)
UNSUPPORTED: lldb-shell :: SymbolFile/PDB/vbases.test (1067 of 1909)
UNSUPPORTED: lldb-shell :: SymbolFile/dissassemble-entry-point.s (1068 of 1909)
UNSUPPORTED: lldb-shell :: SymbolFile/target-symbols-add-unwind.test (1069 of 1909)
PASS: lldb-shell :: SymbolFile/DWARF/gnu-style-compression.cpp (1070 of 1909)
UNSUPPORTED: lldb-shell :: Unwind/eh-frame-small-fde.test (1071 of 1909)
PASS: lldb-shell :: Reproducer/TestReuseDirectory.test (1072 of 1909)
PASS: lldb-shell :: SymbolFile/DWARF/split-dwarf-inlining.cpp (1073 of 1909)
PASS: lldb-shell :: SymbolFile/DWARF/parallel-indexing-stress.s (1074 of 1909)
UNSUPPORTED: lldb-shell :: Unwind/unwind-plan-dwarf-dump.test (1075 of 1909)
PASS: lldb-shell :: SymbolFile/DWARF/split-dwarf-multiple-cu.ll (1076 of 1909)
UNSUPPORTED: lldb-shell :: Watchpoint/netbsd-nouserdbregs.test (1077 of 1909)
PASS: lldb-unit :: Breakpoint/Release/LLDBBreakpointTests/BreakpointIDTest.StringIsBreakpointName (1078 of 1909)
PASS: lldb-unit :: Core/Release/LLDBCoreTests/MangledTest.EmptyForInvalidName (1079 of 1909)
PASS: lldb-shell :: SymbolFile/symbol-binding.test (1080 of 1909)
PASS: lldb-shell :: SymbolFile/DWARF/debug-types-missing-signature.test (1081 of 1909)
PASS: lldb-unit :: Core/Release/LLDBCoreTests/MangledTest.NameIndexes_FindFunctionSymbols (1082 of 1909)
PASS: lldb-unit :: Core/Release/LLDBCoreTests/MangledTest.ResultForBlockInvocation (1083 of 1909)
PASS: lldb-unit :: Core/Release/LLDBCoreTests/MangledTest.ResultForValidName (1084 of 1909)
PASS: lldb-unit :: Core/Release/LLDBCoreTests/RichManglingContextTest.Basic (1085 of 1909)
PASS: lldb-unit :: Core/Release/LLDBCoreTests/RichManglingContextTest.FromCxxMethodName (1086 of 1909)
PASS: lldb-unit :: Core/Release/LLDBCoreTests/RichManglingContextTest.IPDRealloc (1087 of 1909)
PASS: lldb-unit :: Core/Release/LLDBCoreTests/RichManglingContextTest.SwitchProvider (1088 of 1909)
PASS: lldb-unit :: Core/Release/LLDBCoreTests/StreamCallbackTest.Callback (1089 of 1909)
PASS: lldb-unit :: Core/Release/LLDBCoreTests/UniqueCStringMap.NoDefaultConstructor (1090 of 1909)
PASS: lldb-unit :: DataFormatter/Release/LLDBFormatterTests/FormatManagerTests.CompatibleLangs (1091 of 1909)
PASS: lldb-unit :: Disassembler/Release/DisassemblerTests/TestArm64Disassembly.TestArmv81Instruction (1092 of 1909)
PASS: lldb-unit :: Disassembler/Release/DisassemblerTests/TestArmv7Disassembly.TestCortexFPDisass (1093 of 1909)
PASS: lldb-unit :: Editline/Release/EditlineTests/EditlineTestFixture.EditlineReceivesMultiLineText (1094 of 1909)
PASS: lldb-unit :: Editline/Release/EditlineTests/EditlineTestFixture.EditlineReceivesSingleLineText (1095 of 1909)
PASS: lldb-unit :: Expression/Release/ExpressionTests/ClangExpressionDeclMapTest.TestPersistentDeclLookup (1096 of 1909)
PASS: lldb-unit :: Expression/Release/ExpressionTests/ClangExpressionDeclMapTest.TestUnknownIdentifierLookup (1097 of 1909)
PASS: lldb-unit :: Expression/Release/ExpressionTests/ClangHostTest.ComputeClangResourceDirectory (1098 of 1909)
PASS: lldb-unit :: Expression/Release/ExpressionTests/CppModuleConfigurationTest.AmbiguousCLib (1099 of 1909)
PASS: lldb-unit :: Expression/Release/ExpressionTests/ClangHostTest.MacOSX (1100 of 1909)
PASS: lldb-unit :: Expression/Release/ExpressionTests/CppModuleConfigurationTest.AmbiguousLibCpp (1101 of 1909)
PASS: lldb-unit :: Expression/Release/ExpressionTests/CppModuleConfigurationTest.IgnoreLibStdCpp (1102 of 1909)
PASS: lldb-unit :: Expression/Release/ExpressionTests/CppModuleConfigurationTest.LibCppV2 (1103 of 1909)
PASS: lldb-unit :: Expression/Release/ExpressionTests/CppModuleConfigurationTest.MissingLibCpp (1104 of 1909)
PASS: lldb-unit :: Expression/Release/ExpressionTests/CppModuleConfigurationTest.LinuxLocalLibCpp (1105 of 1909)
PASS: lldb-unit :: Expression/Release/ExpressionTests/CppModuleConfigurationTest.Linux (1106 of 1909)
PASS: lldb-unit :: Expression/Release/ExpressionTests/CppModuleConfigurationTest.MissingUsrInclude (1107 of 1909)
PASS: lldb-unit :: Expression/Release/ExpressionTests/CppModuleConfigurationTest.UnknownLibCppFile (1108 of 1909)
PASS: lldb-unit :: Expression/Release/ExpressionTests/CppModuleConfigurationTest.Sysroot (1109 of 1909)
PASS: lldb-unit :: Expression/Release/ExpressionTests/CppModuleConfigurationTest.UnrelatedLibrary (1110 of 1909)
PASS: lldb-unit :: Expression/Release/ExpressionTests/CppModuleConfigurationTest.Xcode (1111 of 1909)
PASS: lldb-unit :: Expression/Release/ExpressionTests/DWARFExpression.DW_OP_convert (1112 of 1909)
PASS: lldb-unit :: Expression/Release/ExpressionTests/DWARFExpression.DW_OP_pick (1113 of 1909)
PASS: lldb-unit :: Expression/Release/ExpressionTests/DWARFExpression.DW_OP_piece (1114 of 1909)
PASS: lldb-unit :: Expression/Release/ExpressionTests/DiagnosticManagerTest.AddDiagnostic (1115 of 1909)
PASS: lldb-unit :: Expression/Release/ExpressionTests/DiagnosticManagerTest.AppendMessageSubsequentDiags (1116 of 1909)
PASS: lldb-unit :: Expression/Release/ExpressionTests/DiagnosticManagerTest.AppendMessageAttachToLastDiag (1117 of 1909)
PASS: lldb-unit :: Expression/Release/ExpressionTests/DiagnosticManagerTest.AppendMessageNoDiag (1118 of 1909)
PASS: lldb-shell :: SymbolFile/DWARF/deterministic-build.cpp (1119 of 1909)
PASS: lldb-unit :: Expression/Release/ExpressionTests/DiagnosticManagerTest.FixedExpression (1120 of 1909)
PASS: lldb-unit :: Expression/Release/ExpressionTests/DiagnosticManagerTest.GetStringBasic (1121 of 1909)
PASS: lldb-unit :: Expression/Release/ExpressionTests/DiagnosticManagerTest.GetStringMultiline (1122 of 1909)
PASS: lldb-unit :: Expression/Release/ExpressionTests/DiagnosticManagerTest.GetStringMultipleDiags (1123 of 1909)
PASS: lldb-unit :: Expression/Release/ExpressionTests/DiagnosticManagerTest.HasFixits (1124 of 1909)
PASS: lldb-unit :: Expression/Release/ExpressionTests/DiagnosticManagerTest.GetStringPreserveOrder (1125 of 1909)
PASS: lldb-unit :: Expression/Release/ExpressionTests/DiagnosticManagerTest.GetStringNoDiags (1126 of 1909)
PASS: lldb-unit :: Expression/Release/ExpressionTests/DiagnosticManagerTest.GetStringSeverityLabels (1127 of 1909)
PASS: lldb-unit :: Host/Release/HostTests/ConnectionFileDescriptorTest.TCPGetURIv4 (1128 of 1909)
PASS: lldb-unit :: Expression/Release/ExpressionTests/DiagnosticManagerTest.PutStringSeverities (1129 of 1909)
PASS: lldb-unit :: Expression/Release/ExpressionTests/DiagnosticManagerTest.PutString (1130 of 1909)
PASS: lldb-unit :: Expression/Release/ExpressionTests/DiagnosticManagerTest.PutStringMultiple (1131 of 1909)
PASS: lldb-unit :: Host/Release/HostTests/File.GetWaitableHandleFileno (1132 of 1909)
PASS: lldb-unit :: Host/Release/HostTests/File.GetStreamFromDescriptor (1133 of 1909)
PASS: lldb-unit :: Host/Release/HostTests/FileActionTest.Open (1134 of 1909)
PASS: lldb-unit :: Host/Release/HostTests/ConnectionFileDescriptorTest.TCPGetURIv6 (1135 of 1909)
PASS: lldb-unit :: Host/Release/HostTests/FileSystemTest.EnumerateDirectory (1136 of 1909)
PASS: lldb-unit :: Host/Release/HostTests/FileSystemTest.FileAndDirectoryComponents (1137 of 1909)
PASS: lldb-unit :: Host/Release/HostTests/FileSystemTest.Exists (1138 of 1909)
PASS: lldb-unit :: Host/Release/HostTests/FileSystemTest.GetByteSize (1139 of 1909)
PASS: lldb-unit :: Host/Release/HostTests/FileSystemTest.GetPermissions (1140 of 1909)
PASS: lldb-unit :: Host/Release/HostTests/FileSystemTest.MakeAbsolute (1141 of 1909)
PASS: lldb-unit :: Host/Release/HostTests/FileSystemTest.OpenErrno (1142 of 1909)
PASS: lldb-unit :: Host/Release/HostTests/FileSystemTest.Readable (1143 of 1909)
PASS: lldb-unit :: Host/Release/HostTests/Host.WaitStatusFormat (1144 of 1909)
PASS: lldb-unit :: Host/Release/HostTests/Host.GetEnvironment (1145 of 1909)
PASS: lldb-unit :: Host/Release/HostTests/FileSystemTest.Resolve (1146 of 1909)
PASS: lldb-unit :: Host/Release/HostTests/HostInfoTest.GetAugmentedArchSpec (1147 of 1909)
PASS: lldb-shell :: Unwind/eh-frame-dwarf-unwind.test (1148 of 1909)
PASS: lldb-unit :: Host/Release/HostTests/HostInfoTest.GetHostname (1149 of 1909)
PASS: lldb-unit :: Host/Release/HostTests/MainLoopTest.Signal (1150 of 1909)
PASS: lldb-unit :: Host/Release/HostTests/MainLoopTest.ReadObject (1151 of 1909)
PASS: lldb-unit :: Host/Release/HostTests/MainLoopTest.DetectsEOF (1152 of 1909)
PASS: lldb-shell :: Unwind/trap_frame_sym_ctx.test (1153 of 1909)
PASS: lldb-unit :: Host/Release/HostTests/MainLoopTest.TerminatesImmediately (1154 of 1909)
PASS: lldb-shell :: Unwind/thread-step-out-ret-addr-check.test (1155 of 1909)
PASS: lldb-unit :: Host/Release/HostTests/NativeProcessProtocolTest.ReadCStringFromMemory_CrossPageBoundary (1156 of 1909)
PASS: lldb-unit :: Host/Release/HostTests/NativeProcessProtocolTest.ReadCStringFromMemory (1157 of 1909)
PASS: lldb-unit :: Host/Release/HostTests/NativeProcessProtocolTest.ReadCStringFromMemory_MaxSize (1158 of 1909)
PASS: lldb-unit :: Host/Release/HostTests/NativeProcessProtocolTest.ReadMemoryWithoutTrap (1159 of 1909)
PASS: lldb-unit :: Host/Release/HostTests/NativeProcessProtocolTest.SetBreakpoint (1160 of 1909)
PASS: lldb-unit :: Host/Release/HostTests/NativeProcessProtocolTest.SetBreakpointFailRead (1161 of 1909)
PASS: lldb-unit :: Host/Release/HostTests/NativeProcessProtocolTest.SetBreakpointFailWrite (1162 of 1909)
PASS: lldb-unit :: Host/Release/HostTests/NativeProcessProtocolTest.SetBreakpointFailVerify (1163 of 1909)
PASS: lldb-unit :: Host/Release/HostTests/ProcessLaunchInfoTest.Constructor (1164 of 1909)
PASS: lldb-unit :: Host/Release/HostTests/SocketAddressTest.GetAddressInfo (1165 of 1909)
PASS: lldb-unit :: Host/Release/HostTests/SocketAddressTest.Set (1166 of 1909)
PASS: lldb-unit :: Host/Release/HostTests/SocketTest.DecodeHostAndPort (1167 of 1909)
PASS: lldb-unit :: Host/Release/HostTests/SocketTest.DomainListenConnectAccept (1168 of 1909)
PASS: lldb-unit :: Host/Release/HostTests/SocketTest.DomainGetConnectURI (1169 of 1909)
PASS: lldb-unit :: Host/Release/HostTests/SocketTest.TCPGetAddress (1170 of 1909)
PASS: lldb-unit :: Host/Release/HostTests/SocketTest.TCPGetConnectURI (1171 of 1909)
PASS: lldb-unit :: Host/Release/HostTests/SocketTest.TCPListen0ConnectAccept (1172 of 1909)
PASS: lldb-unit :: Host/Release/HostTests/SocketTest.TCPListen0GetPort (1173 of 1909)
PASS: lldb-unit :: Host/Release/HostTests/TaskPoolTest.AddTask (1174 of 1909)
PASS: lldb-unit :: Host/Release/HostTests/SocketTest.UDPConnect (1175 of 1909)
PASS: lldb-unit :: Host/Release/HostTests/SocketTest.UDPGetConnectURI (1176 of 1909)
PASS: lldb-unit :: Host/Release/HostTests/TaskPoolTest.RunTasks (1177 of 1909)
PASS: lldb-unit :: Host/Release/HostTests/TaskPoolTest.TaskMap (1178 of 1909)
PASS: lldb-unit :: Interpreter/Release/InterpreterTests/OptionArgParserTest.toBoolean (1179 of 1909)
PASS: lldb-unit :: Interpreter/Release/InterpreterTests/OptionArgParserTest.toChar (1180 of 1909)
PASS: lldb-unit :: Interpreter/Release/InterpreterTests/CompletionTest.DirCompletionAbsolute (1181 of 1909)
PASS: lldb-unit :: Interpreter/Release/InterpreterTests/CompletionTest.DirCompletionUsername (1182 of 1909)
PASS: lldb-unit :: Interpreter/Release/InterpreterTests/CompletionTest.FileCompletionAbsolute (1183 of 1909)
PASS: lldb-unit :: Interpreter/Release/InterpreterTests/OptionArgParserTest.toScriptLanguage (1184 of 1909)
PASS: lldb-unit :: Language/CPlusPlus/Release/LanguageCPlusPlusTests/CPlusPlusLanguage.CPlusPlusNameParser (1185 of 1909)
PASS: lldb-unit :: Language/CPlusPlus/Release/LanguageCPlusPlusTests/CPlusPlusLanguage.ExtractContextAndIdentifier (1186 of 1909)
PASS: lldb-unit :: Language/CPlusPlus/Release/LanguageCPlusPlusTests/CPlusPlusLanguage.FindAlternateFunctionManglings (1187 of 1909)
PASS: lldb-unit :: Language/CPlusPlus/Release/LanguageCPlusPlusTests/CPlusPlusLanguage.MethodNameParsing (1188 of 1909)
PASS: lldb-unit :: Language/Highlighting/Release/HighlighterTests/HighlighterTest.ClangBraces (1189 of 1909)
PASS: lldb-unit :: Language/Highlighting/Release/HighlighterTests/HighlighterTest.ClangCommas (1190 of 1909)
PASS: lldb-unit :: Language/Highlighting/Release/HighlighterTests/HighlighterTest.ClangComments (1191 of 1909)
PASS: lldb-unit :: Language/Highlighting/Release/HighlighterTests/HighlighterTest.ClangCursorOutOfBounds (1192 of 1909)
PASS: lldb-unit :: Language/Highlighting/Release/HighlighterTests/HighlighterTest.ClangCursorPosAfterOtherToken (1193 of 1909)
PASS: lldb-unit :: Language/Highlighting/Release/HighlighterTests/HighlighterTest.ClangCursorPos (1194 of 1909)
PASS: lldb-unit :: Language/Highlighting/Release/HighlighterTests/HighlighterTest.ClangCursorPosBeforeOtherToken (1195 of 1909)
PASS: lldb-unit :: Language/Highlighting/Release/HighlighterTests/HighlighterTest.ClangCursorPosEndOfLine (1196 of 1909)
PASS: lldb-unit :: Language/Highlighting/Release/HighlighterTests/HighlighterTest.ClangEmptyInput (1197 of 1909)
PASS: lldb-unit :: Language/Highlighting/Release/HighlighterTests/HighlighterTest.ClangCursorPosInOtherToken (1198 of 1909)
PASS: lldb-unit :: Language/Highlighting/Release/HighlighterTests/HighlighterTest.ClangIdentifiers (1199 of 1909)
PASS: lldb-unit :: Language/Highlighting/Release/HighlighterTests/HighlighterTest.ClangOperators (1200 of 1909)
PASS: lldb-unit :: Language/Highlighting/Release/HighlighterTests/HighlighterTest.ClangPPDirectives (1201 of 1909)
PASS: lldb-unit :: Language/Highlighting/Release/HighlighterTests/HighlighterTest.ClangPreserveNewLine (1202 of 1909)
PASS: lldb-unit :: Language/Highlighting/Release/HighlighterTests/HighlighterTest.ClangStringLiterals (1203 of 1909)
PASS: lldb-unit :: Language/Highlighting/Release/HighlighterTests/HighlighterTest.ClangScalarLiterals (1204 of 1909)
PASS: lldb-unit :: Language/Highlighting/Release/HighlighterTests/HighlighterTest.ClangSquareBrackets (1205 of 1909)
PASS: lldb-unit :: Language/Highlighting/Release/HighlighterTests/HighlighterTest.ClangTrailingBackslashBeforeNewline (1206 of 1909)
PASS: lldb-unit :: Language/Highlighting/Release/HighlighterTests/HighlighterTest.ClangTrailingBackslashMissingNewLine (1207 of 1909)
PASS: lldb-unit :: Language/Highlighting/Release/HighlighterTests/HighlighterTest.ClangTrailingBackslashWithWhitespace (1208 of 1909)
PASS: lldb-unit :: Language/Highlighting/Release/HighlighterTests/HighlighterTest.DefaultHighlighter (1209 of 1909)
PASS: lldb-unit :: Language/Highlighting/Release/HighlighterTests/HighlighterTest.DefaultHighlighterWithCursor (1210 of 1909)
PASS: lldb-unit :: Language/Highlighting/Release/HighlighterTests/HighlighterTest.ClangUnterminatedString (1211 of 1909)
PASS: lldb-unit :: Language/Highlighting/Release/HighlighterTests/HighlighterTest.Colons (1212 of 1909)
XFAIL: lldb-shell :: Unwind/prefer-debug-over-eh-frame.test (1213 of 1909)
PASS: lldb-unit :: Language/Highlighting/Release/HighlighterTests/HighlighterTest.FallbackHighlighter (1214 of 1909)
PASS: lldb-unit :: Language/Highlighting/Release/HighlighterTests/HighlighterTest.DefaultHighlighterWithCursorOutOfBounds (1215 of 1909)
PASS: lldb-unit :: ObjectFile/Breakpad/Release/ObjectFileBreakpadTests/FileRecord.parse (1216 of 1909)
PASS: lldb-unit :: Language/Highlighting/Release/HighlighterTests/HighlighterTest.HighlighterSelectionType (1217 of 1909)
PASS: lldb-unit :: Language/Highlighting/Release/HighlighterTests/HighlighterTest.HighlighterSelectionPath (1218 of 1909)
PASS: lldb-unit :: Language/Highlighting/Release/HighlighterTests/HighlighterTest.Keywords (1219 of 1909)
PASS: lldb-unit :: ObjectFile/Breakpad/Release/ObjectFileBreakpadTests/LineRecord.parse (1220 of 1909)
PASS: lldb-unit :: ObjectFile/Breakpad/Release/ObjectFileBreakpadTests/InfoRecord.parse (1221 of 1909)
PASS: lldb-unit :: ObjectFile/Breakpad/Release/ObjectFileBreakpadTests/FuncRecord.parse (1222 of 1909)
PASS: lldb-unit :: ObjectFile/Breakpad/Release/ObjectFileBreakpadTests/ModuleRecord.parse (1223 of 1909)
PASS: lldb-unit :: ObjectFile/Breakpad/Release/ObjectFileBreakpadTests/PublicRecord.parse (1224 of 1909)
PASS: lldb-unit :: ObjectFile/Breakpad/Release/ObjectFileBreakpadTests/Record.classify (1225 of 1909)
PASS: lldb-unit :: ObjectFile/Breakpad/Release/ObjectFileBreakpadTests/StackCFIRecord.parse (1226 of 1909)
PASS: lldb-unit :: ObjectFile/Breakpad/Release/ObjectFileBreakpadTests/StackWinRecord.parse (1227 of 1909)
PASS: lldb-unit :: ObjectFile/ELF/Release/ObjectFileELFTests/ObjectFileELFTest.GetModuleSpecifications_EarlySectionHeaders (1228 of 1909)
PASS: lldb-unit :: ObjectFile/ELF/Release/ObjectFileELFTests/ObjectFileELFTest.GetSymtab_NoSymEntryPointArmAddressClass (1229 of 1909)
PASS: lldb-unit :: ObjectFile/ELF/Release/ObjectFileELFTests/ObjectFileELFTest.GetSymtab_NoSymEntryPointArmThumbAddressClass (1230 of 1909)
PASS: lldb-unit :: ObjectFile/PECOFF/Release/ObjectFilePECOFFTests/PECallFrameInfoTest.Chained_eh (1231 of 1909)
PASS: lldb-unit :: ObjectFile/PECOFF/Release/ObjectFilePECOFFTests/PECallFrameInfoTest.Basic_eh (1232 of 1909)
PASS: lldb-unit :: ObjectFile/ELF/Release/ObjectFileELFTests/ObjectFileELFTest.SectionsResolveConsistently (1233 of 1909)
PASS: lldb-unit :: Platform/Release/LLDBPlatformTests/PlatformDarwinTest.TestParseVersionBuildDir (1234 of 1909)
PASS: lldb-unit :: ObjectFile/PECOFF/Release/ObjectFilePECOFFTests/PECallFrameInfoTest.Frame_reg_eh (1235 of 1909)
PASS: lldb-unit :: Process/gdb-remote/Release/ProcessGdbRemoteTests/GDBRemoteClientBaseTest.SendContinueAndInterrupt2PacketBug (1236 of 1909)
PASS: lldb-unit :: Process/gdb-remote/Release/ProcessGdbRemoteTests/GDBRemoteClientBaseTest.SendContinueAndWait (1237 of 1909)
PASS: lldb-unit :: Process/gdb-remote/Release/ProcessGdbRemoteTests/GDBRemoteClientBaseTest.SendContinueDelegateInterface (1238 of 1909)
PASS: lldb-unit :: Process/gdb-remote/Release/ProcessGdbRemoteTests/GDBRemoteClientBaseTest.SendContinueDelegateStructuredDataReceipt (1239 of 1909)
PASS: lldb-unit :: Process/gdb-remote/Release/ProcessGdbRemoteTests/GDBRemoteClientBaseTest.SendPacketAndReceiveResponseWithOutputSupport (1240 of 1909)
PASS: lldb-unit :: Process/gdb-remote/Release/ProcessGdbRemoteTests/GDBRemoteCommunicationClientTest.GetMemoryRegionInfo (1241 of 1909)
PASS: lldb-unit :: Process/gdb-remote/Release/ProcessGdbRemoteTests/GDBRemoteCommunicationClientTest.GetMemoryRegionInfoInvalidResponse (1242 of 1909)
PASS: lldb-unit :: Process/gdb-remote/Release/ProcessGdbRemoteTests/GDBRemoteCommunicationClientTest.GetModulesInfo (1243 of 1909)
PASS: lldb-unit :: Process/gdb-remote/Release/ProcessGdbRemoteTests/GDBRemoteCommunicationClientTest.GetModulesInfoInvalidResponse (1244 of 1909)
PASS: lldb-unit :: Process/gdb-remote/Release/ProcessGdbRemoteTests/GDBRemoteCommunicationClientTest.GetModulesInfo_UUID20 (1245 of 1909)
PASS: lldb-unit :: Process/gdb-remote/Release/ProcessGdbRemoteTests/GDBRemoteCommunicationClientTest.ReadRegister (1246 of 1909)
PASS: lldb-unit :: Process/gdb-remote/Release/ProcessGdbRemoteTests/GDBRemoteCommunicationClientTest.SaveRestoreRegistersNoSuffix (1247 of 1909)
PASS: lldb-unit :: Process/gdb-remote/Release/ProcessGdbRemoteTests/GDBRemoteClientBaseTest.SendContinueAndInterrupt (1248 of 1909)
PASS: lldb-unit :: Process/gdb-remote/Release/ProcessGdbRemoteTests/GDBRemoteClientBaseTest.SendContinueAndLateInterrupt (1249 of 1909)
PASS: lldb-unit :: Process/gdb-remote/Release/ProcessGdbRemoteTests/GDBRemoteClientBaseTest.SendContinueAndAsyncSignal (1250 of 1909)
PASS: lldb-unit :: Process/gdb-remote/Release/ProcessGdbRemoteTests/GDBRemoteClientBaseTest.SendContinueAndAsyncPacket (1251 of 1909)
PASS: lldb-unit :: Process/gdb-remote/Release/ProcessGdbRemoteTests/GDBRemoteCommunicationClientTest.SendGetDataPacket (1252 of 1909)
PASS: lldb-unit :: Process/gdb-remote/Release/ProcessGdbRemoteTests/GDBRemoteCommunicationClientTest.SendGetMetaDataPacket (1253 of 1909)
PASS: lldb-unit :: Process/gdb-remote/Release/ProcessGdbRemoteTests/GDBRemoteCommunicationClientTest.SendSignalsToIgnore (1254 of 1909)
PASS: lldb-unit :: Process/gdb-remote/Release/ProcessGdbRemoteTests/GDBRemoteCommunicationClientTest.SendStartTracePacket (1255 of 1909)
PASS: lldb-unit :: Process/gdb-remote/Release/ProcessGdbRemoteTests/GDBRemoteCommunicationClientTest.SendStopTracePacket (1256 of 1909)
PASS: lldb-unit :: Process/gdb-remote/Release/ProcessGdbRemoteTests/GDBRemoteCommunicationClientTest.SendGetTraceConfigPacket (1257 of 1909)
PASS: lldb-unit :: Process/gdb-remote/Release/ProcessGdbRemoteTests/GDBRemoteCommunicationClientTest.SyncThreadState (1258 of 1909)
PASS: lldb-unit :: Process/gdb-remote/Release/ProcessGdbRemoteTests/GDBRemoteCommunicationServerTest.SendErrorResponse_ErrorNumber (1259 of 1909)
PASS: lldb-unit :: Process/gdb-remote/Release/ProcessGdbRemoteTests/GDBRemoteCommunicationClientTest.WriteRegisterNoSuffix (1260 of 1909)
PASS: lldb-unit :: Process/gdb-remote/Release/ProcessGdbRemoteTests/GDBRemoteCommunicationServerTest.SendErrorResponse_ErrorList (1261 of 1909)
PASS: lldb-unit :: Process/gdb-remote/Release/ProcessGdbRemoteTests/GDBRemoteCommunicationClientTest.WriteRegister (1262 of 1909)
PASS: lldb-unit :: Process/gdb-remote/Release/ProcessGdbRemoteTests/GDBRemoteCommunicationServerTest.SendErrorResponse_Status (1263 of 1909)
PASS: lldb-unit :: Process/gdb-remote/Release/ProcessGdbRemoteTests/GDBRemoteCommunicationServerTest.SendErrorResponse_StringError (1264 of 1909)
PASS: lldb-unit :: Process/gdb-remote/Release/ProcessGdbRemoteTests/GDBRemoteCommunicationServerTest.SendErrorResponse_UnimplementedError (1265 of 1909)
PASS: lldb-unit :: Process/minidump/Release/LLDBMinidumpTests/MinidumpParserTest.FindMemoryRange (1266 of 1909)
PASS: lldb-unit :: Process/gdb-remote/Release/ProcessGdbRemoteTests/GDBRemoteCommunicationTest.ReadPacket_checksum (1267 of 1909)
PASS: lldb-unit :: Process/gdb-remote/Release/ProcessGdbRemoteTests/GDBRemoteCommunicationClientTest.TestPacketSpeedJSON (1268 of 1909)
PASS: lldb-unit :: Process/minidump/Release/LLDBMinidumpTests/MinidumpParserTest.FindMemoryRangeWithFullMemoryMinidump (1269 of 1909)
PASS: lldb-unit :: Process/minidump/Release/LLDBMinidumpTests/MinidumpParserTest.GetArchitectureWindows (1270 of 1909)
PASS: lldb-unit :: Process/minidump/Release/LLDBMinidumpTests/MinidumpParserTest.GetArchitecture (1271 of 1909)
PASS: lldb-unit :: Process/minidump/Release/LLDBMinidumpTests/MinidumpParserTest.GetExceptionStream (1272 of 1909)
PASS: lldb-unit :: Process/minidump/Release/LLDBMinidumpTests/MinidumpParserTest.GetFilteredModuleList (1273 of 1909)
PASS: lldb-unit :: Process/minidump/Release/LLDBMinidumpTests/MinidumpParserTest.GetLinuxProcStatus (1274 of 1909)
PASS: lldb-unit :: Process/minidump/Release/LLDBMinidumpTests/MinidumpParserTest.GetLinuxProcStatus_no_stream (1275 of 1909)
PASS: lldb-unit :: Process/minidump/Release/LLDBMinidumpTests/MinidumpParserTest.GetMemory (1276 of 1909)
PASS: lldb-unit :: Process/minidump/Release/LLDBMinidumpTests/MinidumpParserTest.GetMemoryRegionInfoFromMemoryList (1277 of 1909)
PASS: lldb-unit :: Process/minidump/Release/LLDBMinidumpTests/MinidumpParserTest.GetMemoryRegionInfoFromMemory64List (1278 of 1909)
PASS: lldb-unit :: Process/minidump/Release/LLDBMinidumpTests/MinidumpParserTest.GetMemoryRegionInfo (1279 of 1909)
PASS: lldb-unit :: Process/minidump/Release/LLDBMinidumpTests/MinidumpParserTest.GetMemoryRegionInfoLinuxMaps (1280 of 1909)
PASS: lldb-unit :: Process/minidump/Release/LLDBMinidumpTests/MinidumpParserTest.GetMiscInfoWindows (1281 of 1909)
PASS: lldb-unit :: Process/minidump/Release/LLDBMinidumpTests/MinidumpParserTest.GetPid (1282 of 1909)
PASS: lldb-unit :: Process/minidump/Release/LLDBMinidumpTests/MinidumpParserTest.GetPidWindows (1283 of 1909)
PASS: lldb-unit :: Process/minidump/Release/LLDBMinidumpTests/MinidumpParserTest.GetMiscInfo_no_stream (1284 of 1909)
PASS: lldb-unit :: Process/minidump/Release/LLDBMinidumpTests/MinidumpParserTest.GetThreadContext_x86_32 (1285 of 1909)
PASS: lldb-unit :: Process/minidump/Release/LLDBMinidumpTests/MinidumpParserTest.GetPidWow64 (1286 of 1909)
PASS: lldb-unit :: Process/minidump/Release/LLDBMinidumpTests/MinidumpParserTest.GetThreadContext_x86_32_wow64 (1287 of 1909)
PASS: lldb-unit :: Process/minidump/Release/LLDBMinidumpTests/MinidumpParserTest.InvalidMinidump (1288 of 1909)
PASS: lldb-unit :: Process/minidump/Release/LLDBMinidumpTests/MinidumpParserTest.MinidumpModuleOrder (1289 of 1909)
PASS: lldb-unit :: Process/minidump/Release/LLDBMinidumpTests/MinidumpParserTest.GetThreadsAndGetThreadContext (1290 of 1909)
PASS: lldb-unit :: Process/minidump/Release/LLDBMinidumpTests/MinidumpParserTest.GetThreadContext_x86_64 (1291 of 1909)
PASS: lldb-unit :: Process/minidump/Release/LLDBMinidumpTests/MinidumpParserTest.MinidumpDuplicateModuleMinAddress (1292 of 1909)
PASS: lldb-unit :: Process/minidump/Release/LLDBMinidumpTests/RegisterContextMinidump.CheckRegisterContextMinidump_ARM (1293 of 1909)
PASS: lldb-unit :: Process/minidump/Release/LLDBMinidumpTests/RegisterContextMinidump.ConvertMinidumpContext_x86_64 (1294 of 1909)
PASS: lldb-unit :: Process/minidump/Release/LLDBMinidumpTests/RegisterContextMinidump.ConvertMinidumpContext_x86_32 (1295 of 1909)
PASS: lldb-shell :: Watchpoint/SetErrorCases.test (1296 of 1909)
PASS: lldb-unit :: ScriptInterpreter/Python/Release/ScriptInterpreterPythonTests/PythonDataObjectsTest.TestDictionaryResolutionWithDot (1297 of 1909)
PASS: lldb-unit :: ScriptInterpreter/Python/Release/ScriptInterpreterPythonTests/PythonDataObjectsTest.TestBorrowedReferences (1298 of 1909)
PASS: lldb-unit :: ScriptInterpreter/Python/Release/ScriptInterpreterPythonTests/PythonDataObjectsTest.TestExtractingUInt64ThroughStructuredData (1299 of 1909)
PASS: lldb-unit :: ScriptInterpreter/Python/Release/ScriptInterpreterPythonTests/PythonDataObjectsTest.TestExceptions (1300 of 1909)
PASS: lldb-unit :: ScriptInterpreter/Python/Release/ScriptInterpreterPythonTests/PythonDataObjectsTest.TestCallable (1301 of 1909)
PASS: lldb-unit :: ScriptInterpreter/Python/Release/ScriptInterpreterPythonTests/PythonDataObjectsTest.TestGlobalNameResolutionNoDot (1302 of 1909)
PASS: lldb-unit :: ScriptInterpreter/Python/Release/ScriptInterpreterPythonTests/PythonDataObjectsTest.TestGlobalNameResolutionWithDot (1303 of 1909)
PASS: lldb-unit :: ScriptInterpreter/Python/Release/ScriptInterpreterPythonTests/PythonDataObjectsTest.TestInstanceNameResolutionNoDot (1304 of 1909)
PASS: lldb-unit :: ScriptInterpreter/Python/Release/ScriptInterpreterPythonTests/PythonDataObjectsTest.TestModuleNameResolutionNoDot (1305 of 1909)
PASS: lldb-unit :: ScriptInterpreter/Python/Release/ScriptInterpreterPythonTests/PythonDataObjectsTest.TestPythonBoolean (1306 of 1909)
PASS: lldb-unit :: ScriptInterpreter/Python/Release/ScriptInterpreterPythonTests/PythonDataObjectsTest.TestObjectAttributes (1307 of 1909)
PASS: lldb-unit :: ScriptInterpreter/Python/Release/ScriptInterpreterPythonTests/PythonDataObjectsTest.TestOwnedReferences (1308 of 1909)
PASS: lldb-unit :: ScriptInterpreter/Python/Release/ScriptInterpreterPythonTests/PythonDataObjectsTest.TestPythonByteArray (1309 of 1909)
PASS: lldb-unit :: ScriptInterpreter/Python/Release/ScriptInterpreterPythonTests/PythonDataObjectsTest.TestPythonBytes (1310 of 1909)
PASS: lldb-unit :: ScriptInterpreter/Python/Release/ScriptInterpreterPythonTests/PythonDataObjectsTest.TestPythonCallableCheck (1311 of 1909)
PASS: lldb-unit :: ScriptInterpreter/Python/Release/ScriptInterpreterPythonTests/PythonDataObjectsTest.TestPythonCallableInvoke (1312 of 1909)
PASS: lldb-unit :: ScriptInterpreter/Python/Release/ScriptInterpreterPythonTests/PythonDataObjectsTest.TestPythonDictionaryValueEquality (1313 of 1909)
PASS: lldb-unit :: ScriptInterpreter/Python/Release/ScriptInterpreterPythonTests/PythonDataObjectsTest.TestPythonDictionaryToStructuredDictionary (1314 of 1909)
PASS: lldb-unit :: ScriptInterpreter/Python/Release/ScriptInterpreterPythonTests/PythonDataObjectsTest.TestPythonFile (1315 of 1909)
PASS: lldb-unit :: ScriptInterpreter/Python/Release/ScriptInterpreterPythonTests/PythonDataObjectsTest.TestPythonDictionaryManipulation (1316 of 1909)
PASS: lldb-unit :: ScriptInterpreter/Python/Release/ScriptInterpreterPythonTests/PythonDataObjectsTest.TestPythonInteger (1317 of 1909)
PASS: lldb-unit :: ScriptInterpreter/Python/Release/ScriptInterpreterPythonTests/PythonDataObjectsTest.TestPythonIntegerToStr (1318 of 1909)
PASS: lldb-unit :: ScriptInterpreter/Python/Release/ScriptInterpreterPythonTests/PythonDataObjectsTest.TestPythonIntegerToStructuredInteger (1319 of 1909)
PASS: lldb-unit :: ScriptInterpreter/Python/Release/ScriptInterpreterPythonTests/PythonDataObjectsTest.TestPythonListManipulation (1320 of 1909)
PASS: lldb-unit :: ScriptInterpreter/Python/Release/ScriptInterpreterPythonTests/PythonDataObjectsTest.TestPythonListValueEquality (1321 of 1909)
PASS: lldb-unit :: ScriptInterpreter/Python/Release/ScriptInterpreterPythonTests/PythonDataObjectsTest.TestPythonListToStructuredList (1322 of 1909)
PASS: lldb-unit :: ScriptInterpreter/Python/Release/ScriptInterpreterPythonTests/PythonDataObjectsTest.TestPythonString (1323 of 1909)
PASS: lldb-api :: types/TestShortType.py (1324 of 1909)
PASS: lldb-unit :: ScriptInterpreter/Python/Release/ScriptInterpreterPythonTests/PythonDataObjectsTest.TestPythonStringToStr (1325 of 1909)
PASS: lldb-unit :: ScriptInterpreter/Python/Release/ScriptInterpreterPythonTests/PythonDataObjectsTest.TestPythonStringToStructuredString (1326 of 1909)
PASS: lldb-unit :: ScriptInterpreter/Python/Release/ScriptInterpreterPythonTests/PythonDataObjectsTest.TestPythonTupleInitializerList (1327 of 1909)
PASS: lldb-unit :: ScriptInterpreter/Python/Release/ScriptInterpreterPythonTests/PythonDataObjectsTest.TestPythonTupleInitializerList2 (1328 of 1909)
PASS: lldb-unit :: ScriptInterpreter/Python/Release/ScriptInterpreterPythonTests/PythonDataObjectsTest.TestPythonTupleSize (1329 of 1909)
PASS: lldb-unit :: ScriptInterpreter/Python/Release/ScriptInterpreterPythonTests/PythonDataObjectsTest.TestPythonTupleToStructuredList (1330 of 1909)
PASS: lldb-unit :: ScriptInterpreter/Python/Release/ScriptInterpreterPythonTests/PythonDataObjectsTest.TestPythonTupleValues (1331 of 1909)
PASS: lldb-unit :: Signals/Release/SignalsTests/UnixSignalsTest.GetFilteredSignals (1332 of 1909)
PASS: lldb-unit :: Signals/Release/SignalsTests/UnixSignalsTest.GetInfo (1333 of 1909)
PASS: lldb-unit :: Signals/Release/SignalsTests/UnixSignalsTest.Iteration (1334 of 1909)
PASS: lldb-unit :: ScriptInterpreter/Python/Release/ScriptInterpreterPythonTests/PythonDataObjectsTest.TestResetting (1335 of 1909)
PASS: lldb-unit :: ScriptInterpreter/Python/Release/ScriptInterpreterPythonTests/PythonDataObjectsTest.TestRun (1336 of 1909)
PASS: lldb-unit :: Signals/Release/SignalsTests/UnixSignalsTest.VersionChange (1337 of 1909)
PASS: lldb-unit :: Symbol/Release/SymbolTests/DWARFCallFrameInfoTest.Basic_dwarf3 (1338 of 1909)
PASS: lldb-unit :: Symbol/Release/SymbolTests/DWARFCallFrameInfoTest.Basic_eh (1339 of 1909)
PASS: lldb-unit :: Symbol/Release/SymbolTests/DWARFCallFrameInfoTest.Basic_dwarf4 (1340 of 1909)
PASS: lldb-unit :: ScriptInterpreter/Python/Release/ScriptInterpreterPythonTests/PythonDataObjectsTest.TestTypeNameResolutionNoDot (1341 of 1909)
PASS: lldb-unit :: ScriptInterpreter/Python/Release/ScriptInterpreterPythonTests/PythonDataObjectsTest.TestScript (1342 of 1909)
PASS: lldb-unit :: Symbol/Release/SymbolTests/LineEntryTest.GetSameLineContiguousAddressRangeNoInlines (1343 of 1909)
PASS: lldb-unit :: Symbol/Release/SymbolTests/LineEntryTest.GetSameLineContiguousAddressRangeNestedInline (1344 of 1909)
PASS: lldb-unit :: Symbol/Release/SymbolTests/LineEntryTest.GetSameLineContiguousAddressRangeOneInline (1345 of 1909)
PASS: lldb-unit :: Symbol/Release/SymbolTests/PostfixExpression.ParseFPOProgram (1346 of 1909)
PASS: lldb-unit :: Symbol/Release/SymbolTests/PostfixExpression.ParseOneExpression (1347 of 1909)
PASS: lldb-unit :: Symbol/Release/SymbolTests/PostfixExpression.ToDWARF (1348 of 1909)
PASS: lldb-unit :: Symbol/Release/SymbolTests/SymbolsTest.LocateExecutableSymbolFileForUnknownExecutableAndMissingSymbolFile (1349 of 1909)
PASS: lldb-unit :: Symbol/Release/SymbolTests/SymbolsTest.TerminateLocateExecutableSymbolFileForUnknownExecutableAndUnknownSymbolFile (1350 of 1909)
PASS: lldb-unit :: Symbol/Release/SymbolTests/TestClangASTContext.TestBuiltinTypeForEncodingAndBitSize (1351 of 1909)
PASS: lldb-unit :: Symbol/Release/SymbolTests/TestClangASTContext.TemplateArguments (1352 of 1909)
PASS: lldb-unit :: Symbol/Release/SymbolTests/TestClangASTContext.TestFunctionTemplateConstruction (1353 of 1909)
PASS: lldb-unit :: Symbol/Release/SymbolTests/TestClangASTContext.TestConvertAccessTypeToAccessSpecifier (1354 of 1909)
PASS: lldb-unit :: Symbol/Release/SymbolTests/TestClangASTContext.TestGetBasicTypeFromEnum (1355 of 1909)
PASS: lldb-unit :: Symbol/Release/SymbolTests/TestClangASTContext.TestFunctionTemplateInRecordConstruction (1356 of 1909)
PASS: lldb-unit :: Symbol/Release/SymbolTests/TestClangASTContext.TestGetBasicTypeFromName (1357 of 1909)
PASS: lldb-unit :: Symbol/Release/SymbolTests/TestClangASTContext.TestGetTypeClassDeclType (1358 of 1909)
PASS: lldb-unit :: Symbol/Release/SymbolTests/TestClangASTContext.TestGetTypeClassNested (1359 of 1909)
PASS: lldb-unit :: Symbol/Release/SymbolTests/TestClangASTContext.TestGetTypeClassTypeOf (1360 of 1909)
PASS: lldb-unit :: Symbol/Release/SymbolTests/TestClangASTContext.TestGetTypeClassTypeOfExpr (1361 of 1909)
PASS: lldb-unit :: Symbol/Release/SymbolTests/TestClangASTContext.TestRemoveFastQualifiers (1362 of 1909)
PASS: lldb-unit :: Symbol/Release/SymbolTests/TestClangASTContext.TestRecordHasFields (1363 of 1909)
PASS: lldb-unit :: Symbol/Release/SymbolTests/TestClangASTContext.TestIsClangType (1364 of 1909)
PASS: lldb-unit :: Symbol/Release/SymbolTests/TestClangASTImporter.CanImportInvalidType (1365 of 1909)
PASS: lldb-unit :: Symbol/Release/SymbolTests/TestClangASTContext.TestUnifyAccessSpecifiers (1366 of 1909)
PASS: lldb-unit :: Symbol/Release/SymbolTests/TestClangASTImporter.CopyTypeTagDecl (1367 of 1909)
PASS: lldb-unit :: Symbol/Release/SymbolTests/TestClangASTImporter.CopyDeclTagDecl (1368 of 1909)
PASS: lldb-unit :: Symbol/Release/SymbolTests/TestClangASTImporter.ImportInvalidType (1369 of 1909)
PASS: lldb-unit :: Symbol/Release/SymbolTests/TestClangASTImporter.DeportDeclTagDecl (1370 of 1909)
PASS: lldb-unit :: Symbol/Release/SymbolTests/TestClangASTImporter.MetadataPropagation (1371 of 1909)
PASS: lldb-unit :: Symbol/Release/SymbolTests/TestClangASTImporter.DeportTypeTagDecl (1372 of 1909)
PASS: lldb-unit :: Symbol/Release/SymbolTests/Type.CompilerContextPattern (1373 of 1909)
PASS: lldb-unit :: Symbol/Release/SymbolTests/TestClangASTImporter.MetadataPropagationAfterCopying (1374 of 1909)
PASS: lldb-unit :: Symbol/Release/SymbolTests/TestClangASTImporter.RecordLayout (1375 of 1909)
PASS: lldb-unit :: Symbol/Release/SymbolTests/TestClangASTImporter.MetadataPropagationIndirectImport (1376 of 1909)
PASS: lldb-unit :: Symbol/Release/SymbolTests/Type.GetTypeScopeAndBasename (1377 of 1909)
PASS: lldb-unit :: SymbolFile/DWARF/Release/SymbolFileDWARFTests/SymbolFileDWARFTests.TestAbbrevInvalidNULLTag (1378 of 1909)
PASS: lldb-unit :: SymbolFile/DWARF/Release/SymbolFileDWARFTests/SymbolFileDWARFTests.TestAbbrevMissingTerminator (1379 of 1909)
PASS: lldb-unit :: SymbolFile/DWARF/Release/SymbolFileDWARFTests/DWARFASTParserClangTests.EnsureAllDIEsInDeclContextHaveBeenParsedParsesOnlyMatchingEntries (1380 of 1909)
PASS: lldb-unit :: SymbolFile/DWARF/Release/SymbolFileDWARFTests/SymbolFileDWARFTests.TestAbbrevOrder1Start1 (1381 of 1909)
PASS: lldb-unit :: SymbolFile/DWARF/Release/SymbolFileDWARFTests/SymbolFileDWARFTests.TestAbbrevNullAttrValidForm (1382 of 1909)
PASS: lldb-unit :: SymbolFile/DWARF/Release/SymbolFileDWARFTests/SymbolFileDWARFTests.TestAbbrevOutOfOrder (1383 of 1909)
PASS: lldb-unit :: SymbolFile/DWARF/Release/SymbolFileDWARFTests/SymbolFileDWARFTests.TestAbbrevOrder1Start5 (1384 of 1909)
PASS: lldb-unit :: SymbolFile/NativePDB/Release/SymbolFileNativePDBTests/PDBFPOProgramToDWARFExpressionTests.DependencyChain (1385 of 1909)
PASS: lldb-unit :: SymbolFile/NativePDB/Release/SymbolFileNativePDBTests/PDBFPOProgramToDWARFExpressionTests.InvalidAssignmentMultiple (1386 of 1909)
PASS: lldb-unit :: SymbolFile/DWARF/Release/SymbolFileDWARFTests/SymbolFileDWARFTests.TestAbbrevValidAttrNullForm (1387 of 1909)
PASS: lldb-unit :: SymbolFile/DWARF/Release/SymbolFileDWARFTests/SymbolFileDWARFTests.TestAbilitiesForDWARF (1388 of 1909)
PASS: lldb-unit :: SymbolFile/NativePDB/Release/SymbolFileNativePDBTests/PDBFPOProgramToDWARFExpressionTests.InvalidOpUnary (1389 of 1909)
PASS: lldb-unit :: SymbolFile/NativePDB/Release/SymbolFileNativePDBTests/PDBFPOProgramToDWARFExpressionTests.MissingTargetRegister (1390 of 1909)
PASS: lldb-unit :: SymbolFile/NativePDB/Release/SymbolFileNativePDBTests/PDBFPOProgramToDWARFExpressionTests.InvalidAssignmentSingle (1391 of 1909)
PASS: lldb-unit :: SymbolFile/NativePDB/Release/SymbolFileNativePDBTests/PDBFPOProgramToDWARFExpressionTests.InvalidOpBinary (1392 of 1909)
PASS: lldb-unit :: SymbolFile/NativePDB/Release/SymbolFileNativePDBTests/PDBFPOProgramToDWARFExpressionTests.MultipleIndependentAssignments (1393 of 1909)
PASS: lldb-unit :: SymbolFile/NativePDB/Release/SymbolFileNativePDBTests/PDBFPOProgramToDWARFExpressionTests.SingleAssignmentRegisterRef (1394 of 1909)
PASS: lldb-unit :: SymbolFile/NativePDB/Release/SymbolFileNativePDBTests/PDBFPOProgramToDWARFExpressionTests.MultipleDependentAssignments (1395 of 1909)
PASS: lldb-unit :: SymbolFile/NativePDB/Release/SymbolFileNativePDBTests/PDBFPOProgramToDWARFExpressionTests.UnknownOp (1396 of 1909)
PASS: lldb-unit :: SymbolFile/NativePDB/Release/SymbolFileNativePDBTests/PDBFPOProgramToDWARFExpressionTests.UnresolvedDependentCyclicRegisterAssignmentReference (1397 of 1909)
PASS: lldb-unit :: SymbolFile/NativePDB/Release/SymbolFileNativePDBTests/PDBFPOProgramToDWARFExpressionTests.UnresolvedRegisterAssignmentReference (1398 of 1909)
PASS: lldb-unit :: SymbolFile/NativePDB/Release/SymbolFileNativePDBTests/PDBFPOProgramToDWARFExpressionTests.UnresolvedCyclicRegisterAssignmentReference (1399 of 1909)
PASS: lldb-unit :: SymbolFile/NativePDB/Release/SymbolFileNativePDBTests/PDBFPOProgramToDWARFExpressionTests.UnresolvedRegisterReference (1400 of 1909)
PASS: lldb-unit :: SymbolFile/NativePDB/Release/SymbolFileNativePDBTests/PDBFPOProgramToDWARFExpressionTests.UnsupportedRASearch (1401 of 1909)
PASS: lldb-unit :: Target/Release/TargetTests/ExecutionContextTest.GetByteOrder (1402 of 1909)
PASS: lldb-unit :: Target/Release/TargetTests/ExecutionContextTest.GetByteOrderProcess (1403 of 1909)
PASS: lldb-unit :: Target/Release/TargetTests/ExecutionContextTest.GetByteOrderTarget (1404 of 1909)
PASS: lldb-unit :: Target/Release/TargetTests/MemoryRegionInfoTest.Formatv (1405 of 1909)
PASS: lldb-unit :: Target/Release/TargetTests/ModuleCacheTest.GetAndPutUuidExists (1406 of 1909)
PASS: lldb-unit :: Target/Release/TargetTests/ModuleCacheTest.GetAndPut (1407 of 1909)
PASS: lldb-unit :: Target/Release/TargetTests/ModuleCacheTest.GetAndPutStrangeHostname (1408 of 1909)
PASS: lldb-unit :: Target/Release/TargetTests/PathMappingListTest.AbsoluteTests (1409 of 1909)
PASS: lldb-unit :: Target/Release/TargetTests/PathMappingListTest.RelativeTests (1410 of 1909)
PASS: lldb-unit :: Target/Release/TargetTests/PathMappingListTest.RemapRoot (1411 of 1909)
PASS: lldb-unit :: UnwindAssembly/ARM64/Release/Arm64InstEmulationTests/TestArm64InstEmulation.TestMediumDarwinFunction (1412 of 1909)
PASS: lldb-unit :: UnwindAssembly/ARM64/Release/Arm64InstEmulationTests/TestArm64InstEmulation.TestFramelessThreeEpilogueFunction (1413 of 1909)
PASS: lldb-unit :: UnwindAssembly/ARM64/Release/Arm64InstEmulationTests/TestArm64InstEmulation.TestRegisterDoubleSpills (1414 of 1909)
PASS: lldb-unit :: UnwindAssembly/ARM64/Release/Arm64InstEmulationTests/TestArm64InstEmulation.TestSimpleDarwinFunction (1415 of 1909)
PASS: lldb-unit :: UnwindAssembly/ARM64/Release/Arm64InstEmulationTests/TestArm64InstEmulation.TestRegisterSavedTwice (1416 of 1909)
PASS: lldb-unit :: UnwindAssembly/PPC64/Release/PPC64InstEmulationTests/TestPPC64InstEmulation.TestSimpleFunction (1417 of 1909)
PASS: lldb-unit :: UnwindAssembly/PPC64/Release/PPC64InstEmulationTests/TestPPC64InstEmulation.TestMediumFunction (1418 of 1909)
PASS: lldb-unit :: UnwindAssembly/x86/Release/UnwindAssemblyx86Tests/Testx86AssemblyInspectionEngine.Test32BitOnlyInstruction (1419 of 1909)
PASS: lldb-unit :: UnwindAssembly/x86/Release/UnwindAssemblyx86Tests/Testx86AssemblyInspectionEngine.Test32bitFramelessSmallStackFrame (1420 of 1909)
PASS: lldb-unit :: UnwindAssembly/x86/Release/UnwindAssemblyx86Tests/Testx86AssemblyInspectionEngine.Test32bitFramelessBigStackFrame (1421 of 1909)
PASS: lldb-unit :: UnwindAssembly/x86/Release/UnwindAssemblyx86Tests/Testx86AssemblyInspectionEngine.TestAddESP (1422 of 1909)
PASS: lldb-unit :: UnwindAssembly/x86/Release/UnwindAssemblyx86Tests/Testx86AssemblyInspectionEngine.Test64bitFramelessSmallStackFrame (1423 of 1909)
PASS: lldb-unit :: UnwindAssembly/x86/Release/UnwindAssemblyx86Tests/Testx86AssemblyInspectionEngine.Test64bitFramelessBigStackFrame (1424 of 1909)
PASS: lldb-unit :: UnwindAssembly/x86/Release/UnwindAssemblyx86Tests/Testx86AssemblyInspectionEngine.TestCALLNextInsn (1425 of 1909)
PASS: lldb-unit :: UnwindAssembly/x86/Release/UnwindAssemblyx86Tests/Testx86AssemblyInspectionEngine.TestAddRSP (1426 of 1909)
PASS: lldb-unit :: UnwindAssembly/x86/Release/UnwindAssemblyx86Tests/Testx86AssemblyInspectionEngine.TestDisassemblyJunkBytes (1427 of 1909)
PASS: lldb-unit :: UnwindAssembly/x86/Release/UnwindAssemblyx86Tests/Testx86AssemblyInspectionEngine.TestLEAVE (1428 of 1909)
PASS: lldb-unit :: UnwindAssembly/x86/Release/UnwindAssemblyx86Tests/Testx86AssemblyInspectionEngine.TestDisassemblyMidFunctionEpilogues (1429 of 1909)
PASS: lldb-unit :: UnwindAssembly/x86/Release/UnwindAssemblyx86Tests/Testx86AssemblyInspectionEngine.TestPopEBX (1430 of 1909)
PASS: lldb-unit :: UnwindAssembly/x86/Release/UnwindAssemblyx86Tests/Testx86AssemblyInspectionEngine.TestPopEBP (1431 of 1909)
PASS: lldb-unit :: UnwindAssembly/x86/Release/UnwindAssemblyx86Tests/Testx86AssemblyInspectionEngine.TestMovRSPtoRBP (1432 of 1909)
PASS: lldb-unit :: UnwindAssembly/x86/Release/UnwindAssemblyx86Tests/Testx86AssemblyInspectionEngine.TestPopEDI (1433 of 1909)
PASS: lldb-unit :: UnwindAssembly/x86/Release/UnwindAssemblyx86Tests/Testx86AssemblyInspectionEngine.TestPopESI (1434 of 1909)
PASS: lldb-unit :: UnwindAssembly/x86/Release/UnwindAssemblyx86Tests/Testx86AssemblyInspectionEngine.TestPopR12 (1435 of 1909)
PASS: lldb-unit :: UnwindAssembly/x86/Release/UnwindAssemblyx86Tests/Testx86AssemblyInspectionEngine.TestPopR13 (1436 of 1909)
PASS: lldb-unit :: UnwindAssembly/x86/Release/UnwindAssemblyx86Tests/Testx86AssemblyInspectionEngine.TestPopR14 (1437 of 1909)
PASS: lldb-unit :: UnwindAssembly/x86/Release/UnwindAssemblyx86Tests/Testx86AssemblyInspectionEngine.TestPopRBP (1438 of 1909)
PASS: lldb-unit :: UnwindAssembly/x86/Release/UnwindAssemblyx86Tests/Testx86AssemblyInspectionEngine.TestPopRBX (1439 of 1909)
PASS: lldb-unit :: UnwindAssembly/x86/Release/UnwindAssemblyx86Tests/Testx86AssemblyInspectionEngine.TestPopRBPWithREX (1440 of 1909)
PASS: lldb-unit :: UnwindAssembly/x86/Release/UnwindAssemblyx86Tests/Testx86AssemblyInspectionEngine.TestPopR15 (1441 of 1909)
PASS: lldb-unit :: UnwindAssembly/x86/Release/UnwindAssemblyx86Tests/Testx86AssemblyInspectionEngine.TestPush0 (1442 of 1909)
PASS: lldb-unit :: UnwindAssembly/x86/Release/UnwindAssemblyx86Tests/Testx86AssemblyInspectionEngine.TestPushEAX (1443 of 1909)
PASS: lldb-unit :: UnwindAssembly/x86/Release/UnwindAssemblyx86Tests/Testx86AssemblyInspectionEngine.TestPushEBX (1444 of 1909)
PASS: lldb-unit :: UnwindAssembly/x86/Release/UnwindAssemblyx86Tests/Testx86AssemblyInspectionEngine.TestPushEBP (1445 of 1909)
PASS: lldb-unit :: UnwindAssembly/x86/Release/UnwindAssemblyx86Tests/Testx86AssemblyInspectionEngine.TestPushESI (1446 of 1909)
PASS: lldb-unit :: UnwindAssembly/x86/Release/UnwindAssemblyx86Tests/Testx86AssemblyInspectionEngine.TestPushEDI (1447 of 1909)
PASS: lldb-unit :: UnwindAssembly/x86/Release/UnwindAssemblyx86Tests/Testx86AssemblyInspectionEngine.TestPushEDX (1448 of 1909)
PASS: lldb-unit :: UnwindAssembly/x86/Release/UnwindAssemblyx86Tests/Testx86AssemblyInspectionEngine.TestPushECX (1449 of 1909)
PASS: lldb-unit :: UnwindAssembly/x86/Release/UnwindAssemblyx86Tests/Testx86AssemblyInspectionEngine.TestPushExtended (1450 of 1909)
PASS: lldb-unit :: UnwindAssembly/x86/Release/UnwindAssemblyx86Tests/Testx86AssemblyInspectionEngine.TestPushImm (1451 of 1909)
PASS: lldb-unit :: UnwindAssembly/x86/Release/UnwindAssemblyx86Tests/Testx86AssemblyInspectionEngine.TestPushR12 (1452 of 1909)
PASS: lldb-unit :: UnwindAssembly/x86/Release/UnwindAssemblyx86Tests/Testx86AssemblyInspectionEngine.TestPushR13 (1453 of 1909)
PASS: lldb-unit :: UnwindAssembly/x86/Release/UnwindAssemblyx86Tests/Testx86AssemblyInspectionEngine.TestPushR14 (1454 of 1909)
PASS: lldb-unit :: UnwindAssembly/x86/Release/UnwindAssemblyx86Tests/Testx86AssemblyInspectionEngine.TestPushRBP (1455 of 1909)
PASS: lldb-unit :: UnwindAssembly/x86/Release/UnwindAssemblyx86Tests/Testx86AssemblyInspectionEngine.TestPushRBPWithREX (1456 of 1909)
PASS: lldb-unit :: UnwindAssembly/x86/Release/UnwindAssemblyx86Tests/Testx86AssemblyInspectionEngine.TestPushR15 (1457 of 1909)
PASS: lldb-unit :: UnwindAssembly/x86/Release/UnwindAssemblyx86Tests/Testx86AssemblyInspectionEngine.TestPushRBX (1458 of 1909)
PASS: lldb-unit :: UnwindAssembly/x86/Release/UnwindAssemblyx86Tests/Testx86AssemblyInspectionEngine.TestReturnDetect (1459 of 1909)
PASS: lldb-unit :: UnwindAssembly/x86/Release/UnwindAssemblyx86Tests/Testx86AssemblyInspectionEngine.TestSimple64bitFrameFunction (1460 of 1909)
PASS: lldb-unit :: UnwindAssembly/x86/Release/UnwindAssemblyx86Tests/Testx86AssemblyInspectionEngine.TestSpillRegToStackViaMOVi386 (1461 of 1909)
PASS: lldb-unit :: UnwindAssembly/x86/Release/UnwindAssemblyx86Tests/Testx86AssemblyInspectionEngine.TestSimple32bitFrameFunction (1462 of 1909)
PASS: lldb-unit :: UnwindAssembly/x86/Release/UnwindAssemblyx86Tests/Testx86AssemblyInspectionEngine.TestSimplex86_64Augmented (1463 of 1909)
PASS: lldb-unit :: UnwindAssembly/x86/Release/UnwindAssemblyx86Tests/Testx86AssemblyInspectionEngine.TestSimplei386ugmented (1464 of 1909)
PASS: lldb-unit :: UnwindAssembly/x86/Release/UnwindAssemblyx86Tests/Testx86AssemblyInspectionEngine.TestSpillRegToStackViaMOVx86_64 (1465 of 1909)
PASS: lldb-unit :: UnwindAssembly/x86/Release/UnwindAssemblyx86Tests/Testx86AssemblyInspectionEngine.TestSpArithx86_64Augmented (1466 of 1909)
PASS: lldb-unit :: UnwindAssembly/x86/Release/UnwindAssemblyx86Tests/Testx86AssemblyInspectionEngine.TestStackRealign32BitDisp_x86_64 (1467 of 1909)
PASS: lldb-unit :: Utility/Release/UtilityTests/AnsiTerminal.AtStart (1468 of 1909)
PASS: lldb-unit :: Utility/Release/UtilityTests/AnsiTerminal.AtEnd (1469 of 1909)
PASS: lldb-unit :: UnwindAssembly/x86/Release/UnwindAssemblyx86Tests/Testx86AssemblyInspectionEngine.TestStackRealign8BitDisp_i386 (1470 of 1909)
PASS: lldb-unit :: UnwindAssembly/x86/Release/UnwindAssemblyx86Tests/Testx86AssemblyInspectionEngine.TestStackRealignMSVC_i386 (1471 of 1909)
PASS: lldb-unit :: UnwindAssembly/x86/Release/UnwindAssemblyx86Tests/Testx86AssemblyInspectionEngine.Testi386IgnoredRegisters (1472 of 1909)
PASS: lldb-unit :: UnwindAssembly/x86/Release/UnwindAssemblyx86Tests/Testx86AssemblyInspectionEngine.TestSubESP (1473 of 1909)
PASS: lldb-unit :: UnwindAssembly/x86/Release/UnwindAssemblyx86Tests/Testx86AssemblyInspectionEngine.TestSubRSP (1474 of 1909)
PASS: lldb-unit :: Utility/Release/UtilityTests/AnsiTerminal.Basic (1475 of 1909)
PASS: lldb-unit :: Utility/Release/UtilityTests/AnsiTerminal.Empty (1476 of 1909)
PASS: lldb-unit :: Utility/Release/UtilityTests/AnsiTerminal.Incomplete (1477 of 1909)
PASS: lldb-unit :: Utility/Release/UtilityTests/AnsiTerminal.KnownPrefix (1478 of 1909)
PASS: lldb-unit :: Utility/Release/UtilityTests/AnsiTerminal.Twice (1479 of 1909)
PASS: lldb-unit :: Utility/Release/UtilityTests/AnsiTerminal.Unknown (1480 of 1909)
PASS: lldb-unit :: Utility/Release/UtilityTests/ArchSpecTest.Compatibility (1481 of 1909)
PASS: lldb-unit :: Utility/Release/UtilityTests/AnsiTerminal.WhiteSpace (1482 of 1909)
PASS: lldb-unit :: Utility/Release/UtilityTests/ArchSpecTest.MergeFrom (1483 of 1909)
PASS: lldb-unit :: Utility/Release/UtilityTests/ArchSpecTest.OperatorBool (1484 of 1909)
PASS: lldb-unit :: Utility/Release/UtilityTests/ArchSpecTest.MergeFromMachOUnknown (1485 of 1909)
PASS: lldb-unit :: Utility/Release/UtilityTests/ArchSpecTest.TestParseMachCPUDashSubtypeTripleExtra (1486 of 1909)
PASS: lldb-unit :: Utility/Release/UtilityTests/ArchSpecTest.TestParseMachCPUDashSubtypeTripleSimple (1487 of 1909)
PASS: lldb-unit :: Utility/Release/UtilityTests/ArchSpecTest.TripleComponentsWereSpecified (1488 of 1909)
PASS: lldb-unit :: Utility/Release/UtilityTests/ArchSpecTest.TestSetTriple (1489 of 1909)
PASS: lldb-unit :: Utility/Release/UtilityTests/ArgsTest.AppendArguments (1490 of 1909)
PASS: lldb-unit :: Utility/Release/UtilityTests/ArgsTest.DoubleQuotedItem (1491 of 1909)
PASS: lldb-unit :: Utility/Release/UtilityTests/ArgsTest.EscapeLLDBCommandArgument (1492 of 1909)
PASS: lldb-unit :: Utility/Release/UtilityTests/ArgsTest.BareSingleQuote (1493 of 1909)
PASS: lldb-api :: types/TestCharTypeExpr.py (1494 of 1909)
PASS: lldb-unit :: Utility/Release/UtilityTests/ArgsTest.GetArgumentArrayRef (1495 of 1909)
PASS: lldb-unit :: Utility/Release/UtilityTests/ArgsTest.ReplaceArgumentAtIndexEqual (1496 of 1909)
PASS: lldb-unit :: Utility/Release/UtilityTests/ArgsTest.ReplaceArgumentAtIndexFarOutOfRange (1497 of 1909)
PASS: lldb-unit :: Utility/Release/UtilityTests/ArgsTest.GetQuotedCommandString (1498 of 1909)
PASS: lldb-unit :: Utility/Release/UtilityTests/ArgsTest.ReplaceArgumentAtIndexLonger (1499 of 1909)
PASS: lldb-unit :: Utility/Release/UtilityTests/ArgsTest.ReplaceArgumentAtIndexOutOfRange (1500 of 1909)
PASS: lldb-unit :: Utility/Release/UtilityTests/ArgsTest.ReplaceArgumentAtIndexShort (1501 of 1909)
PASS: lldb-unit :: Utility/Release/UtilityTests/ArgsTest.StringListConstructor (1502 of 1909)
PASS: lldb-unit :: Utility/Release/UtilityTests/ArgsTest.TestAppendArg (1503 of 1909)
PASS: lldb-unit :: Utility/Release/UtilityTests/ArgsTest.TestMultipleArgs (1504 of 1909)
PASS: lldb-unit :: Utility/Release/UtilityTests/ArgsTest.TestInsertArg (1505 of 1909)
PASS: lldb-unit :: Utility/Release/UtilityTests/ArgsTest.TestQuotedTrailingBackslash (1506 of 1909)
PASS: lldb-unit :: Utility/Release/UtilityTests/ArgsTest.TestArgv (1507 of 1909)
PASS: lldb-unit :: Utility/Release/UtilityTests/ArgsTest.TestOverwriteArgs (1508 of 1909)
PASS: lldb-unit :: Utility/Release/UtilityTests/ArgsTest.TestSingleArg (1509 of 1909)
PASS: lldb-unit :: Utility/Release/UtilityTests/ArgsTest.TestQuotedUnknownEscape (1510 of 1909)
PASS: lldb-unit :: Utility/Release/UtilityTests/ArgsTest.TestSingleArgWithQuotedSpace (1511 of 1909)
PASS: lldb-unit :: Utility/Release/UtilityTests/ArgsTest.TestSingleQuotedArgWithSpace (1512 of 1909)
PASS: lldb-unit :: Utility/Release/UtilityTests/BinaryStreamTest.PutSLEB128FourBytes (1513 of 1909)
PASS: lldb-unit :: Utility/Release/UtilityTests/BinaryStreamTest.PutSLEB128EightBytes (1514 of 1909)
PASS: lldb-unit :: Utility/Release/UtilityTests/BinaryStreamTest.PutSLEB128FiveBytes (1515 of 1909)
PASS: lldb-unit :: Utility/Release/UtilityTests/ArgsTest.TestUnknownEscape (1516 of 1909)
PASS: lldb-unit :: Utility/Release/UtilityTests/ArgsTest.TestTrailingBackslash (1517 of 1909)
PASS: lldb-unit :: Utility/Release/UtilityTests/BinaryStreamTest.PutSLEB128NineBytes (1518 of 1909)
PASS: lldb-unit :: Utility/Release/UtilityTests/BinaryStreamTest.PutSLEB128MaxValue (1519 of 1909)
PASS: lldb-unit :: Utility/Release/UtilityTests/BinaryStreamTest.PutSLEB128One (1520 of 1909)
PASS: lldb-unit :: Utility/Release/UtilityTests/BinaryStreamTest.PutSLEB128OneByte (1521 of 1909)
PASS: lldb-unit :: Utility/Release/UtilityTests/BinaryStreamTest.PutSLEB128ThreeBytes (1522 of 1909)
PASS: lldb-unit :: Utility/Release/UtilityTests/BinaryStreamTest.PutSLEB128SevenBytes (1523 of 1909)
PASS: lldb-unit :: Utility/Release/UtilityTests/BinaryStreamTest.PutSLEB128SixBytes (1524 of 1909)
PASS: lldb-unit :: Utility/Release/UtilityTests/BinaryStreamTest.PutSLEB128Zero (1525 of 1909)
PASS: lldb-unit :: Utility/Release/UtilityTests/BinaryStreamTest.PutSLEB128TwoBytes (1526 of 1909)
PASS: lldb-unit :: Utility/Release/UtilityTests/BinaryStreamTest.PutULEB128FourBytes (1527 of 1909)
PASS: lldb-unit :: Utility/Release/UtilityTests/BinaryStreamTest.PutULEB128EightBytes (1528 of 1909)
PASS: lldb-unit :: Utility/Release/UtilityTests/BinaryStreamTest.PutULEB128MaxValue (1529 of 1909)
PASS: lldb-unit :: Utility/Release/UtilityTests/BinaryStreamTest.PutULEB128FiveBytes (1530 of 1909)
PASS: lldb-unit :: Utility/Release/UtilityTests/BinaryStreamTest.PutULEB128NineBytes (1531 of 1909)
PASS: lldb-unit :: Utility/Release/UtilityTests/BinaryStreamTest.PutULEB128SevenBytes (1532 of 1909)
PASS: lldb-unit :: Utility/Release/UtilityTests/BinaryStreamTest.PutULEB128OneByte (1533 of 1909)
PASS: lldb-unit :: Utility/Release/UtilityTests/BinaryStreamTest.PutULEB128SixBytes (1534 of 1909)
PASS: lldb-unit :: Utility/Release/UtilityTests/BinaryStreamTest.PutULEB128One (1535 of 1909)
PASS: lldb-unit :: Utility/Release/UtilityTests/BroadcasterTest.BroadcastEvent (1536 of 1909)
PASS: lldb-unit :: Utility/Release/UtilityTests/BinaryStreamTest.PutULEB128ThreeBytes (1537 of 1909)
PASS: lldb-unit :: Utility/Release/UtilityTests/BinaryStreamTest.PutULEB128TwoBytes (1538 of 1909)
PASS: lldb-unit :: Utility/Release/UtilityTests/BinaryStreamTest.PutULEB128Zero (1539 of 1909)
PASS: lldb-unit :: Utility/Release/UtilityTests/BroadcasterTest.EventTypeHasListeners (1540 of 1909)
PASS: lldb-unit :: Utility/Release/UtilityTests/CompletionRequest.DuplicateFilteringWithComments (1541 of 1909)
PASS: lldb-unit :: Utility/Release/UtilityTests/CompletionRequest.Constructor (1542 of 1909)
PASS: lldb-unit :: Utility/Release/UtilityTests/CompletionRequest.DuplicateFiltering (1543 of 1909)
PASS: lldb-unit :: Utility/Release/UtilityTests/CompletionRequest.FakeLastArg (1544 of 1909)
PASS: lldb-unit :: Utility/Release/UtilityTests/CompletionRequest.ShiftArguments (1545 of 1909)
PASS: lldb-unit :: Utility/Release/UtilityTests/CompletionRequest.TestCompletionOwnership (1546 of 1909)
PASS: lldb-unit :: Utility/Release/UtilityTests/CompletionRequest.TryCompleteCurrentArgGood (1547 of 1909)
PASS: lldb-unit :: Utility/Release/UtilityTests/CompletionRequest.TryCompleteCurrentArgBad (1548 of 1909)
PASS: lldb-unit :: Utility/Release/UtilityTests/ConstStringTest.CompareStringRef (1549 of 1909)
PASS: lldb-unit :: Utility/Release/UtilityTests/CompletionRequest.TryCompleteCurrentArgMode (1550 of 1909)
PASS: lldb-unit :: Utility/Release/UtilityTests/ConstStringTest.MangledCounterpart (1551 of 1909)
PASS: lldb-unit :: Utility/Release/UtilityTests/ConstStringTest.CompareConstString (1552 of 1909)
PASS: lldb-unit :: Utility/Release/UtilityTests/ConstStringTest.FromMidOfBufferStringRef (1553 of 1909)
PASS: lldb-unit :: Utility/Release/UtilityTests/DataExtractorTest.GetBitfield (1554 of 1909)
PASS: lldb-unit :: Utility/Release/UtilityTests/ConstStringTest.UpdateMangledCounterpart (1555 of 1909)
PASS: lldb-unit :: Utility/Release/UtilityTests/ConstStringTest.NullAndEmptyStates (1556 of 1909)
PASS: lldb-unit :: Utility/Release/UtilityTests/ConstStringTest.format_provider (1557 of 1909)
PASS: lldb-unit :: Utility/Release/UtilityTests/DataExtractorTest.GetCStrEmpty (1558 of 1909)
PASS: lldb-unit :: Utility/Release/UtilityTests/DataExtractorTest.GetCStrUnterminated (1559 of 1909)
PASS: lldb-unit :: Utility/Release/UtilityTests/DataExtractorTest.GetCStrAtNullOffset (1560 of 1909)
PASS: lldb-unit :: Utility/Release/UtilityTests/DataExtractorTest.GetCStr (1561 of 1909)
PASS: lldb-unit :: Utility/Release/UtilityTests/DataExtractorTest.GetCStrAtEnd (1562 of 1909)
PASS: lldb-unit :: Utility/Release/UtilityTests/DataExtractorTest.GetMaxU64_unchecked (1563 of 1909)
PASS: lldb-unit :: Utility/Release/UtilityTests/DataExtractorTest.GetMaxS64 (1564 of 1909)
PASS: lldb-unit :: Utility/Release/UtilityTests/DataExtractorTest.PeekData (1565 of 1909)
PASS: lldb-unit :: Utility/Release/UtilityTests/DataExtractorTest.GetMaxU64 (1566 of 1909)
PASS: lldb-unit :: Utility/Release/UtilityTests/EventTest.DumpEventDataBytes (1567 of 1909)
PASS: lldb-unit :: Utility/Release/UtilityTests/EnvironmentTest.EnvpConversion (1568 of 1909)
PASS: lldb-unit :: Utility/Release/UtilityTests/FileSpecTest.AppendPathComponent (1569 of 1909)
PASS: lldb-unit :: Utility/Release/UtilityTests/DeserializerTest.HasData (1570 of 1909)
PASS: lldb-unit :: Utility/Release/UtilityTests/EnvironmentTest.EnvpConstruction (1571 of 1909)
PASS: lldb-unit :: Utility/Release/UtilityTests/FileSpecTest.EqualDotsPosixRoot (1572 of 1909)
PASS: lldb-unit :: Utility/Release/UtilityTests/FileSpecTest.Equal (1573 of 1909)
PASS: lldb-unit :: Utility/Release/UtilityTests/FileSpecTest.CopyByAppendingPathComponent (1574 of 1909)
PASS: lldb-unit :: Utility/Release/UtilityTests/FileSpecTest.EqualDotsPosix (1575 of 1909)
PASS: lldb-unit :: Utility/Release/UtilityTests/FileSpecTest.EqualSeparator (1576 of 1909)
PASS: lldb-unit :: Utility/Release/UtilityTests/FileSpecTest.GetPath (1577 of 1909)
PASS: lldb-unit :: Utility/Release/UtilityTests/FileSpecTest.FormatFileSpec (1578 of 1909)
PASS: lldb-unit :: Utility/Release/UtilityTests/FileSpecTest.EqualDotsWindows (1579 of 1909)
PASS: lldb-unit :: Utility/Release/UtilityTests/FileSpecTest.FileAndDirectoryComponents (1580 of 1909)
PASS: lldb-unit :: Utility/Release/UtilityTests/FileSpecTest.GuessPathStyle (1581 of 1909)
PASS: lldb-unit :: Utility/Release/UtilityTests/FileSpecTest.Match (1582 of 1909)
PASS: lldb-unit :: Utility/Release/UtilityTests/FileSpecTest.IsRelative (1583 of 1909)
PASS: lldb-unit :: Utility/Release/UtilityTests/FileSpecTest.PrependPathComponent (1584 of 1909)
PASS: lldb-unit :: Utility/Release/UtilityTests/FileSpecTest.RemoveLastPathComponent (1585 of 1909)
PASS: lldb-unit :: Utility/Release/UtilityTests/Flags.AnyClear (1586 of 1909)
PASS: lldb-unit :: Utility/Release/UtilityTests/Flags.AnySet (1587 of 1909)
PASS: lldb-unit :: Utility/Release/UtilityTests/Flags.AllSet (1588 of 1909)
PASS: lldb-unit :: Utility/Release/UtilityTests/Flags.AllClear (1589 of 1909)
PASS: lldb-unit :: Utility/Release/UtilityTests/Flags.Clear (1590 of 1909)
PASS: lldb-unit :: Utility/Release/UtilityTests/Flags.IsClear (1591 of 1909)
PASS: lldb-unit :: Utility/Release/UtilityTests/Flags.GetBitSize (1592 of 1909)
PASS: lldb-unit :: Utility/Release/UtilityTests/Flags.Reset (1593 of 1909)
PASS: lldb-unit :: Utility/Release/UtilityTests/Flags.Test (1594 of 1909)
PASS: lldb-unit :: Utility/Release/UtilityTests/GeneratorTest.Create (1595 of 1909)
PASS: lldb-unit :: Utility/Release/UtilityTests/GeneratorTest.Get (1596 of 1909)
PASS: lldb-unit :: Utility/Release/UtilityTests/IndexToObjectTest.ObjectForIndex (1597 of 1909)
PASS: lldb-unit :: Utility/Release/UtilityTests/GeneratorTest.GetOrCreate (1598 of 1909)
PASS: lldb-unit :: Utility/Release/UtilityTests/ListenerTest.GetEventImmediate (1599 of 1909)
PASS: lldb-unit :: Utility/Release/UtilityTests/LogChannelEnabledTest.LogGetLogThread (1600 of 1909)
PASS: lldb-unit :: Utility/Release/UtilityTests/LogChannelEnabledTest.LLDB_LOG_ERROR (1601 of 1909)
PASS: lldb-unit :: Utility/Release/UtilityTests/LogChannelEnabledTest.LogVerboseThread (1602 of 1909)
PASS: lldb-unit :: Utility/Release/UtilityTests/LogChannelEnabledTest.log_options (1603 of 1909)
PASS: lldb-unit :: Utility/Release/UtilityTests/LogChannelTest.Enable (1604 of 1909)
PASS: lldb-unit :: Utility/Release/UtilityTests/LogChannelTest.Disable (1605 of 1909)
PASS: lldb-unit :: Utility/Release/UtilityTests/LogChannelEnabledTest.LogThread (1606 of 1909)
PASS: lldb-unit :: Utility/Release/UtilityTests/LogChannelTest.EnableOptions (1607 of 1909)
PASS: lldb-unit :: Utility/Release/UtilityTests/LogTest.LLDB_LOG_nullptr (1608 of 1909)
PASS: lldb-unit :: Utility/Release/UtilityTests/LogChannelTest.List (1609 of 1909)
PASS: lldb-unit :: Utility/Release/UtilityTests/ListenerTest.GetEventWait (1610 of 1909)
PASS: lldb-unit :: Utility/Release/UtilityTests/NameMatchesTest.Equals (1611 of 1909)
PASS: lldb-unit :: Utility/Release/UtilityTests/LogTest.Register (1612 of 1909)
PASS: lldb-unit :: Utility/Release/UtilityTests/NameMatchesTest.EndsWith (1613 of 1909)
PASS: lldb-unit :: Utility/Release/UtilityTests/NameMatchesTest.Contains (1614 of 1909)
PASS: lldb-unit :: Utility/Release/UtilityTests/LogTest.Unregister (1615 of 1909)
PASS: lldb-unit :: Utility/Release/UtilityTests/NameMatchesTest.Ignore (1616 of 1909)
PASS: lldb-unit :: Utility/Release/UtilityTests/NameMatchesTest.StartsWith (1617 of 1909)
PASS: lldb-unit :: Utility/Release/UtilityTests/NameMatchesTest.RegularExpression (1618 of 1909)
PASS: lldb-unit :: Utility/Release/UtilityTests/OptionsWithRawTest.ArgsButNoDelimiter (1619 of 1909)
PASS: lldb-unit :: Utility/Release/UtilityTests/OptionsWithRawTest.EmptyArgsOnlySuffix (1620 of 1909)
PASS: lldb-unit :: Utility/Release/UtilityTests/OptionsWithRawTest.EmptySuffix (1621 of 1909)
PASS: lldb-unit :: Utility/Release/UtilityTests/OptionsWithRawTest.LeadingSpaceArgs (1622 of 1909)
PASS: lldb-unit :: Utility/Release/UtilityTests/OptionsWithRawTest.EmptyInput (1623 of 1909)
PASS: lldb-unit :: Utility/Release/UtilityTests/OptionsWithRawTest.ArgsButNoLeadingDash (1624 of 1909)
PASS: lldb-unit :: Utility/Release/UtilityTests/OptionsWithRawTest.EmptySuffixSingleWhitespace (1625 of 1909)
PASS: lldb-unit :: Utility/Release/UtilityTests/OptionsWithRawTest.MultiWordSuffix (1626 of 1909)
PASS: lldb-unit :: Utility/Release/UtilityTests/OptionsWithRawTest.QuotedSuffix (1627 of 1909)
PASS: lldb-unit :: Utility/Release/UtilityTests/OptionsWithRawTest.UnterminatedQuote (1628 of 1909)
PASS: lldb-unit :: Utility/Release/UtilityTests/OptionsWithRawTest.TerminatedQuote (1629 of 1909)
PASS: lldb-unit :: Utility/Release/UtilityTests/OptionsWithRawTest.SingleWordSuffix (1630 of 1909)
PASS: lldb-unit :: Utility/Release/UtilityTests/OptionsWithRawTest.SingleWhitespaceInput (1631 of 1909)
PASS: lldb-unit :: Utility/Release/UtilityTests/OptionsWithRawTest.WhitespaceSuffix (1632 of 1909)
PASS: lldb-unit :: Utility/Release/UtilityTests/OptionsWithRawTest.WhitespaceInput (1633 of 1909)
PASS: lldb-unit :: Utility/Release/UtilityTests/ProcessInfoTest.Constructor (1634 of 1909)
PASS: lldb-unit :: Utility/Release/UtilityTests/ProcessInstanceInfo.DumpTable (1635 of 1909)
PASS: lldb-unit :: Utility/Release/UtilityTests/Predicate.WaitForValueNotEqualTo (1636 of 1909)
PASS: lldb-unit :: Utility/Release/UtilityTests/ProcessInstanceInfo.Dump (1637 of 1909)
PASS: lldb-unit :: Utility/Release/UtilityTests/ProcessInstanceInfoMatch.Name (1638 of 1909)
PASS: lldb-unit :: Utility/Release/UtilityTests/RangeDataVector.FindEntryThatContains (1639 of 1909)
PASS: lldb-unit :: Utility/Release/UtilityTests/ProcessInstanceInfo.DumpTable_invalidUID (1640 of 1909)
PASS: lldb-unit :: Utility/Release/UtilityTests/RangeDataVector.CustomSort (1641 of 1909)
PASS: lldb-unit :: Utility/Release/UtilityTests/RangeDataVector.FindEntryThatContains_Overlap (1642 of 1909)
PASS: lldb-unit :: Utility/Release/UtilityTests/RangeTest.Clear (1643 of 1909)
PASS: lldb-unit :: Utility/Release/UtilityTests/RangeTest.Constructor (1644 of 1909)
PASS: lldb-unit :: Utility/Release/UtilityTests/RangeTest.ClearWithStarAddress (1645 of 1909)
PASS: lldb-unit :: Utility/Release/UtilityTests/RangeTest.ContainsAddr (1646 of 1909)
PASS: lldb-unit :: Utility/Release/UtilityTests/RangeTest.ContainsEndInclusive (1647 of 1909)
PASS: lldb-unit :: Utility/Release/UtilityTests/RangeTest.ContainsAddrInvalid (1648 of 1909)
PASS: lldb-unit :: Utility/Release/UtilityTests/RangeTest.ContainsEndInclusiveInvalid (1649 of 1909)
PASS: lldb-unit :: Utility/Release/UtilityTests/RangeTest.ContainsRange (1650 of 1909)
PASS: lldb-unit :: Utility/Release/UtilityTests/RangeTest.Copy (1651 of 1909)
PASS: lldb-unit :: Utility/Release/UtilityTests/RangeTest.ContainsRangeStartingFromZero (1652 of 1909)
PASS: lldb-unit :: Utility/Release/UtilityTests/RangeTest.DefaultConstructor (1653 of 1909)
PASS: lldb-unit :: Utility/Release/UtilityTests/RangeTest.Equal (1654 of 1909)
PASS: lldb-unit :: Utility/Release/UtilityTests/RangeTest.DoesAdjoinOrIntersect (1655 of 1909)
PASS: lldb-unit :: Utility/Release/UtilityTests/RangeTest.DoesIntersect (1656 of 1909)
PASS: lldb-unit :: Utility/Release/UtilityTests/RangeTest.EqualInvalid (1657 of 1909)
PASS: lldb-unit :: Utility/Release/UtilityTests/RangeTest.LessThan (1658 of 1909)
PASS: lldb-unit :: Utility/Release/UtilityTests/RangeTest.SetRangeBase (1659 of 1909)
PASS: lldb-unit :: Utility/Release/UtilityTests/RangeTest.LessThanInvalid (1660 of 1909)
PASS: lldb-unit :: Utility/Release/UtilityTests/RangeTest.NotEqual (1661 of 1909)
PASS: lldb-unit :: Utility/Release/UtilityTests/RangeTest.SizeTypes (1662 of 1909)
PASS: lldb-unit :: Utility/Release/UtilityTests/RangeTest.NotEqualInvalid (1663 of 1909)
PASS: lldb-unit :: Utility/Release/UtilityTests/RangeTest.Slide (1664 of 1909)
PASS: lldb-unit :: Utility/Release/UtilityTests/RangeTest.SlideZero (1665 of 1909)
PASS: lldb-unit :: Utility/Release/UtilityTests/RangeTest.Union (1666 of 1909)
PASS: lldb-unit :: Utility/Release/UtilityTests/RecordReplayTest.InstrumentedFoo (1667 of 1909)
PASS: lldb-unit :: Utility/Release/UtilityTests/RecordReplayTest.InstrumentedBarRef (1668 of 1909)
PASS: lldb-unit :: Utility/Release/UtilityTests/RecordReplayTest.InstrumentedBar (1669 of 1909)
PASS: lldb-unit :: Utility/Release/UtilityTests/RecordReplayTest.InstrumentedBarPtr (1670 of 1909)
PASS: lldb-unit :: Utility/Release/UtilityTests/RecordReplayTest.InstrumentedFooSameThis (1671 of 1909)
PASS: lldb-unit :: Utility/Release/UtilityTests/RegisterValueTest.GetSet8 (1672 of 1909)
PASS: lldb-unit :: Utility/Release/UtilityTests/RegularExpression.CopyAssignment (1673 of 1909)
PASS: lldb-unit :: Utility/Release/UtilityTests/Predicate.WaitForValueEqualTo (1674 of 1909)
PASS: lldb-unit :: Utility/Release/UtilityTests/RegularExpression.Empty (1675 of 1909)
PASS: lldb-unit :: Utility/Release/UtilityTests/RegularExpression.Invalid (1676 of 1909)
PASS: lldb-unit :: Utility/Release/UtilityTests/RegularExpression.Valid (1677 of 1909)
PASS: lldb-unit :: Utility/Release/UtilityTests/ReproducerTest.SetCapture (1678 of 1909)
PASS: lldb-unit :: Utility/Release/UtilityTests/RegularExpression.Match (1679 of 1909)
PASS: lldb-unit :: Utility/Release/UtilityTests/ScalarTest.APIntConstructor (1680 of 1909)
PASS: lldb-unit :: Utility/Release/UtilityTests/ReproducerTest.SetReplay (1681 of 1909)
PASS: lldb-unit :: Utility/Release/UtilityTests/ScalarTest.CastOperations (1682 of 1909)
PASS: lldb-unit :: Utility/Release/UtilityTests/ScalarTest.ComparisonFloat (1683 of 1909)
PASS: lldb-unit :: Utility/Release/UtilityTests/ScalarTest.Comparison (1684 of 1909)
PASS: lldb-unit :: Host/Release/HostTests/MainLoopTest.UnmonitoredSignal (1685 of 1909)
PASS: lldb-unit :: Utility/Release/UtilityTests/ScalarTest.ExtractBitfield (1686 of 1909)
PASS: lldb-unit :: Utility/Release/UtilityTests/ScalarTest.Equality (1687 of 1909)
PASS: lldb-unit :: Utility/Release/UtilityTests/ScalarTest.Division (1688 of 1909)
PASS: lldb-unit :: Utility/Release/UtilityTests/ScalarTest.GetValue (1689 of 1909)
PASS: lldb-unit :: Utility/Release/UtilityTests/ScalarTest.GetBytes (1690 of 1909)
PASS: lldb-unit :: Utility/Release/UtilityTests/ScalarTest.Promotion (1691 of 1909)
PASS: lldb-unit :: Utility/Release/UtilityTests/ScalarTest.RightShiftOperator (1692 of 1909)
PASS: lldb-unit :: Utility/Release/UtilityTests/ScalarTest.Scalar_512 (1693 of 1909)
PASS: lldb-unit :: Utility/Release/UtilityTests/ScalarTest.SetValueFromCString (1694 of 1909)
PASS: lldb-unit :: Utility/Release/UtilityTests/SerializationRountripTest.SerializeDeserializeCString (1695 of 1909)
PASS: lldb-unit :: Utility/Release/UtilityTests/SerializationRountripTest.SerializeDeserializeObjectPointer (1696 of 1909)
PASS: lldb-unit :: Utility/Release/UtilityTests/SerializationRountripTest.SerializeDeserializeObjectReference (1697 of 1909)
PASS: lldb-unit :: Utility/Release/UtilityTests/SerializationRountripTest.SerializeDeserializePod (1698 of 1909)
PASS: lldb-unit :: Utility/Release/UtilityTests/SerializationRountripTest.SerializeDeserializePodPointers (1699 of 1909)
PASS: lldb-unit :: Utility/Release/UtilityTests/StateTest.Formatv (1700 of 1909)
PASS: lldb-unit :: Utility/Release/UtilityTests/SerializationRountripTest.SerializeDeserializePodReferences (1701 of 1909)
PASS: lldb-unit :: Utility/Release/UtilityTests/StatusTest.ErrorConstructor (1702 of 1909)
PASS: lldb-unit :: Utility/Release/UtilityTests/StatusTest.ErrorConversion (1703 of 1909)
PASS: lldb-unit :: Utility/Release/UtilityTests/StatusTest.Formatv (1704 of 1909)
PASS: lldb-unit :: Utility/Release/UtilityTests/StreamTeeTest.AppendStream (1705 of 1909)
PASS: lldb-unit :: Utility/Release/UtilityTests/StreamTeeTest.Assignment (1706 of 1909)
PASS: lldb-unit :: Utility/Release/UtilityTests/StreamTeeTest.Constructor1Stream (1707 of 1909)
PASS: lldb-unit :: Utility/Release/UtilityTests/StreamTeeTest.Constructor2Streams (1708 of 1909)
PASS: lldb-unit :: Utility/Release/UtilityTests/StreamTeeTest.CopyConstructor (1709 of 1909)
PASS: lldb-unit :: Utility/Release/UtilityTests/StreamTeeTest.DefaultConstructor (1710 of 1909)
PASS: lldb-unit :: Utility/Release/UtilityTests/StreamTeeTest.Flush (1711 of 1909)
PASS: lldb-unit :: Utility/Release/UtilityTests/StreamTeeTest.SetStreamAtIndexOutOfBounds (1712 of 1909)
PASS: lldb-unit :: Utility/Release/UtilityTests/StreamTeeTest.GetStreamAtIndexOutOfBounds (1713 of 1909)
PASS: lldb-unit :: Utility/Release/UtilityTests/StreamTeeTest.GetStreamAtIndexOutOfBoundsEmpty (1714 of 1909)
PASS: lldb-unit :: Utility/Release/UtilityTests/StreamTeeTest.Write (1715 of 1909)
PASS: lldb-unit :: Utility/Release/UtilityTests/StreamTest.AddressPrefix (1716 of 1909)
PASS: lldb-unit :: Utility/Release/UtilityTests/StreamTest.AddressNoSuffix (1717 of 1909)
PASS: lldb-unit :: Utility/Release/UtilityTests/StreamTeeTest.SetStreamAtIndexOverwrite (1718 of 1909)
PASS: lldb-unit :: Utility/Release/UtilityTests/StreamTest.AddressEmptyPrefix (1719 of 1909)
PASS: lldb-unit :: Utility/Release/UtilityTests/StreamTest.AddressRangeEmptyRange (1720 of 1909)
PASS: lldb-unit :: Utility/Release/UtilityTests/StreamTest.AddressPrefixAndSuffix (1721 of 1909)
PASS: lldb-unit :: Utility/Release/UtilityTests/StreamTest.AddressRangeSize (1722 of 1909)
PASS: lldb-unit :: Utility/Release/UtilityTests/StreamTest.AddressRangeInvalidRange (1723 of 1909)
PASS: lldb-unit :: Utility/Release/UtilityTests/StreamTest.AddressRange (1724 of 1909)
PASS: lldb-unit :: Utility/Release/UtilityTests/StreamTest.PutBytesAsRawHex8ToBigEndian (1725 of 1909)
PASS: lldb-unit :: Utility/Release/UtilityTests/StreamTest.ChangingByteOrder (1726 of 1909)
PASS: lldb-unit :: Utility/Release/UtilityTests/StreamTest.AddressSuffix (1727 of 1909)
PASS: lldb-unit :: Utility/Release/UtilityTests/StreamTest.PutBytesAsRawHex8ToLittleEndian (1728 of 1909)
PASS: lldb-unit :: Utility/Release/UtilityTests/StreamTest.AddressSize (1729 of 1909)
PASS: lldb-unit :: Utility/Release/UtilityTests/StreamTest.PutChar (1730 of 1909)
PASS: lldb-unit :: Utility/Release/UtilityTests/StreamTest.PutCStringWithStringRef (1731 of 1909)
PASS: lldb-unit :: Utility/Release/UtilityTests/StreamTest.PutBytesAsRawHex8ToMixedEndian (1732 of 1909)
PASS: lldb-unit :: Utility/Release/UtilityTests/StreamTest.PutCString (1733 of 1909)
PASS: lldb-unit :: Utility/Release/UtilityTests/StreamTest.PutCharNull (1734 of 1909)
PASS: lldb-unit :: Utility/Release/UtilityTests/StreamTest.PutCharWhitespace (1735 of 1909)
PASS: lldb-unit :: Utility/Release/UtilityTests/StreamTest.PutHex16ByteOrderLittle (1736 of 1909)
PASS: lldb-unit :: Utility/Release/UtilityTests/StreamTest.PutHex16ByteOrderBig (1737 of 1909)
PASS: lldb-unit :: Utility/Release/UtilityTests/StreamTest.PutHex32ByteOrderBig (1738 of 1909)
PASS: lldb-unit :: Utility/Release/UtilityTests/StreamTest.PutHex32ByteOrderLittle (1739 of 1909)
PASS: lldb-unit :: Utility/Release/UtilityTests/StreamTest.PutHex64ByteOrderLittle (1740 of 1909)
PASS: lldb-unit :: Utility/Release/UtilityTests/StreamTest.PutHex64ByteOrderBig (1741 of 1909)
PASS: lldb-unit :: Utility/Release/UtilityTests/StreamTest.PutHex8 (1742 of 1909)
PASS: lldb-unit :: Utility/Release/UtilityTests/StreamTest.PutMaxHex64ByteOrderBig (1743 of 1909)
PASS: lldb-unit :: Utility/Release/UtilityTests/StreamTest.PutMaxHex64ByteOrderLittle (1744 of 1909)
PASS: lldb-unit :: Utility/Release/UtilityTests/StreamTest.PutRawBytesToMixedEndian (1745 of 1909)
PASS: lldb-unit :: Utility/Release/UtilityTests/StreamTest.PutPtr (1746 of 1909)
PASS: lldb-unit :: Utility/Release/UtilityTests/StreamTest.PutRawBytesToLittleEndian (1747 of 1909)
PASS: lldb-unit :: Utility/Release/UtilityTests/StreamTest.PutNHex8 (1748 of 1909)
PASS: lldb-unit :: Utility/Release/UtilityTests/StreamTest.PutRawBytesToBigEndian (1749 of 1909)
PASS: lldb-unit :: Utility/Release/UtilityTests/StreamTest.PutSLEB128 (1750 of 1909)
PASS: lldb-unit :: Utility/Release/UtilityTests/StreamTest.PutStringAsRawHex8 (1751 of 1909)
PASS: lldb-unit :: Utility/Release/UtilityTests/StreamTest.PutULEB128 (1752 of 1909)
PASS: lldb-unit :: Utility/Release/UtilityTests/StreamTest.QuotedCString (1753 of 1909)
PASS: lldb-unit :: Utility/Release/UtilityTests/StreamTest.ShiftOperatorChars (1754 of 1909)
PASS: lldb-unit :: Utility/Release/UtilityTests/StringExtractorTest.DecodeHexU8_Exact (1755 of 1909)
PASS: lldb-unit :: Utility/Release/UtilityTests/StreamTest.ShiftOperatorStrings (1756 of 1909)
PASS: lldb-unit :: Utility/Release/UtilityTests/StringExtractorTest.DecodeHexU8_Extra (1757 of 1909)
PASS: lldb-unit :: Utility/Release/UtilityTests/StringExtractorTest.DecodeHexU8_InvalidHex (1758 of 1909)
PASS: lldb-unit :: Utility/Release/UtilityTests/StreamTest.ShiftOperatorPtr (1759 of 1909)
PASS: lldb-unit :: Utility/Release/UtilityTests/StringExtractorTest.DecodeHexU8_Underflow2 (1760 of 1909)
PASS: lldb-unit :: Utility/Release/UtilityTests/StringExtractorTest.DecodeHexU8_InvalidHex2 (1761 of 1909)
PASS: lldb-unit :: Utility/Release/UtilityTests/StringExtractorTest.DecodeHexU8_Underflow (1762 of 1909)
PASS: lldb-unit :: Utility/Release/UtilityTests/StringExtractorTest.GetHexBytes (1763 of 1909)
PASS: lldb-unit :: Utility/Release/UtilityTests/StringExtractorTest.GetHexBytesAvail (1764 of 1909)
PASS: lldb-unit :: Utility/Release/UtilityTests/StringExtractorTest.GetHexBytesAvail_OddPair (1765 of 1909)
PASS: lldb-unit :: Utility/Release/UtilityTests/StringExtractorTest.GetHexBytesAvail_OddPair2 (1766 of 1909)
PASS: lldb-unit :: Utility/Release/UtilityTests/StringExtractorTest.GetHexBytesAvail_FullString (1767 of 1909)
PASS: lldb-unit :: Utility/Release/UtilityTests/StringExtractorTest.GetHexBytesAvail_Partial (1768 of 1909)
PASS: lldb-unit :: Utility/Release/UtilityTests/StringExtractorTest.GetHexBytesAvail_Underflow (1769 of 1909)
PASS: lldb-unit :: Utility/Release/UtilityTests/StringExtractorTest.GetHexBytes_OddPair (1770 of 1909)
PASS: lldb-unit :: Utility/Release/UtilityTests/StringExtractorTest.GetHexBytes_FullString (1771 of 1909)
PASS: lldb-unit :: Utility/Release/UtilityTests/StringExtractorTest.GetHexBytes_Underflow (1772 of 1909)
PASS: lldb-unit :: Utility/Release/UtilityTests/StringExtractorTest.GetHexBytes_OddPair2 (1773 of 1909)
PASS: lldb-unit :: Utility/Release/UtilityTests/StringExtractorTest.GetHexBytes_Partial (1774 of 1909)
PASS: lldb-unit :: Utility/Release/UtilityTests/StringExtractorTest.GetHexU8_Exact (1775 of 1909)
PASS: lldb-unit :: Utility/Release/UtilityTests/StringExtractorTest.GetHexU8_Exact_NoEof (1776 of 1909)
PASS: lldb-unit :: Utility/Release/UtilityTests/StringExtractorTest.GetHexU8_Extra (1777 of 1909)
PASS: lldb-unit :: Utility/Release/UtilityTests/StringExtractorTest.GetHexU8_Extra_NoEof (1778 of 1909)
PASS: lldb-unit :: Utility/Release/UtilityTests/StringExtractorTest.GetHexU8_InvalidHex (1779 of 1909)
PASS: lldb-unit :: Utility/Release/UtilityTests/StringExtractorTest.GetHexU8_InvalidHex_NoEof (1780 of 1909)
PASS: lldb-unit :: Utility/Release/UtilityTests/StringExtractorTest.GetHexU8_Underflow (1781 of 1909)
PASS: lldb-unit :: Utility/Release/UtilityTests/StringExtractorTest.GetHexU8_Underflow_NoEof (1782 of 1909)
PASS: lldb-unit :: Utility/Release/UtilityTests/StringExtractorTest.GetHexU8_Underflow2_NoEof (1783 of 1909)
PASS: lldb-unit :: Utility/Release/UtilityTests/StringExtractorTest.GetHexU8_Underflow2 (1784 of 1909)
PASS: lldb-unit :: Utility/Release/UtilityTests/StringExtractorTest.GetNameColonValueNoSemicolon (1785 of 1909)
PASS: lldb-unit :: Utility/Release/UtilityTests/StringExtractorTest.GetNameColonValueContainsColon (1786 of 1909)
PASS: lldb-unit :: Utility/Release/UtilityTests/StringExtractorTest.GetNameColonValueNoColon (1787 of 1909)
PASS: lldb-unit :: Utility/Release/UtilityTests/StringExtractorTest.GetNameColonValueSuccess (1788 of 1909)
PASS: lldb-unit :: Utility/Release/UtilityTests/StringExtractorTest.GetU32BigEndian (1789 of 1909)
PASS: lldb-unit :: Utility/Release/UtilityTests/StringExtractorTest.GetU32LittleEndian (1790 of 1909)
PASS: lldb-unit :: Utility/Release/UtilityTests/StringExtractorTest.InitEmpty (1791 of 1909)
PASS: lldb-unit :: Utility/Release/UtilityTests/StringExtractorTest.GetU64BigEndian (1792 of 1909)
PASS: lldb-unit :: Utility/Release/UtilityTests/StringExtractorTest.InitMisc (1793 of 1909)
PASS: lldb-unit :: Utility/Release/UtilityTests/StringExtractorTest.GetU64LittleEndian (1794 of 1909)
PASS: lldb-unit :: Utility/Release/UtilityTests/StringLexerTest.NextIf (1795 of 1909)
PASS: lldb-unit :: Utility/Release/UtilityTests/StringLexerTest.GetUnlexed (1796 of 1909)
PASS: lldb-unit :: Utility/Release/UtilityTests/StringLexerTest.HasAtLeast (1797 of 1909)
PASS: lldb-unit :: Utility/Release/UtilityTests/StringLexerTest.Next (1798 of 1909)
PASS: lldb-unit :: Utility/Release/UtilityTests/StringLexerTest.AdvanceIf (1799 of 1909)
PASS: lldb-unit :: Utility/Release/UtilityTests/StringListTest.AppendList (1800 of 1909)
PASS: lldb-unit :: Utility/Release/UtilityTests/StringLexerTest.PutBack (1801 of 1909)
PASS: lldb-unit :: Utility/Release/UtilityTests/StringLexerTest.NextIfList (1802 of 1909)
PASS: lldb-unit :: Utility/Release/UtilityTests/StringLexerTest.Peek (1803 of 1909)
PASS: lldb-unit :: Utility/Release/UtilityTests/StringListTest.AppendListCStringArray (1804 of 1909)
PASS: lldb-unit :: Utility/Release/UtilityTests/StringListTest.AppendListCStringArrayEmpty (1805 of 1909)
PASS: lldb-unit :: Utility/Release/UtilityTests/StringListTest.AppendStringMove (1806 of 1909)
PASS: lldb-unit :: Utility/Release/UtilityTests/StringListTest.AppendStringCString (1807 of 1909)
PASS: lldb-unit :: Utility/Release/UtilityTests/StringListTest.Assignment (1808 of 1909)
PASS: lldb-unit :: Utility/Release/UtilityTests/StringListTest.AppendStringStdString (1809 of 1909)
PASS: lldb-unit :: Utility/Release/UtilityTests/StringListTest.CopyListEmpty (1810 of 1909)
PASS: lldb-unit :: Utility/Release/UtilityTests/StringListTest.DefaultConstructor (1811 of 1909)
PASS: lldb-unit :: Utility/Release/UtilityTests/StringListTest.Clear (1812 of 1909)
PASS: lldb-unit :: Utility/Release/UtilityTests/StringListTest.CopyList (1813 of 1909)
PASS: lldb-unit :: Utility/Release/UtilityTests/StringListTest.CopyListSingle (1814 of 1909)
PASS: lldb-unit :: Utility/Release/UtilityTests/StringListTest.ForRange (1815 of 1909)
PASS: lldb-unit :: Utility/Release/UtilityTests/StringListTest.GetMaxStringLengthDecreasingSize (1816 of 1909)
PASS: lldb-unit :: Utility/Release/UtilityTests/StringListTest.ForRangeEmpty (1817 of 1909)
PASS: lldb-unit :: Utility/Release/UtilityTests/StringListTest.GetMaxStringLengthEmpty (1818 of 1909)
PASS: lldb-unit :: Utility/Release/UtilityTests/StringListTest.GetMaxStringLengthEqualSize (1819 of 1909)
PASS: lldb-unit :: Utility/Release/UtilityTests/StringListTest.GetMaxStringLengthIncreasingSize (1820 of 1909)
PASS: lldb-unit :: Utility/Release/UtilityTests/StringListTest.GetMaxStringLengthMixed (1821 of 1909)
PASS: lldb-unit :: Utility/Release/UtilityTests/StringListTest.InsertStringAtIndexMove (1822 of 1909)
PASS: lldb-unit :: Utility/Release/UtilityTests/StringListTest.GetSize (1823 of 1909)
PASS: lldb-unit :: Utility/Release/UtilityTests/StringListTest.InsertStringAtIndexEnd (1824 of 1909)
PASS: lldb-unit :: Utility/Release/UtilityTests/StringListTest.InsertStringAtIndexStdString (1825 of 1909)
PASS: lldb-unit :: Utility/Release/UtilityTests/StringListTest.JoinMultiCharSeparator (1826 of 1909)
PASS: lldb-unit :: Utility/Release/UtilityTests/StringListTest.InsertStringAtIndexStart (1827 of 1909)
PASS: lldb-unit :: Utility/Release/UtilityTests/StringListTest.InsertStringAtIndexOutOfBounds (1828 of 1909)
PASS: lldb-unit :: Utility/Release/UtilityTests/StringListTest.LongestCommonPrefix (1829 of 1909)
PASS: lldb-unit :: Utility/Release/UtilityTests/StringListTest.JoinEmpty (1830 of 1909)
PASS: lldb-unit :: Utility/Release/UtilityTests/StringListTest.Join (1831 of 1909)
PASS: lldb-unit :: Utility/Release/UtilityTests/StringListTest.JoinNonSpace (1832 of 1909)
PASS: lldb-unit :: Utility/Release/UtilityTests/StringListTest.JoinSingle (1833 of 1909)
PASS: lldb-unit :: Utility/Release/UtilityTests/StringListTest.JoinThree (1834 of 1909)
PASS: lldb-unit :: Utility/Release/UtilityTests/StringListTest.LongestCommonPrefixDuplicateElement (1835 of 1909)
PASS: lldb-unit :: Utility/Release/UtilityTests/StringListTest.LongestCommonPrefixEmpty (1836 of 1909)
PASS: lldb-unit :: Utility/Release/UtilityTests/StringListTest.SetSize (1837 of 1909)
PASS: lldb-unit :: Utility/Release/UtilityTests/StringListTest.ShiftCString (1838 of 1909)
PASS: lldb-unit :: Utility/Release/UtilityTests/StringListTest.LongestCommonPrefixSingleElement (1839 of 1909)
PASS: lldb-unit :: Utility/Release/UtilityTests/StringListTest.ShiftStdString (1840 of 1909)
PASS: lldb-unit :: Utility/Release/UtilityTests/StringListTest.PopBack (1841 of 1909)
PASS: lldb-unit :: Utility/Release/UtilityTests/StringListTest.ShiftMove (1842 of 1909)
PASS: lldb-unit :: Utility/Release/UtilityTests/StringListTest.LongestCommonPrefixNoPrefix (1843 of 1909)
PASS: lldb-unit :: Utility/Release/UtilityTests/StringListTest.RemoveBlankLines (1844 of 1909)
PASS: lldb-unit :: Utility/Release/UtilityTests/StringListTest.SplitIntoLines (1845 of 1909)
PASS: lldb-unit :: Utility/Release/UtilityTests/StringListTest.SplitIntoLinesSingleTrailingCR (1846 of 1909)
PASS: lldb-unit :: Utility/Release/UtilityTests/StringListTest.SplitIntoLinesEmpty (1847 of 1909)
PASS: lldb-unit :: Utility/Release/UtilityTests/StructuredDataTest.ParseJSONFromFile (1848 of 1909)
PASS: lldb-unit :: Utility/Release/UtilityTests/StructuredDataTest.StringDump (1849 of 1909)
PASS: lldb-unit :: Utility/Release/UtilityTests/SubsystemRAIITest.NormalSubsystem (1850 of 1909)
PASS: lldb-unit :: Utility/Release/UtilityTests/SubsystemRAIITest.SubsystemWithErrorSuccess (1851 of 1909)
PASS: lldb-unit :: Utility/Release/UtilityTests/SubsystemRAIITest.SubsystemWithErrorFailure (1852 of 1909)
PASS: lldb-unit :: Utility/Release/UtilityTests/TildeExpressionResolver.ResolveFullPath (1853 of 1909)
PASS: lldb-unit :: Utility/Release/UtilityTests/TimeoutTest.Construction (1854 of 1909)
PASS: lldb-unit :: Utility/Release/UtilityTests/TimeoutTest.Format (1855 of 1909)
PASS: lldb-unit :: Utility/Release/UtilityTests/UUIDTest.StringConverion (1856 of 1909)
PASS: lldb-unit :: Utility/Release/UtilityTests/UUIDTest.SetFromStringRef (1857 of 1909)
PASS: lldb-unit :: Utility/Release/UtilityTests/UUIDTest.RelationalOperators (1858 of 1909)
PASS: lldb-unit :: Utility/Release/UtilityTests/UUIDTest.Validity (1859 of 1909)
PASS: lldb-unit :: Utility/Release/UtilityTests/UriParserTest.BadPort (1860 of 1909)
PASS: lldb-unit :: Utility/Release/UtilityTests/TimerTest.CategoryTimes (1861 of 1909)
PASS: lldb-unit :: Utility/Release/UtilityTests/UriParserTest.BadPort2 (1862 of 1909)
PASS: lldb-unit :: Utility/Release/UtilityTests/UriParserTest.BracketedHostnameWithColon (1863 of 1909)
PASS: lldb-unit :: Utility/Release/UtilityTests/UriParserTest.Empty (1864 of 1909)
PASS: lldb-unit :: Utility/Release/UtilityTests/UriParserTest.LongPath (1865 of 1909)
PASS: lldb-unit :: Utility/Release/UtilityTests/UriParserTest.BracketedHostnamePort (1866 of 1909)
PASS: lldb-unit :: Utility/Release/UtilityTests/UriParserTest.BracketedHostname (1867 of 1909)
PASS: lldb-unit :: Utility/Release/UtilityTests/TimerTest.CategoryTimesNested (1868 of 1909)
PASS: lldb-unit :: Utility/Release/UtilityTests/UriParserTest.Minimal (1869 of 1909)
PASS: lldb-unit :: Utility/Release/UtilityTests/UriParserTest.MinimalPath (1870 of 1909)
PASS: lldb-unit :: Utility/Release/UtilityTests/UriParserTest.MinimalPort (1871 of 1909)
PASS: lldb-unit :: Utility/Release/UtilityTests/UriParserTest.SchemeHostSeparator2 (1872 of 1909)
PASS: lldb-unit :: Utility/Release/UtilityTests/UriParserTest.MinimalPortPath (1873 of 1909)
PASS: lldb-unit :: Utility/Release/UtilityTests/UriParserTest.PortOverflow (1874 of 1909)
PASS: lldb-unit :: Utility/Release/UtilityTests/UriParserTest.SchemeHostSeparator (1875 of 1909)
PASS: lldb-unit :: Utility/Release/UtilityTests/UriParserTest.SchemeHostSeparator3 (1876 of 1909)
PASS: lldb-unit :: Utility/Release/UtilityTests/UriParserTest.SchemeHostSeparator4 (1877 of 1909)
PASS: lldb-unit :: Utility/Release/UtilityTests/UriParserTest.TypicalPortPath (1878 of 1909)
PASS: lldb-unit :: Utility/Release/UtilityTests/UserIDResolver.GetGroupName (1879 of 1909)
PASS: lldb-unit :: Utility/Release/UtilityTests/VASprintfTest.BufferResize (1880 of 1909)
PASS: lldb-unit :: Utility/Release/UtilityTests/UserIDResolver.GetUserName (1881 of 1909)
PASS: lldb-unit :: Utility/Release/UtilityTests/VASprintfTest.EncodingError (1882 of 1909)
PASS: lldb-unit :: Utility/Release/UtilityTests/VASprintfTest.NoBufferResize (1883 of 1909)
PASS: lldb-unit :: Utility/Release/UtilityTests/VMRange.Clear (1884 of 1909)
PASS: lldb-unit :: Utility/Release/UtilityTests/VMRange.CollectionContains (1885 of 1909)
PASS: lldb-unit :: Utility/Release/UtilityTests/VMRange.ContainsAddr (1886 of 1909)
PASS: lldb-unit :: Utility/Release/UtilityTests/VMRange.ContainsRange (1887 of 1909)
PASS: lldb-unit :: Utility/Release/UtilityTests/VMRange.Comparison (1888 of 1909)
PASS: lldb-unit :: Utility/Release/UtilityTests/VMRange.Ordering (1889 of 1909)
PASS: lldb-unit :: Utility/Release/UtilityTests/VMRange.Reset (1890 of 1909)
PASS: lldb-unit :: Utility/Release/UtilityTests/VMRange.IsValid (1891 of 1909)
PASS: lldb-unit :: Utility/Release/UtilityTests/VMRange.SetEndAddress (1892 of 1909)
PASS: lldb-unit :: debugserver/Release/debugserverTests/JSON.Parse (1893 of 1909)
PASS: lldb-unit :: debugserver/Release/debugserverTests/RNBSocket.LoopBackConnectIPv4 (1894 of 1909)
PASS: lldb-unit :: debugserver/Release/debugserverTests/RNBSocket.LoopBackListenIPv4 (1895 of 1909)
PASS: lldb-unit :: debugserver/Release/debugserverTests/RNBSocket.LoopBackListenIPv6 (1896 of 1909)
PASS: lldb-unit :: debugserver/Release/debugserverTests/RNBSocket.AnyListen (1897 of 1909)
PASS: lldb-unit :: debugserver/Release/debugserverTests/RNBSocket.LoopBackConnectIPv6 (1898 of 1909)
PASS: lldb-unit :: Utility/Release/UtilityTests/TimerTest.CategoryTimes2 (1899 of 1909)
PASS: lldb-unit :: Utility/Release/UtilityTests/TimerTest.CategoryTimesStats (1900 of 1909)
PASS: lldb-unit :: tools/lldb-server/tests/Release/LLDBServerTests/TestBase.DebugserverEnv (1901 of 1909)
PASS: lldb-unit :: tools/lldb-server/tests/Release/LLDBServerTests/TestBase.LaunchModePreservesEnvironment (1902 of 1909)
PASS: lldb-unit :: tools/lldb-server/tests/Release/LLDBServerTests/StandardStartupTest.TestStopReplyContainsThreadPcs (1903 of 1909)
PASS: lldb-api :: types/TestIntegerTypeExpr.py (1904 of 1909)
PASS: lldb-unit :: Process/gdb-remote/Release/ProcessGdbRemoteTests/GDBRemoteClientBaseTest.InterruptNoResponse (1905 of 1909)
PASS: lldb-api :: types/TestShortTypeExpr.py (1906 of 1909)
PASS: lldb-api :: types/TestLongTypes.py (1907 of 1909)
PASS: lldb-api :: types/TestLongTypesExpr.py (1908 of 1909)
PASS: lldb-api :: tools/lldb-server/TestLldbGdbServer.py (1909 of 1909)

Hide Details

Testing Time: 372.86s ******************** Failing Tests (2): lldb-shell :: ObjectFile/ELF/PT_LOAD-overlap-PT_TLS.yaml lldb-shell :: ObjectFile/ELF/PT_TLS-overlap-PT_LOAD.yaml

Hide Details

Expected Passes : 1703 Expected Failures : 5 Unsupported Tests : 199 Unexpected Failures: 2 make: *** [/Users/buildslave/jenkins/workspace/lldb-cmake-standalone/lldb-xcode-build/test/CMakeFiles/check-lldb-lit] Error 1

Hide Details

** BUILD FAILED **

Hide Details

Hide Details

The following build commands failed: PhaseScriptExecution CMake\ Rules /Users/buildslave/jenkins/workspace/lldb-cmake-standalone/lldb-xcode-build/test/lldb.build/Release/check-lldb-lit.build/Script-B52132E3A72B469C84A2C70F.sh (1 failure) Command failed: Command '['/usr/bin/env', 'TERM=vt100', '/usr/local/bin/cmake', '--build', '.', '--config', 'Release', '--target', 'check-lldb']' returned non-zero exit status 65. Command: ['/usr/bin/env', 'TERM=vt100', '/usr/local/bin/cmake', '--build', '.', '--config', 'Release', '--target', 'check-lldb'] [Pipeline] } [Pipeline] // timeout [Pipeline] } [Pipeline] // stage [Pipeline] } [Pipeline] // withEnv [Pipeline] } [Pipeline] // node [Pipeline] End of Pipeline ERROR: script returned exit code 1 Finished: FAILURE