FailedConsole Output

Skipping 2,323 KB.. Full Log
e204e23911b1f8bd1463535da40c6e48747a138
  llvm revision 2e204e23911b1f8bd1463535da40c6e48747a138
libstdcxx tests will not be run because: Don't know how to build with libstdcxx on macosx
Skipping following debug info categories: ['dwo']

Hide Details

-- Command Output (stderr): --

Hide Details

Session logs for test failures/errors/unexpected successes will go into directory '/Users/buildslave/jenkins/workspace/lldb-cmake/lldb-build/lldb-test-traces' Change dir to: /Users/buildslave/jenkins/workspace/lldb-cmake/llvm-project/lldb/test/API/functionalities/gdb_remote_client runCmd: settings clear -all output:

Hide Details

runCmd: settings set symbols.enable-external-lookup false output:

Hide Details

runCmd: settings set target.inherit-tcc true output:

Hide Details

runCmd: settings set target.auto-apply-fixits false output:

Hide Details

runCmd: settings set plugin.process.gdb-remote.packet-timeout 60 output:

Hide Details

runCmd: settings set symbols.clang-modules-cache-path "/Users/buildslave/jenkins/workspace/lldb-cmake/lldb-build/lldb-test-build.noindex/module-cache-lldb/lldb-api" output:

Hide Details

runCmd: settings set use-color false output:

Hide Details

runCmd: setting set target.prefer-dynamic-value no-dynamic-values output:

Hide Details

FAIL: LLDB (/Users/buildslave/jenkins/workspace/lldb-cmake/lldb-build/bin/clang-x86_64) :: test (TestThreadSelectionBug.TestThreadSelectionBug) <bound method SBProcess.Kill of <lldb.SBProcess; proxy of <Swig Object of type 'lldb::SBProcess *' at 0x1082cc960> >>: success

Hide Details

Restore dir to: /Users/buildslave/jenkins/workspace/lldb-cmake/lldb-build/tools/lldb/test ====================================================================== FAIL: test (TestThreadSelectionBug.TestThreadSelectionBug) ---------------------------------------------------------------------- Traceback (most recent call last): File "/Users/buildslave/jenkins/workspace/lldb-cmake/llvm-project/lldb/test/API/functionalities/gdb_remote_client/TestThreadSelectionBug.py", line 16, in test process = self.connect(target) File "/Users/buildslave/jenkins/workspace/lldb-cmake/llvm-project/lldb/test/API/functionalities/gdb_remote_client/gdbclientutils.py", line 533, in connect self.assertTrue(error.Success(), error.description) AssertionError: False is not True : failed to get reply to handshake packet Config=x86_64-/Users/buildslave/jenkins/workspace/lldb-cmake/lldb-build/bin/clang ---------------------------------------------------------------------- Ran 1 test in 105.650s

Hide Details

RESULT: FAILED (0 passes, 1 failures, 0 errors, 0 skipped, 0 expected failures, 0 unexpected successes)

Hide Details

--

Hide Details

******************** PASS: lldb-unit :: Core/./LLDBCoreTests/ModuleSpecTest.TestCOFFFile (1160 of 2178) PASS: lldb-api :: lang/objc/global_ptrs/TestGlobalObjects.py (1161 of 2178) PASS: lldb-api :: functionalities/set-data/TestSetData.py (1162 of 2178) PASS: lldb-unit :: Utility/./UtilityTests/StreamTeeTest.Flush (1163 of 2178) PASS: lldb-unit :: Utility/./UtilityTests/ScalarTest.Comparison (1164 of 2178) PASS: lldb-shell :: ObjectFile/ELF/PT_LOAD-empty.yaml (1165 of 2178) PASS: lldb-api :: lang/c/vla/TestVLA.py (1166 of 2178) PASS: lldb-shell :: Settings/TestDisableColor.test (1167 of 2178) PASS: lldb-api :: functionalities/breakpoint/breakpoint_command/TestBreakpointCommand.py (1168 of 2178) PASS: lldb-api :: functionalities/data-formatter/data-formatter-globals/TestDataFormatterGlobals.py (1169 of 2178) PASS: lldb-api :: functionalities/breakpoint/source_regexp/TestSourceRegexBreakpoints.py (1170 of 2178) PASS: lldb-shell :: SymbolFile/DWARF/debug-types-signature-loop.s (1171 of 2178) PASS: lldb-unit :: ScriptInterpreter/Python/./ScriptInterpreterPythonTests/PythonDataObjectsTest.TestPythonTupleInitializerList2 (1172 of 2178) UNSUPPORTED: lldb-api :: functionalities/darwin_log/filter/regex/message/TestDarwinLogFilterRegexMessage.py (1173 of 2178) PASS: lldb-api :: commands/expression/char/TestExprsChar.py (1174 of 2178) PASS: lldb-unit :: Utility/./UtilityTests/BinaryStreamTest.PutSLEB128Zero (1175 of 2178) UNSUPPORTED: lldb-shell :: SymbolFile/PDB/func-symbols.test (1176 of 2178) PASS: lldb-unit :: Utility/./UtilityTests/StringLexerTest.NextIfList (1177 of 2178) PASS: lldb-api :: lang/objc/rdar-10967107/TestRdar10967107.py (1178 of 2178) UNSUPPORTED: lldb-shell :: ScriptInterpreter/Lua/convenience_variables.test (1179 of 2178) PASS: lldb-unit :: Interpreter/./InterpreterTests/OptionArgParserTest.toScriptLanguage (1180 of 2178) PASS: lldb-unit :: Symbol/./SymbolTests/TestTypeSystemClang.AddMethodToObjCObjectType (1181 of 2178) PASS: lldb-unit :: SymbolFile/NativePDB/./SymbolFileNativePDBTests/PDBFPOProgramToDWARFExpressionTests.SingleAssignmentRegisterRef (1182 of 2178) PASS: lldb-api :: functionalities/thread/concurrent_events/TestConcurrentBreakpointsDelayedBreakpointOneWatchpoint.py (1183 of 2178) PASS: lldb-unit :: Utility/./UtilityTests/StreamTeeTest.SetStreamAtIndexOverwrite (1184 of 2178) PASS: lldb-unit :: Utility/./UtilityTests/StringListTest.Clear (1185 of 2178) PASS: lldb-shell :: ObjectFile/Breakpad/uuid-matching-mac.test (1186 of 2178) PASS: lldb-unit :: Host/./HostTests/ConnectionFileDescriptorTest.TCPGetURIv6 (1187 of 2178) PASS: lldb-unit :: Utility/./UtilityTests/StringLexerTest.Next (1188 of 2178) PASS: lldb-api :: commands/frame/language/TestGuessLanguage.py (1189 of 2178) PASS: lldb-unit :: Process/gdb-remote/./ProcessGdbRemoteTests/GDBRemoteCommunicationClientTest.WriteRegister (1190 of 2178) PASS: lldb-api :: functionalities/thread/concurrent_events/TestConcurrentTwoWatchpointsOneSignal.py (1191 of 2178) PASS: lldb-api :: commands/target/create-no-such-arch/TestNoSuchArch.py (1192 of 2178) PASS: lldb-unit :: ObjectFile/Breakpad/./ObjectFileBreakpadTests/Record.classify (1193 of 2178) UNSUPPORTED: lldb-shell :: SymbolFile/PDB/compilands.test (1194 of 2178) PASS: lldb-unit :: Utility/./UtilityTests/RegularExpression.Invalid (1195 of 2178) PASS: lldb-unit :: Interpreter/./InterpreterTests/OptionArgParserTest.toChar (1196 of 2178) PASS: lldb-shell :: Settings/TestLineMarkerColor.test (1197 of 2178) PASS: lldb-unit :: Utility/./UtilityTests/LogTest.Unregister (1198 of 2178) PASS: lldb-shell :: SymbolFile/DWARF/dir-separator-posix.s (1199 of 2178) UNSUPPORTED: lldb-api :: tools/lldb-server/TestGdbRemoteCompletion.py (1200 of 2178) PASS: lldb-unit :: Utility/./UtilityTests/BinaryStreamTest.PutSLEB128MaxValue (1201 of 2178) PASS: lldb-unit :: Utility/./UtilityTests/StreamTest.PutNHex8 (1202 of 2178) PASS: lldb-api :: functionalities/step_scripted/TestStepScripted.py (1203 of 2178) PASS: lldb-api :: python_api/watchpoint/watchlocation/TestSetWatchlocation.py (1204 of 2178) PASS: lldb-api :: lang/c/const_variables/TestConstVariables.py (1205 of 2178) PASS: lldb-shell :: SymbolFile/NativePDB/function-types-classes.cpp (1206 of 2178) PASS: lldb-api :: lang/objc/objc-stepping/TestObjCStepping.py (1207 of 2178) PASS: lldb-api :: functionalities/deleted-executable/TestDeletedExecutable.py (1208 of 2178) PASS: lldb-unit :: Utility/./UtilityTests/UriParserTest.BracketedHostnameWithPortIPv6 (1209 of 2178) UNSUPPORTED: lldb-shell :: Reproducer/TestLuaImport.test (1210 of 2178) PASS: lldb-shell :: Register/x86-multithread-read.test (1211 of 2178) PASS: lldb-api :: lang/cpp/overloaded-functions/TestOverloadedFunctions.py (1212 of 2178) PASS: lldb-shell :: ScriptInterpreter/Python/crashlog.test (1213 of 2178) PASS: lldb-unit :: Host/./HostTests/NativeProcessProtocolTest.SetBreakpointFailRead (1214 of 2178) PASS: lldb-api :: commands/expression/namespace_local_var_same_name_obj_c/TestNamespaceLocalVarSameNameObjC.py (1215 of 2178) PASS: lldb-shell :: SymbolFile/DWARF/compilercontext.ll (1216 of 2178) PASS: lldb-api :: lang/cpp/constructors/TestCppConstructors.py (1217 of 2178) PASS: lldb-unit :: Utility/./UtilityTests/BinaryStreamTest.PutULEB128ThreeBytes (1218 of 2178) PASS: lldb-api :: lang/objc/blocks/TestObjCIvarsInBlocks.py (1219 of 2178) PASS: lldb-unit :: Utility/./UtilityTests/ConstStringTest.CompareStringRef (1220 of 2178) PASS: lldb-unit :: Target/./TargetTests/ModuleCacheTest.GetAndPutUuidExists (1221 of 2178) PASS: lldb-shell :: SymbolFile/DWARF/debug-types-line-tables.s (1222 of 2178) PASS: lldb-api :: lang/objc/foundation/TestObjCMethods2.py (1223 of 2178) PASS: lldb-unit :: ScriptInterpreter/Python/./ScriptInterpreterPythonTests/PythonDataObjectsTest.TestPythonString (1224 of 2178) UNSUPPORTED: lldb-api :: commands/expression/call-restarts/TestCallThatRestarts.py (1225 of 2178) PASS: lldb-unit :: Utility/./UtilityTests/StringListTest.GetMaxStringLengthEmpty (1226 of 2178) PASS: lldb-api :: functionalities/data-formatter/data-formatter-objc/TestDataFormatterObjCNSURL.py (1227 of 2178) PASS: lldb-api :: commands/expression/persistent_variables/TestPersistentVariables.py (1228 of 2178) PASS: lldb-unit :: Utility/./UtilityTests/StreamTest.PutRawBytesToBigEndian (1229 of 2178) PASS: lldb-api :: functionalities/abbreviation/TestCommonShortSpellings.py (1230 of 2178) PASS: lldb-unit :: Utility/./UtilityTests/BinaryStreamTest.PutULEB128SevenBytes (1231 of 2178) PASS: lldb-unit :: Language/CPlusPlus/./LanguageCPlusPlusTests/CPlusPlusLanguage.FindAlternateFunctionManglings (1232 of 2178) PASS: lldb-shell :: Driver/TestCommands.test (1233 of 2178) PASS: lldb-shell :: lldb-server/TestErrorMessages.test (1234 of 2178) PASS: lldb-api :: macosx/save_crashlog/TestSaveCrashlog.py (1235 of 2178) PASS: lldb-api :: types/TestShortTypeExpr.py (1236 of 2178) PASS: lldb-shell :: Minidump/Windows/broken-unwind.test (1237 of 2178) PASS: lldb-api :: lang/mixed/TestMixedLanguages.py (1238 of 2178) PASS: lldb-unit :: Utility/./UtilityTests/UserIDResolver.GetUserName (1239 of 2178) PASS: lldb-unit :: UnwindAssembly/x86/./UnwindAssemblyx86Tests/Testx86AssemblyInspectionEngine.TestPushEBX (1240 of 2178) PASS: lldb-unit :: SymbolFile/DWARF/./SymbolFileDWARFTests/SymbolFileDWARFTests.TestAbbrevInvalidNULLTag (1241 of 2178) PASS: lldb-unit :: Symbol/./SymbolTests/TestTypeSystemClang.TestIsClangType (1242 of 2178) PASS: lldb-api :: python_api/frame/TestFrames.py (1243 of 2178) PASS: lldb-unit :: ScriptInterpreter/Python/./ScriptInterpreterPythonTests/PythonDataObjectsTest.TestPythonBoolean (1244 of 2178) PASS: lldb-unit :: Utility/./UtilityTests/StreamTest.PutMaxHex64ByteOrderBig (1245 of 2178) PASS: lldb-unit :: Target/./TargetTests/ExecutionContextTest.GetByteOrderProcess (1246 of 2178) PASS: lldb-unit :: Interpreter/./InterpreterTests/CompletionTest.FileCompletionAbsolute (1247 of 2178) PASS: lldb-api :: functionalities/gdb_remote_client/TestNoWatchpointSupportInfo.py (1248 of 2178) PASS: lldb-unit :: Utility/./UtilityTests/AnsiTerminal.Empty (1249 of 2178) PASS: lldb-shell :: SymbolFile/NativePDB/locate-pdb.cpp (1250 of 2178) PASS: lldb-api :: functionalities/reproducers/attach/TestReproducerAttach.py (1251 of 2178) PASS: lldb-unit :: Target/./TargetTests/MemoryRegionInfoTest.Formatv (1252 of 2178) PASS: lldb-api :: functionalities/breakpoint/inlined_breakpoints/TestInlinedBreakpoints.py (1253 of 2178) PASS: lldb-api :: functionalities/object-file/TestImageListMultiArchitecture.py (1254 of 2178) UNSUPPORTED: lldb-api :: functionalities/darwin_log/source/info/TestDarwinLogSourceInfo.py (1255 of 2178) PASS: lldb-api :: lang/objc/modules-auto-import/TestModulesAutoImport.py (1256 of 2178) PASS: lldb-unit :: UnwindAssembly/x86/./UnwindAssemblyx86Tests/Testx86AssemblyInspectionEngine.Test32BitOnlyInstruction (1257 of 2178) PASS: lldb-unit :: Utility/./UtilityTests/StreamTest.ShiftOperatorStrings (1258 of 2178) PASS: lldb-api :: lang/c/modules/TestCModules.py (1259 of 2178) PASS: lldb-unit :: Utility/./UtilityTests/ArchSpecTest.TestParseMachCPUDashSubtypeTripleSimple (1260 of 2178) PASS: lldb-unit :: API/./APITests/SBCommandInterpreterTest.SingleWordCommand (1261 of 2178) PASS: lldb-shell :: Reproducer/TestDriverOptions.test (1262 of 2178) PASS: lldb-api :: commands/quit/TestQuit.py (1263 of 2178) PASS: lldb-unit :: ScriptInterpreter/Python/./ScriptInterpreterPythonTests/PythonDataObjectsTest.TestExceptions (1264 of 2178) PASS: lldb-unit :: Symbol/./SymbolTests/TestTypeSystemClang.TestGetTypeClassTypeOfExpr (1265 of 2178) PASS: lldb-api :: tools/lldb-vscode/breakpoint/TestVSCode_setBreakpoints.py (1266 of 2178) FAIL: lldb-api :: functionalities/gdb_remote_client/TestGDBRemoteLoad.py (1267 of 2178) ******************** TEST 'lldb-api :: functionalities/gdb_remote_client/TestGDBRemoteLoad.py' FAILED ******************** Script: -- /usr/local/Frameworks/Python.framework/Versions/3.7/bin/python3.7 /Users/buildslave/jenkins/workspace/lldb-cmake/llvm-project/lldb/test/API/dotest.py -S nm -u CXXFLAGS -u CFLAGS --codesign-identity - --arch x86_64 --build-dir /Users/buildslave/jenkins/workspace/lldb-cmake/lldb-build/lldb-test-build.noindex -s=/Users/buildslave/jenkins/workspace/lldb-cmake/test/logs -t --env TERM=vt100 --env LLVM_LIBS_DIR=/Users/buildslave/jenkins/workspace/lldb-cmake/lldb-build/./lib --arch x86_64 --build-dir /Users/buildslave/jenkins/workspace/lldb-cmake/lldb-build/lldb-test-build.noindex -s /Users/buildslave/jenkins/workspace/lldb-cmake/lldb-build/lldb-test-traces --lldb-module-cache-dir /Users/buildslave/jenkins/workspace/lldb-cmake/lldb-build/lldb-test-build.noindex/module-cache-lldb/lldb-api --clang-module-cache-dir /Users/buildslave/jenkins/workspace/lldb-cmake/lldb-build/lldb-test-build.noindex/module-cache-clang/lldb-api --executable /Users/buildslave/jenkins/workspace/lldb-cmake/lldb-build/./bin/lldb --compiler /Users/buildslave/jenkins/workspace/lldb-cmake/lldb-build/./bin/clang --dsymutil /Users/buildslave/jenkins/workspace/lldb-cmake/lldb-build/./bin/dsymutil --filecheck /Users/buildslave/jenkins/workspace/lldb-cmake/lldb-build/./bin/FileCheck --yaml2obj /Users/buildslave/jenkins/workspace/lldb-cmake/lldb-build/./bin/yaml2obj --server /Users/buildslave/jenkins/workspace/lldb-cmake/lldb-build/./bin/debugserver --lldb-libs-dir /Users/buildslave/jenkins/workspace/lldb-cmake/lldb-build/./lib /Users/buildslave/jenkins/workspace/lldb-cmake/llvm-project/lldb/test/API/functionalities/gdb_remote_client -p TestGDBRemoteLoad.py -- Exit Code: 1

Hide Details

Command Output (stdout): -- lldb version 12.0.99 (http://labmaster3.local/git/llvm-project.git revision 2e204e23911b1f8bd1463535da40c6e48747a138) clang revision 2e204e23911b1f8bd1463535da40c6e48747a138 llvm revision 2e204e23911b1f8bd1463535da40c6e48747a138 libstdcxx tests will not be run because: Don't know how to build with libstdcxx on macosx Skipping following debug info categories: ['dwo']

Hide Details

-- Command Output (stderr): --

Hide Details

Session logs for test failures/errors/unexpected successes will go into directory '/Users/buildslave/jenkins/workspace/lldb-cmake/lldb-build/lldb-test-traces' Change dir to: /Users/buildslave/jenkins/workspace/lldb-cmake/llvm-project/lldb/test/API/functionalities/gdb_remote_client runCmd: settings clear -all output:

Hide Details

runCmd: settings set symbols.enable-external-lookup false output:

Hide Details

runCmd: settings set target.inherit-tcc true output:

Hide Details

runCmd: settings set target.auto-apply-fixits false output:

Hide Details

runCmd: settings set plugin.process.gdb-remote.packet-timeout 60 output:

Hide Details

runCmd: settings set symbols.clang-modules-cache-path "/Users/buildslave/jenkins/workspace/lldb-cmake/lldb-build/lldb-test-build.noindex/module-cache-lldb/lldb-api" output:

Hide Details

runCmd: settings set use-color false output:

Hide Details

runCmd: setting set target.prefer-dynamic-value no-dynamic-values output:

Hide Details

FAIL: LLDB (/Users/buildslave/jenkins/workspace/lldb-cmake/lldb-build/bin/clang-x86_64) :: test_flash_load (TestGDBRemoteLoad.TestGDBRemoteLoad) <bound method SBProcess.Kill of <lldb.SBProcess; proxy of <Swig Object of type 'lldb::SBProcess *' at 0x105fc79f0> >>: success

Hide Details

runCmd: settings clear -all output:

Hide Details

runCmd: settings set symbols.enable-external-lookup false output:

Hide Details

runCmd: settings set target.inherit-tcc true output:

Hide Details

runCmd: settings set target.auto-apply-fixits false output:

Hide Details

runCmd: settings set plugin.process.gdb-remote.packet-timeout 60 output:

Hide Details

runCmd: settings set symbols.clang-modules-cache-path "/Users/buildslave/jenkins/workspace/lldb-cmake/lldb-build/lldb-test-build.noindex/module-cache-lldb/lldb-api" output:

Hide Details

runCmd: settings set use-color false output:

Hide Details

runCmd: setting set target.prefer-dynamic-value no-dynamic-values output:

Hide Details

<bound method SBProcess.Kill of <lldb.SBProcess; proxy of <Swig Object of type 'lldb::SBProcess *' at 0x105e70c90> >>: success

Hide Details

PASS: LLDB (/Users/buildslave/jenkins/workspace/lldb-cmake/lldb-build/bin/clang-x86_64) :: test_module_load_address (TestGDBRemoteLoad.TestGDBRemoteLoad) runCmd: settings clear -all output:

Hide Details

runCmd: settings set symbols.enable-external-lookup false output:

Hide Details

runCmd: settings set target.inherit-tcc true output:

Hide Details

runCmd: settings set target.auto-apply-fixits false output:

Hide Details

runCmd: settings set plugin.process.gdb-remote.packet-timeout 60 output:

Hide Details

runCmd: settings set symbols.clang-modules-cache-path "/Users/buildslave/jenkins/workspace/lldb-cmake/lldb-build/lldb-test-build.noindex/module-cache-lldb/lldb-api" output:

Hide Details

runCmd: settings set use-color false output:

Hide Details

runCmd: setting set target.prefer-dynamic-value no-dynamic-values output:

Hide Details

<bound method SBProcess.Kill of <lldb.SBProcess; proxy of <Swig Object of type 'lldb::SBProcess *' at 0x105fc7a50> >>: success

Hide Details

PASS: LLDB (/Users/buildslave/jenkins/workspace/lldb-cmake/lldb-build/bin/clang-x86_64) :: test_ram_load (TestGDBRemoteLoad.TestGDBRemoteLoad) Restore dir to: /Users/buildslave/jenkins/workspace/lldb-cmake/lldb-build/tools/lldb/test ====================================================================== FAIL: test_flash_load (TestGDBRemoteLoad.TestGDBRemoteLoad) Test loading an object file to a target's flash memory ---------------------------------------------------------------------- Traceback (most recent call last): File "/Users/buildslave/jenkins/workspace/lldb-cmake/llvm-project/lldb/test/API/functionalities/gdb_remote_client/TestGDBRemoteLoad.py", line 67, in test_flash_load process = self.connect(target) File "/Users/buildslave/jenkins/workspace/lldb-cmake/llvm-project/lldb/test/API/functionalities/gdb_remote_client/gdbclientutils.py", line 533, in connect self.assertTrue(error.Success(), error.description) AssertionError: False is not True : failed to get reply to handshake packet Config=x86_64-/Users/buildslave/jenkins/workspace/lldb-cmake/lldb-build/bin/clang ---------------------------------------------------------------------- Ran 3 tests in 106.459s

Hide Details

RESULT: FAILED (2 passes, 1 failures, 0 errors, 0 skipped, 0 expected failures, 0 unexpected successes)

Hide Details

--

Hide Details

******************** PASS: lldb-api :: commands/target/create-deps/TestTargetCreateDeps.py (1268 of 2178) PASS: lldb-unit :: Utility/./UtilityTests/StringListTest.Assignment (1269 of 2178) PASS: lldb-shell :: SymbolFile/DWARF/debug_loc-aslr.s (1270 of 2178) PASS: lldb-api :: functionalities/type_completion/TestTypeCompletion.py (1271 of 2178) UNSUPPORTED: lldb-shell :: ScriptInterpreter/Lua/lua-python.test (1272 of 2178) PASS: lldb-unit :: Utility/./UtilityTests/ScalarTest.ComparisonFloat (1273 of 2178) PASS: lldb-shell :: Minidump/breakpad-symbols.test (1274 of 2178) PASS: lldb-unit :: Utility/./UtilityTests/ArgsTest.TestArgv (1275 of 2178) PASS: lldb-api :: functionalities/data-formatter/data-formatter-stl/libcxx/string/TestDataFormatterLibcxxString.py (1276 of 2178) PASS: lldb-shell :: ExecControl/StopHook/stop-hook.test (1277 of 2178) PASS: lldb-unit :: UnwindAssembly/x86/./UnwindAssemblyx86Tests/Testx86AssemblyInspectionEngine.TestPushImm (1278 of 2178) PASS: lldb-shell :: SymbolFile/DWARF/static_scope.s (1279 of 2178) PASS: lldb-unit :: Utility/./UtilityTests/DataExtractorTest.GetMaxU64_unchecked (1280 of 2178) PASS: lldb-unit :: Utility/./UtilityTests/ScalarTest.TruncOrExtendTo (1281 of 2178) PASS: lldb-api :: functionalities/data-formatter/format-propagation/TestFormatPropagation.py (1282 of 2178) PASS: lldb-api :: functionalities/data-formatter/data-formatter-stl/libcxx/set/TestDataFormatterLibcxxSet.py (1283 of 2178) PASS: lldb-unit :: Expression/./ExpressionTests/CppModuleConfigurationTest.LinuxLocalLibCpp (1284 of 2178) PASS: lldb-unit :: Utility/./UtilityTests/NameMatchesTest.EndsWith (1285 of 2178) PASS: lldb-unit :: Utility/./UtilityTests/RangeTest.EqualInvalid (1286 of 2178) PASS: lldb-api :: functionalities/pointer_num_children/TestPointerNumChildren.py (1287 of 2178) PASS: lldb-shell :: Reproducer/TestPythonImport.test (1288 of 2178) PASS: lldb-unit :: Utility/./UtilityTests/DataExtractorTest.GetMaxU64 (1289 of 2178) PASS: lldb-unit :: Symbol/./SymbolTests/TestTypeSystemClang.TestRemoveFastQualifiers (1290 of 2178) PASS: lldb-api :: commands/expression/weak_symbols/TestWeakSymbols.py (1291 of 2178) PASS: lldb-api :: functionalities/thread/exit_during_step/TestExitDuringStep.py (1292 of 2178) PASS: lldb-api :: commands/expression/import-std-module/list-dbg-info-content/TestDbgInfoContentListFromStdModule.py (1293 of 2178) PASS: lldb-api :: tools/lldb-server/inferior-crash/TestGdbRemoteAbort.py (1294 of 2178) PASS: lldb-unit :: SymbolFile/DWARF/./SymbolFileDWARFTests/SymbolFileDWARFTests.TestAbbrevValidAttrNullForm (1295 of 2178) PASS: lldb-unit :: Utility/./UtilityTests/LogChannelEnabledTest.LogThread (1296 of 2178) PASS: lldb-unit :: ObjectFile/Breakpad/./ObjectFileBreakpadTests/ModuleRecord.parse (1297 of 2178) PASS: lldb-unit :: SymbolFile/DWARF/./SymbolFileDWARFTests/SymbolFileDWARFTests.ParseArangesNonzeroSegmentSize (1298 of 2178) PASS: lldb-unit :: Utility/./UtilityTests/StringExtractorTest.GetHexBytes_FullString (1299 of 2178) PASS: lldb-shell :: ObjectFile/Breakpad/sections.test (1300 of 2178) PASS: lldb-unit :: SymbolFile/DWARF/./SymbolFileDWARFTests/SymbolFileDWARFTests.TestAbbrevOrder1Start1 (1301 of 2178) XFAIL: lldb-shell :: Register/x86-64-fp-write.test (1302 of 2178) PASS: lldb-unit :: Utility/./UtilityTests/SerializationRountripTest.SerializeDeserializeCStringNull (1303 of 2178) UNSUPPORTED: lldb-api :: functionalities/unwind/standard/TestStandardUnwind.py (1304 of 2178) PASS: lldb-shell :: SymbolFile/DWARF/gnu-style-compression.cpp (1305 of 2178) PASS: lldb-api :: commands/expression/argument_passing_restrictions/TestArgumentPassingRestrictions.py (1306 of 2178) PASS: lldb-shell :: SymbolFile/NativePDB/ast-functions.cpp (1307 of 2178) PASS: lldb-unit :: Utility/./UtilityTests/DataExtractorTest.GetSLEB128_bit63 (1308 of 2178) PASS: lldb-api :: functionalities/data-formatter/data-formatter-objc/TestDataFormatterObjCNSData.py (1309 of 2178) PASS: lldb-unit :: ScriptInterpreter/Python/./ScriptInterpreterPythonTests/PythonDataObjectsTest.TestScript (1310 of 2178) PASS: lldb-api :: commands/target/stop-hook/disable/TestTargetStopHookDisable.py (1311 of 2178) PASS: lldb-api :: functionalities/memory/cache/TestMemoryCache.py (1312 of 2178) PASS: lldb-api :: functionalities/postmortem/wow64_minidump/TestWow64MiniDump.py (1313 of 2178) PASS: lldb-shell :: SymbolFile/DWARF/find-basic-namespace.cpp (1314 of 2178) PASS: lldb-api :: functionalities/thread/concurrent_events/TestConcurrentNWatchNBreak.py (1315 of 2178) PASS: lldb-api :: functionalities/target_var/TestTargetVar.py (1316 of 2178) PASS: lldb-api :: lang/objc/foundation/TestObjCMethodsString.py (1317 of 2178) PASS: lldb-unit :: Expression/./ExpressionTests/ClangExpressionDeclMapTest.TestPersistentDeclLookup (1318 of 2178) PASS: lldb-api :: functionalities/data-formatter/synthcapping/TestSyntheticCapping.py (1319 of 2178) PASS: lldb-unit :: Core/./LLDBCoreTests/StreamCallbackTest.Callback (1320 of 2178) PASS: lldb-api :: functionalities/thread/step_until/TestStepUntil.py (1321 of 2178) PASS: lldb-shell :: SymbolFile/DWARF/find-qualified-variable.cpp (1322 of 2178) PASS: lldb-shell :: SymbolFile/DWARF/debug_ranges-missing-section.s (1323 of 2178) PASS: lldb-api :: python_api/module_section/TestModuleAndSection.py (1324 of 2178) PASS: lldb-api :: functionalities/breakpoint/breakpoint_conditions/TestBreakpointConditions.py (1325 of 2178) PASS: lldb-api :: python_api/default-constructor/TestDefaultConstructorForAPIObjects.py (1326 of 2178) PASS: lldb-unit :: Utility/./UtilityTests/StringExtractorTest.GetHexU8_Underflow2_NoEof (1327 of 2178) PASS: lldb-unit :: Utility/./UtilityTests/StringExtractorTest.GetHexBytes (1328 of 2178) PASS: lldb-api :: lang/c/shared_lib_stripped_symbols/TestSharedLibStrippedSymbols.py (1329 of 2178) UNSUPPORTED: lldb-api :: benchmarks/expression/TestExpressionCmd.py (1330 of 2178) PASS: lldb-api :: lang/cpp/char8_t/TestCxxChar8_t.py (1331 of 2178) PASS: lldb-shell :: ObjectFile/ELF/gnu-debuglink.yaml (1332 of 2178) PASS: lldb-unit :: Language/Highlighting/./HighlighterTests/HighlighterTest.HighlighterSelectionType (1333 of 2178) PASS: lldb-api :: functionalities/tail_call_frames/ambiguous_tail_call_seq1/TestAmbiguousTailCallSeq1.py (1334 of 2178) PASS: lldb-unit :: Utility/./UtilityTests/BinaryStreamTest.PutULEB128EightBytes (1335 of 2178) PASS: lldb-api :: commands/expression/cast_int_to_anonymous_enum/TestCastIntToAnonymousEnum.py (1336 of 2178) PASS: lldb-api :: commands/statistics/basic/TestStats.py (1337 of 2178) PASS: lldb-shell :: Breakpoint/split-dwarf-5-addrbase.test (1338 of 2178) PASS: lldb-api :: commands/expression/vector_of_enums/TestVectorOfEnums.py (1339 of 2178) PASS: lldb-unit :: Disassembler/./DisassemblerTests/TestArm64Disassembly.TestArmv81Instruction (1340 of 2178) PASS: lldb-unit :: Symbol/./SymbolTests/TestTypeSystemClang.TestGetEnumIntegerTypeBasicTypes (1341 of 2178) PASS: lldb-unit :: Utility/./UtilityTests/TimeoutTest.Format (1342 of 2178) PASS: lldb-api :: functionalities/data-formatter/vector-types/TestVectorTypesFormatting.py (1343 of 2178) PASS: lldb-unit :: Utility/./UtilityTests/BinaryStreamTest.PutSLEB128FiveBytes (1344 of 2178) PASS: lldb-unit :: ScriptInterpreter/Python/./ScriptInterpreterPythonTests/PythonDataObjectsTest.TestPythonFile (1345 of 2178) PASS: lldb-unit :: Language/Highlighting/./HighlighterTests/HighlighterTest.ClangPreserveNewLine (1346 of 2178) PASS: lldb-unit :: Utility/./UtilityTests/OptionsWithRawTest.MultiWordSuffix (1347 of 2178) PASS: lldb-api :: python_api/name_lookup/TestNameLookup.py (1348 of 2178) PASS: lldb-unit :: Utility/./UtilityTests/RangeDataVector.FindEntryIndexesThatContain (1349 of 2178) PASS: lldb-unit :: Utility/./UtilityTests/RangeTest.Equal (1350 of 2178) PASS: lldb-unit :: Utility/./UtilityTests/StreamTest.AddressPrefix (1351 of 2178) PASS: lldb-unit :: Expression/./ExpressionTests/DiagnosticManagerTest.GetStringSeverityLabels (1352 of 2178) PASS: lldb-unit :: Utility/./UtilityTests/BinaryStreamTest.PutSLEB128SevenBytes (1353 of 2178) PASS: lldb-api :: functionalities/breakpoint/breakpoint_command/TestRegexpBreakCommand.py (1354 of 2178) PASS: lldb-unit :: Language/Highlighting/./HighlighterTests/HighlighterTest.ClangIdentifiers (1355 of 2178) PASS: lldb-unit :: Symbol/./SymbolTests/TestTypeSystemClang.TestDisplayName (1356 of 2178) PASS: lldb-shell :: ScriptInterpreter/Python/eof.test (1357 of 2178) PASS: lldb-shell :: SymbolFile/DWARF/dwarf5-index-is-used.cpp (1358 of 2178) PASS: lldb-api :: functionalities/thread/step_out/TestThreadStepOut.py (1359 of 2178) PASS: lldb-unit :: Utility/./UtilityTests/StringExtractorTest.InitMisc (1360 of 2178) PASS: lldb-unit :: Core/./LLDBCoreTests/MangledTest.ResultForValidName (1361 of 2178) PASS: lldb-unit :: Utility/./UtilityTests/RangeTest.ContainsAddrInvalid (1362 of 2178) PASS: lldb-api :: functionalities/breakpoint/address_breakpoints/TestBadAddressBreakpoints.py (1363 of 2178) UNSUPPORTED: lldb-shell :: SymbolFile/PDB/variables-locations.test (1364 of 2178) PASS: lldb-shell :: Reproducer/Functionalities/TestExpressionEvaluation.test (1365 of 2178) PASS: lldb-unit :: Utility/./UtilityTests/StringListTest.LongestCommonPrefix (1366 of 2178) PASS: lldb-api :: commands/expression/static-initializers/TestStaticInitializers.py (1367 of 2178) PASS: lldb-shell :: Breakpoint/debug_rnglist_rlestartend.test (1368 of 2178) PASS: lldb-shell :: ObjectFile/ELF/section-addresses.yaml (1369 of 2178) PASS: lldb-unit :: SymbolFile/DWARF/./SymbolFileDWARFTests/XcodeSDKModuleTests.TestModuleGetXcodeSDK (1370 of 2178) PASS: lldb-shell :: Minidump/Windows/arm-fp-unwind.test (1371 of 2178) PASS: lldb-unit :: Utility/./UtilityTests/OptionsWithRawTest.EmptyArgsOnlySuffix (1372 of 2178) PASS: lldb-api :: lang/c/forward/TestForwardDeclaration.py (1373 of 2178) PASS: lldb-api :: commands/expression/rdar42038760/TestScalarURem.py (1374 of 2178) PASS: lldb-api :: lang/cpp/signed_types/TestSignedTypes.py (1375 of 2178) PASS: lldb-shell :: Register/x86-64-ymm-read.test (1376 of 2178) PASS: lldb-api :: commands/expression/class_template_specialization_empty_pack/TestClassTemplateSpecializationParametersHandling.py (1377 of 2178) PASS: lldb-shell :: SymbolFile/DWARF/dwarf5_locations.s (1378 of 2178) PASS: lldb-api :: lang/c/step_over_no_deadlock/TestStepOverDoesntBlock.py (1379 of 2178) PASS: lldb-api :: lang/cpp/gmodules/TestWithModuleDebugging.py (1380 of 2178) PASS: lldb-unit :: Process/gdb-remote/./ProcessGdbRemoteTests/GDBRemoteCommunicationServerTest.SendErrorResponse_ErrorNumber (1381 of 2178) UNSUPPORTED: lldb-api :: commands/trace/TestTraceDumpInstructions.py (1382 of 2178) PASS: lldb-api :: functionalities/thread/backtrace_limit/TestBacktraceLimit.py (1383 of 2178) PASS: lldb-unit :: Utility/./UtilityTests/DataExtractorTest.GetFloatUnaligned (1384 of 2178) PASS: lldb-unit :: DataFormatter/./LLDBFormatterTests/StringPrinterTests.SwiftUTF8 (1385 of 2178) PASS: lldb-api :: commands/command/script_alias/TestCommandScriptAlias.py (1386 of 2178) PASS: lldb-unit :: Process/minidump/./LLDBMinidumpTests/RegisterContextMinidump.CheckRegisterContextMinidump_ARM (1387 of 2178) PASS: lldb-unit :: Utility/./UtilityTests/OptionsWithRawTest.EmptySuffixSingleWhitespace (1388 of 2178) PASS: lldb-unit :: Utility/./UtilityTests/StructuredDataTest.ParseJSONFromFile (1389 of 2178) PASS: lldb-unit :: UnwindAssembly/x86/./UnwindAssemblyx86Tests/Testx86AssemblyInspectionEngine.TestSpillRegToStackViaMOVx86_64 (1390 of 2178) PASS: lldb-api :: commands/expression/radar_9673664/TestExprHelpExamples.py (1391 of 2178) PASS: lldb-shell :: Minidump/Windows/find-module.test (1392 of 2178) PASS: lldb-api :: functionalities/gdb_remote_client/TestNestedRegDefinitions.py (1393 of 2178) PASS: lldb-api :: lang/objc/conflicting-definition/TestConflictingDefinition.py (1394 of 2178) PASS: lldb-unit :: Host/./HostTests/ProcessLaunchInfoTest.Constructor (1395 of 2178) PASS: lldb-unit :: Thread/./ThreadTests/ThreadTest.SetStopInfo (1396 of 2178) PASS: lldb-api :: functionalities/data-formatter/cstring-utf8-summary/TestCstringUnicode.py (1397 of 2178) PASS: lldb-api :: functionalities/data-formatter/data-formatter-stl/libcxx/multiset/TestDataFormatterLibcxxMultiSet.py (1398 of 2178) PASS: lldb-shell :: SymbolFile/DWARF/DW_TAG_variable-invalid_location.s (1399 of 2178) PASS: lldb-unit :: ScriptInterpreter/Python/./ScriptInterpreterPythonTests/PythonDataObjectsTest.TestPythonTupleValues (1400 of 2178) PASS: lldb-unit :: Target/./TargetTests/ModuleCacheTest.GetAndPut (1401 of 2178) PASS: lldb-unit :: Utility/./UtilityTests/StreamTest.PutMaxHex64ByteOrderLittle (1402 of 2178) PASS: lldb-unit :: Utility/./UtilityTests/PassiveReplayTest.InstrumentedFoo (1403 of 2178) PASS: lldb-unit :: Utility/./UtilityTests/ArgsTest.Yaml (1404 of 2178) PASS: lldb-api :: commands/frame/diagnose/complicated-expression/TestComplicatedExpression.py (1405 of 2178) PASS: lldb-unit :: Utility/./UtilityTests/DataExtractorTest.GetDoubleUnaligned (1406 of 2178) PASS: lldb-unit :: Editline/./EditlineTests/EditlineTestFixture.EditlineReceivesMultiLineText (1407 of 2178) PASS: lldb-api :: macosx/function-starts/TestFunctionStarts.py (1408 of 2178) PASS: lldb-unit :: Process/gdb-remote/./ProcessGdbRemoteTests/GDBRemoteClientBaseTest.InterruptNoResponse (1409 of 2178) PASS: lldb-unit :: Process/minidump/./LLDBMinidumpTests/MinidumpParserTest.GetMiscInfo_no_stream (1410 of 2178) UNSUPPORTED: lldb-shell :: Register/x86-64-xmm16-write.test (1411 of 2178) PASS: lldb-shell :: SymbolFile/DWARF/dwp-debug-types.s (1412 of 2178) PASS: lldb-unit :: Utility/./UtilityTests/StringExtractorTest.GetHexBytesAvail_Underflow (1413 of 2178) PASS: lldb-api :: functionalities/param_entry_vals/basic_entry_values/TestBasicEntryValues.py (1414 of 2178) PASS: lldb-unit :: Utility/./UtilityTests/UriParserTest.BracketedHostname (1415 of 2178) PASS: lldb-api :: lang/cpp/nested-class-other-compilation-unit/TestNestedClassWithParentInAnotherCU.py (1416 of 2178) PASS: lldb-shell :: Reproducer/TestDebugSymbols.test (1417 of 2178) PASS: lldb-api :: functionalities/limit-debug-info/TestLimitDebugInfo.py (1418 of 2178) UNSUPPORTED: lldb-api :: macosx/macCatalystAppMacOSFramework/TestMacCatalystAppWithMacOSFramework.py (1419 of 2178) PASS: lldb-api :: functionalities/breakpoint/dummy_target_breakpoints/TestBreakpointsWithNoTargets.py (1420 of 2178) PASS: lldb-unit :: Utility/./UtilityTests/ConstStringTest.FromMidOfBufferStringRef (1421 of 2178) PASS: lldb-shell :: Commands/command-breakpoint-col.test (1422 of 2178) PASS: lldb-unit :: Symbol/./SymbolTests/Type.CompilerContextPattern (1423 of 2178) PASS: lldb-unit :: Utility/./UtilityTests/LogChannelEnabledTest.LogVerboseThread (1424 of 2178) PASS: lldb-unit :: Utility/./UtilityTests/UriParserTest.LongPath (1425 of 2178) PASS: lldb-api :: commands/frame/var/TestFrameVar.py (1426 of 2178) PASS: lldb-unit :: ScriptInterpreter/Python/./ScriptInterpreterPythonTests/PythonDataObjectsTest.TestPythonStringToStr (1427 of 2178) PASS: lldb-unit :: Utility/./UtilityTests/StreamTest.ShiftOperatorChars (1428 of 2178) PASS: lldb-api :: lang/cpp/typeof/TestTypeOfDeclTypeExpr.py (1429 of 2178) PASS: lldb-unit :: Expression/./ExpressionTests/ClangHostTest.ComputeClangResourceDirectory (1430 of 2178) PASS: lldb-api :: lang/objc/objc-property/TestObjCProperty.py (1431 of 2178) PASS: lldb-api :: functionalities/thread/concurrent_events/TestConcurrentSignalWatchBreak.py (1432 of 2178) PASS: lldb-api :: functionalities/breakpoint/address_breakpoints/TestAddressBreakpoints.py (1433 of 2178) PASS: lldb-unit :: Utility/./UtilityTests/Flags.Clear (1434 of 2178) PASS: lldb-shell :: Breakpoint/implicit_const_form_support.test (1435 of 2178) PASS: lldb-api :: lang/c/shared_lib/TestSharedLib.py (1436 of 2178) PASS: lldb-unit :: SymbolFile/NativePDB/./SymbolFileNativePDBTests/PDBFPOProgramToDWARFExpressionTests.InvalidOpBinary (1437 of 2178) UNSUPPORTED: lldb-api :: functionalities/darwin_log/filter/exact_match/subsystem/TestDarwinLogFilterMatchSubsystem.py (1438 of 2178) PASS: lldb-unit :: Utility/./UtilityTests/StringLexerTest.NextIf (1439 of 2178) PASS: lldb-unit :: Process/gdb-remote/./ProcessGdbRemoteTests/GDBRemoteCommunicationClientTest.SendGetMetaDataPacket (1440 of 2178) PASS: lldb-api :: lang/cpp/rvalue-references/TestRvalueReferences.py (1441 of 2178) PASS: lldb-api :: functionalities/dead-strip/TestDeadStrip.py (1442 of 2178) PASS: lldb-api :: commands/settings/quoting/TestQuoting.py (1443 of 2178) PASS: lldb-unit :: Language/Highlighting/./HighlighterTests/HighlighterTest.ClangPPDirectives (1444 of 2178) PASS: lldb-api :: functionalities/thread/concurrent_events/TestConcurrentDelayedCrashWithBreakpointSignal.py (1445 of 2178) PASS: lldb-shell :: SymbolFile/DWARF/DW_AT_declaration-with-children.s (1446 of 2178) PASS: lldb-api :: python_api/sbenvironment/TestSBEnvironment.py (1447 of 2178) PASS: lldb-api :: lang/objc/ivar-IMP/TestObjCiVarIMP.py (1448 of 2178) PASS: lldb-api :: lang/c/tls_globals/TestTlsGlobals.py (1449 of 2178) PASS: lldb-unit :: Process/gdb-remote/./ProcessGdbRemoteTests/GDBRemoteClientBaseTest.SendContinueAndInterrupt2PacketBug (1450 of 2178) PASS: lldb-unit :: UnwindAssembly/ARM64/./Arm64InstEmulationTests/TestArm64InstEmulation.TestSimpleDarwinFunction (1451 of 2178) PASS: lldb-unit :: Utility/./UtilityTests/UriParserTest.MinimalPortPath (1452 of 2178) PASS: lldb-api :: lang/cpp/thread_local/TestThreadLocal.py (1453 of 2178) PASS: lldb-unit :: Utility/./UtilityTests/XcodeSDKTest.FindXcodeContentsDirectoryInPath (1454 of 2178) PASS: lldb-api :: functionalities/thread/thread_exit/TestThreadExit.py (1455 of 2178) PASS: lldb-api :: types/TestCharTypeExpr.py (1456 of 2178) PASS: lldb-api :: functionalities/avoids-fd-leak/TestFdLeak.py (1457 of 2178) PASS: lldb-unit :: Utility/./UtilityTests/UriParserTest.SchemeHostSeparator2 (1458 of 2178) PASS: lldb-unit :: Utility/./UtilityTests/StringListTest.ShiftCString (1459 of 2178) PASS: lldb-api :: functionalities/unwind/noreturn/module-end/TestNoReturnModuleEnd.py (1460 of 2178) PASS: lldb-api :: functionalities/data-formatter/data-formatter-categories/TestDataFormatterCategories.py (1461 of 2178) PASS: lldb-unit :: Utility/./UtilityTests/StreamTest.AddressPrefixAndSuffix (1462 of 2178) PASS: lldb-api :: lang/cpp/namespace/TestNamespace.py (1463 of 2178) PASS: lldb-unit :: Target/./TargetTests/StackFrameRecognizerTest.NullModuleRegex (1464 of 2178) PASS: lldb-unit :: Process/minidump/./LLDBMinidumpTests/MinidumpParserTest.MinidumpDuplicateModuleMinAddress (1465 of 2178) PASS: lldb-api :: lang/objc/objc-static-method-stripped/TestObjCStaticMethodStripped.py (1466 of 2178) PASS: lldb-api :: functionalities/gdb_remote_client/TestIOSSimulator.py (1467 of 2178) PASS: lldb-api :: functionalities/thread/crash_during_step/TestCrashDuringStep.py (1468 of 2178) PASS: lldb-api :: functionalities/data-formatter/data-formatter-stl/libcxx/iterator/TestDataFormatterLibccIterator.py (1469 of 2178) PASS: lldb-api :: commands/frame/diagnose/virtual-method-call/TestDiagnoseDereferenceVirtualMethodCall.py (1470 of 2178) PASS: lldb-shell :: SymbolFile/DWARF/DW_OP_piece-struct.s (1471 of 2178) PASS: lldb-api :: functionalities/inline-stepping/TestInlineStepping.py (1472 of 2178) PASS: lldb-api :: functionalities/mtc/simple/TestMTCSimple.py (1473 of 2178) PASS: lldb-api :: tools/lldb-vscode/breakpoint/TestVSCode_setExceptionBreakpoints.py (1474 of 2178) PASS: lldb-api :: lang/cpp/exceptions/TestCPPExceptionBreakpoints.py (1475 of 2178) PASS: lldb-unit :: DataFormatter/./LLDBFormatterTests/TypeMatcherTests.RegexMatchPart (1476 of 2178) PASS: lldb-shell :: Reproducer/TestCaptureEnvOverride.test (1477 of 2178) PASS: lldb-unit :: Utility/./UtilityTests/UriParserTest.Minimal (1478 of 2178) PASS: lldb-unit :: Utility/./UtilityTests/RangeTest.LessThan (1479 of 2178) PASS: lldb-unit :: Utility/./UtilityTests/StringListTest.SplitIntoLinesSingleTrailingCR (1480 of 2178) PASS: lldb-unit :: UnwindAssembly/x86/./UnwindAssemblyx86Tests/Testx86AssemblyInspectionEngine.TestStackRealignMSVC_i386 (1481 of 2178) PASS: lldb-api :: commands/expression/options/TestExprOptions.py (1482 of 2178) PASS: lldb-shell :: SymbolFile/DWARF/debug-types-missing-signature.test (1483 of 2178) PASS: lldb-unit :: Utility/./UtilityTests/StreamTest.PutCharWhitespace (1484 of 2178) PASS: lldb-unit :: ScriptInterpreter/Python/./ScriptInterpreterPythonTests/PythonDataObjectsTest.TestPythonTupleToStructuredList (1485 of 2178) PASS: lldb-unit :: Utility/./UtilityTests/DataExtractorTest.UncommonAddressSize (1486 of 2178) PASS: lldb-unit :: Language/Highlighting/./HighlighterTests/HighlighterTest.ClangEmptyInput (1487 of 2178) PASS: lldb-api :: python_api/function_symbol/TestDisasmAPI.py (1488 of 2178) PASS: lldb-api :: commands/frame/var-scope/TestFrameVariableScope.py (1489 of 2178) PASS: lldb-unit :: Utility/./UtilityTests/ScalarTest.SetValueFromCString (1490 of 2178) PASS: lldb-unit :: Utility/./UtilityTests/ArchSpecTest.TestSetTriple (1491 of 2178) PASS: lldb-api :: lang/cpp/function_refs/TestFunctionRefs.py (1492 of 2178) PASS: lldb-api :: lang/objc/exceptions/TestObjCExceptions.py (1493 of 2178) PASS: lldb-unit :: Utility/./UtilityTests/ConstStringTest.YAML (1494 of 2178) PASS: lldb-api :: lang/c/step-target/TestStepTarget.py (1495 of 2178) PASS: lldb-api :: functionalities/thread/concurrent_events/TestConcurrentCrashWithSignal.py (1496 of 2178) PASS: lldb-api :: commands/expression/import-std-module/vector-bool/TestVectorBoolFromStdModule.py (1497 of 2178) PASS: lldb-unit :: Utility/./UtilityTests/Flags.GetBitSize (1498 of 2178) PASS: lldb-shell :: SymbolFile/NativePDB/function-types-calling-conv.cpp (1499 of 2178) PASS: lldb-shell :: Settings/TestEchoCommands.test (1500 of 2178) PASS: lldb-unit :: Utility/./UtilityTests/RecordReplayTest.InstrumentedFooSameThis (1501 of 2178) XFAIL: lldb-shell :: Register/x86-multithread-write.test (1502 of 2178) PASS: lldb-api :: sanity/TestModuleCacheSanity.py (1503 of 2178) PASS: lldb-api :: lang/cpp/limit-debug-info/TestWithLimitDebugInfo.py (1504 of 2178) UNSUPPORTED: lldb-shell :: SymbolFile/PDB/pointers.test (1505 of 2178) UNSUPPORTED: lldb-shell :: Watchpoint/netbsd-nouserdbregs.test (1506 of 2178) PASS: lldb-api :: commands/expression/persist_objc_pointeetype/TestPersistObjCPointeeType.py (1507 of 2178) PASS: lldb-unit :: Expression/./ExpressionTests/DWARFExpression.DW_OP_implicit_value (1508 of 2178) PASS: lldb-api :: functionalities/breakpoint/breakpoint_by_file_colon_line/TestBreakpointByFileColonLine.py (1509 of 2178) PASS: lldb-api :: lang/cpp/chained-calls/TestCppChainedCalls.py (1510 of 2178) PASS: lldb-unit :: Utility/./UtilityTests/BinaryStreamTest.PutULEB128SixBytes (1511 of 2178) UNSUPPORTED: lldb-api :: functionalities/data-formatter/data-formatter-stl/libstdcpp/vbool/TestDataFormatterStdVBool.py (1512 of 2178) PASS: lldb-shell :: Settings/TestFrameFormatNoColor.test (1513 of 2178) PASS: lldb-unit :: Symbol/./SymbolTests/TestTypeSystemClang.TestGetTypeClassDeclType (1514 of 2178) PASS: lldb-api :: commands/gui/viewlarge/TestGuiViewLarge.py (1515 of 2178) PASS: lldb-api :: arm/emulation/TestEmulations.py (1516 of 2178) UNSUPPORTED: lldb-shell :: Breakpoint/case-insensitive.test (1517 of 2178) PASS: lldb-unit :: Utility/./UtilityTests/BinaryStreamTest.PutSLEB128One (1518 of 2178) PASS: lldb-unit :: Utility/./UtilityTests/StringListTest.InsertStringAtIndexStdString (1519 of 2178) PASS: lldb-unit :: Target/./TargetTests/PathMappingListTest.AbsoluteTests (1520 of 2178) PASS: lldb-unit :: Utility/./UtilityTests/VMRange.ContainsRange (1521 of 2178) PASS: lldb-unit :: Utility/./UtilityTests/RangeDataVector.CustomSort (1522 of 2178) PASS: lldb-api :: commands/target/basic/TestTargetCommand.py (1523 of 2178) PASS: lldb-unit :: Utility/./UtilityTests/CompletionRequest.TryCompleteCurrentArgBad (1524 of 2178) PASS: lldb-unit :: Utility/./UtilityTests/RangeTest.ClearWithStarAddress (1525 of 2178) PASS: lldb-unit :: Utility/./UtilityTests/FileSpecTest.Match (1526 of 2178) PASS: lldb-unit :: Host/./HostTests/SocketTests/SocketTest.TCPListen0GetPort/ipv6 (1527 of 2178) PASS: lldb-api :: functionalities/thread/exit_during_break/TestExitDuringBreak.py (1528 of 2178) PASS: lldb-unit :: Utility/./UtilityTests/EnvironmentTest.EnvpConstruction (1529 of 2178) PASS: lldb-unit :: Host/./HostTests/FileSystemTest.Exists (1530 of 2178) PASS: lldb-api :: lang/cpp/stl/TestStdCXXDisassembly.py (1531 of 2178) UNSUPPORTED: lldb-api :: lang/cpp/static_members/TestCPPStaticMembers.py (1532 of 2178) PASS: lldb-unit :: Utility/./UtilityTests/RangeTest.ContainsRangeStartingFromZero (1533 of 2178) PASS: lldb-unit :: Host/./HostTests/File.GetStreamFromDescriptor (1534 of 2178) PASS: lldb-api :: commands/expression/error-limit/TestExprErrorLimit.py (1535 of 2178) PASS: lldb-api :: functionalities/inferior-crashing/recursive-inferior/TestRecursiveInferiorStep.py (1536 of 2178) PASS: lldb-unit :: Utility/./UtilityTests/UUIDTest.Validity (1537 of 2178) UNSUPPORTED: lldb-shell :: ObjectFile/ELF/minidebuginfo-no-lzma.yaml (1538 of 2178) PASS: lldb-unit :: Process/gdb-remote/./ProcessGdbRemoteTests/GDBRemoteCommunicationClientTest.GetMemoryRegionInfoInvalidResponse (1539 of 2178) UNSUPPORTED: lldb-shell :: Register/x86-zmm-write.test (1540 of 2178) UNSUPPORTED: lldb-shell :: ScriptInterpreter/Lua/lua.test (1541 of 2178) PASS: lldb-unit :: Host/./HostTests/FileSystemTest.OpenErrno (1542 of 2178) PASS: lldb-unit :: Utility/./UtilityTests/StreamTest.PutBytesAsRawHex8ToMixedEndian (1543 of 2178) PASS: lldb-unit :: Utility/./UtilityTests/StreamTest.AddressRange (1544 of 2178) PASS: lldb-unit :: Utility/./UtilityTests/ArgsTest.TestSingleArgWithQuotedSpace (1545 of 2178) PASS: lldb-unit :: Process/minidump/./LLDBMinidumpTests/MinidumpParserTest.GetThreadContext_x86_32_wow64 (1546 of 2178) PASS: lldb-unit :: Utility/./UtilityTests/RangeDataVector.FindEntryIndexesThatContain_Overlap (1547 of 2178) PASS: lldb-unit :: Expression/./ExpressionTests/DiagnosticManagerTest.HasFixits (1548 of 2178) PASS: lldb-unit :: Utility/./UtilityTests/OptionsWithRawTest.EmptySuffix (1549 of 2178) PASS: lldb-api :: functionalities/postmortem/minidump-new/TestMiniDumpNew.py (1550 of 2178) PASS: lldb-api :: functionalities/thread/backtrace_all/TestBacktraceAll.py (1551 of 2178) UNSUPPORTED: lldb-api :: commands/watchpoints/hello_watchlocation/TestWatchLocation.py (1552 of 2178) PASS: lldb-shell :: ObjectFile/ELF/duplicate-section.yaml (1553 of 2178) PASS: lldb-shell :: BuildScript/compiler-full-path.test (1554 of 2178) UNSUPPORTED: lldb-api :: benchmarks/expression/TestRepeatedExprs.py (1555 of 2178) UNSUPPORTED: lldb-api :: functionalities/darwin_log/format/TestDarwinLogMessageFormat.py (1556 of 2178) PASS: lldb-unit :: Language/Highlighting/./HighlighterTests/HighlighterTest.DefaultHighlighterWithCursorOutOfBounds (1557 of 2178) PASS: lldb-unit :: Process/gdb-remote/./ProcessGdbRemoteTests/GDBRemoteCommunicationServerTest.SendErrorResponse_UnimplementedError (1558 of 2178) PASS: lldb-api :: lang/cpp/member-and-local-vars-with-same-name/TestMembersAndLocalsWithSameName.py (1559 of 2178) PASS: lldb-api :: functionalities/gdb_remote_client/TestqOffsets.py (1560 of 2178) PASS: lldb-api :: lang/objc/objc-checker/TestObjCCheckers.py (1561 of 2178) PASS: lldb-shell :: ObjectFile/PECOFF/basic-info-arm64.yaml (1562 of 2178) PASS: lldb-unit :: Utility/./UtilityTests/SerializationRountripTest.SerializeDeserializeObjectPointer (1563 of 2178) PASS: lldb-api :: tools/lldb-server/register-reading/TestGdbRemoteGPacket.py (1564 of 2178) PASS: lldb-api :: lang/cpp/unicode-literals/TestUnicodeLiterals.py (1565 of 2178) PASS: lldb-unit :: UnwindAssembly/x86/./UnwindAssemblyx86Tests/Testx86AssemblyInspectionEngine.TestPushR12 (1566 of 2178) PASS: lldb-api :: lang/cpp/type_lookup/TestCppTypeLookup.py (1567 of 2178) PASS: lldb-api :: lang/cpp/symbols/TestSymbols.py (1568 of 2178) PASS: lldb-shell :: ObjectFile/ELF/PT_LOAD-overlap-PT_INTERP.yaml (1569 of 2178) PASS: lldb-shell :: ObjectFile/ELF/section-types.yaml (1570 of 2178) PASS: lldb-api :: functionalities/data-formatter/nssetsynth/TestNSSetSynthetic.py (1571 of 2178) PASS: lldb-unit :: Utility/./UtilityTests/ArgsTest.ReplaceArgumentAtIndexFarOutOfRange (1572 of 2178) PASS: lldb-unit :: Process/minidump/./LLDBMinidumpTests/MinidumpParserTest.GetExceptionStream (1573 of 2178) PASS: lldb-api :: lang/objc/objc++/TestObjCXX.py (1574 of 2178) PASS: lldb-unit :: Process/minidump/./LLDBMinidumpTests/MinidumpParserTest.GetArchitectureWindows (1575 of 2178) PASS: lldb-unit :: Host/./HostTests/SocketTests/SocketTest.TCPGetAddress/ipv6 (1576 of 2178) UNSUPPORTED: lldb-api :: functionalities/darwin_log/filter/exact_match/activity/TestDarwinLogFilterMatchActivity.py (1577 of 2178) PASS: lldb-api :: lang/c/array_types/TestArrayTypes.py (1578 of 2178) PASS: lldb-unit :: ObjectFile/ELF/./ObjectFileELFTests/ObjectFileELFTest.GetModuleSpecifications_EarlySectionHeaders (1579 of 2178) PASS: lldb-api :: iohandler/unicode/TestUnicode.py (1580 of 2178) PASS: lldb-unit :: Utility/./UtilityTests/ArgsTest.TestSingleQuotedArgWithSpace (1581 of 2178) PASS: lldb-unit :: Utility/./UtilityTests/UriParserTest.BadPort (1582 of 2178) UNSUPPORTED: lldb-api :: commands/watchpoints/variable_out_of_scope/TestWatchedVarHitWhenInScope.py (1583 of 2178) PASS: lldb-api :: python_api/value/empty_class/TestValueAPIEmptyClass.py (1584 of 2178) PASS: lldb-shell :: ObjectFile/ELF/base-address.yaml (1585 of 2178) PASS: lldb-unit :: Utility/./UtilityTests/Flags.AllSet (1586 of 2178) PASS: lldb-api :: lang/objc/objc-optimized/TestObjcOptimized.py (1587 of 2178) PASS: lldb-unit :: Symbol/./SymbolTests/LineEntryTest.GetSameLineContiguousAddressRangeOneInline (1588 of 2178) PASS: lldb-api :: python_api/sbdata/TestSBData.py (1589 of 2178) PASS: lldb-api :: functionalities/thread/concurrent_events/TestConcurrentWatchpointWithDelayWatchpointThreads.py (1590 of 2178) PASS: lldb-unit :: Utility/./UtilityTests/RangeTest.LessThanInvalid (1591 of 2178) PASS: lldb-api :: functionalities/completion/TestCompletion.py (1592 of 2178) PASS: lldb-unit :: Process/minidump/./LLDBMinidumpTests/MinidumpParserTest.GetMemoryRegionInfoLinuxMaps (1593 of 2178) PASS: lldb-api :: functionalities/thread/exit_during_expression/TestExitDuringExpression.py (1594 of 2178) PASS: lldb-api :: functionalities/data-formatter/data-formatter-objc/TestDataFormatterObjCNSContainer.py (1595 of 2178) PASS: lldb-api :: commands/watchpoints/watchpoint_commands/command/TestWatchpointCommandPython.py (1596 of 2178) PASS: lldb-unit :: Core/./LLDBCoreTests/SourceFileCache.FindSourceFileFound (1597 of 2178) PASS: lldb-api :: lang/cpp/enum_types/TestCPP11EnumTypes.py (1598 of 2178) PASS: lldb-api :: functionalities/data-formatter/data-formatter-objc/cmtime/TestDataFormatterCMTime.py (1599 of 2178) PASS: lldb-unit :: Interpreter/./InterpreterTests/CompletionTest.DirCompletionUsername (1600 of 2178) PASS: lldb-api :: macosx/safe-to-func-call/TestSafeFuncCalls.py (1601 of 2178) PASS: lldb-api :: lang/cpp/gmodules-templates/TestGModules.py (1602 of 2178) PASS: lldb-api :: tools/lldb-server/TestGdbRemoteRegisterState.py (1603 of 2178) PASS: lldb-api :: functionalities/thread/concurrent_events/TestConcurrentTwoBreakpointsOneWatchpoint.py (1604 of 2178) PASS: lldb-api :: commands/expression/two-files/TestObjCTypeQueryFromOtherCompileUnit.py (1605 of 2178) PASS: lldb-unit :: Process/minidump/./LLDBMinidumpTests/MinidumpParserTest.MinidumpModuleOrder (1606 of 2178) PASS: lldb-api :: functionalities/data-formatter/data-formatter-synthtype/TestDataFormatterSynthType.py (1607 of 2178) PASS: lldb-api :: commands/platform/file/read/TestPlatformFileRead.py (1608 of 2178) PASS: lldb-unit :: Host/./HostTests/SocketTests/SocketTest.TCPListen0ConnectAccept/ipv4 (1609 of 2178) PASS: lldb-unit :: Host/./HostTests/FileSystemTest.EnumerateDirectory (1610 of 2178) XFAIL: lldb-shell :: Expr/nodefaultlib.cpp (1611 of 2178) PASS: lldb-unit :: DataFormatter/./LLDBFormatterTests/StringPrinterTests.CxxUTF8 (1612 of 2178) PASS: lldb-unit :: Utility/./UtilityTests/StatusTest.ErrorConversion (1613 of 2178) PASS: lldb-unit :: Process/gdb-remote/./ProcessGdbRemoteTests/GDBRemoteCommunicationClientTest.WriteRegisterNoSuffix (1614 of 2178) PASS: lldb-unit :: Utility/./UtilityTests/StreamTest.AddressEmptyPrefix (1615 of 2178) PASS: lldb-api :: lang/objc/print-obj/TestPrintObj.py (1616 of 2178) PASS: lldb-api :: commands/platform/basic/TestPlatformCommand.py (1617 of 2178) PASS: lldb-unit :: Utility/./UtilityTests/FileSpecTest.EqualSeparator (1618 of 2178) PASS: lldb-unit :: Utility/./UtilityTests/StreamTest.AddressNoSuffix (1619 of 2178) PASS: lldb-unit :: Core/./LLDBCoreTests/CommunicationTest.SynchronizeWhileClosing (1620 of 2178) PASS: lldb-api :: lang/cpp/namespace/TestNamespaceLookup.py (1621 of 2178) PASS: lldb-api :: terminal/TestEditline.py (1622 of 2178) PASS: lldb-unit :: Utility/./UtilityTests/CompletionRequest.Constructor (1623 of 2178) PASS: lldb-api :: commands/session/history/TestSessionHistory.py (1624 of 2178) UNSUPPORTED: lldb-api :: functionalities/data-formatter/data-formatter-stl/libstdcpp/iterator/TestDataFormatterStdIterator.py (1625 of 2178) PASS: lldb-shell :: Settings/TestSettingsWrite.test (1626 of 2178) PASS: lldb-unit :: Process/gdb-remote/./ProcessGdbRemoteTests/GDBRemoteCommunicationClientTest.GetModulesInfo (1627 of 2178) UNSUPPORTED: lldb-api :: functionalities/data-formatter/data-formatter-stl/libstdcpp/smart_ptr/TestDataFormatterStdSmartPtr.py (1628 of 2178) PASS: lldb-shell :: SymbolFile/DWARF/debug-types-address-ranges.s (1629 of 2178) PASS: lldb-unit :: SymbolFile/NativePDB/./SymbolFileNativePDBTests/PDBFPOProgramToDWARFExpressionTests.UnresolvedRegisterReference (1630 of 2178) PASS: lldb-unit :: Expression/./ExpressionTests/DiagnosticManagerTest.GetStringMultiline (1631 of 2178) PASS: lldb-shell :: SymbolFile/DWARF/clang-ast-from-dwarf-objc-property.m (1632 of 2178) PASS: lldb-api :: lang/objc/objc-new-syntax/TestObjCNewSyntaxDictionary.py (1633 of 2178) PASS: lldb-unit :: UnwindAssembly/x86/./UnwindAssemblyx86Tests/Testx86AssemblyInspectionEngine.TestPushEBP (1634 of 2178) PASS: lldb-shell :: SymbolFile/DWARF/debug_loclists-dwo.s (1635 of 2178) XFAIL: lldb-shell :: Register/x86-64-write.test (1636 of 2178) PASS: lldb-unit :: Utility/./UtilityTests/StreamTest.PutULEB128 (1637 of 2178) PASS: lldb-unit :: Utility/./UtilityTests/StringExtractorTest.DecodeHexU8_InvalidHex (1638 of 2178) PASS: lldb-api :: commands/expression/completion-crash-incomplete-record/TestCompletionCrashIncompleteRecord.py (1639 of 2178) PASS: lldb-api :: commands/expression/import-std-module/shared_ptr-dbg-info-content/TestSharedPtrDbgInfoContentFromStdModule.py (1640 of 2178) PASS: lldb-unit :: Expression/./ExpressionTests/DiagnosticManagerTest.GetStringBasic (1641 of 2178) PASS: lldb-shell :: SymbolFile/DWARF/find-inline-method.s (1642 of 2178) PASS: lldb-unit :: Host/./HostTests/SocketTests/SocketTest.UDPGetConnectURI/ipv4 (1643 of 2178) UNSUPPORTED: lldb-api :: tools/lldb-server/platform-process-connect/TestPlatformProcessConnect.py (1644 of 2178) PASS: lldb-shell :: SymbolFile/DWARF/dir-separator-windows.s (1645 of 2178) PASS: lldb-api :: commands/expression/import-std-module/empty-module/TestEmptyStdModule.py (1646 of 2178) PASS: lldb-api :: commands/expression/import-std-module/basic/TestImportStdModule.py (1647 of 2178) PASS: lldb-unit :: Process/gdb-remote/./ProcessGdbRemoteTests/GDBRemoteCommunicationClientTest.GetModulesInfoInvalidResponse (1648 of 2178) PASS: lldb-unit :: Symbol/./SymbolTests/TestTypeSystemClang.TestGetBasicTypeFromName (1649 of 2178) PASS: lldb-api :: functionalities/thread/concurrent_events/TestConcurrentManyBreakpoints.py (1650 of 2178) PASS: lldb-shell :: Reproducer/TestVerify.test (1651 of 2178) PASS: lldb-api :: python_api/frame/get-variables/TestGetVariables.py (1652 of 2178) PASS: lldb-unit :: Utility/./UtilityTests/ConstStringTest.UpdateMangledCounterpart (1653 of 2178) PASS: lldb-api :: functionalities/thread/concurrent_events/TestConcurrentCrashWithWatchpointBreakpointSignal.py (1654 of 2178) PASS: lldb-api :: functionalities/tail_call_frames/thread_step_out_or_return/TestSteppingOutWithArtificialFrames.py (1655 of 2178) PASS: lldb-api :: types/TestDoubleTypesExpr.py (1656 of 2178) PASS: lldb-unit :: Symbol/./SymbolTests/DWARFCallFrameInfoTest.Basic_dwarf3 (1657 of 2178) PASS: lldb-unit :: debugserver/./debugserverTests/RNBSocket.AnyListen (1658 of 2178) PASS: lldb-unit :: Utility/./UtilityTests/SubsystemRAIITest.SubsystemWithErrorSuccess (1659 of 2178) PASS: lldb-unit :: Utility/./UtilityTests/TimerTest.CategoryTimesNested (1660 of 2178) PASS: lldb-api :: commands/expression/dollar-in-variable/TestDollarInVariable.py (1661 of 2178) PASS: lldb-unit :: UnwindAssembly/x86/./UnwindAssemblyx86Tests/Testx86AssemblyInspectionEngine.TestPushEDI (1662 of 2178) UNSUPPORTED: lldb-api :: functionalities/data-formatter/data-formatter-stl/libstdcpp/unique_ptr/TestDataFormatterStdUniquePtr.py (1663 of 2178) PASS: lldb-unit :: Utility/./UtilityTests/StringExtractorTest.GetHexBytes_OddPair2 (1664 of 2178) PASS: lldb-unit :: Language/Highlighting/./HighlighterTests/HighlighterTest.ClangUnterminatedString (1665 of 2178) PASS: lldb-unit :: Utility/./UtilityTests/StreamTest.AddressRangeInvalidRange (1666 of 2178) PASS: lldb-unit :: Utility/./UtilityTests/StringExtractorTest.GetHexBytes_OddPair (1667 of 2178) PASS: lldb-shell :: Commands/command-backtrace.test (1668 of 2178) PASS: lldb-api :: lang/objc/bitfield_ivars/TestBitfieldIvars.py (1669 of 2178) PASS: lldb-api :: lang/objc/foundation/TestObjectDescriptionAPI.py (1670 of 2178) PASS: lldb-unit :: Symbol/./SymbolTests/TestTypeSystemClang.TestGetTypeClassNested (1671 of 2178) PASS: lldb-unit :: Expression/./ExpressionTests/DiagnosticManagerTest.GetStringPreserveOrder (1672 of 2178) PASS: lldb-unit :: Expression/./ExpressionTests/CppModuleConfigurationTest.UnknownLibCppFile (1673 of 2178) PASS: lldb-shell :: ObjectFile/ELF/compressed-sections.yaml (1674 of 2178) PASS: lldb-api :: functionalities/thread/concurrent_events/TestConcurrentTwoWatchpointThreads.py (1675 of 2178) PASS: lldb-unit :: Utility/./UtilityTests/StreamTest.PutHex32ByteOrderLittle (1676 of 2178) PASS: lldb-unit :: Symbol/./SymbolTests/TestTypeSystemClang.TestConvertAccessTypeToAccessSpecifier (1677 of 2178) PASS: lldb-unit :: UnwindAssembly/x86/./UnwindAssemblyx86Tests/Testx86AssemblyInspectionEngine.TestPopEDI (1678 of 2178) PASS: lldb-unit :: Host/./HostTests/FileSystemTest.FileAndDirectoryComponents (1679 of 2178) PASS: lldb-api :: functionalities/data-formatter/data-formatter-stl/libcxx/optional/TestDataFormatterLibcxxOptional.py (1680 of 2178) PASS: lldb-api :: lang/cpp/operators/TestCppOperators.py (1681 of 2178) PASS: lldb-unit :: Process/minidump/./LLDBMinidumpTests/MinidumpParserTest.FindMemoryRangeWithFullMemoryMinidump (1682 of 2178) UNSUPPORTED: lldb-shell :: Register/x86-ymm-write.test (1683 of 2178) PASS: lldb-shell :: Process/TestAbortExitCode.test (1684 of 2178) PASS: lldb-unit :: Utility/./UtilityTests/ArgsTest.DoubleQuotedItem (1685 of 2178) PASS: lldb-unit :: Utility/./UtilityTests/Flags.AllClear (1686 of 2178) PASS: lldb-api :: commands/platform/process/list/TestProcessList.py (1687 of 2178) XFAIL: lldb-shell :: Unwind/prefer-debug-over-eh-frame.test (1688 of 2178) PASS: lldb-api :: functionalities/data-formatter/stringprinter/TestStringPrinter.py (1689 of 2178) PASS: lldb-unit :: Utility/./UtilityTests/TimeoutTest.Construction (1690 of 2178) PASS: lldb-unit :: Utility/./UtilityTests/GeneratorTest.GetOrCreate (1691 of 2178) UNSUPPORTED: lldb-api :: arm/breakpoint-thumb-codesection/TestBreakpointThumbCodesection.py (1692 of 2178) PASS: lldb-api :: commands/expression/import-std-module/conflicts/TestStdModuleWithConflicts.py (1693 of 2178) PASS: lldb-unit :: Host/./HostTests/NativeProcessProtocolTest.ReadCStringFromMemory (1694 of 2178) PASS: lldb-unit :: Symbol/./SymbolTests/PostfixExpression.ParseFPOProgram (1695 of 2178) PASS: lldb-api :: functionalities/backticks/TestBackticksWithoutATarget.py (1696 of 2178) UNSUPPORTED: lldb-api :: commands/register/register/intel_xtended_registers/TestMPXRegisters.py (1697 of 2178) PASS: lldb-shell :: Reproducer/TestDiscard.test (1698 of 2178) UNSUPPORTED: lldb-api :: linux/sepdebugsymlink/TestTargetSymbolsSepDebugSymlink.py (1699 of 2178) PASS: lldb-unit :: Utility/./UtilityTests/ReproducerTest.SetReplay (1700 of 2178) PASS: lldb-api :: tools/lldb-server/inferior-crash/TestGdbRemoteSegFault.py (1701 of 2178) PASS: lldb-unit :: Utility/./UtilityTests/StreamTeeTest.SetStreamAtIndexOutOfBounds (1702 of 2178) PASS: lldb-api :: functionalities/thread/concurrent_events/TestConcurrentTwoWatchpointsOneDelayBreakpoint.py (1703 of 2178) PASS: lldb-unit :: ScriptInterpreter/Python/./ScriptInterpreterPythonTests/PythonDataObjectsTest.TestPythonIntegerToStructuredInteger (1704 of 2178) PASS: lldb-api :: commands/help/TestHelp.py (1705 of 2178) PASS: lldb-api :: commands/expression/invalid-args/TestInvalidArgsExpression.py (1706 of 2178) PASS: lldb-unit :: UnwindAssembly/x86/./UnwindAssemblyx86Tests/Testx86AssemblyInspectionEngine.TestPopRBX (1707 of 2178) PASS: lldb-api :: python_api/target/TestTargetAPI.py (1708 of 2178) PASS: lldb-shell :: Reproducer/TestRelativePath.test (1709 of 2178) PASS: lldb-api :: functionalities/tsan/global_location/TestTsanGlobalLocation.py (1710 of 2178) PASS: lldb-unit :: ScriptInterpreter/Python/./ScriptInterpreterPythonTests/PythonDataObjectsTest.TestTypeNameResolutionNoDot (1711 of 2178) PASS: lldb-unit :: Utility/./UtilityTests/RangeTest.DoesIntersect (1712 of 2178) PASS: lldb-unit :: Utility/./UtilityTests/FileSpecTest.FormatFileSpec (1713 of 2178) PASS: lldb-unit :: Process/minidump/./LLDBMinidumpTests/MinidumpParserTest.MinidumpDuplicateModuleMappedSecond (1714 of 2178) PASS: lldb-unit :: UnwindAssembly/ARM64/./Arm64InstEmulationTests/TestArm64InstEmulation.TestRegisterSavedTwice (1715 of 2178) PASS: lldb-shell :: SymbolFile/DWARF/debug_loc.s (1716 of 2178) PASS: lldb-shell :: SymbolFile/Breakpad/symtab.test (1717 of 2178) PASS: lldb-unit :: Utility/./UtilityTests/RegisterValueTest.GetSet8 (1718 of 2178) PASS: lldb-unit :: Host/./HostTests/FileSystemTest.MakeAbsolute (1719 of 2178) PASS: lldb-api :: functionalities/breakpoint/step_over_breakpoint/TestStepOverBreakpoint.py (1720 of 2178) PASS: lldb-unit :: Symbol/./SymbolTests/PostfixExpression.ToDWARF (1721 of 2178) PASS: lldb-unit :: Utility/./UtilityTests/StringListTest.SetSize (1722 of 2178) UNSUPPORTED: lldb-shell :: ScriptInterpreter/Lua/nested_sessions.test (1723 of 2178) PASS: lldb-unit :: Utility/./UtilityTests/FileSpecTest.PrependPathComponent (1724 of 2178) PASS: lldb-unit :: SymbolFile/NativePDB/./SymbolFileNativePDBTests/PDBFPOProgramToDWARFExpressionTests.UnknownOp (1725 of 2178) PASS: lldb-api :: lang/c/complex_int/TestComplexInt.py (1726 of 2178) PASS: lldb-unit :: Host/./HostTests/SocketTests/SocketTest.DomainGetConnectURI/ipv4 (1727 of 2178) UNSUPPORTED: lldb-shell :: Register/x86-64-zmm-write.test (1728 of 2178) PASS: lldb-api :: functionalities/gdb_remote_client/TestPlatformClient.py (1729 of 2178) PASS: lldb-unit :: Language/Highlighting/./HighlighterTests/HighlighterTest.ClangStringLiterals (1730 of 2178) PASS: lldb-unit :: Utility/./UtilityTests/StringListTest.JoinNonSpace (1731 of 2178) UNSUPPORTED: lldb-api :: commands/register/register/intel_xtended_registers/mpx_bound_violation/TestBoundViolation.py (1732 of 2178) UNSUPPORTED: lldb-shell :: Register/x86-fp-write.test (1733 of 2178) PASS: lldb-api :: commands/expression/import-std-module/sysroot/TestStdModuleSysroot.py (1734 of 2178) PASS: lldb-api :: functionalities/data-formatter/ptr_ref_typedef/TestPtrRef2Typedef.py (1735 of 2178) PASS: lldb-unit :: Platform/./LLDBPlatformTests/PlatformAppleSimulatorTest.TestSimHasSimEnvionament (1736 of 2178) PASS: lldb-unit :: Core/./LLDBCoreTests/SourceFileCache.FindSourceFileNotFound (1737 of 2178) PASS: lldb-api :: commands/expression/test/TestExprs2.py (1738 of 2178) PASS: lldb-api :: functionalities/data-formatter/data-formatter-objc/nsindexpath/TestDataFormatterNSIndexPath.py (1739 of 2178) PASS: lldb-unit :: Host/./HostTests/Host.WaitStatusFormat (1740 of 2178) UNSUPPORTED: lldb-shell :: SymbolFile/NativePDB/typedefs.cpp (1741 of 2178) PASS: lldb-unit :: Utility/./UtilityTests/StreamTest.PutHex32ByteOrderBig (1742 of 2178) PASS: lldb-api :: lang/cpp/lambdas/TestLambdas.py (1743 of 2178) PASS: lldb-unit :: Utility/./UtilityTests/LogChannelTest.Enable (1744 of 2178) UNSUPPORTED: lldb-api :: functionalities/tty/TestTerminal.py (1745 of 2178) PASS: lldb-api :: sample_test/TestSampleTest.py (1746 of 2178) PASS: lldb-api :: tools/lldb-vscode/runInTerminal/TestVSCode_runInTerminal.py (1747 of 2178) PASS: lldb-shell :: Reproducer/TestFinalize.test (1748 of 2178) PASS: lldb-shell :: Settings/TestModuleCacheSanity.test (1749 of 2178) PASS: lldb-api :: commands/apropos/with-process/TestAproposWithProcess.py (1750 of 2178) PASS: lldb-unit :: Utility/./UtilityTests/RangeTest.Constructor (1751 of 2178) PASS: lldb-unit :: Breakpoint/./LLDBBreakpointTests/BreakpointIDTest.StringIsBreakpointName (1752 of 2178) PASS: lldb-unit :: Utility/./UtilityTests/CompletionRequest.DuplicateFilteringWithComments (1753 of 2178) PASS: lldb-unit :: Utility/./UtilityTests/StringListTest.Join (1754 of 2178) PASS: lldb-api :: functionalities/data-formatter/data-formatter-skip-summary/TestDataFormatterSkipSummary.py (1755 of 2178) PASS: lldb-shell :: SymbolFile/NativePDB/break-by-function.cpp (1756 of 2178) PASS: lldb-api :: functionalities/gdb_remote_client/TestQemuAArch64TargetXml.py (1757 of 2178) PASS: lldb-unit :: Utility/./UtilityTests/ArgsTest.TestAppendArg (1758 of 2178) UNSUPPORTED: lldb-api :: commands/target/auto-install-main-executable/TestAutoInstallMainExecutable.py (1759 of 2178) PASS: lldb-api :: commands/expression/import-std-module/no-std-module/TestMissingStdModule.py (1760 of 2178) PASS: lldb-shell :: ObjectFile/ELF/PT_LOAD-overlap-section.yaml (1761 of 2178) PASS: lldb-shell :: Unwind/trap_frame_sym_ctx.test (1762 of 2178) PASS: lldb-unit :: DataFormatter/./LLDBFormatterTests/TypeMatcherTests.GetMatchStringExactName (1763 of 2178) PASS: lldb-unit :: Utility/./UtilityTests/StreamTeeTest.Constructor1Stream (1764 of 2178) PASS: lldb-unit :: Utility/./UtilityTests/ScalarTest.LongLongAssigmentOperator (1765 of 2178) PASS: lldb-api :: functionalities/breakpoint/breakpoint_set_restart/TestBreakpointSetRestart.py (1766 of 2178) PASS: lldb-unit :: Utility/./UtilityTests/StringListTest.PopBack (1767 of 2178) PASS: lldb-api :: lang/objc/unicode-string/TestUnicodeString.py (1768 of 2178) PASS: lldb-api :: lang/cpp/class-template-parameter-pack/TestClassTemplateParameterPack.py (1769 of 2178) PASS: lldb-unit :: ScriptInterpreter/Python/./ScriptInterpreterPythonTests/PythonDataObjectsTest.TestPythonStringToStructuredString (1770 of 2178) PASS: lldb-api :: commands/expression/import-std-module/vector/TestVectorFromStdModule.py (1771 of 2178) PASS: lldb-shell :: ObjectFile/ELF/section-types-edgecases.yaml (1772 of 2178) PASS: lldb-unit :: Utility/./UtilityTests/StringExtractorTest.GetHexBytesAvail_OddPair (1773 of 2178) PASS: lldb-api :: tools/lldb-server/TestGdbRemote_qThreadStopInfo.py (1774 of 2178) PASS: lldb-api :: commands/expression/namespace_local_var_same_name_cpp_and_c/TestNamespaceLocalVarSameNameCppAndC.py (1775 of 2178) PASS: lldb-api :: functionalities/data-formatter/frameformat_smallstruct/TestFrameFormatSmallStruct.py (1776 of 2178) PASS: lldb-shell :: SymbolFile/DWARF/debug-types-dwarf5.s (1777 of 2178) PASS: lldb-api :: functionalities/unwind/sigtramp/TestSigtrampUnwind.py (1778 of 2178) PASS: lldb-api :: functionalities/data-formatter/data-formatter-proper-plurals/TestFormattersOneIsSingular.py (1779 of 2178) PASS: lldb-api :: types/TestCharType.py (1780 of 2178) PASS: lldb-unit :: Utility/./UtilityTests/StringListTest.ShiftMove (1781 of 2178) PASS: lldb-unit :: Utility/./UtilityTests/ProcessInstanceInfoList.Yaml (1782 of 2178) PASS: lldb-unit :: Host/./HostTests/SocketTests/SocketTest.UDPConnect/ipv6 (1783 of 2178) PASS: lldb-unit :: Utility/./UtilityTests/VMRange.Clear (1784 of 2178) PASS: lldb-api :: macosx/find-dsym/bundle-with-dot-in-filename/TestBundleWithDotInFilename.py (1785 of 2178) PASS: lldb-api :: functionalities/thread/concurrent_events/TestConcurrentSignalBreak.py (1786 of 2178) PASS: lldb-shell :: SymbolFile/DWARF/dwo-type-in-main-file.s (1787 of 2178) PASS: lldb-api :: lang/objc/objc-static-method/TestObjCStaticMethod.py (1788 of 2178) PASS: lldb-unit :: Utility/./UtilityTests/StatusTest.ErrorConstructor (1789 of 2178) PASS: lldb-unit :: UnwindAssembly/x86/./UnwindAssemblyx86Tests/Testx86AssemblyInspectionEngine.TestDisassemblyJunkBytes (1790 of 2178) PASS: lldb-shell :: Commands/command-regex-unalias.test (1791 of 2178) PASS: lldb-api :: functionalities/data-formatter/summary-string-onfail/Test-rdar-9974002.py (1792 of 2178) PASS: lldb-unit :: UnwindAssembly/x86/./UnwindAssemblyx86Tests/Testx86AssemblyInspectionEngine.TestDisassemblyMidFunctionEpilogues (1793 of 2178) PASS: lldb-unit :: Host/./HostTests/MainLoopTest.TerminatesImmediately (1794 of 2178) PASS: lldb-shell :: ObjectFile/PECOFF/basic-info-arm.yaml (1795 of 2178) PASS: lldb-shell :: Recognizer/assert.test (1796 of 2178) PASS: lldb-unit :: Instruction/./EmulatorTests/TestAArch64Emulator.TestOverflow (1797 of 2178) PASS: lldb-api :: tools/lldb-server/TestGdbRemoteExitCode.py (1798 of 2178) PASS: lldb-api :: functionalities/data-formatter/data-formatter-stl/libcxx/initializerlist/TestInitializerList.py (1799 of 2178) PASS: lldb-unit :: Utility/./UtilityTests/StringListTest.SplitIntoLines (1800 of 2178) PASS: lldb-unit :: Utility/./UtilityTests/NameMatchesTest.StartsWith (1801 of 2178) PASS: lldb-api :: commands/command/source/TestCommandSource.py (1802 of 2178) PASS: lldb-api :: lang/cpp/subst_template_type_param/TestSubstTemplateTypeParam.py (1803 of 2178) PASS: lldb-unit :: Thread/./ThreadTests/ThreadTest.GetPrivateStopInfo (1804 of 2178) UNSUPPORTED: lldb-shell :: Unwind/eh-frame-small-fde.test (1805 of 2178) PASS: lldb-unit :: Utility/./UtilityTests/BroadcasterTest.BroadcastEvent (1806 of 2178) PASS: lldb-unit :: SymbolFile/DWARF/./SymbolFileDWARFTests/SymbolFileDWARFTests.TestAbbrevOrder1Start5 (1807 of 2178) PASS: lldb-unit :: Utility/./UtilityTests/DataExtractorTest.GetCStrUnterminated (1808 of 2178) PASS: lldb-api :: lang/objc/real-definition/TestRealDefinition.py (1809 of 2178) PASS: lldb-unit :: Symbol/./SymbolTests/TestTypeSystemClang.TestGetEnumIntegerTypeInvalid (1810 of 2178) PASS: lldb-api :: functionalities/signal/raise/TestRaise.py (1811 of 2178) PASS: lldb-api :: macosx/macCatalyst/TestMacCatalyst.py (1812 of 2178) PASS: lldb-api :: functionalities/thread/ignore_suspended/TestIgnoreSuspendedThread.py (1813 of 2178) PASS: lldb-shell :: ScriptInterpreter/Python/python.test (1814 of 2178) PASS: lldb-api :: commands/process/attach/attach_denied/TestAttachDenied.py (1815 of 2178) PASS: lldb-unit :: Process/minidump/./LLDBMinidumpTests/MinidumpParserTest.GetThreadContext_x86_32 (1816 of 2178) PASS: lldb-unit :: ScriptInterpreter/Python/./ScriptInterpreterPythonTests/PythonDataObjectsTest.TestPythonListManipulation (1817 of 2178) PASS: lldb-unit :: Host/./HostTests/FileSystemTest.EmptyTest (1818 of 2178) UNSUPPORTED: lldb-api :: tools/lldb-server/TestGdbRemoteModuleInfo.py (1819 of 2178) PASS: lldb-unit :: Utility/./UtilityTests/XcodeSDKTest.GetSDKTypeForTriple (1820 of 2178) PASS: lldb-api :: functionalities/thread/concurrent_events/TestConcurrentBreakpointOneDelayBreakpointThreads.py (1821 of 2178) PASS: lldb-api :: functionalities/breakpoint/breakpoint_options/TestBreakpointOptions.py (1822 of 2178) PASS: lldb-api :: commands/expression/anonymous-struct/TestCallUserAnonTypedef.py (1823 of 2178) PASS: lldb-api :: functionalities/gdb_remote_client/TestGDBRemoteDiskFileCompletion.py (1824 of 2178) PASS: lldb-unit :: Utility/./UtilityTests/AnsiTerminal.Twice (1825 of 2178) PASS: lldb-shell :: SymbolFile/DWARF/dwp-separate-debug-file.cpp (1826 of 2178) PASS: lldb-unit :: Utility/./UtilityTests/ArgsTest.AppendArguments (1827 of 2178) PASS: lldb-unit :: Expression/./ExpressionTests/DiagnosticManagerTest.AppendMessageAttachToLastDiag (1828 of 2178) UNSUPPORTED: lldb-api :: functionalities/darwin_log/filter/regex/activity/TestDarwinLogFilterRegexActivity.py (1829 of 2178) PASS: lldb-api :: tools/lldb-server/TestGdbRemote_vCont.py (1830 of 2178) PASS: lldb-api :: commands/expression/call-throws/TestCallThatThrows.py (1831 of 2178) PASS: lldb-api :: commands/expression/diagnostics/TestExprDiagnostics.py (1832 of 2178) PASS: lldb-api :: commands/expression/ir-interpreter/TestIRInterpreter.py (1833 of 2178) PASS: lldb-unit :: Process/minidump/./LLDBMinidumpTests/MinidumpParserTest.GetMemoryRegionInfoFromMemoryList (1834 of 2178) PASS: lldb-unit :: ScriptInterpreter/Python/./ScriptInterpreterPythonTests/PythonDataObjectsTest.TestDictionaryResolutionWithDot (1835 of 2178) PASS: lldb-api :: functionalities/signal/handle-abrt/TestHandleAbort.py (1836 of 2178) PASS: lldb-api :: functionalities/thread/concurrent_events/TestConcurrentDelayedCrashWithBreakpointWatchpoint.py (1837 of 2178) PASS: lldb-unit :: Utility/./UtilityTests/ConstStringTest.CompareConstString (1838 of 2178) PASS: lldb-unit :: Symbol/./SymbolTests/LineEntryTest.GetSameLineContiguousAddressRangeNestedInline (1839 of 2178) PASS: lldb-api :: lang/cpp/this_class_type_mixing/TestThisClassTypeMixing.py (1840 of 2178) PASS: lldb-unit :: Process/minidump/./LLDBMinidumpTests/MinidumpParserTest.GetMemoryRegionInfoFromMemory64List (1841 of 2178) PASS: lldb-unit :: ObjectFile/Breakpad/./ObjectFileBreakpadTests/PublicRecord.parse (1842 of 2178) PASS: lldb-api :: python_api/watchpoint/TestWatchpointIter.py (1843 of 2178) PASS: lldb-unit :: Utility/./UtilityTests/GeneratorTest.Create (1844 of 2178) PASS: lldb-api :: lang/cpp/function-qualifiers/TestCppFunctionQualifiers.py (1845 of 2178) PASS: lldb-shell :: Breakpoint/ppc64-localentry.test (1846 of 2178) PASS: lldb-shell :: SymbolFile/Breakpad/unwind-via-raSearch.test (1847 of 2178) PASS: lldb-api :: python_api/exprpath_synthetic/TestExprPathSynthetic.py (1848 of 2178) PASS: lldb-shell :: SymbolFile/DWARF/debug-types-dwo-cross-reference.cpp (1849 of 2178) PASS: lldb-unit :: Process/gdb-remote/./ProcessGdbRemoteTests/GDBRemoteCommunicationClientTest.SendStartTracePacket (1850 of 2178) PASS: lldb-unit :: Utility/./UtilityTests/StringListTest.GetMaxStringLengthEqualSize (1851 of 2178) PASS: lldb-unit :: Language/Highlighting/./HighlighterTests/HighlighterTest.ClangCursorPosBeforeOtherToken (1852 of 2178) PASS: lldb-api :: functionalities/data-formatter/poarray/TestPrintObjectArray.py (1853 of 2178) PASS: lldb-api :: lang/objc/rdar-11355592/TestRdar11355592.py (1854 of 2178) PASS: lldb-shell :: Reproducer/TestProcessList.test (1855 of 2178) PASS: lldb-api :: functionalities/tail_call_frames/cross_object/TestCrossObjectTailCalls.py (1856 of 2178) PASS: lldb-api :: tools/lldb-server/TestLldbGdbServer.py (1857 of 2178) PASS: lldb-shell :: Watchpoint/SetErrorCases.test (1858 of 2178) PASS: lldb-api :: commands/gui/basic/TestGuiBasic.py (1859 of 2178) UNSUPPORTED: lldb-api :: tools/intel-features/intel-pt/test/TestIntelPTSimpleBinary.py (1860 of 2178) PASS: lldb-unit :: ObjectFile/ELF/./ObjectFileELFTests/ObjectFileELFTest.SectionsResolveConsistently (1861 of 2178) PASS: lldb-api :: lang/cpp/multiple-inheritance/TestCppMultipleInheritance.py (1862 of 2178) PASS: lldb-unit :: Core/./LLDBCoreTests/RichManglingContextTest.IPDRealloc (1863 of 2178) PASS: lldb-shell :: SymbolFile/DWARF/debug_line-tombstone.s (1864 of 2178) PASS: lldb-unit :: Process/minidump/./LLDBMinidumpTests/MinidumpParserTest.GetMemoryRegionInfo (1865 of 2178) PASS: lldb-unit :: Expression/./ExpressionTests/DiagnosticManagerTest.PutStringMultiple (1866 of 2178) PASS: lldb-unit :: Utility/./UtilityTests/ScalarTest.Equality (1867 of 2178) PASS: lldb-shell :: Driver/TestSingleQuote.test (1868 of 2178) PASS: lldb-shell :: Reproducer/TestWorkingDir.test (1869 of 2178) PASS: lldb-api :: functionalities/breakpoint/comp_dir_symlink/TestCompDirSymLink.py (1870 of 2178) XFAIL: lldb-shell :: Register/x86-64-ymm-write.test (1871 of 2178) PASS: lldb-unit :: Process/gdb-remote/./ProcessGdbRemoteTests/GDBRemoteCommunicationServerTest.SendErrorResponse_StringError (1872 of 2178) PASS: lldb-unit :: Utility/./UtilityTests/StreamTest.PutChar (1873 of 2178) PASS: lldb-api :: functionalities/breakpoint/scripted_bkpt/TestScriptedResolver.py (1874 of 2178) PASS: lldb-api :: functionalities/recursion/TestValueObjectRecursion.py (1875 of 2178) PASS: lldb-shell :: SymbolFile/DWARF/inline-function-address-shared.test (1876 of 2178) PASS: lldb-unit :: SymbolFile/NativePDB/./SymbolFileNativePDBTests/PDBFPOProgramToDWARFExpressionTests.MultipleIndependentAssignments (1877 of 2178) PASS: lldb-unit :: Utility/./UtilityTests/StringListTest.LongestCommonPrefixNoPrefix (1878 of 2178) PASS: lldb-unit :: Utility/./UtilityTests/DataExtractorTest.PeekData (1879 of 2178) PASS: lldb-unit :: Utility/./UtilityTests/RecordReplayTest.InstrumentedBarRef (1880 of 2178) PASS: lldb-api :: functionalities/data-formatter/data-formatter-objc/TestDataFormatterObjCNSBundle.py (1881 of 2178) PASS: lldb-unit :: Host/./HostTests/SocketAddressTest.Set (1882 of 2178) PASS: lldb-api :: commands/process/attach/TestProcessAttach.py (1883 of 2178) PASS: lldb-unit :: UnwindAssembly/x86/./UnwindAssemblyx86Tests/Testx86AssemblyInspectionEngine.TestPushR15 (1884 of 2178) PASS: lldb-api :: commands/frame/diagnose/inheritance/TestDiagnoseInheritance.py (1885 of 2178) PASS: lldb-api :: commands/expression/expr-in-syscall/TestExpressionInSyscall.py (1886 of 2178) PASS: lldb-unit :: Utility/./UtilityTests/LogChannelTest.EnableOptions (1887 of 2178) UNSUPPORTED: lldb-shell :: Process/Windows/exception_access_violation.cpp (1888 of 2178) PASS: lldb-shell :: SymbolFile/NativePDB/s_constant.cpp (1889 of 2178) PASS: lldb-shell :: SymbolFile/NativePDB/global-classes.cpp (1890 of 2178) PASS: lldb-unit :: Process/gdb-remote/./ProcessGdbRemoteTests/GDBRemoteCommunicationClientTest.SendGetTraceConfigPacket (1891 of 2178) PASS: lldb-api :: lang/cpp/virtual-functions/TestCppVirtualFunctions.py (1892 of 2178) PASS: lldb-unit :: Utility/./UtilityTests/DataExtractorTest.GetFloat (1893 of 2178) PASS: lldb-shell :: SymbolFile/DWARF/DW_AT_location-DW_AT_const_value.s (1894 of 2178) UNSUPPORTED: lldb-api :: python_api/event/TestEvents.py (1895 of 2178) PASS: lldb-unit :: Utility/./UtilityTests/BinaryStreamTest.PutSLEB128TwoBytes (1896 of 2178) PASS: lldb-api :: functionalities/memory-region/TestMemoryRegion.py (1897 of 2178) PASS: lldb-unit :: Utility/./UtilityTests/LogChannelTest.Disable (1898 of 2178) PASS: lldb-api :: sample_test/TestSampleInlineTest.py (1899 of 2178) PASS: lldb-unit :: Expression/./ExpressionTests/CppModuleConfigurationTest.IgnoreLibStdCpp (1900 of 2178) PASS: lldb-shell :: ObjectFile/Breakpad/sections-trailing-func.test (1901 of 2178) PASS: lldb-api :: commands/expression/import-std-module/list/TestListFromStdModule.py (1902 of 2178) PASS: lldb-api :: functionalities/data-formatter/ostypeformatting/TestFormattersOsType.py (1903 of 2178) PASS: lldb-shell :: Settings/TestStopCommandSourceOnError.test (1904 of 2178) UNSUPPORTED: lldb-api :: benchmarks/stepping/TestSteppingSpeed.py (1905 of 2178) PASS: lldb-unit :: Utility/./UtilityTests/StringListTest.LongestCommonPrefixDuplicateElement (1906 of 2178) PASS: lldb-api :: functionalities/data-formatter/data-formatter-objc/TestDataFormatterObjCExpr.py (1907 of 2178) PASS: lldb-unit :: Utility/./UtilityTests/StringListTest.InsertStringAtIndexEnd (1908 of 2178) PASS: lldb-unit :: Utility/./UtilityTests/ConstStringTest.MangledCounterpart (1909 of 2178) PASS: lldb-unit :: Process/minidump/./LLDBMinidumpTests/MinidumpParserTest.MinidumpDuplicateModuleMappedFirst (1910 of 2178) PASS: lldb-shell :: SymbolFile/DWARF/DW_TAG_basic_type_DW_ATE_UTF_nonC.ll (1911 of 2178) PASS: lldb-unit :: Utility/./UtilityTests/RangeTest.DefaultConstructor (1912 of 2178) PASS: lldb-unit :: Utility/./UtilityTests/StringListTest.SplitIntoLinesEmpty (1913 of 2178) PASS: lldb-unit :: Host/./HostTests/HostInfoTest.GetAugmentedArchSpec (1914 of 2178) PASS: lldb-api :: lang/cpp/scope/TestCppScope.py (1915 of 2178) PASS: lldb-unit :: ObjectFile/Breakpad/./ObjectFileBreakpadTests/LineRecord.parse (1916 of 2178) UNSUPPORTED: lldb-shell :: SymbolFile/target-symbols-add-unwind.test (1917 of 2178) PASS: lldb-shell :: SymbolFile/DWARF/deterministic-build.cpp (1918 of 2178) PASS: lldb-unit :: SymbolFile/DWARF/./SymbolFileDWARFTests/SymbolFileDWARFTests.TestAbbrevMissingTerminator (1919 of 2178) UNSUPPORTED: lldb-shell :: ScriptInterpreter/Lua/watchpoint_callback.test (1920 of 2178) PASS: lldb-api :: api/multithreaded/TestMultithreaded.py (1921 of 2178) PASS: lldb-shell :: SymbolFile/DWARF/find-basic-variable.cpp (1922 of 2178) PASS: lldb-unit :: Utility/./UtilityTests/StreamTeeTest.AppendStream (1923 of 2178) PASS: lldb-shell :: Quit/TestQuitExitCode-30.test (1924 of 2178) PASS: lldb-api :: functionalities/breakpoint/breakpoint_callback_command_source/TestBreakpointCallbackCommandSource.py (1925 of 2178) PASS: lldb-shell :: ObjectFile/ELF/avr-basic-info.yaml (1926 of 2178) PASS: lldb-api :: commands/expression/import-std-module/pair/TestPairFromStdModule.py (1927 of 2178) UNSUPPORTED: lldb-shell :: SymbolFile/DWARF/split-dwarf-expression-eval-bug.cpp (1928 of 2178) UNSUPPORTED: lldb-api :: functionalities/darwin_log/basic/TestDarwinLogBasic.py (1929 of 2178) PASS: lldb-shell :: BuildScript/script-args.test (1930 of 2178) PASS: lldb-unit :: Utility/./UtilityTests/SerializationRountripTest.SerializeDeserializeCStringArray (1931 of 2178) PASS: lldb-unit :: Core/./LLDBCoreTests/ModuleSpecTest.TestMachOFile (1932 of 2178) PASS: lldb-shell :: SymbolFile/DWARF/find-variable-file.cpp (1933 of 2178) PASS: lldb-api :: api/check_public_api_headers/TestPublicAPIHeaders.py (1934 of 2178) PASS: lldb-unit :: Expression/./ExpressionTests/DWARFExpression.DW_OP_convert (1935 of 2178) PASS: lldb-api :: commands/expression/save_jit_objects/TestSaveJITObjects.py (1936 of 2178) PASS: lldb-shell :: ObjectFile/PECOFF/disassemble-thumb.yaml (1937 of 2178) PASS: lldb-unit :: Process/minidump/./LLDBMinidumpTests/MinidumpParserTest.GetThreadsAndGetThreadContext (1938 of 2178) PASS: lldb-shell :: SymbolFile/NativePDB/ast-types.cpp (1939 of 2178) PASS: lldb-api :: commands/watchpoints/watchpoint_disable/TestWatchpointDisable.py (1940 of 2178) UNSUPPORTED: lldb-shell :: SymbolFile/PDB/function-level-linking.test (1941 of 2178) PASS: lldb-shell :: SymbolFile/DWARF/debug_aranges-empty-section.s (1942 of 2178) UNSUPPORTED: lldb-shell :: Register/x86-64-xmm16-read.test (1943 of 2178) PASS: lldb-api :: functionalities/data-formatter/data-formatter-stl/libcxx/list/TestDataFormatterLibcxxList.py (1944 of 2178) PASS: lldb-api :: functionalities/tsan/basic/TestTsanBasic.py (1945 of 2178) PASS: lldb-api :: macosx/lc-note/firmware-corefile/TestFirmwareCorefiles.py (1946 of 2178) PASS: lldb-shell :: Driver/TestHelp.test (1947 of 2178) PASS: lldb-shell :: ObjectFile/MachO/lc_build_version.yaml (1948 of 2178) UNSUPPORTED: lldb-shell :: SymbolFile/PDB/udt-layout.test (1949 of 2178) PASS: lldb-unit :: Utility/./UtilityTests/SerializationRountripTest.SerializeDeserializeCStringArrayNullptrElem (1950 of 2178) PASS: lldb-api :: lang/cpp/class_types/TestClassTypes.py (1951 of 2178) PASS: lldb-unit :: Expression/./ExpressionTests/DiagnosticManagerTest.GetStringMultipleDiags (1952 of 2178) PASS: lldb-api :: functionalities/data-formatter/data-formatter-stl/libcxx/tuple/TestDataFormatterLibcxxTuple.py (1953 of 2178) PASS: lldb-unit :: Utility/./UtilityTests/StringExtractorTest.GetNameColonValueNoSemicolon (1954 of 2178) PASS: lldb-unit :: Utility/./UtilityTests/PassiveReplayTest.InstrumentedBar (1955 of 2178) PASS: lldb-api :: functionalities/data-formatter/data-formatter-objc/TestDataFormatterObjCNSError.py (1956 of 2178) PASS: lldb-unit :: Expression/./ExpressionTests/DiagnosticManagerTest.GetStringNoDiags (1957 of 2178) PASS: lldb-shell :: SymbolFile/DWARF/dir-separator-no-comp-dir.s (1958 of 2178) PASS: lldb-api :: commands/watchpoints/watchpoint_events/TestWatchpointEvents.py (1959 of 2178) PASS: lldb-unit :: Process/minidump/./LLDBMinidumpTests/RegisterContextMinidump.ConvertMinidumpContext_x86_64 (1960 of 2178) PASS: lldb-shell :: Commands/command-stop-hook-output.test (1961 of 2178) PASS: lldb-api :: commands/expression/regression-access-function-template-in-record/TestRegressionAccessFunctionTemplateInRecord.py (1962 of 2178) PASS: lldb-unit :: Process/minidump/./LLDBMinidumpTests/MinidumpParserTest.GetPid (1963 of 2178) PASS: lldb-unit :: ScriptInterpreter/Python/./ScriptInterpreterPythonTests/PythonDataObjectsTest.TestInstanceNameResolutionNoDot (1964 of 2178) PASS: lldb-api :: lang/cpp/frame-var-anon-unions/TestFrameVariableAnonymousUnions.py (1965 of 2178) PASS: lldb-unit :: Utility/./UtilityTests/ScalarTest.Promotion (1966 of 2178) PASS: lldb-unit :: Utility/./UtilityTests/UriParserTest.BracketedHostnameWithColon (1967 of 2178) PASS: lldb-unit :: Core/./LLDBCoreTests/MangledTest.NameIndexes_FindFunctionSymbols (1968 of 2178) PASS: lldb-unit :: UnwindAssembly/x86/./UnwindAssemblyx86Tests/Testx86AssemblyInspectionEngine.TestSpArithx86_64Augmented (1969 of 2178) PASS: lldb-api :: lang/objc/objc-dyn-sbtype/TestObjCDynamicSBType.py (1970 of 2178) PASS: lldb-unit :: Symbol/./SymbolTests/TestClangASTImporter.MetadataPropagationIndirectImport (1971 of 2178) PASS: lldb-unit :: Core/./LLDBCoreTests/MangledTest.EmptyForInvalidName (1972 of 2178) PASS: lldb-api :: commands/frame/recognizer/TestFrameRecognizer.py (1973 of 2178) PASS: lldb-shell :: SymbolFile/Breakpad/unwind-via-stack-win.test (1974 of 2178) PASS: lldb-unit :: Utility/./UtilityTests/BinaryStreamTest.PutSLEB128OneByte (1975 of 2178) PASS: lldb-shell :: SymbolFile/DWARF/dwp.s (1976 of 2178) UNSUPPORTED: lldb-shell :: BuildScript/toolchain-clang-cl.test (1977 of 2178) PASS: lldb-unit :: Utility/./UtilityTests/ScalarTest.SetValueFromData (1978 of 2178) PASS: lldb-shell :: Quit/TestQuitExitCode0.test (1979 of 2178) PASS: lldb-unit :: Core/./LLDBCoreTests/RichManglingContextTest.Basic (1980 of 2178) PASS: lldb-api :: functionalities/inferior-crashing/TestInferiorCrashingStep.py (1981 of 2178) PASS: lldb-unit :: Process/gdb-remote/./ProcessGdbRemoteTests/GDBRemoteCommunicationTest.ReadPacket_checksum (1982 of 2178) PASS: lldb-api :: functionalities/thread/concurrent_events/TestConcurrentCrashWithWatchpoint.py (1983 of 2178) PASS: lldb-api :: lang/objc/modules-hash-mismatch/TestClangModulesHashMismatch.py (1984 of 2178) PASS: lldb-unit :: Language/Highlighting/./HighlighterTests/HighlighterTest.ClangCursorPosEndOfLine (1985 of 2178) PASS: lldb-unit :: Utility/./UtilityTests/SharedCluster.ClusterManager (1986 of 2178) UNSUPPORTED: lldb-api :: tools/lldb-server/TestGdbRemote_vContThreads.py (1987 of 2178) PASS: lldb-unit :: Utility/./UtilityTests/EventTest.DumpEventDataBytes (1988 of 2178) PASS: lldb-unit :: UnwindAssembly/x86/./UnwindAssemblyx86Tests/Testx86AssemblyInspectionEngine.TestSpillRegToStackViaMOVi386 (1989 of 2178) PASS: lldb-unit :: Utility/./UtilityTests/BinaryStreamTest.PutULEB128FourBytes (1990 of 2178) PASS: lldb-shell :: Register/x86-64-read.test (1991 of 2178) PASS: lldb-api :: commands/expression/po_verbosity/TestPoVerbosity.py (1992 of 2178) PASS: lldb-api :: lang/c/bitfields/TestBitfields.py (1993 of 2178) PASS: lldb-api :: functionalities/data-formatter/data-formatter-python-synth/TestDataFormatterPythonSynth.py (1994 of 2178) PASS: lldb-unit :: Utility/./UtilityTests/StringExtractorTest.DecodeHexU8_InvalidHex2 (1995 of 2178) PASS: lldb-api :: commands/watchpoints/watchpoint_set_command/TestWatchLocationWithWatchSet.py (1996 of 2178) PASS: lldb-api :: commands/watchpoints/watchpoint_commands/TestWatchpointCommands.py (1997 of 2178) PASS: lldb-shell :: Driver/TestNoUseColor.test (1998 of 2178) PASS: lldb-unit :: Process/minidump/./LLDBMinidumpTests/MinidumpParserTest.MinidumpDuplicateModuleSeparateCode (1999 of 2178) PASS: lldb-unit :: debugserver/./debugserverTests/RNBSocket.LoopBackConnectIPv4 (2000 of 2178) UNSUPPORTED: lldb-api :: commands/trace/TestTraceLoad.py (2001 of 2178) PASS: lldb-shell :: SymbolFile/Breakpad/unwind-via-stack-win-no-memory-info.yaml (2002 of 2178) PASS: lldb-api :: commands/process/launch-with-shellexpand/TestLaunchWithShellExpand.py (2003 of 2178) PASS: lldb-api :: macosx/find-dsym/deep-bundle/TestDeepBundle.py (2004 of 2178) PASS: lldb-api :: functionalities/signal/TestSendSignal.py (2005 of 2178) PASS: lldb-unit :: Utility/./UtilityTests/StreamTest.PutRawBytesToLittleEndian (2006 of 2178) PASS: lldb-api :: lang/cpp/incomplete-types/TestCppIncompleteTypes.py (2007 of 2178) PASS: lldb-api :: commands/expression/calculator_mode/TestCalculatorMode.py (2008 of 2178) PASS: lldb-api :: functionalities/data-formatter/data-formatter-enum-format/TestDataFormatterEnumFormat.py (2009 of 2178) PASS: lldb-api :: functionalities/multiword-commands/TestMultiWordCommands.py (2010 of 2178) PASS: lldb-shell :: SymbolFile/DWARF/DW_AT_const_value.s (2011 of 2178) PASS: lldb-api :: lang/cpp/extern_c/TestExternCSymbols.py (2012 of 2178) PASS: lldb-api :: python_api/hello_world/TestHelloWorld.py (2013 of 2178) PASS: lldb-unit :: Symbol/./SymbolTests/Type.GetTypeScopeAndBasename (2014 of 2178) PASS: lldb-unit :: Utility/./UtilityTests/BinaryStreamTest.PutULEB128MaxValue (2015 of 2178) PASS: lldb-unit :: Utility/./UtilityTests/BinaryStreamTest.PutSLEB128FourBytes (2016 of 2178) UNSUPPORTED: lldb-shell :: SymbolFile/PDB/vbases.test (2017 of 2178) PASS: lldb-unit :: Utility/./UtilityTests/UriParserTest.SchemeHostSeparator4 (2018 of 2178) PASS: lldb-unit :: Utility/./UtilityTests/StreamTest.PutHex64ByteOrderBig (2019 of 2178) PASS: lldb-shell :: Driver/TestRepl.test (2020 of 2178) PASS: lldb-api :: functionalities/data-formatter/data-formatter-stl/libcxx/unique_ptr/TestDataFormatterLibcxxUniquePtr.py (2021 of 2178) PASS: lldb-api :: lang/cpp/dynamic-value-same-basename/TestDynamicValueSameBase.py (2022 of 2178) FAIL: lldb-api :: functionalities/gdb_remote_client/TestGDBRemoteClient.py (2023 of 2178) ******************** TEST 'lldb-api :: functionalities/gdb_remote_client/TestGDBRemoteClient.py' FAILED ******************** Script: -- /usr/local/Frameworks/Python.framework/Versions/3.7/bin/python3.7 /Users/buildslave/jenkins/workspace/lldb-cmake/llvm-project/lldb/test/API/dotest.py -S nm -u CXXFLAGS -u CFLAGS --codesign-identity - --arch x86_64 --build-dir /Users/buildslave/jenkins/workspace/lldb-cmake/lldb-build/lldb-test-build.noindex -s=/Users/buildslave/jenkins/workspace/lldb-cmake/test/logs -t --env TERM=vt100 --env LLVM_LIBS_DIR=/Users/buildslave/jenkins/workspace/lldb-cmake/lldb-build/./lib --arch x86_64 --build-dir /Users/buildslave/jenkins/workspace/lldb-cmake/lldb-build/lldb-test-build.noindex -s /Users/buildslave/jenkins/workspace/lldb-cmake/lldb-build/lldb-test-traces --lldb-module-cache-dir /Users/buildslave/jenkins/workspace/lldb-cmake/lldb-build/lldb-test-build.noindex/module-cache-lldb/lldb-api --clang-module-cache-dir /Users/buildslave/jenkins/workspace/lldb-cmake/lldb-build/lldb-test-build.noindex/module-cache-clang/lldb-api --executable /Users/buildslave/jenkins/workspace/lldb-cmake/lldb-build/./bin/lldb --compiler /Users/buildslave/jenkins/workspace/lldb-cmake/lldb-build/./bin/clang --dsymutil /Users/buildslave/jenkins/workspace/lldb-cmake/lldb-build/./bin/dsymutil --filecheck /Users/buildslave/jenkins/workspace/lldb-cmake/lldb-build/./bin/FileCheck --yaml2obj /Users/buildslave/jenkins/workspace/lldb-cmake/lldb-build/./bin/yaml2obj --server /Users/buildslave/jenkins/workspace/lldb-cmake/lldb-build/./bin/debugserver --lldb-libs-dir /Users/buildslave/jenkins/workspace/lldb-cmake/lldb-build/./lib /Users/buildslave/jenkins/workspace/lldb-cmake/llvm-project/lldb/test/API/functionalities/gdb_remote_client -p TestGDBRemoteClient.py -- Exit Code: 1

Hide Details

Command Output (stdout): -- lldb version 12.0.99 (http://labmaster3.local/git/llvm-project.git revision 2e204e23911b1f8bd1463535da40c6e48747a138) clang revision 2e204e23911b1f8bd1463535da40c6e48747a138 llvm revision 2e204e23911b1f8bd1463535da40c6e48747a138 < 1> send packet: + history[1] tid=0x0307 < 1> send packet: + < 19> send packet: $QStartNoAckMode#b0 < 1> read packet: + < 6> read packet: $OK#9a < 1> send packet: + < 45> send packet: $qSupported:xmlRegisters=i386,arm,mips,arc#74 < 57> read packet: $qXfer:features:read+;PacketSize=3fff;QStartNoAckMode+#86 < 26> send packet: $QThreadSuffixSupported#e4 < 4> read packet: $#00 < 27> send packet: $QListThreadsInStopReply#21 < 4> read packet: $#00 < 13> send packet: $qHostInfo#9b < 28> read packet: $ptrsize:8;endian:little;#30 < 10> send packet: $vCont?#49 < 4> read packet: $#00 < 27> send packet: $qVAttachOrWaitSupported#38 < 4> read packet: $#00 < 23> send packet: $QEnableErrorStrings#8c < 6> read packet: $OK#9a < 16> send packet: $qProcessInfo#dc < 4> read packet: $#00 < 6> send packet: $qC#b4 < 7> read packet: $E42#ab < 16> send packet: $qfThreadInfo#bb < 6> read packet: $OK#9a < 38> send packet: $QSetSTDIN:2f6465762f74747973303032#86 < 4> read packet: $#00 < 39> send packet: $QSetSTDOUT:2f6465762f74747973303032#e7 < 4> read packet: $#00 < 39> send packet: $QSetSTDERR:2f6465762f74747973303032#d8 < 4> read packet: $#00 < 21> send packet: $QSetDisableASLR:0#cd < 4> read packet: $#00 < 23> send packet: $QSetDetachOnError:0#f7 < 4> read packet: $#00 < 19> send packet: $QLaunchArch:arm#a4 < 4> read packet: $#00 < 112> send packet: $QEnvironment:LLDB_SESSION_DIRNAME=/Users/buildslave/jenkins/workspace/lldb-cmake/lldb-build/lldb-test-traces#85 < 4> read packet: $#00 < 319> send packet: $A308,0,2f55736572732f6275696c64736c6176652f6a656e6b696e732f776f726b73706163652f6c6c64622d636d616b652f6c6c64622d6275696c642f6c6c64622d746573742d6275696c642e6e6f696e6465782f66756e6374696f6e616c69746965732f6764625f72656d6f74655f636c69656e742f5465737447444252656d6f7465436c69656e742e746573745f6c61756e63685f6661696c2f61#e4 < 7> read packet: $E47#b0 < 1> send packet: + history[1] tid=0x0307 < 1> send packet: + < 19> send packet: $QStartNoAckMode#b0 < 1> read packet: + < 6> read packet: $OK#9a < 1> send packet: + < 45> send packet: $qSupported:xmlRegisters=i386,arm,mips,arc#74 < 57> read packet: $qXfer:features:read+;PacketSize=3fff;QStartNoAckMode+#86 < 26> send packet: $QThreadSuffixSupported#e4 < 4> read packet: $#00 < 27> send packet: $QListThreadsInStopReply#21 < 4> read packet: $#00 < 13> send packet: $qHostInfo#9b < 28> read packet: $ptrsize:8;endian:little;#30 < 10> send packet: $vCont?#49 < 4> read packet: $#00 < 27> send packet: $qVAttachOrWaitSupported#38 < 4> read packet: $#00 < 23> send packet: $QEnableErrorStrings#8c < 6> read packet: $OK#9a < 16> send packet: $qProcessInfo#dc < 4> read packet: $#00 < 6> send packet: $qC#b4 < 7> read packet: $QC0#c4 < 16> send packet: $qfThreadInfo#bb < 5> read packet: $l#6c < 5> send packet: $?#3f < 7> read packet: $S02#b5 < 16> send packet: $qProcessInfo#dc < 4> read packet: $#00 < 41> send packet: $qXfer:features:read:target.xml:0,3ffe#af < 4> read packet: $#00 < 18> send packet: $qRegisterInfo0#72 < 4> read packet: $#00 < 16> send packet: $qfThreadInfo#bb < 5> read packet: $l#6c < 7> send packet: $Hg1#e0 < 6> read packet: $OK#9a < 6> send packet: $p0#a0 < 12> read packet: $00000000#80 < 16> send packet: $qProcessInfo#dc < 4> read packet: $#00 < 12> send packet: $qOffsets#4b < 4> read packet: $#00 < 26> send packet: $qStructuredDataPlugins#02 < 4> read packet: $#00 < 13> send packet: $qSymbol::#5b < 6> read packet: $OK#9a < 16> send packet: $qfThreadInfo#bb < 5> read packet: $l#6c < 16> send packet: $qfThreadInfo#bb < 5> read packet: $l#6c < 5> send packet: $g#67 < 860> read packet: $0000000000000000000000000000000000000000000000000000000000000000000000000000000000000000000000000000000000000000000000000000000000000000000000000000000000000000000000000000000000000000000000000000000000000000000000000000000000000000000000000000000000000000000000000000000000000000000000000000000000000000000000000000000000000000000000000000000000000000000000000000000000000000000000000000000000000000000000000000000000000000000000000000000000000000000000000000000000000000000000000000000000000000000000000000000000000000000000000000000000000000000000000000000000000000000000000000000000000000000000000000000000000000000000000000000000000000000000000000000000000000000000000000000000000000000000000000000000000000000000000000000000000000000000000000000000000000000000000000000000000000000000000000000000000000000000000000000000000000000000000000000000000000#80 < 5> send packet: $k#6b < 4> read packet: $#00 < 1> send packet: + history[1] tid=0x0307 < 1> send packet: + < 19> send packet: $QStartNoAckMode#b0 < 1> read packet: + < 6> read packet: $OK#9a < 1> send packet: + < 45> send packet: $qSupported:xmlRegisters=i386,arm,mips,arc#74 < 57> read packet: $qXfer:features:read+;PacketSize=3fff;QStartNoAckMode+#86 < 26> send packet: $QThreadSuffixSupported#e4 < 4> read packet: $#00 < 27> send packet: $QListThreadsInStopReply#21 < 4> read packet: $#00 < 13> send packet: $qHostInfo#9b < 28> read packet: $ptrsize:8;endian:little;#30 < 10> send packet: $vCont?#49 < 4> read packet: $#00 < 27> send packet: $qVAttachOrWaitSupported#38 < 4> read packet: $#00 < 23> send packet: $QEnableErrorStrings#8c < 6> read packet: $OK#9a < 16> send packet: $qProcessInfo#dc < 4> read packet: $#00 < 6> send packet: $qC#b4 < 7> read packet: $QC0#c4 < 16> send packet: $qfThreadInfo#bb < 5> read packet: $l#6c < 5> send packet: $?#3f < 7> read packet: $S02#b5 < 16> send packet: $qProcessInfo#dc < 4> read packet: $#00 < 41> send packet: $qXfer:features:read:target.xml:0,3ffe#af < 4> read packet: $#00 < 18> send packet: $qRegisterInfo0#72 < 4> read packet: $#00 < 16> send packet: $qfThreadInfo#bb < 5> read packet: $l#6c < 7> send packet: $Hg1#e0 < 6> read packet: $OK#9a < 6> send packet: $p0#a0 < 12> read packet: $00000000#80 < 16> send packet: $qProcessInfo#dc < 4> read packet: $#00 < 12> send packet: $qOffsets#4b < 4> read packet: $#00 < 26> send packet: $qStructuredDataPlugins#02 < 4> read packet: $#00 < 13> send packet: $qSymbol::#5b < 6> read packet: $OK#9a < 16> send packet: $qfThreadInfo#bb < 5> read packet: $l#6c < 16> send packet: $qfThreadInfo#bb < 5> read packet: $l#6c < 6> send packet: $pf#d6 < 12> read packet: $00000000#80 < 6> send packet: $pd#d4 < 12> read packet: $00000000#80 < 6> send packet: $p0#a0 < 12> read packet: $00000000#80 < 6> send packet: $p1#a1 < 12> read packet: $00000000#80 < 6> send packet: $p2#a2 < 12> read packet: $00000000#80 < 6> send packet: $p3#a3 < 12> read packet: $00000000#80 < 6> send packet: $p4#a4 < 12> read packet: $00000000#80 < 6> send packet: $p5#a5 < 12> read packet: $00000000#80 < 6> send packet: $p6#a6 < 12> read packet: $00000000#80 < 6> send packet: $p7#a7 < 12> read packet: $00000000#80 < 6> send packet: $p8#a8 < 12> read packet: $00000000#80 < 6> send packet: $p9#a9 < 12> read packet: $00000000#80 < 6> send packet: $pa#d1 < 12> read packet: $00000000#80 < 6> send packet: $pb#d2 < 12> read packet: $00000000#80 < 6> send packet: $pc#d3 < 12> read packet: $00000000#80 < 6> send packet: $pe#d5 < 12> read packet: $00000000#80 < 7> send packet: $p19#da < 12> read packet: $00000000#80 < 5> send packet: $k#6b < 4> read packet: $#00 < 1> send packet: + history[1] tid=0x0307 < 1> send packet: + < 19> send packet: $QStartNoAckMode#b0 < 1> read packet: + < 6> read packet: $OK#9a < 1> send packet: + < 45> send packet: $qSupported:xmlRegisters=i386,arm,mips,arc#74 < 57> read packet: $qXfer:features:read+;PacketSize=3fff;QStartNoAckMode+#86 < 26> send packet: $QThreadSuffixSupported#e4 < 4> read packet: $#00 < 27> send packet: $QListThreadsInStopReply#21 < 4> read packet: $#00 < 13> send packet: $qHostInfo#9b < 28> read packet: $ptrsize:8;endian:little;#30 < 10> send packet: $vCont?#49 < 4> read packet: $#00 < 27> send packet: $qVAttachOrWaitSupported#38 < 4> read packet: $#00 < 23> send packet: $QEnableErrorStrings#8c < 6> read packet: $OK#9a < 16> send packet: $qProcessInfo#dc < 4> read packet: $#00 < 6> send packet: $qC#b4 < 7> read packet: $QC0#c4 < 16> send packet: $qfThreadInfo#bb < 5> read packet: $l#6c < 5> send packet: $?#3f < 7> read packet: $S02#b5 < 16> send packet: $qProcessInfo#dc < 4> read packet: $#00 < 41> send packet: $qXfer:features:read:target.xml:0,3ffe#af < 4> read packet: $#00 < 18> send packet: $qRegisterInfo0#72 < 4> read packet: $#00 < 16> send packet: $qfThreadInfo#bb < 5> read packet: $l#6c < 7> send packet: $Hg1#e0 < 6> read packet: $OK#9a < 6> send packet: $p0#a0 < 4> read packet: $#00 < 16> send packet: $qProcessInfo#dc < 4> read packet: $#00 < 12> send packet: $qOffsets#4b < 4> read packet: $#00 < 26> send packet: $qStructuredDataPlugins#02 < 4> read packet: $#00 < 13> send packet: $qSymbol::#5b < 6> read packet: $OK#9a < 16> send packet: $qfThreadInfo#bb < 5> read packet: $l#6c < 16> send packet: $qfThreadInfo#bb < 5> read packet: $l#6c < 5> send packet: $g#67 < 860> read packet: $0000000000000000000000000000000000000000000000000000000000000000000000000000000000000000000000000000000000000000000000000000000000000000000000000000000000000000000000000000000000000000000000000000000000000000000000000000000000000000000000000000000000000000000000000000000000000000000000000000000000000000000000000000000000000000000000000000000000000000000000000000000000000000000000000000000000000000000000000000000000000000000000000000000000000000000000000000000000000000000000000000000000000000000000000000000000000000000000000000000000000000000000000000000000000000000000000000000000000000000000000000000000000000000000000000000000000000000000000000000000000000000000000000000000000000000000000000000000000000000000000000000000000000000000000000000000000000000000000000000000000000000000000000000000000000000000000000000000000000000000000000000000000000#80 < 861> send packet: $G0000000000000000000000000000000000000000000000000000000000000000000000000000000000000000000000000000000000000000000000000000000000000000000000000000000000000000000000000000000000000000000000000000000000000000000000000000000000000000000000000000000000000000000000000000000000000000000000000000000000000000000000000000000000000000000000000000000000000000000000000000000000000000000000000000000000000000000000000000000000000000000000000000000000000000000000000000000000000000000000000000000000000000000000000000000000000000000000000000000000000000000000000000000000000000000000000000000000000000000000000000000000000000000000000000000000000000000000000000000000000000000000000000000000000000000000000000000000000000000000000000000000000000000000000000000000000000000000000000000000000000000000000000000000000000000000000000000000000000000000000000000000000000#c7 < 6> read packet: $OK#9a < 861> send packet: $G0000000000000000000000000000000000000000000000000000000000000000000000000000000000000000000000000000000000000000000000000000000000000000000000000000000000000000000000000000000000000000000000000000000000000000000000000000000000000000000000000000000000000000000000000000000000000000000000000000000000000000000000000000000000000000000000000000000000000000000000000000000000000000000000000000000000000000000000000000000000000000000000000000000000000000000000000000000000000000000000000000000000000000000000000000000000000000000000000000000000000000000000000000000000000000000000000000000000000000000000000000000000000000000000000000000000000000000000000000000000000000000000000000000000000000000000000000000000000000000000000000000000000000000000000000000000000000000000000000000000000000000000000000000000000000000000000000000000000000000000000000000000000000#c7 < 6> read packet: $OK#9a < 861> send packet: $G0000000000000000000000000000000000000000000000000000000000000000000000000000000000000000000000000000000000000000000000000000000000000000000000000000000000000000000000000000000000000000000000000000000000000000000000000000000000000000000000000000000000000000000000000000000000000000000000000000000000000000000000000000000000000000000000000000000000000000000000000000000000000000000000000000000000000000000000000000000000000000000000000000000000000000000000000000000000000000000000000000000000000000000000000000000000000000000000000000000000000000000000000000000000000000000000000000000000000000000000000000000000000000000000000000000000000000000000000000000000000000000000000000000000000000000000000000000000000000000000000000000000000000000000000000000000000000000000000000000000000000000000000000000000000000000000000000000000000000000000000000000000000000#c7 < 6> read packet: $OK#9a < 861> send packet: $G0000000000000000000000000000000000000000000000000000000000000000000000000000000000000000000000000000000000000000000000000000000000000000000000000000000000000000000000000000000000000000000000000000000000000000000000000000000000000000000000000000000000000000000000000000000000000000000000000000000000000000000000000000000000000000000000000000000000000000000000000000000000000000000000000000000000000000000000000000000000000000000000000000000000000000000000000000000000000000000000000000000000000000000000000000000000000000000000000000000000000000000000000000000000000000000000000000000000000000000000000000000000000000000000000000000000000000000000000000000000000000000000000000000000000000000000000000000000000000000000000000000000000000000000000000000000000000000000000000000000000000000000000000000000000000000000000000000000000000000000000000000000000000#c7 < 6> read packet: $OK#9a < 861> send packet: $G0000000000000000000000000000000000000000000000000000000000000000000000000000000000000000000000000000000000000000000000000000000000000000000000000000000000000000000000000000000000000000000000000000000000000000000000000000000000000000000000000000000000000000000000000000000000000000000000000000000000000000000000000000000000000000000000000000000000000000000000000000000000000000000000000000000000000000000000000000000000000000000000000000000000000000000000000000000000000000000000000000000000000000000000000000000000000000000000000000000000000000000000000000000000000000000000000000000000000000000000000000000000000000000000000000000000000000000000000000000000000000000000000000000000000000000000000000000000000000000000000000000000000000000000000000000000000000000000000000000000000000000000000000000000000000000000000000000000000000000000000000000000000000#c7 < 6> read packet: $OK#9a < 861> send packet: $G0000000000000000000000000000000000000000000000000000000000000000000000000000000000000000000000000000000000000000000000000000000000000000000000000000000000000000000000000000000000000000000000000000000000000000000000000000000000000000000000000000000000000000000000000000000000000000000000000000000000000000000000000000000000000000000000000000000000000000000000000000000000000000000000000000000000000000000000000000000000000000000000000000000000000000000000000000000000000000000000000000000000000000000000000000000000000000000000000000000000000000000000000000000000000000000000000000000000000000000000000000000000000000000000000000000000000000000000000000000000000000000000000000000000000000000000000000000000000000000000000000000000000000000000000000000000000000000000000000000000000000000000000000000000000000000000000000000000000000000000000000000000000000#c7 < 6> read packet: $OK#9a < 861> send packet: $G0000000000000000000000000000000000000000000000000000000000000000000000000000000000000000000000000000000000000000000000000000000000000000000000000000000000000000000000000000000000000000000000000000000000000000000000000000000000000000000000000000000000000000000000000000000000000000000000000000000000000000000000000000000000000000000000000000000000000000000000000000000000000000000000000000000000000000000000000000000000000000000000000000000000000000000000000000000000000000000000000000000000000000000000000000000000000000000000000000000000000000000000000000000000000000000000000000000000000000000000000000000000000000000000000000000000000000000000000000000000000000000000000000000000000000000000000000000000000000000000000000000000000000000000000000000000000000000000000000000000000000000000000000000000000000000000000000000000000000000000000000000000000000#c7 < 6> read packet: $OK#9a < 861> send packet: $G0000000000000000000000000000000000000000000000000000000000000000000000000000000000000000000000000000000000000000000000000000000000000000000000000000000000000000000000000000000000000000000000000000000000000000000000000000000000000000000000000000000000000000000000000000000000000000000000000000000000000000000000000000000000000000000000000000000000000000000000000000000000000000000000000000000000000000000000000000000000000000000000000000000000000000000000000000000000000000000000000000000000000000000000000000000000000000000000000000000000000000000000000000000000000000000000000000000000000000000000000000000000000000000000000000000000000000000000000000000000000000000000000000000000000000000000000000000000000000000000000000000000000000000000000000000000000000000000000000000000000000000000000000000000000000000000000000000000000000000000000000000000000000#c7 < 6> read packet: $OK#9a < 861> send packet: $G0000000000000000000000000000000000000000000000000000000000000000000000000000000000000000000000000000000000000000000000000000000000000000000000000000000000000000000000000000000000000000000000000000000000000000000000000000000000000000000000000000000000000000000000000000000000000000000000000000000000000000000000000000000000000000000000000000000000000000000000000000000000000000000000000000000000000000000000000000000000000000000000000000000000000000000000000000000000000000000000000000000000000000000000000000000000000000000000000000000000000000000000000000000000000000000000000000000000000000000000000000000000000000000000000000000000000000000000000000000000000000000000000000000000000000000000000000000000000000000000000000000000000000000000000000000000000000000000000000000000000000000000000000000000000000000000000000000000000000000000000000000000000000#c7 < 6> read packet: $OK#9a < 861> send packet: $G0000000000000000000000000000000000000000000000000000000000000000000000000000000000000000000000000000000000000000000000000000000000000000000000000000000000000000000000000000000000000000000000000000000000000000000000000000000000000000000000000000000000000000000000000000000000000000000000000000000000000000000000000000000000000000000000000000000000000000000000000000000000000000000000000000000000000000000000000000000000000000000000000000000000000000000000000000000000000000000000000000000000000000000000000000000000000000000000000000000000000000000000000000000000000000000000000000000000000000000000000000000000000000000000000000000000000000000000000000000000000000000000000000000000000000000000000000000000000000000000000000000000000000000000000000000000000000000000000000000000000000000000000000000000000000000000000000000000000000000000000000000000000000#c7 < 6> read packet: $OK#9a < 861> send packet: $G0000000000000000000000000000000000000000000000000000000000000000000000000000000000000000000000000000000000000000000000000000000000000000000000000000000000000000000000000000000000000000000000000000000000000000000000000000000000000000000000000000000000000000000000000000000000000000000000000000000000000000000000000000000000000000000000000000000000000000000000000000000000000000000000000000000000000000000000000000000000000000000000000000000000000000000000000000000000000000000000000000000000000000000000000000000000000000000000000000000000000000000000000000000000000000000000000000000000000000000000000000000000000000000000000000000000000000000000000000000000000000000000000000000000000000000000000000000000000000000000000000000000000000000000000000000000000000000000000000000000000000000000000000000000000000000000000000000000000000000000000000000000000000#c7 < 6> read packet: $OK#9a < 861> send packet: $G0000000000000000000000000000000000000000000000000000000000000000000000000000000000000000000000000000000000000000000000000000000000000000000000000000000000000000000000000000000000000000000000000000000000000000000000000000000000000000000000000000000000000000000000000000000000000000000000000000000000000000000000000000000000000000000000000000000000000000000000000000000000000000000000000000000000000000000000000000000000000000000000000000000000000000000000000000000000000000000000000000000000000000000000000000000000000000000000000000000000000000000000000000000000000000000000000000000000000000000000000000000000000000000000000000000000000000000000000000000000000000000000000000000000000000000000000000000000000000000000000000000000000000000000000000000000000000000000000000000000000000000000000000000000000000000000000000000000000000000000000000000000000000#c7 < 6> read packet: $OK#9a < 861> send packet: $G0000000000000000000000000000000000000000000000000000000000000000000000000000000000000000000000000000000000000000000000000000000000000000000000000000000000000000000000000000000000000000000000000000000000000000000000000000000000000000000000000000000000000000000000000000000000000000000000000000000000000000000000000000000000000000000000000000000000000000000000000000000000000000000000000000000000000000000000000000000000000000000000000000000000000000000000000000000000000000000000000000000000000000000000000000000000000000000000000000000000000000000000000000000000000000000000000000000000000000000000000000000000000000000000000000000000000000000000000000000000000000000000000000000000000000000000000000000000000000000000000000000000000000000000000000000000000000000000000000000000000000000000000000000000000000000000000000000000000000000000000000000000000000#c7 < 6> read packet: $OK#9a < 861> send packet: $G0000000000000000000000000000000000000000000000000000000000000000000000000000000000000000000000000000000000000000000000000000000000000000000000000000000000000000000000000000000000000000000000000000000000000000000000000000000000000000000000000000000000000000000000000000000000000000000000000000000000000000000000000000000000000000000000000000000000000000000000000000000000000000000000000000000000000000000000000000000000000000000000000000000000000000000000000000000000000000000000000000000000000000000000000000000000000000000000000000000000000000000000000000000000000000000000000000000000000000000000000000000000000000000000000000000000000000000000000000000000000000000000000000000000000000000000000000000000000000000000000000000000000000000000000000000000000000000000000000000000000000000000000000000000000000000000000000000000000000000000000000000000000000#c7 < 6> read packet: $OK#9a < 861> send packet: $G0000000000000000000000000000000000000000000000000000000000000000000000000000000000000000000000000000000000000000000000000000000000000000000000000000000000000000000000000000000000000000000000000000000000000000000000000000000000000000000000000000000000000000000000000000000000000000000000000000000000000000000000000000000000000000000000000000000000000000000000000000000000000000000000000000000000000000000000000000000000000000000000000000000000000000000000000000000000000000000000000000000000000000000000000000000000000000000000000000000000000000000000000000000000000000000000000000000000000000000000000000000000000000000000000000000000000000000000000000000000000000000000000000000000000000000000000000000000000000000000000000000000000000000000000000000000000000000000000000000000000000000000000000000000000000000000000000000000000000000000000000000000000000#c7 < 6> read packet: $OK#9a < 861> send packet: $G0000000000000000000000000000000000000000000000000000000000000000000000000000000000000000000000000000000000000000000000000000000000000000000000000000000000000000000000000000000000000000000000000000000000000000000000000000000000000000000000000000000000000000000000000000000000000000000000000000000000000000000000000000000000000000000000000000000000000000000000000000000000000000000000000000000000000000000000000000000000000000000000000000000000000000000000000000000000000000000000000000000000000000000000000000000000000000000000000000000000000000000000000000000000000000000000000000000000000000000000000000000000000000000000000000000000000000000000000000000000000000000000000000000000000000000000000000000000000000000000000000000000000000000000000000000000000000000000000000000000000000000000000000000000000000000000000000000000000000000000000000000000000000#c7 < 6> read packet: $OK#9a < 861> send packet: $G0000000000000000000000000000000000000000000000000000000000000000000000000000000000000000000000000000000000000000000000000000000000000000000000000000000000000000000000000000000000000000000000000000000000000000000000000000000000000000000000000000000000000000000000000000000000000000000000000000000000000000000000000000000000000000000000000000000000000000000000000000000000000000000000000000000000000000000000000000000000000000000000000000000000000000000000000000000000000000000000000000000000000000000000000000000000000000000000000000000000000000000000000000000000000000000000000000000000000000000000000000000000000000000000000000000000000000000000000000000000000000000000000000000000000000000000000000000000000000000000000000000000000000000000000000000000000000000000000000000000000000000000000000000000000000000000000000000000000000000000000000000000000000#c7 < 6> read packet: $OK#9a < 5> send packet: $k#6b < 4> read packet: $#00 < 1> send packet: + history[1] tid=0x0307 < 1> send packet: + < 19> send packet: $QStartNoAckMode#b0 < 1> read packet: + < 6> read packet: $OK#9a < 1> send packet: + < 45> send packet: $qSupported:xmlRegisters=i386,arm,mips,arc#74 < 57> read packet: $qXfer:features:read+;PacketSize=3fff;QStartNoAckMode+#86 < 26> send packet: $QThreadSuffixSupported#e4 < 4> read packet: $#00 < 27> send packet: $QListThreadsInStopReply#21 < 4> read packet: $#00 < 13> send packet: $qHostInfo#9b < 28> read packet: $ptrsize:8;endian:little;#30 < 10> send packet: $vCont?#49 < 4> read packet: $#00 < 27> send packet: $qVAttachOrWaitSupported#38 < 4> read packet: $#00 < 23> send packet: $QEnableErrorStrings#8c < 6> read packet: $OK#9a < 16> send packet: $qProcessInfo#dc < 4> read packet: $#00 < 6> send packet: $qC#b4 < 7> read packet: $QC0#c4 < 16> send packet: $qfThreadInfo#bb < 5> read packet: $l#6c < 5> send packet: $?#3f < 7> read packet: $S02#b5 < 16> send packet: $qProcessInfo#dc < 4> read packet: $#00 < 41> send packet: $qXfer:features:read:target.xml:0,3ffe#af < 4> read packet: $#00 < 18> send packet: $qRegisterInfo0#72 < 4> read packet: $#00 < 16> send packet: $qfThreadInfo#bb < 5> read packet: $l#6c < 7> send packet: $Hg1#e0 < 6> read packet: $OK#9a < 6> send packet: $p0#a0 < 12> read packet: $00000000#80 < 16> send packet: $qProcessInfo#dc < 4> read packet: $#00 < 12> send packet: $qOffsets#4b < 4> read packet: $#00 < 26> send packet: $qStructuredDataPlugins#02 < 4> read packet: $#00 < 13> send packet: $qSymbol::#5b < 6> read packet: $OK#9a < 16> send packet: $qfThreadInfo#bb < 5> read packet: $l#6c < 16> send packet: $qfThreadInfo#bb < 5> read packet: $l#6c < 6> send packet: $pf#d6 < 12> read packet: $00000000#80 < 6> send packet: $pd#d4 < 12> read packet: $00000000#80 < 15> send packet: $P0=00000000#3d < 6> read packet: $OK#9a < 15> send packet: $P1=00000000#3e < 6> read packet: $OK#9a < 15> send packet: $P2=00000000#3f < 6> read packet: $OK#9a < 15> send packet: $P3=00000000#40 < 6> read packet: $OK#9a < 15> send packet: $P4=00000000#41 < 6> read packet: $OK#9a < 15> send packet: $P5=00000000#42 < 6> read packet: $OK#9a < 15> send packet: $P6=00000000#43 < 6> read packet: $OK#9a < 15> send packet: $P7=00000000#44 < 6> read packet: $OK#9a < 15> send packet: $P8=00000000#45 < 6> read packet: $OK#9a < 15> send packet: $P9=00000000#46 < 6> read packet: $OK#9a < 15> send packet: $Pa=00000000#6e < 6> read packet: $OK#9a < 15> send packet: $Pb=00000000#6f < 6> read packet: $OK#9a < 15> send packet: $Pc=00000000#70 < 6> read packet: $OK#9a < 15> send packet: $Pd=00000000#71 < 6> read packet: $OK#9a < 15> send packet: $Pe=00000000#72 < 6> read packet: $OK#9a < 15> send packet: $Pf=00000000#73 < 6> read packet: $OK#9a < 16> send packet: $P19=00000000#77 < 6> read packet: $OK#9a < 5> send packet: $k#6b < 4> read packet: $#00 libstdcxx tests will not be run because: Don't know how to build with libstdcxx on macosx Skipping following debug info categories: ['dwo']

Hide Details

-- Command Output (stderr): --

Hide Details

Session logs for test failures/errors/unexpected successes will go into directory '/Users/buildslave/jenkins/workspace/lldb-cmake/lldb-build/lldb-test-traces' Change dir to: /Users/buildslave/jenkins/workspace/lldb-cmake/llvm-project/lldb/test/API/functionalities/gdb_remote_client runCmd: settings clear -all output:

Hide Details

runCmd: settings set symbols.enable-external-lookup false output:

Hide Details

runCmd: settings set target.inherit-tcc true output:

Hide Details

runCmd: settings set target.auto-apply-fixits false output:

Hide Details

runCmd: settings set plugin.process.gdb-remote.packet-timeout 60 output:

Hide Details

runCmd: settings set symbols.clang-modules-cache-path "/Users/buildslave/jenkins/workspace/lldb-cmake/lldb-build/lldb-test-build.noindex/module-cache-lldb/lldb-api" output:

Hide Details

runCmd: settings set use-color false output:

Hide Details

runCmd: setting set target.prefer-dynamic-value no-dynamic-values output:

Hide Details

<bound method SBProcess.Kill of <lldb.SBProcess; proxy of <Swig Object of type 'lldb::SBProcess *' at 0x117f6c990> >>: success

Hide Details

PASS: LLDB (/Users/buildslave/jenkins/workspace/lldb-cmake/lldb-build/bin/clang-x86_64) :: test_attach_fail (TestGDBRemoteClient.TestGDBRemoteClient) runCmd: settings clear -all output:

Hide Details

runCmd: settings set symbols.enable-external-lookup false output:

Hide Details

runCmd: settings set target.inherit-tcc true output:

Hide Details

runCmd: settings set target.auto-apply-fixits false output:

Hide Details

runCmd: settings set plugin.process.gdb-remote.packet-timeout 60 output:

Hide Details

runCmd: settings set symbols.clang-modules-cache-path "/Users/buildslave/jenkins/workspace/lldb-cmake/lldb-build/lldb-test-build.noindex/module-cache-lldb/lldb-api" output:

Hide Details

runCmd: settings set use-color false output:

Hide Details

runCmd: setting set target.prefer-dynamic-value no-dynamic-values output:

Hide Details

FAIL: LLDB (/Users/buildslave/jenkins/workspace/lldb-cmake/lldb-build/bin/clang-x86_64) :: test_connect (TestGDBRemoteClient.TestGDBRemoteClient) <bound method SBProcess.Kill of <lldb.SBProcess; proxy of <Swig Object of type 'lldb::SBProcess *' at 0x1109acc90> >>: success

Hide Details

runCmd: settings clear -all output:

Hide Details

runCmd: settings set symbols.enable-external-lookup false output:

Hide Details

runCmd: settings set target.inherit-tcc true output:

Hide Details

runCmd: settings set target.auto-apply-fixits false output:

Hide Details

runCmd: settings set plugin.process.gdb-remote.packet-timeout 60 output:

Hide Details

runCmd: settings set symbols.clang-modules-cache-path "/Users/buildslave/jenkins/workspace/lldb-cmake/lldb-build/lldb-test-build.noindex/module-cache-lldb/lldb-api" output:

Hide Details

runCmd: settings set use-color false output:

Hide Details

runCmd: setting set target.prefer-dynamic-value no-dynamic-values output:

Hide Details

runCmd: log enable gdb-remote packets output:

Hide Details

<bound method SBProcess.Kill of <lldb.SBProcess; proxy of <Swig Object of type 'lldb::SBProcess *' at 0x117f6c9f0> >>: success

Hide Details

PASS: LLDB (/Users/buildslave/jenkins/workspace/lldb-cmake/lldb-build/bin/clang-x86_64) :: test_launch_fail (TestGDBRemoteClient.TestGDBRemoteClient) runCmd: settings clear -all output:

Hide Details

runCmd: settings set symbols.enable-external-lookup false output:

Hide Details

runCmd: settings set target.inherit-tcc true output:

Hide Details

runCmd: settings set target.auto-apply-fixits false output:

Hide Details

runCmd: settings set plugin.process.gdb-remote.packet-timeout 60 output:

Hide Details

runCmd: settings set symbols.clang-modules-cache-path "/Users/buildslave/jenkins/workspace/lldb-cmake/lldb-build/lldb-test-build.noindex/module-cache-lldb/lldb-api" output:

Hide Details

runCmd: settings set use-color false output:

Hide Details

runCmd: setting set target.prefer-dynamic-value no-dynamic-values output:

Hide Details

Adding tearDown hook: self.addTearDownHook(lambda: self.runCmd("settings set plugin.process.gdb-remote.use-g-packet-for-reading false"))

Hide Details

Hide Details

<bound method SBProcess.Kill of <lldb.SBProcess; proxy of <Swig Object of type 'lldb::SBProcess *' at 0x1109ac6c0> >>: success

Hide Details

Executing tearDown hook: self.addTearDownHook(lambda: self.runCmd("settings set plugin.process.gdb-remote.use-g-packet-for-reading false"))

Hide Details

Hide Details

runCmd: settings set plugin.process.gdb-remote.use-g-packet-for-reading false output:

Hide Details

PASS: LLDB (/Users/buildslave/jenkins/workspace/lldb-cmake/lldb-build/bin/clang-x86_64) :: test_read_registers_using_g_packets (TestGDBRemoteClient.TestGDBRemoteClient) runCmd: settings clear -all output:

Hide Details

runCmd: settings set symbols.enable-external-lookup false output:

Hide Details

runCmd: settings set target.inherit-tcc true output:

Hide Details

runCmd: settings set target.auto-apply-fixits false output:

Hide Details

runCmd: settings set plugin.process.gdb-remote.packet-timeout 60 output:

Hide Details

runCmd: settings set symbols.clang-modules-cache-path "/Users/buildslave/jenkins/workspace/lldb-cmake/lldb-build/lldb-test-build.noindex/module-cache-lldb/lldb-api" output:

Hide Details

runCmd: settings set use-color false output:

Hide Details

runCmd: setting set target.prefer-dynamic-value no-dynamic-values output:

Hide Details

<bound method SBProcess.Kill of <lldb.SBProcess; proxy of <Swig Object of type 'lldb::SBProcess *' at 0x117f6c9f0> >>: success

Hide Details

PASS: LLDB (/Users/buildslave/jenkins/workspace/lldb-cmake/lldb-build/bin/clang-x86_64) :: test_read_registers_using_p_packets (TestGDBRemoteClient.TestGDBRemoteClient) runCmd: settings clear -all output:

Hide Details

runCmd: settings set symbols.enable-external-lookup false output:

Hide Details

runCmd: settings set target.inherit-tcc true output:

Hide Details

runCmd: settings set target.auto-apply-fixits false output:

Hide Details

runCmd: settings set plugin.process.gdb-remote.packet-timeout 60 output:

Hide Details

runCmd: settings set symbols.clang-modules-cache-path "/Users/buildslave/jenkins/workspace/lldb-cmake/lldb-build/lldb-test-build.noindex/module-cache-lldb/lldb-api" output:

Hide Details

runCmd: settings set use-color false output:

Hide Details

runCmd: setting set target.prefer-dynamic-value no-dynamic-values output:

Hide Details

<bound method SBProcess.Kill of <lldb.SBProcess; proxy of <Swig Object of type 'lldb::SBProcess *' at 0x1109acc90> >>: success

Hide Details

PASS: LLDB (/Users/buildslave/jenkins/workspace/lldb-cmake/lldb-build/bin/clang-x86_64) :: test_write_registers_using_G_packets (TestGDBRemoteClient.TestGDBRemoteClient) runCmd: settings clear -all output:

Hide Details

runCmd: settings set symbols.enable-external-lookup false output:

Hide Details

runCmd: settings set target.inherit-tcc true output:

Hide Details

runCmd: settings set target.auto-apply-fixits false output:

Hide Details

runCmd: settings set plugin.process.gdb-remote.packet-timeout 60 output:

Hide Details

runCmd: settings set symbols.clang-modules-cache-path "/Users/buildslave/jenkins/workspace/lldb-cmake/lldb-build/lldb-test-build.noindex/module-cache-lldb/lldb-api" output:

Hide Details

runCmd: settings set use-color false output:

Hide Details

runCmd: setting set target.prefer-dynamic-value no-dynamic-values output:

Hide Details

<bound method SBProcess.Kill of <lldb.SBProcess; proxy of <Swig Object of type 'lldb::SBProcess *' at 0x117f6c9f0> >>: success

Hide Details

PASS: LLDB (/Users/buildslave/jenkins/workspace/lldb-cmake/lldb-build/bin/clang-x86_64) :: test_write_registers_using_P_packets (TestGDBRemoteClient.TestGDBRemoteClient) Restore dir to: /Users/buildslave/jenkins/workspace/lldb-cmake/lldb-build/tools/lldb/test ====================================================================== FAIL: test_connect (TestGDBRemoteClient.TestGDBRemoteClient) Test connecting to a remote gdb server ---------------------------------------------------------------------- Traceback (most recent call last): File "/Users/buildslave/jenkins/workspace/lldb-cmake/llvm-project/lldb/test/API/functionalities/gdb_remote_client/TestGDBRemoteClient.py", line 18, in test_connect process = self.connect(target) File "/Users/buildslave/jenkins/workspace/lldb-cmake/llvm-project/lldb/test/API/functionalities/gdb_remote_client/gdbclientutils.py", line 533, in connect self.assertTrue(error.Success(), error.description) AssertionError: False is not True : failed to get reply to handshake packet Config=x86_64-/Users/buildslave/jenkins/workspace/lldb-cmake/lldb-build/bin/clang ---------------------------------------------------------------------- Ran 7 tests in 100.931s

Hide Details

RESULT: FAILED (6 passes, 1 failures, 0 errors, 0 skipped, 0 expected failures, 0 unexpected successes)

Hide Details

--

Hide Details

******************** PASS: lldb-api :: functionalities/tail_call_frames/disambiguate_paths_to_common_sink/TestDisambiguatePathsToCommonSink.py (2024 of 2178) PASS: lldb-unit :: Host/./HostTests/NativeProcessProtocolTest.SetBreakpointFailVerify (2025 of 2178) PASS: lldb-unit :: Utility/./UtilityTests/ArgsTest.TestSingleArg (2026 of 2178) PASS: lldb-unit :: Utility/./UtilityTests/UriParserTest.SchemeHostSeparator (2027 of 2178) PASS: lldb-unit :: Utility/./UtilityTests/ArchSpecTest.Compatibility (2028 of 2178) PASS: lldb-shell :: ObjectFile/PECOFF/export-dllfunc.yaml (2029 of 2178) PASS: lldb-api :: lang/c/stepping/TestStepAndBreakpoints.py (2030 of 2178) PASS: lldb-api :: commands/expression/multiline-navigation/TestMultilineNavigation.py (2031 of 2178) PASS: lldb-unit :: Utility/./UtilityTests/ProcessInstanceInfo.DumpTable (2032 of 2178) PASS: lldb-shell :: ObjectFile/PECOFF/dep-modules.yaml (2033 of 2178) UNSUPPORTED: lldb-api :: functionalities/thread/break_after_join/TestBreakAfterJoin.py (2034 of 2178) PASS: lldb-api :: lang/cpp/breakpoint-commands/TestCPPBreakpointCommands.py (2035 of 2178) PASS: lldb-unit :: UnwindAssembly/x86/./UnwindAssemblyx86Tests/Testx86AssemblyInspectionEngine.Test64bitFramelessSmallStackFrame (2036 of 2178) PASS: lldb-api :: functionalities/data-formatter/data-formatter-script/TestDataFormatterScript.py (2037 of 2178) PASS: lldb-unit :: UnwindAssembly/x86/./UnwindAssemblyx86Tests/Testx86AssemblyInspectionEngine.TestSimple64bitFrameFunction (2038 of 2178) PASS: lldb-unit :: Host/./HostTests/SocketTests/SocketTest.DecodeHostAndPort/ipv6 (2039 of 2178) PASS: lldb-api :: lang/cpp/llvm-style/TestLLVMStyle.py (2040 of 2178) PASS: lldb-unit :: Utility/./UtilityTests/StringListTest.AppendListCStringArray (2041 of 2178) PASS: lldb-shell :: Process/TestEnvironment.test (2042 of 2178) PASS: lldb-shell :: Reproducer/Functionalities/TestStepping.test (2043 of 2178) PASS: lldb-api :: functionalities/tsan/thread_leak/TestTsanThreadLeak.py (2044 of 2178) PASS: lldb-api :: functionalities/data-formatter/synthupdate/TestSyntheticFilterRecompute.py (2045 of 2178) PASS: lldb-shell :: ObjectFile/ELF/PT_TLS-overlap-PT_LOAD.yaml (2046 of 2178) PASS: lldb-api :: functionalities/gdb_remote_client/TestTargetXMLArch.py (2047 of 2178) PASS: lldb-unit :: UnwindAssembly/x86/./UnwindAssemblyx86Tests/Testx86AssemblyInspectionEngine.TestPushRBPWithREX (2048 of 2178) PASS: lldb-api :: tools/lldb-vscode/coreFile/TestVSCode_coreFile.py (2049 of 2178) PASS: lldb-unit :: Utility/./UtilityTests/OptionsWithRawTest.ArgsButNoDelimiter (2050 of 2178) PASS: lldb-api :: functionalities/data-formatter/data-formatter-stl/libstdcpp/unique_ptr/invalid/TestDataFormatterInvalidStdUniquePtr.py (2051 of 2178) PASS: lldb-unit :: Utility/./UtilityTests/StringExtractorTest.GetHexU8_Underflow2 (2052 of 2178) PASS: lldb-api :: functionalities/gdb_remote_client/TestWriteMemory.py (2053 of 2178) PASS: lldb-unit :: Utility/./UtilityTests/StringExtractorTest.GetHexU8_Exact_NoEof (2054 of 2178) PASS: lldb-api :: functionalities/thread/concurrent_events/TestConcurrentWatchBreakDelay.py (2055 of 2178) PASS: lldb-unit :: Language/CPlusPlus/./LanguageCPlusPlusTests/CPlusPlusLanguage.CPlusPlusNameParser (2056 of 2178) PASS: lldb-unit :: UnwindAssembly/x86/./UnwindAssemblyx86Tests/Testx86AssemblyInspectionEngine.TestPopR14 (2057 of 2178) PASS: lldb-unit :: Symbol/./SymbolTests/SymbolsTest.LocateExecutableSymbolFileForUnknownExecutableAndMissingSymbolFile (2058 of 2178) PASS: lldb-shell :: SymbolFile/DWARF/dwarf5-atomic.s (2059 of 2178) PASS: lldb-unit :: ObjectFile/Breakpad/./ObjectFileBreakpadTests/InfoRecord.parse (2060 of 2178) PASS: lldb-unit :: SymbolFile/NativePDB/./SymbolFileNativePDBTests/PDBFPOProgramToDWARFExpressionTests.InvalidAssignmentSingle (2061 of 2178) PASS: lldb-unit :: Target/./TargetTests/MCBasedABI.MapRegisterName (2062 of 2178) PASS: lldb-api :: commands/command/script/import/TestImport.py (2063 of 2178) PASS: lldb-api :: functionalities/abbreviation/TestAbbreviations.py (2064 of 2178) PASS: lldb-api :: macosx/duplicate-archive-members/TestDuplicateMembers.py (2065 of 2178) PASS: lldb-unit :: UnwindAssembly/x86/./UnwindAssemblyx86Tests/Testx86AssemblyInspectionEngine.Test64bitFramelessBigStackFrame (2066 of 2178) PASS: lldb-api :: functionalities/data-formatter/data-formatter-named-summaries/TestDataFormatterNamedSummaries.py (2067 of 2178) PASS: lldb-unit :: ScriptInterpreter/Python/./ScriptInterpreterPythonTests/PythonDataObjectsTest.TestPythonListToStructuredList (2068 of 2178) PASS: lldb-api :: lang/objc/objc-super/TestObjCSuper.py (2069 of 2178) PASS: lldb-api :: commands/expression/import-std-module/weak_ptr/TestWeakPtrFromStdModule.py (2070 of 2178) PASS: lldb-unit :: Utility/./UtilityTests/ProcessInstanceInfo.DumpTable_invalidUID (2071 of 2178) PASS: lldb-api :: functionalities/process_crash_info/TestProcessCrashInfo.py (2072 of 2178) PASS: lldb-api :: commands/expression/call-function/TestCallBuiltinFunction.py (2073 of 2178) UNSUPPORTED: lldb-shell :: ExecControl/StopHook/stop-hook-threads.test (2074 of 2178) PASS: lldb-unit :: UnwindAssembly/x86/./UnwindAssemblyx86Tests/Testx86AssemblyInspectionEngine.TestAddRSP (2075 of 2178) PASS: lldb-api :: lang/objcxx/objcxx-ivar-vector/TestIvarVector.py (2076 of 2178) PASS: lldb-unit :: Language/Highlighting/./HighlighterTests/HighlighterTest.ClangComments (2077 of 2178) PASS: lldb-api :: functionalities/postmortem/minidump-new/TestMiniDumpUUID.py (2078 of 2178) PASS: lldb-api :: macosx/lc-note/kern-ver-str/TestKernVerStrLCNOTE.py (2079 of 2178) PASS: lldb-shell :: Quit/TestQuitExitCodeImplicit0.test (2080 of 2178) PASS: lldb-api :: functionalities/data-formatter/data-formatter-stl/libcxx/forward_list/TestDataFormatterLibcxxForwardList.py (2081 of 2178) PASS: lldb-unit :: Utility/./UtilityTests/Flags.IsClear (2082 of 2178) PASS: lldb-unit :: Utility/./UtilityTests/ProcessInstanceInfo.Dump (2083 of 2178) PASS: lldb-shell :: ObjectFile/ELF/build-id-case.yaml (2084 of 2178) PASS: lldb-api :: commands/version/TestVersion.py (2085 of 2178) PASS: lldb-api :: commands/watchpoints/watchpoint_on_vectors/TestValueOfVectorVariable.py (2086 of 2178) PASS: lldb-unit :: Utility/./UtilityTests/StringExtractorTest.InitEmpty (2087 of 2178) PASS: lldb-api :: functionalities/optimized_code/TestNoASanExceptionAfterEvalOP_piece.py (2088 of 2178) PASS: lldb-shell :: Reproducer/TestCrash.test (2089 of 2178) PASS: lldb-unit :: Expression/./ExpressionTests/CppModuleConfigurationTest.Sysroot (2090 of 2178) PASS: lldb-unit :: Language/Highlighting/./HighlighterTests/HighlighterTest.Colons (2091 of 2178) PASS: lldb-shell :: SymbolFile/DWARF/find-basic-function.cpp (2092 of 2178) PASS: lldb-api :: functionalities/data-formatter/data-formatter-stl/libcxx/deque/TestDataFormatterLibcxxDeque.py (2093 of 2178) PASS: lldb-shell :: SymbolFile/DWARF/childless-compile-unit.s (2094 of 2178) PASS: lldb-api :: functionalities/postmortem/elf-core/gcore/TestGCore.py (2095 of 2178) PASS: lldb-api :: commands/settings/TestSettings.py (2096 of 2178) PASS: lldb-api :: lang/objc/modules-app-update/TestClangModulesAppUpdate.py (2097 of 2178) PASS: lldb-unit :: Utility/./UtilityTests/StreamTeeTest.GetStreamAtIndexOutOfBounds (2098 of 2178) PASS: lldb-shell :: SymbolFile/DWARF/debug_ranges.s (2099 of 2178) PASS: lldb-api :: functionalities/thread/create_after_attach/TestCreateAfterAttach.py (2100 of 2178) PASS: lldb-api :: lang/objc/modules-cache/TestClangModulesCache.py (2101 of 2178) PASS: lldb-unit :: Editline/./EditlineTests/EditlineTestFixture.EditlineReceivesSingleLineText (2102 of 2178) PASS: lldb-api :: python_api/debugger/TestDebuggerAPI.py (2103 of 2178) PASS: lldb-api :: lang/objc/objc-ivar-stripped/TestObjCIvarStripped.py (2104 of 2178) PASS: lldb-api :: functionalities/breakpoint/debugbreak/TestDebugBreak.py (2105 of 2178) PASS: lldb-unit :: UnwindAssembly/x86/./UnwindAssemblyx86Tests/Testx86AssemblyInspectionEngine.TestPushRBX (2106 of 2178) UNSUPPORTED: lldb-shell :: SymbolFile/PDB/enums-layout.test (2107 of 2178) PASS: lldb-unit :: Host/./HostTests/SocketTests/SocketTest.TCPListen0GetPort/ipv4 (2108 of 2178) UNSUPPORTED: lldb-shell :: SymbolFile/DWARF/debug-types-expressions.test (2109 of 2178) PASS: lldb-api :: python_api/signals/TestSignalsAPI.py (2110 of 2178) PASS: lldb-unit :: Utility/./UtilityTests/StringExtractorTest.DecodeHexU8_Exact (2111 of 2178) PASS: lldb-unit :: Platform/Android/./AdbClientTests/AdbClientTest.CreateByDeviceId_ByEnvVar (2112 of 2178) UNSUPPORTED: lldb-api :: lang/objc/rdar-12408181/TestRdar12408181.py (2113 of 2178) PASS: lldb-api :: functionalities/gdb_remote_client/TestStopPCs.py (2114 of 2178) PASS: lldb-unit :: ScriptInterpreter/Python/./ScriptInterpreterPythonTests/PythonDataObjectsTest.TestOwnedReferences (2115 of 2178) PASS: lldb-api :: iohandler/autosuggestion/TestAutosuggestion.py (2116 of 2178) PASS: lldb-api :: functionalities/gdb_remote_client/TestRecognizeBreakpoint.py (2117 of 2178) PASS: lldb-api :: commands/expression/import_builtin_fileid/TestImportBuiltinFileID.py (2118 of 2178) PASS: lldb-shell :: Commands/command-source.test (2119 of 2178) PASS: lldb-unit :: Utility/./UtilityTests/LogChannelEnabledTest.LLDB_LOG_ERROR (2120 of 2178) PASS: lldb-api :: commands/expression/entry-bp/TestExprEntryBP.py (2121 of 2178) PASS: lldb-unit :: Utility/./UtilityTests/StringExtractorTest.DecodeHexU8_Extra (2122 of 2178) PASS: lldb-api :: commands/expression/dont_allow_jit/TestAllowJIT.py (2123 of 2178) PASS: lldb-api :: macosx/order/TestOrderFile.py (2124 of 2178) PASS: lldb-api :: python_api/watchpoint/TestWatchpointIgnoreCount.py (2125 of 2178) PASS: lldb-api :: functionalities/data-formatter/data-formatter-synthval/TestDataFormatterSynthVal.py (2126 of 2178) PASS: lldb-unit :: Symbol/./SymbolTests/TestClangASTImporter.DeportTypeTagDecl (2127 of 2178) PASS: lldb-api :: functionalities/postmortem/minidump/TestMiniDump.py (2128 of 2178) PASS: lldb-api :: functionalities/data-formatter/data-formatter-stl/libcxx/multimap/TestDataFormatterLibccMultiMap.py (2129 of 2178) PASS: lldb-unit :: Symbol/./SymbolTests/PostfixExpression.ParseOneExpression (2130 of 2178) PASS: lldb-api :: lang/objc/objc-runtime-ivars/TestRuntimeIvars.py (2131 of 2178) PASS: lldb-api :: api/listeners/TestListener.py (2132 of 2178) UNSUPPORTED: lldb-shell :: SymbolFile/PDB/class-layout.test (2133 of 2178) PASS: lldb-api :: lang/c/set_values/TestSetValues.py (2134 of 2178) PASS: lldb-unit :: DataFormatter/./LLDBFormatterTests/TypeMatcherTests.CreatedBySameMatchString (2135 of 2178) PASS: lldb-unit :: Utility/./UtilityTests/OptionsWithRawTest.LeadingSpaceArgs (2136 of 2178) PASS: lldb-unit :: ObjectFile/Breakpad/./ObjectFileBreakpadTests/StackCFIRecord.parse (2137 of 2178) PASS: lldb-api :: commands/frame/diagnose/bad-reference/TestBadReference.py (2138 of 2178) PASS: lldb-unit :: SymbolFile/NativePDB/./SymbolFileNativePDBTests/PDBFPOProgramToDWARFExpressionTests.UnresolvedRegisterAssignmentReference (2139 of 2178) PASS: lldb-api :: functionalities/breakpoint/serialize/TestBreakpointSerialization.py (2140 of 2178) PASS: lldb-unit :: Utility/./UtilityTests/StringExtractorTest.GetHexBytesAvail (2141 of 2178) PASS: lldb-unit :: Core/./LLDBCoreTests/RichManglingContextTest.FromCxxMethodName (2142 of 2178) PASS: lldb-shell :: Reproducer/Functionalities/TestDataFormatter.test (2143 of 2178) PASS: lldb-api :: commands/watchpoints/hello_watchpoint/TestMyFirstWatchpoint.py (2144 of 2178) PASS: lldb-api :: functionalities/data-formatter/refpointer-recursion/TestDataFormatterRefPtrRecursion.py (2145 of 2178) PASS: lldb-unit :: Utility/./UtilityTests/StringExtractorTest.GetU32LittleEndian (2146 of 2178) PASS: lldb-unit :: Process/minidump/./LLDBMinidumpTests/MinidumpParserTest.FindMemoryRange (2147 of 2178) PASS: lldb-shell :: Minidump/no-process-id.yaml (2148 of 2178) PASS: lldb-unit :: Utility/./UtilityTests/ArgsTest.TestTrailingBackslash (2149 of 2178) PASS: lldb-unit :: UnwindAssembly/x86/./UnwindAssemblyx86Tests/Testx86AssemblyInspectionEngine.TestPopRBPWithREX (2150 of 2178) PASS: lldb-unit :: Utility/./UtilityTests/LogChannelEnabledTest.log_options (2151 of 2178) PASS: lldb-api :: functionalities/type_lookup/TestTypeLookup.py (2152 of 2178) PASS: lldb-api :: lang/c/struct_types/TestStructTypes.py (2153 of 2178) PASS: lldb-unit :: Utility/./UtilityTests/VMRange.Ordering (2154 of 2178) PASS: lldb-api :: commands/expression/import-std-module/forward_list-dbg-info-content/TestDbgInfoContentForwardListFromStdModule.py (2155 of 2178) PASS: lldb-unit :: Process/gdb-remote/./ProcessGdbRemoteTests/GDBRemoteClientBaseTest.SendPacketAndReceiveResponseWithOutputSupport (2156 of 2178) PASS: lldb-api :: tools/lldb-vscode/variables/TestVSCode_variables.py (2157 of 2178) PASS: lldb-unit :: DataFormatter/./LLDBFormatterTests/StringPrinterTests.CxxASCII (2158 of 2178) PASS: lldb-unit :: Utility/./UtilityTests/CompletionRequest.TryCompleteCurrentArgGood (2159 of 2178) PASS: lldb-api :: api/multiple-targets/TestMultipleTargets.py (2160 of 2178) PASS: lldb-api :: types/TestFloatTypesExpr.py (2161 of 2178) PASS: lldb-unit :: Utility/./UtilityTests/RangeTest.SetRangeBase (2162 of 2178) PASS: lldb-api :: tools/lldb-server/TestGdbRemoteThreadsInStopReply.py (2163 of 2178) PASS: lldb-unit :: Utility/./UtilityTests/StreamTest.QuotedCString (2164 of 2178) PASS: lldb-unit :: Utility/./UtilityTests/StreamTest.PutSLEB128 (2165 of 2178) PASS: lldb-shell :: SymbolFile/DWARF/DW_TAG_variable-DW_AT_const_value.s (2166 of 2178) UNSUPPORTED: lldb-shell :: SymbolFile/PDB/expressions.test (2167 of 2178) PASS: lldb-shell :: Settings/TestSettingsSet.test (2168 of 2178) PASS: lldb-shell :: SymbolFile/DWARF/DW_OP_piece-smaller-than-struct.s (2169 of 2178) PASS: lldb-unit :: UnwindAssembly/x86/./UnwindAssemblyx86Tests/Testx86AssemblyInspectionEngine.TestPushR13 (2170 of 2178) PASS: lldb-api :: python_api/class_members/TestSBTypeClassMembers.py (2171 of 2178) PASS: lldb-api :: functionalities/postmortem/elf-core/TestLinuxCore.py (2172 of 2178) PASS: lldb-unit :: Utility/./UtilityTests/AnsiTerminal.Unknown (2173 of 2178) PASS: lldb-shell :: VSCode/TestOptions.test (2174 of 2178) PASS: lldb-shell :: Commands/CommandScriptImmediateOutput/CommandScriptImmediateOutputConsole.test (2175 of 2178) PASS: lldb-api :: macosx/universal/TestUniversal.py (2176 of 2178) PASS: lldb-api :: lang/objc/objc-struct-return/TestObjCStructReturn.py (2177 of 2178) PASS: lldb-api :: types/TestLongTypes.py (2178 of 2178) Slowest Tests: -------------------------------------------------------------------------- 215.47s: lldb-api :: macosx/simulator/TestSimulatorPlatform.py 110.97s: lldb-api :: tools/lldb-server/TestLldbGdbServer.py 106.97s: lldb-api :: functionalities/gdb_remote_client/TestGDBRemoteLoad.py 106.56s: lldb-api :: functionalities/gdb_remote_client/TestThreadSelectionBug.py 102.14s: lldb-api :: functionalities/gdb_remote_client/TestRestartBug.py 101.77s: lldb-api :: functionalities/gdb_remote_client/TestGDBRemoteClient.py 96.09s: lldb-api :: lang/objc/exceptions/TestObjCExceptions.py 93.21s: lldb-api :: types/TestLongTypesExpr.py 88.63s: lldb-api :: lang/objc/foundation/TestObjCMethods.py 84.44s: lldb-api :: lang/objc/hidden-ivars/TestHiddenIvars.py 79.58s: lldb-api :: commands/target/basic/TestTargetCommand.py 75.26s: lldb-api :: lang/objc/foundation/TestObjCMethodsString.py 73.70s: lldb-api :: api/multithreaded/TestMultithreaded.py 65.21s: lldb-shell :: SymbolFile/NativePDB/locate-pdb.cpp 62.71s: lldb-api :: functionalities/mtc/simple/TestMTCSimple.py 62.40s: lldb-api :: lang/objc/self/TestObjCSelf.py 62.23s: lldb-api :: commands/expression/import_builtin_fileid/TestImportBuiltinFileID.py 60.98s: lldb-api :: functionalities/postmortem/wow64_minidump/TestWow64MiniDump.py 59.05s: lldb-api :: lang/objc/foundation/TestFoundationDisassembly.py 58.73s: lldb-api :: lang/objc/conflicting-definition/TestConflictingDefinition.py

Hide Details

Tests Times: -------------------------------------------------------------------------- [ Range ] :: [ Percentage ] :: [ Count ] -------------------------------------------------------------------------- [200s,220s) :: [ ] :: [ 1/2178] [180s,200s) :: [ ] :: [ 0/2178] [160s,180s) :: [ ] :: [ 0/2178] [140s,160s) :: [ ] :: [ 0/2178] [120s,140s) :: [ ] :: [ 0/2178] [100s,120s) :: [ ] :: [ 5/2178] [ 80s,100s) :: [ ] :: [ 5/2178] [ 60s, 80s) :: [ ] :: [ 8/2178] [ 40s, 60s) :: [ ] :: [ 37/2178] [ 20s, 40s) :: [* ] :: [ 97/2178] [ 0s, 20s) :: [************************************* ] :: [2025/2178] -------------------------------------------------------------------------- ******************** Failed Tests (3): lldb-api :: functionalities/gdb_remote_client/TestThreadSelectionBug.py lldb-api :: functionalities/gdb_remote_client/TestGDBRemoteLoad.py lldb-api :: functionalities/gdb_remote_client/TestGDBRemoteClient.py

Hide Details

Hide Details

Testing Time: 2777.99s Unsupported : 157 Passed : 2009 Expectedly Failed: 9 Failed : 3 FAILED: tools/lldb/test/CMakeFiles/check-lldb-lit cd /Users/buildslave/jenkins/workspace/lldb-cmake/lldb-build/tools/lldb/test && /usr/local/Frameworks/Python.framework/Versions/3.7/bin/python3.7 /Users/buildslave/jenkins/workspace/lldb-cmake/lldb-build/./bin/llvm-lit -v --time-tests --shuffle --xunit-xml-output=/Users/buildslave/jenkins/workspace/lldb-cmake/test/results.xml -v -j 4 /Users/buildslave/jenkins/workspace/lldb-cmake/lldb-build/tools/lldb/test ninja: build stopped: subcommand failed. Command failed: Command '['/usr/bin/env', 'TERM=vt100', '/usr/local/bin/ninja', '-v', 'check-lldb']' returned non-zero exit status 1 Command: ['/usr/bin/env', 'TERM=vt100', '/usr/local/bin/ninja', '-v', 'check-lldb'] [Pipeline] } [Pipeline] // timeout [Pipeline] } [Pipeline] // stage [Pipeline] stage [Pipeline] { (Declarative: Post Actions) [Pipeline] scanForIssues [Clang (LLVM based)] Sleeping for 5 seconds due to JENKINS-32191... [Clang (LLVM based)] Parsing console log (workspace: '/Users/buildslave/jenkins/workspace/lldb-cmake') [Clang (LLVM based)] Successfully parsed console log [Clang (LLVM based)] -> found 5 issues (skipped 13 duplicates) [Clang (LLVM based)] Post processing issues on 'green-dragon-10' with source code encoding 'UTF-8' [Clang (LLVM based)] Creating SCM blamer to obtain author and commit information for affected files [Clang (LLVM based)] Creating SCM miner to obtain statistics for affected repository files [Clang (LLVM based)] Resolving file names for all issues in source directory '/Users/buildslave/jenkins/workspace/lldb-cmake' [Clang (LLVM based)] -> resolved paths in source directory (4 found, 0 not found) [Clang (LLVM based)] Resolving module names from module definitions (build.xml, pom.xml, or Manifest.mf files) [Clang (LLVM based)] -> resolved module names for 5 issues [Clang (LLVM based)] Resolving package names (or namespaces) by parsing the affected files [Clang (LLVM based)] -> resolved package names of 3 affected files [Clang (LLVM based)] No filter has been set, publishing all 4 issues [Clang (LLVM based)] Creating fingerprints for all affected code blocks to track issues over different builds [Clang (LLVM based)] -> created fingerprints for 4 issues (skipped 0 issues) [Clang (LLVM based)] Copying affected files to Jenkins' build folder '/Users/Shared/Jenkins/Home/jobs/lldb-cmake/builds/24579/files-with-issues' [Clang (LLVM based)] -> 3 copied, 0 not in workspace, 0 not-found, 0 with I/O error [Pipeline] junit Recording test results [Pipeline] emailext Warning: melanie.blower@intel.com is not a recognized user, but sending mail anyway Warning: melanie.blower@intel.com is not a recognized user, but sending mail anyway

Hide Details

Begin Pre-Send Script... Sending email to: mschifer@apple.com melanie.blower@intel.com Akira Hatanaka <ahatanaka@apple.com> Azhar Mohammed <azhar@apple.com>
[Pipeline] } [Pipeline] // stage [Pipeline] } [Pipeline] // withEnv [Pipeline] } [Pipeline] // node [Pipeline] End of Pipeline [Checks API] No suitable checks publisher found. ERROR: script returned exit code 1 Finished: FAILURE