AbortedConsole Output

Skipping 9,136 KB.. Full Log
x86AssemblyInspectionEngine.TestAddRSP (824 of 2182)
PASS: lldb-unit :: Utility/./UtilityTests/StreamTest.QuotedCString (825 of 2182)
PASS: lldb-api :: lang/cpp/lambdas/TestLambdas.py (826 of 2182)
PASS: lldb-api :: lang/c/struct_types/TestStructTypes.py (827 of 2182)
PASS: lldb-api :: commands/expression/entry-bp/TestExprEntryBP.py (828 of 2182)
PASS: lldb-unit :: Utility/./UtilityTests/LogChannelTest.List (829 of 2182)
PASS: lldb-shell :: SymbolFile/DWARF/dwarf5-index-is-used.cpp (830 of 2182)
PASS: lldb-shell :: SymbolFile/DWARF/dwp.s (831 of 2182)
PASS: lldb-unit :: Host/./HostTests/Host.GetEnvironment (832 of 2182)
PASS: lldb-api :: commands/statistics/basic/TestStats.py (833 of 2182)
PASS: lldb-unit :: Utility/./UtilityTests/UUIDTest.SetFromStringRef (834 of 2182)
PASS: lldb-api :: sample_test/TestSampleInlineTest.py (835 of 2182)
PASS: lldb-api :: tools/lldb-vscode/module/TestVSCode_module.py (836 of 2182)
PASS: lldb-api :: lang/cpp/rvalue-references/TestRvalueReferences.py (837 of 2182)
PASS: lldb-unit :: Process/minidump/./LLDBMinidumpTests/MinidumpParserTest.GetFilteredModuleList (838 of 2182)
PASS: lldb-unit :: UnwindAssembly/x86/./UnwindAssemblyx86Tests/Testx86AssemblyInspectionEngine.TestLEAVE (839 of 2182)
PASS: lldb-unit :: Utility/./UtilityTests/RangeVector.CombineConsecutiveRanges (840 of 2182)
PASS: lldb-unit :: Language/Highlighting/./HighlighterTests/HighlighterTest.ClangTrailingBackslashBeforeNewline (841 of 2182)
PASS: lldb-api :: lang/cpp/wchar_t/TestCxxWCharT.py (842 of 2182)
PASS: lldb-api :: macosx/thread-names/TestInterruptThreadNames.py (843 of 2182)
PASS: lldb-api :: python_api/formatters/TestFormattersSBAPI.py (844 of 2182)
PASS: lldb-unit :: debugserver/./debugserverTests/RNBSocket.LoopBackConnectIPv6 (845 of 2182)
PASS: lldb-shell :: ObjectFile/ELF/gnu-debuglink.yaml (846 of 2182)
PASS: lldb-shell :: ObjectFile/ELF/build-id-case.yaml (847 of 2182)
PASS: lldb-unit :: ObjectFile/Breakpad/./ObjectFileBreakpadTests/PublicRecord.parse (848 of 2182)
PASS: lldb-api :: lang/objc/objc-ivar-protocols/TestIvarProtocols.py (849 of 2182)
PASS: lldb-api :: lang/objc/objc-ivar-stripped/TestObjCIvarStripped.py (850 of 2182)
PASS: lldb-unit :: Utility/./UtilityTests/ListenerTest.GetEventWait (851 of 2182)
PASS: lldb-api :: functionalities/data-formatter/parray/TestPrintArray.py (852 of 2182)
PASS: lldb-api :: functionalities/data-formatter/data-formatter-disabling/TestDataFormatterDisabling.py (853 of 2182)
UNSUPPORTED: lldb-shell :: SymbolFile/PDB/func-symbols.test (854 of 2182)
PASS: lldb-api :: functionalities/param_entry_vals/basic_entry_values/TestBasicEntryValues.py (855 of 2182)
PASS: lldb-shell :: Driver/TestNoUseColor.test (856 of 2182)
PASS: lldb-api :: lang/cpp/template-arguments/TestCppTemplateArguments.py (857 of 2182)
UNSUPPORTED: lldb-shell :: ScriptInterpreter/Lua/nested_sessions.test (858 of 2182)
PASS: lldb-api :: functionalities/data-formatter/stringprinter/TestStringPrinter.py (859 of 2182)
PASS: lldb-shell :: Settings/TestDisableColor.test (860 of 2182)
PASS: lldb-unit :: UnwindAssembly/ARM64/./Arm64InstEmulationTests/TestArm64InstEmulation.TestMediumDarwinFunction (861 of 2182)
PASS: lldb-unit :: Host/./HostTests/SocketTests/SocketTest.TCPListen0GetPort/ipv4 (862 of 2182)
PASS: lldb-api :: functionalities/thread/concurrent_events/TestConcurrentNWatchNBreak.py (863 of 2182)
PASS: lldb-api :: lang/objc/real-definition/TestRealDefinition.py (864 of 2182)
PASS: lldb-api :: functionalities/thread/concurrent_events/TestConcurrentBreakpointOneDelayBreakpointThreads.py (865 of 2182)
PASS: lldb-unit :: ScriptInterpreter/Python/./ScriptInterpreterPythonTests/PythonDataObjectsTest.TestPythonStringToStructuredString (866 of 2182)
PASS: lldb-unit :: Utility/./UtilityTests/BinaryStreamTest.PutSLEB128NineBytes (867 of 2182)
PASS: lldb-unit :: SymbolFile/DWARF/./SymbolFileDWARFTests/XcodeSDKModuleTests.TestModuleGetXcodeSDK (868 of 2182)
PASS: lldb-api :: commands/expression/class_template_specialization_empty_pack/TestClassTemplateSpecializationParametersHandling.py (869 of 2182)
PASS: lldb-api :: functionalities/breakpoint/global_constructor/TestBreakpointInGlobalConstructor.py (870 of 2182)
PASS: lldb-unit :: Utility/./UtilityTests/ScalarTest.TruncOrExtendTo (871 of 2182)
PASS: lldb-api :: functionalities/data-formatter/data-formatter-stl/libcxx/optional/TestDataFormatterLibcxxOptional.py (872 of 2182)
UNSUPPORTED: lldb-shell :: SymbolFile/DWARF/debug-types-expressions.test (873 of 2182)
PASS: lldb-shell :: SymbolFile/Breakpad/line-table-discontinuous-file-ids.test (874 of 2182)
PASS: lldb-shell :: ObjectFile/ELF/PT_LOAD-overlap-section.yaml (875 of 2182)
UNSUPPORTED: lldb-api :: arm/breakpoint-thumb-codesection/TestBreakpointThumbCodesection.py (876 of 2182)
PASS: lldb-unit :: Utility/./UtilityTests/ArgsTest.EscapeLLDBCommandArgument (877 of 2182)
PASS: lldb-unit :: Target/./TargetTests/StackFrameRecognizerTest.NullModuleRegex (878 of 2182)
PASS: lldb-api :: commands/quit/TestQuit.py (879 of 2182)
PASS: lldb-unit :: Platform/./LLDBPlatformTests/PlatformDarwinTest.FindComponentInPath (880 of 2182)
PASS: lldb-unit :: Utility/./UtilityTests/StringListTest.AppendStringStdString (881 of 2182)
PASS: lldb-unit :: Utility/./UtilityTests/StreamTest.AddressNoSuffix (882 of 2182)
PASS: lldb-api :: functionalities/thread/concurrent_events/TestConcurrentDelayWatchBreak.py (883 of 2182)
PASS: lldb-unit :: Expression/./ExpressionTests/DiagnosticManagerTest.PutString (884 of 2182)
PASS: lldb-api :: lang/cpp/namespace_definitions/TestNamespaceDefinitions.py (885 of 2182)
PASS: lldb-shell :: SymbolFile/DWARF/DW_AT_loclists_base.s (886 of 2182)
PASS: lldb-unit :: Utility/./UtilityTests/RangeDataVector.FindEntryIndexesThatContain (887 of 2182)
PASS: lldb-api :: functionalities/gdb_remote_client/TestRestartBug.py (888 of 2182)
PASS: lldb-unit :: Utility/./UtilityTests/StringLexerTest.Next (889 of 2182)
PASS: lldb-shell :: SymbolFile/DWARF/debug_rnglists-dwo.s (890 of 2182)
PASS: lldb-api :: functionalities/dead-strip/TestDeadStrip.py (891 of 2182)
PASS: lldb-api :: commands/expression/static-initializers/TestStaticInitializers.py (892 of 2182)
PASS: lldb-api :: commands/expression/weak_symbols/TestWeakSymbols.py (893 of 2182)
UNSUPPORTED: lldb-shell :: ScriptInterpreter/Lua/bindings.test (894 of 2182)
PASS: lldb-shell :: Settings/TestFrameFormatColor.test (895 of 2182)
PASS: lldb-shell :: Reproducer/TestDSYM.test (896 of 2182)
PASS: lldb-unit :: Utility/./UtilityTests/StreamTest.PutHex32ByteOrderBig (897 of 2182)
PASS: lldb-unit :: Utility/./UtilityTests/StringListTest.Assignment (898 of 2182)
PASS: lldb-api :: commands/command/script_alias/TestCommandScriptAlias.py (899 of 2182)
PASS: lldb-unit :: Utility/./UtilityTests/StringExtractorTest.GetHexBytes (900 of 2182)
PASS: lldb-api :: functionalities/data-formatter/data-formatter-stl/libcxx/forward_list/TestDataFormatterLibcxxForwardList.py (901 of 2182)
PASS: lldb-unit :: Process/minidump/./LLDBMinidumpTests/MinidumpParserTest.GetLinuxProcStatus (902 of 2182)
PASS: lldb-unit :: Utility/./UtilityTests/StringListTest.InsertStringAtIndexEnd (903 of 2182)
PASS: lldb-unit :: Utility/./UtilityTests/DataExtractorTest.GetULEB128_bit63 (904 of 2182)
UNSUPPORTED: lldb-api :: arm/breakpoint-it/TestBreakpointIt.py (905 of 2182)
PASS: lldb-unit :: UnwindAssembly/x86/./UnwindAssemblyx86Tests/Testx86AssemblyInspectionEngine.TestStackRealign32BitDisp_x86_64 (906 of 2182)
PASS: lldb-unit :: ScriptInterpreter/Python/./ScriptInterpreterPythonTests/PythonDataObjectsTest.TestPythonByteArray (907 of 2182)
PASS: lldb-unit :: Utility/./UtilityTests/OptionsWithRawTest.WhitespaceSuffix (908 of 2182)
PASS: lldb-api :: functionalities/data-formatter/data-formatter-stl/libcxx/set/TestDataFormatterLibcxxSet.py (909 of 2182)
PASS: lldb-api :: functionalities/breakpoint/debugbreak/TestDebugBreak.py (910 of 2182)
PASS: lldb-unit :: Process/gdb-remote/./ProcessGdbRemoteTests/GDBRemoteCommunicationServerTest.SendErrorResponse_Status (911 of 2182)
PASS: lldb-api :: types/TestShortType.py (912 of 2182)
PASS: lldb-unit :: Utility/./UtilityTests/ConstStringTest.CompareConstString (913 of 2182)
PASS: lldb-shell :: SymbolFile/DWARF/DW_AT_const_value.s (914 of 2182)
XFAIL: lldb-shell :: Register/x86-mm-xmm-read.test (915 of 2182)
PASS: lldb-unit :: Utility/./UtilityTests/TildeExpressionResolver.ResolveFullPath (916 of 2182)
PASS: lldb-unit :: Utility/./UtilityTests/StringExtractorTest.GetHexBytes_FullString (917 of 2182)
UNSUPPORTED: lldb-api :: commands/watchpoints/hello_watchlocation/TestWatchLocation.py (918 of 2182)
PASS: lldb-unit :: Utility/./UtilityTests/XcodeSDKTest.MergeTest (919 of 2182)
PASS: lldb-api :: functionalities/breakpoint/breakpoint_command/TestBreakpointCommandsFromPython.py (920 of 2182)
PASS: lldb-unit :: Utility/./UtilityTests/UriParserTest.Minimal (921 of 2182)
PASS: lldb-api :: functionalities/thread/concurrent_events/TestConcurrentTwoBreakpointsOneDelaySignal.py (922 of 2182)
PASS: lldb-unit :: Host/./HostTests/FileSystemTest.EnumerateDirectory (923 of 2182)
PASS: lldb-shell :: ObjectFile/ELF/many-sections.s (924 of 2182)
PASS: lldb-api :: iohandler/resize/TestIOHandlerResizeNoEditline.py (925 of 2182)
PASS: lldb-api :: commands/expression/import-std-module/stack/TestStackFromStdModule.py (926 of 2182)
PASS: lldb-unit :: SymbolFile/NativePDB/./SymbolFileNativePDBTests/PDBFPOProgramToDWARFExpressionTests.MultipleDependentAssignments (927 of 2182)
PASS: lldb-api :: commands/target/create-no-such-arch/TestNoSuchArch.py (928 of 2182)
PASS: lldb-unit :: Utility/./UtilityTests/RecordReplayTest.InstrumentedFoo (929 of 2182)
PASS: lldb-unit :: Utility/./UtilityTests/TimerTest.CategoryTimes2 (930 of 2182)
UNSUPPORTED: lldb-api :: benchmarks/frame_variable/TestFrameVariableResponse.py (931 of 2182)
PASS: lldb-unit :: Utility/./UtilityTests/BinaryStreamTest.PutULEB128FiveBytes (932 of 2182)
PASS: lldb-api :: functionalities/breakpoint/breakpoint_names/TestBreakpointNames.py (933 of 2182)
PASS: lldb-api :: commands/frame/select/TestFrameSelect.py (934 of 2182)
PASS: lldb-api :: lang/c/step-target/TestStepTarget.py (935 of 2182)
PASS: lldb-api :: lang/objc/forward-decl/TestForwardDecl.py (936 of 2182)
PASS: lldb-api :: tools/lldb-vscode/step/TestVSCode_step.py (937 of 2182)
PASS: lldb-api :: tools/lldb-server/TestGdbRemoteHostInfo.py (938 of 2182)
PASS: lldb-api :: lang/objc/modules-auto-import/TestModulesAutoImport.py (939 of 2182)
UNSUPPORTED: lldb-shell :: ScriptInterpreter/Lua/persistent_state.test (940 of 2182)
PASS: lldb-shell :: ObjectFile/Breakpad/sections.test (941 of 2182)
PASS: lldb-unit :: Host/./HostTests/SocketTests/SocketTest.DecodeHostAndPort/ipv4 (942 of 2182)
PASS: lldb-unit :: Target/./TargetTests/ModuleCacheTest.GetAndPutUuidExists (943 of 2182)
PASS: lldb-api :: commands/watchpoints/watchpoint_set_command/TestWatchLocationWithWatchSet.py (944 of 2182)
PASS: lldb-api :: functionalities/data-formatter/data-formatter-stl/libcxx/vector/TestDataFormatterLibcxxVector.py (945 of 2182)
PASS: lldb-unit :: Host/./HostTests/MainLoopTest.UnmonitoredSignal (946 of 2182)
PASS: lldb-unit :: SymbolFile/DWARF/./SymbolFileDWARFTests/SymbolFileDWARFTests.TestAbbrevMissingTerminator (947 of 2182)
PASS: lldb-unit :: Utility/./UtilityTests/StreamTeeTest.SetStreamAtIndexOverwrite (948 of 2182)
PASS: lldb-api :: lang/cpp/type_lookup/TestCppTypeLookup.py (949 of 2182)
UNSUPPORTED: lldb-api :: functionalities/thread/thread_specific_break_plus_condition/TestThreadSpecificBpPlusCondition.py (950 of 2182)
PASS: lldb-unit :: Core/./LLDBCoreTests/RichManglingContextTest.FromCxxMethodName (951 of 2182)
PASS: lldb-unit :: UnwindAssembly/x86/./UnwindAssemblyx86Tests/Testx86AssemblyInspectionEngine.TestPopR15 (952 of 2182)
PASS: lldb-unit :: Utility/./UtilityTests/StringExtractorTest.GetHexU8_Underflow2 (953 of 2182)
PASS: lldb-api :: tools/lldb-server/inferior-crash/TestGdbRemoteSegFault.py (954 of 2182)
PASS: lldb-api :: commands/watchpoints/step_over_watchpoint/TestStepOverWatchpoint.py (955 of 2182)
PASS: lldb-shell :: Expr/TestIRMemoryMap.test (956 of 2182)
PASS: lldb-unit :: Language/Highlighting/./HighlighterTests/HighlighterTest.DefaultHighlighterWithCursor (957 of 2182)
PASS: lldb-unit :: Core/./LLDBCoreTests/CommunicationTest.SynchronizeWhileClosing (958 of 2182)
PASS: lldb-shell :: Quit/TestQuitExitCodeTooManyArgs.test (959 of 2182)
PASS: lldb-api :: commands/source/info/TestSourceInfo.py (960 of 2182)
PASS: lldb-unit :: Host/./HostTests/SocketTests/SocketTest.UDPGetConnectURI/ipv6 (961 of 2182)
PASS: lldb-api :: lang/c/array_types/TestArrayTypes.py (962 of 2182)
PASS: lldb-api :: commands/frame/recognizer/TestFrameRecognizer.py (963 of 2182)
PASS: lldb-unit :: ObjectFile/Breakpad/./ObjectFileBreakpadTests/FuncRecord.parse (964 of 2182)
PASS: lldb-unit :: UnwindAssembly/x86/./UnwindAssemblyx86Tests/Testx86AssemblyInspectionEngine.TestPushRBP (965 of 2182)
PASS: lldb-api :: functionalities/thread/concurrent_events/TestConcurrentBreakpointDelayBreakpointOneSignal.py (966 of 2182)
PASS: lldb-unit :: Expression/./ExpressionTests/ClangExpressionDeclMapTest.TestPersistentDeclLookup (967 of 2182)
PASS: lldb-unit :: Utility/./UtilityTests/UriParserTest.MinimalPort (968 of 2182)
PASS: lldb-api :: python_api/frame/TestFrames.py (969 of 2182)
PASS: lldb-unit :: ScriptInterpreter/Python/./ScriptInterpreterPythonTests/PythonDataObjectsTest.TestPythonBytes (970 of 2182)
UNSUPPORTED: lldb-shell :: ScriptInterpreter/Lua/lua.test (971 of 2182)
PASS: lldb-unit :: Utility/./UtilityTests/BinaryStreamTest.PutULEB128OneByte (972 of 2182)
PASS: lldb-unit :: Utility/./UtilityTests/SubsystemRAIITest.NormalSubsystem (973 of 2182)
PASS: lldb-shell :: SymbolFile/DWARF/debug_line-relative_path.s (974 of 2182)
PASS: lldb-api :: commands/expression/two-files/TestObjCTypeQueryFromOtherCompileUnit.py (975 of 2182)
PASS: lldb-api :: lang/cpp/unicode-literals/TestUnicodeLiterals.py (976 of 2182)
PASS: lldb-api :: lang/cpp/virtual-overload/TestVirtualOverload.py (977 of 2182)
PASS: lldb-unit :: DataFormatter/./LLDBFormatterTests/StringPrinterTests.CxxUTF8 (978 of 2182)
PASS: lldb-api :: functionalities/data-formatter/synthupdate/TestSyntheticFilterRecompute.py (979 of 2182)
PASS: lldb-api :: tools/lldb-server/TestGdbRemoteAttach.py (980 of 2182)
PASS: lldb-unit :: Process/gdb-remote/./ProcessGdbRemoteTests/GDBRemoteCommunicationClientTest.SyncThreadState (981 of 2182)
PASS: lldb-api :: commands/expression/persist_objc_pointeetype/TestPersistObjCPointeeType.py (982 of 2182)
PASS: lldb-unit :: Utility/./UtilityTests/ArgsTest.TestQuotedUnknownEscape (983 of 2182)
PASS: lldb-api :: macosx/save_crashlog/TestSaveCrashlog.py (984 of 2182)
PASS: lldb-api :: tools/lldb-server/commandline/TestStubReverseConnect.py (985 of 2182)
PASS: lldb-api :: functionalities/data-formatter/data-formatter-caching/TestDataFormatterCaching.py (986 of 2182)
PASS: lldb-api :: lang/cpp/breakpoint-commands/TestCPPBreakpointCommands.py (987 of 2182)
PASS: lldb-api :: python_api/lldbutil/TestSwigVersion.py (988 of 2182)
PASS: lldb-unit :: Utility/./UtilityTests/StringListTest.JoinThree (989 of 2182)
PASS: lldb-api :: functionalities/tail_call_frames/ambiguous_tail_call_seq1/TestAmbiguousTailCallSeq1.py (990 of 2182)
PASS: lldb-shell :: SymbolFile/DWARF/debug_line-tombstone.s (991 of 2182)
PASS: lldb-unit :: Utility/./UtilityTests/ArgsTest.ReplaceArgumentAtIndexEqual (992 of 2182)
PASS: lldb-api :: functionalities/data-formatter/data-formatter-synthtype/TestDataFormatterSynthType.py (993 of 2182)
PASS: lldb-unit :: Utility/./UtilityTests/StringExtractorTest.GetNameColonValueContainsColon (994 of 2182)
PASS: lldb-unit :: Platform/Android/./AdbClientTests/AdbClientTest.CreateByDeviceId (995 of 2182)
PASS: lldb-unit :: UnwindAssembly/x86/./UnwindAssemblyx86Tests/Testx86AssemblyInspectionEngine.Test32bitFramelessBigStackFrame (996 of 2182)
PASS: lldb-unit :: Utility/./UtilityTests/GeneratorTest.Create (997 of 2182)
PASS: lldb-shell :: Register/x86-64-gp-read.test (998 of 2182)
PASS: lldb-unit :: Utility/./UtilityTests/VMRange.ContainsRange (999 of 2182)
PASS: lldb-unit :: Utility/./UtilityTests/StreamTest.PutBytesAsRawHex8ToLittleEndian (1000 of 2182)
PASS: lldb-shell :: SymbolFile/Breakpad/line-table-missing-file.test (1001 of 2182)
PASS: lldb-unit :: Utility/./UtilityTests/StreamTeeTest.Assignment (1002 of 2182)
PASS: lldb-api :: commands/target/stop-hook/disable/TestTargetStopHookDisable.py (1003 of 2182)
UNSUPPORTED: lldb-api :: linux/thread/create_during_instruction_step/TestCreateDuringInstructionStep.py (1004 of 2182)
PASS: lldb-unit :: Symbol/./SymbolTests/TestTypeSystemClang.TestGetTypeClassTypeOf (1005 of 2182)
PASS: lldb-api :: functionalities/thread/concurrent_events/TestConcurrentTwoWatchpointsOneDelayBreakpoint.py (1006 of 2182)
PASS: lldb-unit :: Utility/./UtilityTests/AnsiTerminal.AtEnd (1007 of 2182)
PASS: lldb-unit :: Utility/./UtilityTests/ArgsTest.DoubleQuotedItem (1008 of 2182)
PASS: lldb-api :: functionalities/show_location/TestShowLocationDwarf5.py (1009 of 2182)
PASS: lldb-shell :: SymbolFile/Breakpad/stack-cfi-arm.yaml (1010 of 2182)
PASS: lldb-api :: functionalities/thread/concurrent_events/TestConcurrentCrashWithBreak.py (1011 of 2182)
PASS: lldb-unit :: Utility/./UtilityTests/StreamTest.ChangingByteOrder (1012 of 2182)
PASS: lldb-unit :: Utility/./UtilityTests/BinaryStreamTest.PutSLEB128ThreeBytes (1013 of 2182)
PASS: lldb-unit :: UnwindAssembly/x86/./UnwindAssemblyx86Tests/Testx86AssemblyInspectionEngine.TestStackRealign8BitDisp_i386 (1014 of 2182)
PASS: lldb-api :: python_api/frame/inlines/TestInlinedFrame.py (1015 of 2182)
PASS: lldb-shell :: Process/TestAbortExitCode.test (1016 of 2182)
XFAIL: lldb-shell :: SymbolFile/DWARF/find-type-in-function.cpp (1017 of 2182)
PASS: lldb-shell :: SymbolFile/DWARF/debug_rnglists.s (1018 of 2182)
PASS: lldb-unit :: Utility/./UtilityTests/NameMatchesTest.Ignore (1019 of 2182)
PASS: lldb-shell :: Expr/TestMultilineExpr.test (1020 of 2182)
PASS: lldb-unit :: Process/minidump/./LLDBMinidumpTests/MinidumpParserTest.InvalidMinidump (1021 of 2182)
PASS: lldb-unit :: Process/gdb-remote/./ProcessGdbRemoteTests/GDBRemoteClientBaseTest.SendPacketAndReceiveResponseWithOutputSupport (1022 of 2182)
PASS: lldb-unit :: Symbol/./SymbolTests/TestTypeSystemClang.TestFunctionTemplateInRecordConstruction (1023 of 2182)
PASS: lldb-shell :: Reproducer/Modules/TestModuleCXX.test (1024 of 2182)
UNSUPPORTED: lldb-shell :: SymbolFile/PDB/function-nested-block.test (1025 of 2182)
PASS: lldb-api :: commands/platform/basic/TestPlatformPython.py (1026 of 2182)
PASS: lldb-api :: commands/expression/import-std-module/weak_ptr-dbg-info-content/TestDbgInfoContentWeakPtrFromStdModule.py (1027 of 2182)
PASS: lldb-unit :: Utility/./UtilityTests/StatusTest.ErrorConversion (1028 of 2182)
PASS: lldb-api :: functionalities/data-formatter/type_summary_list_script/TestTypeSummaryListScript.py (1029 of 2182)
PASS: lldb-api :: python_api/watchpoint/TestSetWatchpoint.py (1030 of 2182)
PASS: lldb-unit :: Expression/./ExpressionTests/DWARFExpression.DW_OP_piece (1031 of 2182)
PASS: lldb-api :: arm/emulation/TestEmulations.py (1032 of 2182)
PASS: lldb-unit :: UnwindAssembly/ARM64/./Arm64InstEmulationTests/TestArm64InstEmulation.TestRegisterSavedTwice (1033 of 2182)
PASS: lldb-unit :: Utility/./UtilityTests/CompletionRequest.Constructor (1034 of 2182)
PASS: lldb-unit :: Utility/./UtilityTests/DataExtractorTest.GetCStr (1035 of 2182)
PASS: lldb-unit :: ObjectFile/ELF/./ObjectFileELFTests/ObjectFileELFTest.GetSymtab_NoSymEntryPointArmThumbAddressClass (1036 of 2182)
PASS: lldb-api :: functionalities/gdb_remote_client/TestJLink6Armv7RegisterDefinition.py (1037 of 2182)
PASS: lldb-shell :: SymbolFile/DWARF/debug_loc_and_loclists.s (1038 of 2182)
PASS: lldb-api :: macosx/profile_vrs_detach/TestDetachVrsProfile.py (1039 of 2182)
UNSUPPORTED: lldb-api :: macosx/macCatalystAppMacOSFramework/TestMacCatalystAppWithMacOSFramework.py (1040 of 2182)
PASS: lldb-api :: commands/expression/char/TestExprsChar.py (1041 of 2182)
PASS: lldb-unit :: Utility/./UtilityTests/StreamTest.Indent (1042 of 2182)
PASS: lldb-api :: tools/lldb-vscode/stackTrace/TestVSCode_stackTrace.py (1043 of 2182)
PASS: lldb-unit :: UnwindAssembly/x86/./UnwindAssemblyx86Tests/Testx86AssemblyInspectionEngine.TestPushExtended (1044 of 2182)
PASS: lldb-unit :: Utility/./UtilityTests/StringExtractorTest.GetHexBytesAvail_Underflow (1045 of 2182)
PASS: lldb-unit :: Utility/./UtilityTests/TimerTest.CategoryTimesStats (1046 of 2182)
PASS: lldb-api :: functionalities/data-formatter/array_typedef/TestArrayTypedef.py (1047 of 2182)
PASS: lldb-unit :: Utility/./UtilityTests/StringExtractorTest.DecodeHexU8_InvalidHex2 (1048 of 2182)
PASS: lldb-unit :: Process/gdb-remote/./ProcessGdbRemoteTests/GDBRemoteClientBaseTest.InterruptNoResponse (1049 of 2182)
PASS: lldb-api :: commands/command/script/import/rdar-12586188/TestRdar12586188.py (1050 of 2182)
PASS: lldb-api :: functionalities/data-formatter/data-formatter-stl/libcxx/function/TestLibCxxFunction.py (1051 of 2182)
PASS: lldb-shell :: SymbolFile/DWARF/limit-debug-info.s (1052 of 2182)
PASS: lldb-unit :: Utility/./UtilityTests/StreamTest.PutStringAsRawHex8 (1053 of 2182)
PASS: lldb-api :: functionalities/asan/TestReportData.py (1054 of 2182)
PASS: lldb-shell :: SymbolFile/DWARF/debug-types-signature-loop.s (1055 of 2182)
PASS: lldb-unit :: Symbol/./SymbolTests/TestClangASTImporter.CompleteFwdDeclWithOtherOrigin (1056 of 2182)
UNSUPPORTED: lldb-shell :: ObjectFile/ELF/minidebuginfo-set-and-hit-breakpoint.test (1057 of 2182)
PASS: lldb-unit :: Utility/./UtilityTests/TimerTest.CategoryTimes (1058 of 2182)
PASS: lldb-unit :: UnwindAssembly/x86/./UnwindAssemblyx86Tests/Testx86AssemblyInspectionEngine.TestPopEBP (1059 of 2182)
PASS: lldb-shell :: Commands/command-backtrace.test (1060 of 2182)
PASS: lldb-unit :: Symbol/./SymbolTests/TestClangASTImporter.ImportInvalidType (1061 of 2182)
PASS: lldb-api :: commands/reproducer/invalid-args/TestInvalidArgsReproducer.py (1062 of 2182)
PASS: lldb-unit :: Utility/./UtilityTests/ConstStringTest.FromMidOfBufferStringRef (1063 of 2182)
PASS: lldb-unit :: Utility/./UtilityTests/BinaryStreamTest.PutULEB128FourBytes (1064 of 2182)
PASS: lldb-api :: lang/cpp/global_variables/TestCPPGlobalVariables.py (1065 of 2182)
PASS: lldb-unit :: Utility/./UtilityTests/RangeDataVector.FindEntryIndexesThatContain_Overlap (1066 of 2182)
PASS: lldb-api :: functionalities/multiword-commands/TestMultiWordCommands.py (1067 of 2182)
UNSUPPORTED: lldb-api :: tools/lldb-server/TestGdbRemoteCompletion.py (1068 of 2182)
PASS: lldb-unit :: Utility/./UtilityTests/OptionsWithRawTest.SingleWordSuffix (1069 of 2182)
PASS: lldb-shell :: Unwind/trap_frame_sym_ctx.test (1070 of 2182)
UNSUPPORTED: lldb-shell :: Watchpoint/netbsd-nouserdbregs.test (1071 of 2182)
PASS: lldb-api :: macosx/function-starts/TestFunctionStarts.py (1072 of 2182)
PASS: lldb-api :: commands/watchpoints/multiple_threads/TestWatchpointMultipleThreads.py (1073 of 2182)
PASS: lldb-api :: api/log/TestAPILog.py (1074 of 2182)
PASS: lldb-unit :: Host/./HostTests/SocketTests/SocketTest.DomainListenConnectAccept/ipv6 (1075 of 2182)
PASS: lldb-api :: lang/objc/orderedset/TestOrderedSet.py (1076 of 2182)
PASS: lldb-unit :: Utility/./UtilityTests/Flags.AllSet (1077 of 2182)
PASS: lldb-api :: commands/frame/diagnose/local-variable/TestLocalVariable.py (1078 of 2182)
PASS: lldb-api :: macosx/find-dsym/bundle-with-dot-in-filename/TestBundleWithDotInFilename.py (1079 of 2182)
PASS: lldb-api :: functionalities/data-formatter/data-formatter-objc/TestDataFormatterObjCNSError.py (1080 of 2182)
PASS: lldb-shell :: SymbolFile/DWARF/debug_ranges.s (1081 of 2182)
PASS: lldb-unit :: ScriptInterpreter/Python/./ScriptInterpreterPythonTests/PythonDataObjectsTest.TestBorrowedReferences (1082 of 2182)
PASS: lldb-unit :: Utility/./UtilityTests/StreamTeeTest.SetStreamAtIndexOutOfBounds (1083 of 2182)
PASS: lldb-api :: functionalities/abbreviation/TestAbbreviations.py (1084 of 2182)
PASS: lldb-api :: functionalities/optimized_code/TestNoASanExceptionAfterEvalOP_piece.py (1085 of 2182)
PASS: lldb-shell :: SymbolFile/DWARF/find-method.cpp (1086 of 2182)
PASS: lldb-unit :: SymbolFile/DWARF/./SymbolFileDWARFTests/SymbolFileDWARFTests.ParseArangesNonzeroSegmentSize (1087 of 2182)
UNSUPPORTED: lldb-shell :: Register/x86-64-xmm16-write.test (1088 of 2182)
PASS: lldb-api :: functionalities/tail_call_frames/thread_step_out_or_return/TestSteppingOutWithArtificialFrames.py (1089 of 2182)
PASS: lldb-api :: lang/c/global_variables/TestGlobalVariables.py (1090 of 2182)
UNSUPPORTED: lldb-shell :: Unwind/split-machine-functions.test (1091 of 2182)
PASS: lldb-unit :: Utility/./UtilityTests/StringListTest.AppendListCStringArrayEmpty (1092 of 2182)
PASS: lldb-api :: commands/target/create-deps/TestTargetCreateDeps.py (1093 of 2182)
PASS: lldb-unit :: Utility/./UtilityTests/RangeTest.LessThanInvalid (1094 of 2182)
PASS: lldb-shell :: Unwind/thread-step-out-ret-addr-check.test (1095 of 2182)
PASS: lldb-api :: functionalities/ubsan/user-expression/TestUbsanUserExpression.py (1096 of 2182)
PASS: lldb-api :: python_api/sbplatform/TestSBPlatform.py (1097 of 2182)
PASS: lldb-api :: functionalities/var_path/TestVarPath.py (1098 of 2182)
PASS: lldb-unit :: Host/./HostTests/SocketTests/SocketTest.DomainGetConnectURI/ipv4 (1099 of 2182)
PASS: lldb-api :: lang/objc/modules-compile-error/TestModulesCompileError.py (1100 of 2182)
XFAIL: lldb-shell :: Register/x86-multithread-write.test (1101 of 2182)
PASS: lldb-unit :: tools/lldb-server/tests/./LLDBServerTests/TestBase.LaunchModePreservesEnvironment (1102 of 2182)
PASS: lldb-unit :: Utility/./UtilityTests/ArgsTest.ReplaceArgumentAtIndexShort (1103 of 2182)
PASS: lldb-unit :: Utility/./UtilityTests/StringListTest.CopyList (1104 of 2182)
PASS: lldb-api :: commands/expression/deleting-implicit-copy-constructor/TestDeletingImplicitCopyConstructor.py (1105 of 2182)
PASS: lldb-unit :: Utility/./UtilityTests/UUIDTest.StringConverion (1106 of 2182)
PASS: lldb-api :: functionalities/thread/concurrent_events/TestConcurrentDelayedCrashWithBreakpointSignal.py (1107 of 2182)
PASS: lldb-api :: commands/session/history/TestSessionHistory.py (1108 of 2182)
PASS: lldb-unit :: Utility/./UtilityTests/StringListTest.Clear (1109 of 2182)
PASS: lldb-unit :: Core/./LLDBCoreTests/MangledTest.ResultForBlockInvocation (1110 of 2182)
PASS: lldb-api :: macosx/safe-to-func-call/TestSafeFuncCalls.py (1111 of 2182)
PASS: lldb-api :: functionalities/data-formatter/data-formatter-stl/libcxx/map/TestDataFormatterLibccMap.py (1112 of 2182)
PASS: lldb-api :: lang/cpp/breakpoint_in_member_func_w_non_primitive_params/TestBreakpointInMemberFuncWNonPrimitiveParams.py (1113 of 2182)
PASS: lldb-api :: functionalities/data-formatter/data-formatter-stl/libcxx/queue/TestDataFormatterLibcxxQueue.py (1114 of 2182)
PASS: lldb-unit :: Utility/./UtilityTests/SerializationRountripTest.SerializeDeserializePodReferences (1115 of 2182)
PASS: lldb-shell :: SymbolFile/DWARF/debug-types-basic.test (1116 of 2182)
PASS: lldb-api :: commands/expression/import-std-module/vector-dbg-info-content/TestDbgInfoContentVectorFromStdModule.py (1117 of 2182)
PASS: lldb-unit :: Utility/./UtilityTests/RangeDataVector.CustomSort (1118 of 2182)
PASS: lldb-api :: commands/expression/radar_9531204/TestPrintfAfterUp.py (1119 of 2182)
UNSUPPORTED: lldb-api :: functionalities/data-formatter/data-formatter-stl/libstdcpp/tuple/TestDataFormatterStdTuple.py (1120 of 2182)
PASS: lldb-unit :: Utility/./UtilityTests/CompletionRequest.ShiftArguments (1121 of 2182)
PASS: lldb-api :: functionalities/thread/concurrent_events/TestConcurrentTwoWatchpointThreads.py (1122 of 2182)
PASS: lldb-shell :: Minidump/fb-dump.test (1123 of 2182)
PASS: lldb-shell :: ObjectFile/ELF/minidebuginfo-corrupt-xz.yaml (1124 of 2182)
PASS: lldb-unit :: Utility/./UtilityTests/StreamTeeTest.GetStreamAtIndexOutOfBounds (1125 of 2182)
PASS: lldb-unit :: Utility/./UtilityTests/StringLexerTest.GetUnlexed (1126 of 2182)
PASS: lldb-unit :: ScriptInterpreter/Python/./ScriptInterpreterPythonTests/PythonDataObjectsTest.TestPythonListValueEquality (1127 of 2182)
PASS: lldb-api :: lang/objc/variadic_methods/TestVariadicMethods.py (1128 of 2182)
PASS: lldb-api :: lang/cpp/char1632_t/TestChar1632T.py (1129 of 2182)
PASS: lldb-unit :: Process/gdb-remote/./ProcessGdbRemoteTests/GDBRemoteCommunicationServerTest.SendErrorResponse_UnimplementedError (1130 of 2182)
PASS: lldb-unit :: Utility/./UtilityTests/StringListTest.GetMaxStringLengthMixed (1131 of 2182)
PASS: lldb-api :: lang/c/const_variables/TestConstVariables.py (1132 of 2182)
PASS: lldb-shell :: SymbolFile/DWARF/debug_loc-aslr.s (1133 of 2182)
PASS: lldb-unit :: Utility/./UtilityTests/CompletionRequest.TryCompleteCurrentArgGood (1134 of 2182)
PASS: lldb-api :: lang/cpp/typedef/TestCppTypedef.py (1135 of 2182)
UNSUPPORTED: lldb-shell :: Register/x86-64-zmm-read.test (1136 of 2182)
UNSUPPORTED: lldb-shell :: Process/Windows/exception_access_violation.cpp (1137 of 2182)
PASS: lldb-api :: functionalities/tail_call_frames/disambiguate_call_site/TestDisambiguateCallSite.py (1138 of 2182)
PASS: lldb-api :: commands/frame/diagnose/bad-reference/TestBadReference.py (1139 of 2182)
PASS: lldb-api :: commands/frame/diagnose/dereference-this/TestDiagnoseDereferenceThis.py (1140 of 2182)
PASS: lldb-api :: lang/objc/objc-static-method-stripped/TestObjCStaticMethodStripped.py (1141 of 2182)
PASS: lldb-api :: functionalities/data-formatter/type_summary_list_arg/TestTypeSummaryListArg.py (1142 of 2182)
PASS: lldb-api :: functionalities/thread/exit_during_expression/TestExitDuringExpression.py (1143 of 2182)
PASS: lldb-api :: functionalities/data-formatter/data-formatter-objc/TestDataFormatterObjCCF.py (1144 of 2182)
PASS: lldb-unit :: Utility/./UtilityTests/AnsiTerminal.Incomplete (1145 of 2182)
PASS: lldb-unit :: Utility/./UtilityTests/TimeoutTest.Construction (1146 of 2182)
PASS: lldb-api :: python_api/default-constructor/TestDefaultConstructorForAPIObjects.py (1147 of 2182)
PASS: lldb-api :: lang/cpp/enum_types/TestCPP11EnumTypes.py (1148 of 2182)
PASS: lldb-api :: lang/cpp/operators/TestCppOperators.py (1149 of 2182)
PASS: lldb-shell :: ObjectFile/PDB/object.test (1150 of 2182)
PASS: lldb-unit :: Utility/./UtilityTests/StringListTest.JoinNonSpace (1151 of 2182)
PASS: lldb-api :: functionalities/signal/raise/TestRaise.py (1152 of 2182)
PASS: lldb-api :: functionalities/conditional_break/TestConditionalBreak.py (1153 of 2182)
PASS: lldb-unit :: SymbolFile/NativePDB/./SymbolFileNativePDBTests/PDBFPOProgramToDWARFExpressionTests.InvalidAssignmentMultiple (1154 of 2182)
PASS: lldb-unit :: Host/./HostTests/SocketTests/SocketTest.TCPGetAddress/ipv4 (1155 of 2182)
PASS: lldb-unit :: Expression/./ExpressionTests/DiagnosticManagerTest.FixedExpression (1156 of 2182)
PASS: lldb-unit :: Language/Highlighting/./HighlighterTests/HighlighterTest.ClangComments (1157 of 2182)
PASS: lldb-api :: commands/disassemble/basic/TestFrameDisassemble.py (1158 of 2182)
PASS: lldb-unit :: Utility/./UtilityTests/PassiveReplayTest.InstrumentedBarRef (1159 of 2182)
PASS: lldb-unit :: Utility/./UtilityTests/RangeDataVector.FindEntryThatContains_Overlap (1160 of 2182)
PASS: lldb-shell :: ScriptInterpreter/Python/sb_address_exception.test (1161 of 2182)
PASS: lldb-api :: functionalities/tsan/basic/TestTsanBasic.py (1162 of 2182)
PASS: lldb-unit :: Utility/./UtilityTests/RangeTest.SizeTypes (1163 of 2182)
PASS: lldb-api :: commands/process/attach/TestProcessAttach.py (1164 of 2182)
PASS: lldb-unit :: Host/./HostTests/MainLoopTest.Signal (1165 of 2182)
PASS: lldb-unit :: Expression/./ExpressionTests/DiagnosticManagerTest.GetStringMultipleDiags (1166 of 2182)
PASS: lldb-api :: functionalities/thread/concurrent_events/TestConcurrentCrashWithWatchpointBreakpointSignal.py (1167 of 2182)
PASS: lldb-api :: functionalities/data-formatter/user-format-vs-summary/TestUserFormatVsSummary.py (1168 of 2182)
PASS: lldb-unit :: UnwindAssembly/ARM64/./Arm64InstEmulationTests/TestArm64InstEmulation.TestRegisterDoubleSpills (1169 of 2182)
PASS: lldb-api :: python_api/sbtype_typeclass/TestSBTypeTypeClass.py (1170 of 2182)
PASS: lldb-shell :: Register/x86-multithread-read.test (1171 of 2182)
PASS: lldb-unit :: Utility/./UtilityTests/UriParserTest.TypicalPortPathIPv4 (1172 of 2182)
PASS: lldb-unit :: Process/gdb-remote/./ProcessGdbRemoteTests/GDBRemoteCommunicationClientTest.SendStopTracePacket (1173 of 2182)
PASS: lldb-api :: python_api/lldbutil/iter/TestLLDBIterator.py (1174 of 2182)
PASS: lldb-unit :: UnwindAssembly/x86/./UnwindAssemblyx86Tests/Testx86AssemblyInspectionEngine.TestPushESI (1175 of 2182)
PASS: lldb-unit :: UnwindAssembly/x86/./UnwindAssemblyx86Tests/Testx86AssemblyInspectionEngine.TestPopRBX (1176 of 2182)
PASS: lldb-unit :: Utility/./UtilityTests/LogChannelEnabledTest.LogThread (1177 of 2182)
PASS: lldb-shell :: SymbolFile/Breakpad/line-table-edgecases.test (1178 of 2182)
PASS: lldb-api :: python_api/sbstructureddata/TestStructuredDataAPI.py (1179 of 2182)
PASS: lldb-api :: macosx/queues/TestQueues.py (1180 of 2182)
PASS: lldb-api :: functionalities/mtc/simple/TestMTCSimple.py (1181 of 2182)
PASS: lldb-api :: python_api/sbdata/TestSBData.py (1182 of 2182)
PASS: lldb-unit :: Utility/./UtilityTests/RecordReplayTest.InstrumentedFooSameThis (1183 of 2182)
PASS: lldb-api :: functionalities/gdb_remote_client/TestRecognizeBreakpoint.py (1184 of 2182)
PASS: lldb-shell :: SymbolFile/DWARF/dir-separator-no-comp-dir-relative-name.s (1185 of 2182)
PASS: lldb-unit :: Utility/./UtilityTests/ScalarTest.Division (1186 of 2182)
PASS: lldb-api :: commands/platform/basic/TestPlatformCommand.py (1187 of 2182)
PASS: lldb-api :: functionalities/gdb_remote_client/TestQemuAArch64TargetXml.py (1188 of 2182)
PASS: lldb-unit :: Thread/./ThreadTests/ThreadTest.SetStopInfo (1189 of 2182)
PASS: lldb-api :: python_api/sbenvironment/TestSBEnvironment.py (1190 of 2182)
UNSUPPORTED: lldb-api :: commands/register/register/intel_xtended_registers/mpx_bound_violation/TestBoundViolation.py (1191 of 2182)
PASS: lldb-api :: functionalities/gdb_remote_client/TestNoGPacketSupported.py (1192 of 2182)
UNSUPPORTED: lldb-shell :: Register/x86-gp-write.test (1193 of 2182)
PASS: lldb-unit :: Symbol/./SymbolTests/PostfixExpression.ParseOneExpression (1194 of 2182)
PASS: lldb-unit :: Utility/./UtilityTests/UriParserTest.Empty (1195 of 2182)
PASS: lldb-api :: commands/expression/pr35310/TestExprsBug35310.py (1196 of 2182)
PASS: lldb-unit :: Utility/./UtilityTests/ArgsTest.Yaml (1197 of 2182)
PASS: lldb-unit :: Host/./HostTests/SocketTests/SocketTest.TCPGetConnectURI/ipv4 (1198 of 2182)
PASS: lldb-shell :: SymbolFile/DWARF/debug-types-missing-signature.test (1199 of 2182)
PASS: lldb-api :: functionalities/plugins/command_plugin/TestPluginCommands.py (1200 of 2182)
UNSUPPORTED: lldb-shell :: Register/x86-64-xmm16-read.test (1201 of 2182)
PASS: lldb-api :: functionalities/data-formatter/typedef_array/TestTypedefArray.py (1202 of 2182)
PASS: lldb-api :: functionalities/data-formatter/data-formatter-categories/TestDataFormatterCategories.py (1203 of 2182)
UNSUPPORTED: lldb-api :: commands/trace/TestTraceLoad.py (1204 of 2182)
PASS: lldb-api :: functionalities/reproducers/attach/TestReproducerAttach.py (1205 of 2182)
PASS: lldb-api :: lang/cpp/symbols/TestSymbols.py (1206 of 2182)
PASS: lldb-unit :: Language/Highlighting/./HighlighterTests/HighlighterTest.ClangScalarLiterals (1207 of 2182)
PASS: lldb-api :: functionalities/thread/thread_specific_break/TestThreadSpecificBreakpoint.py (1208 of 2182)
PASS: lldb-api :: lang/objc/objc-ivar-offsets/TestObjCIvarOffsets.py (1209 of 2182)
PASS: lldb-unit :: Expression/./ExpressionTests/CppModuleConfigurationTest.UnrelatedLibrary (1210 of 2182)
PASS: lldb-unit :: Utility/./UtilityTests/LogTest.Register (1211 of 2182)
PASS: lldb-api :: functionalities/gdb_remote_client/TestNestedRegDefinitions.py (1212 of 2182)
PASS: lldb-shell :: Minidump/Windows/Sigsegv/sigsegv.test (1213 of 2182)
PASS: lldb-api :: functionalities/tail_call_frames/disambiguate_tail_call_seq/TestDisambiguateTailCallSeq.py (1214 of 2182)
PASS: lldb-shell :: ScriptInterpreter/None/import_module.test (1215 of 2182)
UNSUPPORTED: lldb-shell :: ScriptInterpreter/Lua/quit.test (1216 of 2182)
PASS: lldb-api :: tools/lldb-vscode/breakpoint-events/TestVSCode_breakpointEvents.py (1217 of 2182)
PASS: lldb-api :: commands/expression/multiline-navigation/TestMultilineNavigation.py (1218 of 2182)
PASS: lldb-unit :: Symbol/./SymbolTests/DWARFCallFrameInfoTest.Basic_eh (1219 of 2182)
UNSUPPORTED: lldb-api :: commands/trace/TestTraceSchema.py (1220 of 2182)
UNSUPPORTED: lldb-shell :: ScriptInterpreter/Lua/command_script_import.test (1221 of 2182)
PASS: lldb-unit :: ScriptInterpreter/Python/./ScriptInterpreterPythonTests/PythonDataObjectsTest.TestPythonBoolean (1222 of 2182)
PASS: lldb-unit :: Utility/./UtilityTests/CompletionRequest.TryCompleteCurrentArgMode (1223 of 2182)
PASS: lldb-unit :: Utility/./UtilityTests/BinaryStreamTest.PutULEB128MaxValue (1224 of 2182)
PASS: lldb-unit :: Utility/./UtilityTests/ProcessInfoTest.Constructor (1225 of 2182)
PASS: lldb-unit :: Core/./LLDBCoreTests/RichManglingContextTest.Basic (1226 of 2182)
PASS: lldb-unit :: Utility/./UtilityTests/ScalarTest.Getters (1227 of 2182)
PASS: lldb-unit :: Utility/./UtilityTests/StringLexerTest.HasAtLeast (1228 of 2182)
PASS: lldb-unit :: ScriptInterpreter/Python/./ScriptInterpreterPythonTests/PythonDataObjectsTest.TestRun (1229 of 2182)
PASS: lldb-unit :: Utility/./UtilityTests/StringListTest.AppendStringMove (1230 of 2182)
PASS: lldb-unit :: Process/gdb-remote/./ProcessGdbRemoteTests/GDBRemoteCommunicationClientTest.GetModulesInfoInvalidResponse (1231 of 2182)
PASS: lldb-unit :: Utility/./UtilityTests/RangeTest.ContainsAddrInvalid (1232 of 2182)
PASS: lldb-api :: functionalities/thread/concurrent_events/TestConcurrentSignalWatch.py (1233 of 2182)
UNSUPPORTED: lldb-shell :: Unwind/basic-block-sections.test (1234 of 2182)
PASS: lldb-unit :: Utility/./UtilityTests/TimeoutTest.Format (1235 of 2182)
PASS: lldb-api :: functionalities/data-formatter/data-formatter-objc/TestDataFormatterObjCNSContainer.py (1236 of 2182)
PASS: lldb-api :: functionalities/object-file/TestImageListMultiArchitecture.py (1237 of 2182)
PASS: lldb-unit :: Utility/./UtilityTests/FileSpecTest.RemoveLastPathComponent (1238 of 2182)
PASS: lldb-unit :: Core/./LLDBCoreTests/SourceFileCache.FindSourceFileFound (1239 of 2182)
PASS: lldb-api :: functionalities/data-formatter/data-formatter-stl/libcxx/bitset/TestDataFormatterLibcxxBitset.py (1240 of 2182)
PASS: lldb-api :: lang/objc/objc-super/TestObjCSuper.py (1241 of 2182)
PASS: lldb-unit :: Core/./LLDBCoreTests/MangledTest.NameIndexes_FindFunctionSymbols (1242 of 2182)
PASS: lldb-shell :: SymbolFile/DWARF/debug-types-dwarf5.s (1243 of 2182)
PASS: lldb-unit :: Utility/./UtilityTests/DataExtractorTest.PeekData (1244 of 2182)
PASS: lldb-api :: functionalities/tsan/thread_leak/TestTsanThreadLeak.py (1245 of 2182)
PASS: lldb-unit :: ScriptInterpreter/Python/./ScriptInterpreterPythonTests/PythonDataObjectsTest.TestGlobalNameResolutionNoDot (1246 of 2182)
PASS: lldb-unit :: Utility/./UtilityTests/EnvironmentTest.EnvpConversion (1247 of 2182)
PASS: lldb-unit :: Process/minidump/./LLDBMinidumpTests/MinidumpParserTest.MinidumpModuleOrder (1248 of 2182)
PASS: lldb-unit :: Expression/./ExpressionTests/DiagnosticManagerTest.GetStringBasic (1249 of 2182)
PASS: lldb-unit :: Utility/./UtilityTests/BinaryStreamTest.PutSLEB128EightBytes (1250 of 2182)
PASS: lldb-api :: commands/process/attach/attach_denied/TestAttachDenied.py (1251 of 2182)
PASS: lldb-unit :: Host/./HostTests/SocketTests/SocketTest.DomainListenConnectAccept/ipv4 (1252 of 2182)
PASS: lldb-api :: commands/command/script/import/TestImport.py (1253 of 2182)
PASS: lldb-api :: functionalities/completion/TestCompletion.py (1254 of 2182)
PASS: lldb-api :: commands/expression/import-std-module/shared_ptr/TestSharedPtrFromStdModule.py (1255 of 2182)
PASS: lldb-shell :: ScriptInterpreter/Python/scripted_breakpoint.test (1256 of 2182)
PASS: lldb-unit :: Process/gdb-remote/./ProcessGdbRemoteTests/GDBRemoteCommunicationClientTest.SendSignalsToIgnore (1257 of 2182)
PASS: lldb-api :: python_api/interpreter/TestCommandInterpreterAPI.py (1258 of 2182)
PASS: lldb-shell :: Heap/heap-cstr.test (1259 of 2182)
UNSUPPORTED: lldb-api :: functionalities/darwin_log/filter/exact_match/category/TestDarwinLogFilterMatchCategory.py (1260 of 2182)
PASS: lldb-shell :: SymbolFile/DWARF/dir-separator-windows.s (1261 of 2182)
PASS: lldb-unit :: Utility/./UtilityTests/UriParserTest.SchemeHostSeparator3 (1262 of 2182)
PASS: lldb-api :: functionalities/breakpoint/hardware_breakpoints/require_hw_breakpoints/TestRequireHWBreakpoints.py (1263 of 2182)
PASS: lldb-unit :: Utility/./UtilityTests/VASprintfTest.NoBufferResize (1264 of 2182)
PASS: lldb-unit :: Utility/./UtilityTests/RegisterValueTest.GetSet8 (1265 of 2182)
PASS: lldb-shell :: Unwind/eh-frame-dwarf-unwind.test (1266 of 2182)
PASS: lldb-unit :: UnwindAssembly/x86/./UnwindAssemblyx86Tests/Testx86AssemblyInspectionEngine.TestPush0 (1267 of 2182)
PASS: lldb-unit :: Language/Highlighting/./HighlighterTests/HighlighterTest.Keywords (1268 of 2182)
PASS: lldb-unit :: Utility/./UtilityTests/AnsiTerminal.AtStart (1269 of 2182)
PASS: lldb-unit :: Utility/./UtilityTests/CompletionRequest.TestCompletionOwnership (1270 of 2182)
PASS: lldb-unit :: Utility/./UtilityTests/BinaryStreamTest.PutSLEB128TwoBytes (1271 of 2182)
PASS: lldb-api :: commands/target/stop-hook/enable/TestTargetStopHookEnable.py (1272 of 2182)
PASS: lldb-unit :: Process/minidump/./LLDBMinidumpTests/MinidumpParserTest.GetPidWindows (1273 of 2182)
PASS: lldb-unit :: Utility/./UtilityTests/SerializationRountripTest.SerializeDeserializeCStringNull (1274 of 2182)
PASS: lldb-shell :: Minidump/Windows/find-module.test (1275 of 2182)
PASS: lldb-unit :: Utility/./UtilityTests/StatusTest.ErrorConstructor (1276 of 2182)
PASS: lldb-api :: iohandler/completion/TestIOHandlerCompletion.py (1277 of 2182)
PASS: lldb-unit :: Utility/./UtilityTests/ScalarTest.CastOperations (1278 of 2182)
PASS: lldb-api :: commands/frame/diagnose/inheritance/TestDiagnoseInheritance.py (1279 of 2182)
PASS: lldb-api :: lang/cpp/extern_c/TestExternCSymbols.py (1280 of 2182)
UNSUPPORTED: lldb-api :: functionalities/data-formatter/data-formatter-stl/libstdcpp/iterator/TestDataFormatterStdIterator.py (1281 of 2182)
PASS: lldb-unit :: Platform/./LLDBPlatformTests/PlatformDarwinTest.TestParseVersionBuildDir (1282 of 2182)
UNSUPPORTED: lldb-api :: functionalities/darwin_log/format/TestDarwinLogMessageFormat.py (1283 of 2182)
PASS: lldb-api :: functionalities/postmortem/wow64_minidump/TestWow64MiniDump.py (1284 of 2182)
PASS: lldb-unit :: Utility/./UtilityTests/SerializationRountripTest.SerializeDeserializePodPointers (1285 of 2182)
PASS: lldb-unit :: UnwindAssembly/x86/./UnwindAssemblyx86Tests/Testx86AssemblyInspectionEngine.TestDisassemblyJunkBytes (1286 of 2182)
PASS: lldb-unit :: Utility/./UtilityTests/StringLexerTest.NextIfList (1287 of 2182)
PASS: lldb-api :: functionalities/dlopen_other_executable/TestDlopenOtherExecutable.py (1288 of 2182)
PASS: lldb-api :: types/TestRecursiveTypes.py (1289 of 2182)
PASS: lldb-unit :: Utility/./UtilityTests/OptionsWithRawTest.QuotedSuffix (1290 of 2182)
PASS: lldb-api :: functionalities/type_completion/TestTypeCompletion.py (1291 of 2182)
PASS: lldb-shell :: ObjectFile/PECOFF/basic-info.yaml (1292 of 2182)
PASS: lldb-unit :: Symbol/./SymbolTests/TestTypeSystemClang.TestGetEnumIntegerTypeBasicTypes (1293 of 2182)
PASS: lldb-api :: lang/cpp/auto/TestCPPAuto.py (1294 of 2182)
PASS: lldb-api :: functionalities/thread/concurrent_events/TestConcurrentSignalDelayBreak.py (1295 of 2182)
PASS: lldb-shell :: Settings/TestSettingsWrite.test (1296 of 2182)
PASS: lldb-unit :: Utility/./UtilityTests/FileSpecTest.PrependPathComponent (1297 of 2182)
PASS: lldb-api :: commands/apropos/basic/TestApropos.py (1298 of 2182)
UNSUPPORTED: lldb-api :: lang/cpp/static_members/TestCPPStaticMembers.py (1299 of 2182)
UNSUPPORTED: lldb-api :: functionalities/darwin_log/basic/TestDarwinLogBasic.py (1300 of 2182)
PASS: lldb-api :: lang/cpp/static_methods/TestCPPStaticMethods.py (1301 of 2182)
UNSUPPORTED: lldb-api :: functionalities/signal/handle-segv/TestHandleSegv.py (1302 of 2182)
PASS: lldb-unit :: Symbol/./SymbolTests/TestTypeSystemClang.AddMethodToObjCObjectType (1303 of 2182)
PASS: lldb-unit :: Utility/./UtilityTests/PassiveReplayTest.InstrumentedBarPtr (1304 of 2182)
PASS: lldb-unit :: Utility/./UtilityTests/ConstStringTest.YAML (1305 of 2182)
PASS: lldb-unit :: Utility/./UtilityTests/ArgsTest.TestSingleQuotedArgWithSpace (1306 of 2182)
PASS: lldb-shell :: ObjectFile/ELF/basic-info.yaml (1307 of 2182)
PASS: lldb-api :: functionalities/inferior-changed/TestInferiorChanged.py (1308 of 2182)
PASS: lldb-unit :: Utility/./UtilityTests/UriParserTest.BracketedHostnameWithPortIPv4 (1309 of 2182)
PASS: lldb-shell :: BuildScript/compiler-full-path.test (1310 of 2182)
PASS: lldb-api :: iohandler/unicode/TestUnicode.py (1311 of 2182)
PASS: lldb-api :: lang/c/conflicting-symbol/TestConflictingSymbol.py (1312 of 2182)
PASS: lldb-shell :: Quit/TestQuitExitCode30.test (1313 of 2182)
PASS: lldb-shell :: ObjectFile/PECOFF/dep-modules.yaml (1314 of 2182)
PASS: lldb-api :: commands/settings/use_source_cache/TestUseSourceCache.py (1315 of 2182)
PASS: lldb-unit :: Utility/./UtilityTests/ReproducerTest.SetCapture (1316 of 2182)
PASS: lldb-unit :: Process/minidump/./LLDBMinidumpTests/MinidumpParserTest.GetPid (1317 of 2182)
PASS: lldb-unit :: Utility/./UtilityTests/StreamTest.PutHex16ByteOrderLittle (1318 of 2182)
PASS: lldb-api :: functionalities/thread/concurrent_events/TestConcurrentSignalDelayWatch.py (1319 of 2182)
PASS: lldb-api :: commands/expression/completion-crash-incomplete-record/TestCompletionCrashIncompleteRecord.py (1320 of 2182)
PASS: lldb-unit :: UnwindAssembly/x86/./UnwindAssemblyx86Tests/Testx86AssemblyInspectionEngine.Test32BitOnlyInstruction (1321 of 2182)
UNSUPPORTED: lldb-api :: lang/cpp/function-template-parameter-pack/TestFunctionTemplateParameterPack.py (1322 of 2182)
UNSUPPORTED: lldb-api :: tools/lldb-server/TestGdbRemoteAuxvSupport.py (1323 of 2182)
PASS: lldb-api :: functionalities/thread/state_after_expression/TestStateAfterExpression.py (1324 of 2182)
PASS: lldb-shell :: Commands/command-disassemble.s (1325 of 2182)
PASS: lldb-unit :: Utility/./UtilityTests/DataExtractorTest.GetMaxU64 (1326 of 2182)
UNSUPPORTED: lldb-api :: commands/expression/call-restarts/TestCallThatRestarts.py (1327 of 2182)
PASS: lldb-shell :: SymbolFile/DWARF/clang-ast-from-dwarf-objc-property.m (1328 of 2182)
PASS: lldb-api :: macosx/duplicate-archive-members/TestDuplicateMembers.py (1329 of 2182)
PASS: lldb-unit :: debugserver/./debugserverTests/JSON.Parse (1330 of 2182)
PASS: lldb-unit :: Target/./TargetTests/PathMappingListTest.RemapRoot (1331 of 2182)
PASS: lldb-unit :: Utility/./UtilityTests/Flags.GetBitSize (1332 of 2182)
PASS: lldb-unit :: Expression/./ExpressionTests/DWARFExpression.DW_OP_convert (1333 of 2182)
UNSUPPORTED: lldb-shell :: SymbolFile/NativePDB/typedefs.cpp (1334 of 2182)
PASS: lldb-unit :: Expression/./ExpressionTests/DiagnosticManagerTest.GetStringMultiline (1335 of 2182)
PASS: lldb-api :: functionalities/data-formatter/data-formatter-objc/TestDataFormatterObjCNSURL.py (1336 of 2182)
PASS: lldb-shell :: Reproducer/TestReuseDirectory.test (1337 of 2182)
PASS: lldb-unit :: Utility/./UtilityTests/StreamTest.PutBytesAsRawHex8ToBigEndian (1338 of 2182)
PASS: lldb-api :: python_api/lldbutil/process/TestPrintStackTraces.py (1339 of 2182)
PASS: lldb-unit :: Utility/./UtilityTests/FileSpecTest.Equal (1340 of 2182)
PASS: lldb-api :: lang/c/tls_globals/TestTlsGlobals.py (1341 of 2182)
UNSUPPORTED: lldb-api :: functionalities/unwind/ehframe/TestEhFrameUnwind.py (1342 of 2182)
PASS: lldb-unit :: Utility/./UtilityTests/BinaryStreamTest.PutSLEB128Zero (1343 of 2182)
PASS: lldb-unit :: UnwindAssembly/x86/./UnwindAssemblyx86Tests/Testx86AssemblyInspectionEngine.TestPushRBX (1344 of 2182)
PASS: lldb-unit :: Utility/./UtilityTests/UriParserTest.MinimalPath (1345 of 2182)
PASS: lldb-shell :: Quit/TestQuitExitCode-30.test (1346 of 2182)
PASS: lldb-api :: functionalities/signal/handle-abrt/TestHandleAbort.py (1347 of 2182)
PASS: lldb-shell :: Reproducer/TestFileRepro.test (1348 of 2182)
PASS: lldb-unit :: Utility/./UtilityTests/StreamTeeTest.GetStreamAtIndexOutOfBoundsEmpty (1349 of 2182)
PASS: lldb-shell :: SymbolFile/DWARF/dwarf5_locations.s (1350 of 2182)
PASS: lldb-unit :: Expression/./ExpressionTests/ClangExpressionDeclMapTest.TestUnknownIdentifierLookup (1351 of 2182)
PASS: lldb-api :: commands/expression/call-function/TestCallBuiltinFunction.py (1352 of 2182)
PASS: lldb-api :: functionalities/breakpoint/breakpoint_ids/TestBreakpointIDs.py (1353 of 2182)
PASS: lldb-shell :: ObjectFile/ELF/short-build-id.yaml (1354 of 2182)
PASS: lldb-unit :: Utility/./UtilityTests/StringListTest.InsertStringAtIndexMove (1355 of 2182)
PASS: lldb-unit :: Symbol/./SymbolTests/TestTypeSystemClang.TestDisplayNameEmpty (1356 of 2182)
PASS: lldb-api :: functionalities/gdb_remote_client/TestProcessConnect.py (1357 of 2182)
PASS: lldb-api :: lang/cpp/frame-var-anon-unions/TestFrameVariableAnonymousUnions.py (1358 of 2182)
PASS: lldb-api :: functionalities/data-formatter/varscript_formatting/TestDataFormatterVarScriptFormatting.py (1359 of 2182)
PASS: lldb-shell :: Quit/TestQuitExitCode0.test (1360 of 2182)
PASS: lldb-api :: functionalities/step_scripted/TestStepScripted.py (1361 of 2182)
PASS: lldb-unit :: Expression/./ExpressionTests/DWARFExpression.DW_OP_unknown (1362 of 2182)
PASS: lldb-api :: commands/expression/save_jit_objects/TestSaveJITObjects.py (1363 of 2182)
PASS: lldb-unit :: Process/gdb-remote/./ProcessGdbRemoteTests/GDBRemoteClientBaseTest.SendContinueDelegateStructuredDataReceipt (1364 of 2182)
PASS: lldb-unit :: Utility/./UtilityTests/TimerTest.CategoryTimesNested (1365 of 2182)
PASS: lldb-unit :: UnwindAssembly/x86/./UnwindAssemblyx86Tests/Testx86AssemblyInspectionEngine.TestPopRBPWithREX (1366 of 2182)
PASS: lldb-unit :: Utility/./UtilityTests/StreamTest.AddressRangeEmptyRange (1367 of 2182)
PASS: lldb-shell :: ScriptInterpreter/Python/python.test (1368 of 2182)
PASS: lldb-api :: types/TestLongTypes.py (1369 of 2182)
PASS: lldb-unit :: Target/./TargetTests/ModuleCacheTest.GetAndPut (1370 of 2182)
PASS: lldb-api :: commands/expression/import-std-module/unique_ptr-dbg-info-content/TestUniquePtrDbgInfoContent.py (1371 of 2182)
PASS: lldb-unit :: ScriptInterpreter/Python/./ScriptInterpreterPythonTests/PythonDataObjectsTest.TestTypeNameResolutionNoDot (1372 of 2182)
PASS: lldb-shell :: ObjectFile/ELF/base-address.yaml (1373 of 2182)
PASS: lldb-unit :: Language/Highlighting/./HighlighterTests/HighlighterTest.DefaultHighlighter (1374 of 2182)
PASS: lldb-unit :: UnwindAssembly/x86/./UnwindAssemblyx86Tests/Testx86AssemblyInspectionEngine.TestPushEAX (1375 of 2182)
PASS: lldb-unit :: Utility/./UtilityTests/StringListTest.ShiftCString (1376 of 2182)
PASS: lldb-unit :: ScriptInterpreter/Python/./ScriptInterpreterPythonTests/PythonDataObjectsTest.TestPythonDictionaryManipulation (1377 of 2182)
PASS: lldb-unit :: Language/Highlighting/./HighlighterTests/HighlighterTest.ClangPPDirectives (1378 of 2182)
UNSUPPORTED: lldb-api :: functionalities/process_save_core/TestProcessSaveCore.py (1379 of 2182)
PASS: lldb-unit :: Utility/./UtilityTests/RangeTest.Clear (1380 of 2182)
PASS: lldb-api :: iohandler/autosuggestion/TestAutosuggestion.py (1381 of 2182)
PASS: lldb-api :: functionalities/load_using_paths/TestLoadUsingPaths.py (1382 of 2182)
PASS: lldb-unit :: Utility/./UtilityTests/StringListTest.SetSize (1383 of 2182)
PASS: lldb-unit :: Symbol/./SymbolTests/LineEntryTest.GetSameLineContiguousAddressRangeOneInline (1384 of 2182)
PASS: lldb-unit :: Utility/./UtilityTests/StreamTest.PutNHex8 (1385 of 2182)
PASS: lldb-shell :: Settings/TestLineMarkerColor.test (1386 of 2182)
PASS: lldb-unit :: Symbol/./SymbolTests/TestTypeSystemClang.TestBuiltinTypeForEncodingAndBitSize (1387 of 2182)
PASS: lldb-api :: commands/expression/result_numbering/TestResultNumbering.py (1388 of 2182)
PASS: lldb-unit :: ScriptInterpreter/Python/./ScriptInterpreterPythonTests/PythonDataObjectsTest.TestPythonTupleToStructuredList (1389 of 2182)
PASS: lldb-api :: functionalities/breakpoint/comp_dir_symlink/TestCompDirSymLink.py (1390 of 2182)
PASS: lldb-api :: python_api/exprpath_synthetic/TestExprPathSynthetic.py (1391 of 2182)
PASS: lldb-unit :: Symbol/./SymbolTests/Type.GetTypeScopeAndBasename (1392 of 2182)
PASS: lldb-api :: functionalities/postmortem/elf-core/TestLinuxCore.py (1393 of 2182)
PASS: lldb-unit :: Language/CPlusPlus/./LanguageCPlusPlusTests/CPlusPlusLanguage.CPlusPlusNameParser (1394 of 2182)
PASS: lldb-unit :: Utility/./UtilityTests/StatusTest.ErrorCodeConstructor (1395 of 2182)
PASS: lldb-api :: terminal/TestSTTYBeforeAndAfter.py (1396 of 2182)
PASS: lldb-api :: lang/objc/modules-update/TestClangModulesUpdate.py (1397 of 2182)
PASS: lldb-api :: lang/c/local_types/TestUseClosestType.py (1398 of 2182)
PASS: lldb-api :: lang/objcxx/objcxx-ivar-vector/TestIvarVector.py (1399 of 2182)
PASS: lldb-api :: commands/frame/language/TestGuessLanguage.py (1400 of 2182)
PASS: lldb-api :: functionalities/return-value/TestReturnValue.py (1401 of 2182)
PASS: lldb-shell :: SymbolFile/Breakpad/unwind-via-stack-win.test (1402 of 2182)
PASS: lldb-api :: functionalities/gdb_remote_client/TestGDBRemoteClient.py (1403 of 2182)
PASS: lldb-api :: macosx/order/TestOrderFile.py (1404 of 2182)
PASS: lldb-api :: types/TestCharType.py (1405 of 2182)
PASS: lldb-unit :: Language/Highlighting/./HighlighterTests/HighlighterTest.ClangCursorPosAfterOtherToken (1406 of 2182)
PASS: lldb-unit :: ObjectFile/MachO/./ObjectFileMachOTests/ObjectFileMachOTest.ModuleFromSharedCacheInfo (1407 of 2182)
PASS: lldb-api :: functionalities/data-formatter/data-formatter-cpp/TestDataFormatterCpp.py (1408 of 2182)
PASS: lldb-shell :: ObjectFile/MachO/symtab.yaml (1409 of 2182)
PASS: lldb-unit :: ScriptInterpreter/Python/./ScriptInterpreterPythonTests/PythonDataObjectsTest.TestPythonTupleValues (1410 of 2182)
PASS: lldb-shell :: Driver/TestHelp.test (1411 of 2182)
PASS: lldb-unit :: Utility/./UtilityTests/NameMatchesTest.EndsWith (1412 of 2182)
PASS: lldb-api :: lang/c/unions/TestUnionMembers.py (1413 of 2182)
PASS: lldb-shell :: SymbolFile/DWARF/find-variable-dwo.cpp (1414 of 2182)
PASS: lldb-unit :: Platform/./LLDBPlatformTests/PlatformAppleSimulatorTest.TestSimHasSimEnvionament (1415 of 2182)
PASS: lldb-shell :: Reproducer/TestVersionCheck.test (1416 of 2182)
PASS: lldb-unit :: Expression/./ExpressionTests/DiagnosticManagerTest.AppendMessageNoDiag (1417 of 2182)
PASS: lldb-unit :: Utility/./UtilityTests/StringListTest.JoinSingle (1418 of 2182)
PASS: lldb-unit :: Utility/./UtilityTests/StringExtractorTest.GetHexBytesAvail_Partial (1419 of 2182)
PASS: lldb-api :: functionalities/signal/TestSendSignal.py (1420 of 2182)
PASS: lldb-unit :: Host/./HostTests/SocketTests/SocketTest.TCPGetAddress/ipv6 (1421 of 2182)
PASS: lldb-api :: lang/c/enum_types/TestEnumTypes.py (1422 of 2182)
PASS: lldb-unit :: UnwindAssembly/x86/./UnwindAssemblyx86Tests/Testx86AssemblyInspectionEngine.TestPushECX (1423 of 2182)
PASS: lldb-api :: commands/expression/invalid-args/TestInvalidArgsExpression.py (1424 of 2182)
UNSUPPORTED: lldb-api :: functionalities/tty/TestTerminal.py (1425 of 2182)
PASS: lldb-unit :: Utility/./UtilityTests/StringListTest.AppendList (1426 of 2182)
PASS: lldb-unit :: Symbol/./SymbolTests/TestTypeSystemClang.TestGetEnumIntegerTypeInvalid (1427 of 2182)
PASS: lldb-unit :: UnwindAssembly/x86/./UnwindAssemblyx86Tests/Testx86AssemblyInspectionEngine.TestCALLNextInsn (1428 of 2182)
PASS: lldb-shell :: SymbolFile/DWARF/find-basic-type.cpp (1429 of 2182)
PASS: lldb-unit :: UnwindAssembly/ARM64/./Arm64InstEmulationTests/TestArm64InstEmulation.TestFramelessThreeEpilogueFunction (1430 of 2182)
PASS: lldb-shell :: ObjectFile/PECOFF/section-types.yaml (1431 of 2182)
PASS: lldb-shell :: Commands/command-thread-select.test (1432 of 2182)
PASS: lldb-unit :: Process/minidump/./LLDBMinidumpTests/MinidumpParserTest.GetMemoryRegionInfoLinuxMaps (1433 of 2182)
PASS: lldb-unit :: UnwindAssembly/x86/./UnwindAssemblyx86Tests/Testx86AssemblyInspectionEngine.Test32bitFramelessSmallStackFrame (1434 of 2182)
PASS: lldb-api :: python_api/value/linked_list/TestValueAPILinkedList.py (1435 of 2182)
PASS: lldb-unit :: Host/./HostTests/NativeProcessProtocolTest.ReadCStringFromMemory_MaxSize (1436 of 2182)
PASS: lldb-api :: commands/session/save/TestSessionSave.py (1437 of 2182)
PASS: lldb-unit :: Utility/./UtilityTests/StreamTest.PutHex64ByteOrderBig (1438 of 2182)
PASS: lldb-unit :: Utility/./UtilityTests/StringListTest.GetMaxStringLengthDecreasingSize (1439 of 2182)
PASS: lldb-api :: commands/expression/import-std-module/forward_list-dbg-info-content/TestDbgInfoContentForwardListFromStdModule.py (1440 of 2182)
PASS: lldb-api :: functionalities/pointer_num_children/TestPointerNumChildren.py (1441 of 2182)
PASS: lldb-unit :: Utility/./UtilityTests/FileSpecTest.IsRelative (1442 of 2182)
PASS: lldb-unit :: Utility/./UtilityTests/OptionsWithRawTest.EmptyInput (1443 of 2182)
UNSUPPORTED: lldb-api :: lang/c/typedef/Testtypedef.py (1444 of 2182)
PASS: lldb-api :: python_api/name_lookup/TestNameLookup.py (1445 of 2182)
PASS: lldb-unit :: Utility/./UtilityTests/CompletionRequest.FakeLastArg (1446 of 2182)
PASS: lldb-unit :: Utility/./UtilityTests/ArgsTest.AppendArguments (1447 of 2182)
PASS: lldb-api :: commands/command/delete/TestCommandDelete.py (1448 of 2182)
PASS: lldb-api :: functionalities/data-formatter/data-formatter-skip-summary/TestDataFormatterSkipSummary.py (1449 of 2182)
PASS: lldb-shell :: Process/Optimization.test (1450 of 2182)
PASS: lldb-unit :: Process/gdb-remote/./ProcessGdbRemoteTests/GDBRemoteCommunicationServerTest.SendErrorResponse_ErrorNumber (1451 of 2182)
PASS: lldb-unit :: Utility/./UtilityTests/ConstStringTest.format_provider (1452 of 2182)
PASS: lldb-shell :: Reproducer/TestRelativePath.test (1453 of 2182)
PASS: lldb-unit :: Symbol/./SymbolTests/TestTypeSystemClang.TestGetTypeClassNested (1454 of 2182)
PASS: lldb-unit :: Utility/./UtilityTests/XcodeSDKTest.SDKSupportsModules (1455 of 2182)
PASS: lldb-unit :: Symbol/./SymbolTests/TestTypeSystemClang.TestRemoveFastQualifiers (1456 of 2182)
PASS: lldb-unit :: Utility/./UtilityTests/BinaryStreamTest.PutSLEB128One (1457 of 2182)
PASS: lldb-unit :: Utility/./UtilityTests/StringListTest.GetMaxStringLengthEmpty (1458 of 2182)
PASS: lldb-unit :: Utility/./UtilityTests/StringListTest.LongestCommonPrefixDuplicateElement (1459 of 2182)
PASS: lldb-api :: lang/cpp/nsimport/TestCppNsImport.py (1460 of 2182)
PASS: lldb-unit :: Symbol/./SymbolTests/TestTypeSystemClang.TemplateArguments (1461 of 2182)
PASS: lldb-unit :: Utility/./UtilityTests/StringListTest.InsertStringAtIndexStart (1462 of 2182)
PASS: lldb-api :: sanity/TestModuleCacheSanity.py (1463 of 2182)
PASS: lldb-unit :: Core/./LLDBCoreTests/ModuleSpecTest.TestMachOFile (1464 of 2182)
PASS: lldb-unit :: Utility/./UtilityTests/StringListTest.DefaultConstructor (1465 of 2182)
PASS: lldb-unit :: Utility/./UtilityTests/RangeTest.ContainsEndInclusive (1466 of 2182)
PASS: lldb-shell :: ObjectFile/wasm/embedded-debug-sections.yaml (1467 of 2182)
PASS: lldb-unit :: Utility/./UtilityTests/StringExtractorTest.GetHexBytesAvail_OddPair2 (1468 of 2182)
PASS: lldb-unit :: Breakpoint/./LLDBBreakpointTests/BreakpointIDTest.StringIsBreakpointName (1469 of 2182)
PASS: lldb-api :: functionalities/breakpoint/inlined_breakpoints/TestInlinedBreakpoints.py (1470 of 2182)
PASS: lldb-api :: functionalities/pre_run_dylibs/TestPreRunDylibs.py (1471 of 2182)
PASS: lldb-shell :: SymbolFile/DWARF/DW_TAG_variable-DW_AT_const_value.s (1472 of 2182)
PASS: lldb-api :: functionalities/breakpoint/serialize/TestBreakpointSerialization.py (1473 of 2182)
PASS: lldb-unit :: Utility/./UtilityTests/DataExtractorTest.GetMaxU64_unchecked (1474 of 2182)
PASS: lldb-unit :: Utility/./UtilityTests/StringLexerTest.PutBack (1475 of 2182)
PASS: lldb-unit :: Utility/./UtilityTests/ArgsTest.TestSingleArg (1476 of 2182)
PASS: lldb-unit :: Utility/./UtilityTests/LogTest.LLDB_LOG_nullptr (1477 of 2182)
PASS: lldb-api :: functionalities/deleted-executable/TestDeletedExecutable.py (1478 of 2182)
PASS: lldb-api :: lang/c/find_struct_type/TestFindStructTypes.py (1479 of 2182)
PASS: lldb-unit :: Utility/./UtilityTests/RangeDataVector.FindEntryThatContains (1480 of 2182)
PASS: lldb-unit :: UnwindAssembly/x86/./UnwindAssemblyx86Tests/Testx86AssemblyInspectionEngine.Test64bitFramelessSmallStackFrame (1481 of 2182)
PASS: lldb-shell :: SymbolFile/DWARF/clang-ast-from-dwarf-unamed-and-anon-structs.cpp (1482 of 2182)
PASS: lldb-unit :: Symbol/./SymbolTests/PostfixExpression.ToDWARF (1483 of 2182)
PASS: lldb-api :: commands/expression/call-function/TestCallUserDefinedFunction.py (1484 of 2182)
PASS: lldb-unit :: ScriptInterpreter/Python/./ScriptInterpreterPythonTests/PythonDataObjectsTest.TestPythonTupleSize (1485 of 2182)
PASS: lldb-unit :: Symbol/./SymbolTests/TestClangASTImporter.CopyTypeTagDecl (1486 of 2182)
PASS: lldb-unit :: UnwindAssembly/x86/./UnwindAssemblyx86Tests/Testx86AssemblyInspectionEngine.TestPushRBPWithREX (1487 of 2182)
PASS: lldb-unit :: Utility/./UtilityTests/SubsystemRAIITest.SubsystemWithErrorSuccess (1488 of 2182)
UNSUPPORTED: lldb-api :: functionalities/darwin_log/filter/regex/activity/TestDarwinLogFilterRegexActivity.py (1489 of 2182)
PASS: lldb-shell :: Commands/command-regex-delete.test (1490 of 2182)
PASS: lldb-api :: lang/cpp/modules-import/TestCXXModulesImport.py (1491 of 2182)
PASS: lldb-api :: functionalities/plugins/python_os_plugin/stepping_plugin_threads/TestOSPluginStepping.py (1492 of 2182)
PASS: lldb-api :: types/TestFloatTypesExpr.py (1493 of 2182)
PASS: lldb-api :: lang/cpp/llvm-style/TestLLVMStyle.py (1494 of 2182)
PASS: lldb-api :: commands/expression/call-function/TestCallStdStringFunction.py (1495 of 2182)
PASS: lldb-unit :: Language/Highlighting/./HighlighterTests/HighlighterTest.ClangTrailingBackslashWithWhitespace (1496 of 2182)
PASS: lldb-api :: functionalities/thread/concurrent_events/TestConcurrentBreakpointsDelayedBreakpointOneWatchpoint.py (1497 of 2182)
PASS: lldb-shell :: Host/TestCustomShell.test (1498 of 2182)
PASS: lldb-api :: functionalities/memory/find/TestMemoryFind.py (1499 of 2182)
PASS: lldb-api :: functionalities/thread/concurrent_events/TestConcurrentWatchBreakDelay.py (1500 of 2182)
PASS: lldb-api :: lang/objc/objc-new-syntax/TestObjCNewSyntaxDictionary.py (1501 of 2182)
PASS: lldb-api :: lang/objc/single-entry-dictionary/TestObjCSingleEntryDictionary.py (1502 of 2182)
PASS: lldb-api :: lang/c/function_types/TestFunctionTypes.py (1503 of 2182)
PASS: lldb-shell :: Process/UnsupportedLanguage.test (1504 of 2182)
XFAIL: lldb-shell :: Register/x86-64-ymm-write.test (1505 of 2182)
PASS: lldb-api :: commands/expression/dont_allow_jit/TestAllowJIT.py (1506 of 2182)
PASS: lldb-api :: sample_test/TestSampleTest.py (1507 of 2182)
PASS: lldb-unit :: Host/./HostTests/FileSystemTest.OpenErrno (1508 of 2182)
PASS: lldb-api :: lang/objc/foundation/TestObjCMethods2.py (1509 of 2182)
PASS: lldb-shell :: SymbolFile/NativePDB/tag-types.cpp (1510 of 2182)
PASS: lldb-api :: functionalities/data-formatter/data-formatter-stl/libcxx/deque/TestDataFormatterLibcxxDeque.py (1511 of 2182)
PASS: lldb-api :: functionalities/thread/exit_during_break/TestExitDuringBreak.py (1512 of 2182)
PASS: lldb-api :: tools/lldb-server/commandline/TestStubSetSID.py (1513 of 2182)
PASS: lldb-unit :: Utility/./UtilityTests/SerializationRountripTest.SerializeDeserializeCString (1514 of 2182)
PASS: lldb-api :: commands/target/basic/TestTargetCommand.py (1515 of 2182)
PASS: lldb-unit :: SymbolFile/NativePDB/./SymbolFileNativePDBTests/PDBFPOProgramToDWARFExpressionTests.UnsupportedRASearch (1516 of 2182)
UNSUPPORTED: lldb-api :: commands/register/register/aarch64_sve_registers/rw_access_static_config/TestSVERegisters.py (1517 of 2182)
PASS: lldb-api :: lang/objc/modules-inline-functions/TestModulesInlineFunctions.py (1518 of 2182)
PASS: lldb-shell :: SymbolFile/DWARF/debug-names-compressed.cpp (1519 of 2182)
PASS: lldb-unit :: Utility/./UtilityTests/Flags.AnyClear (1520 of 2182)
PASS: lldb-unit :: ScriptInterpreter/Python/./ScriptInterpreterPythonTests/PythonDataObjectsTest.TestPythonStringToStr (1521 of 2182)
PASS: lldb-shell :: SymbolFile/DWARF/inline-function-address-shared.test (1522 of 2182)
PASS: lldb-unit :: UnwindAssembly/x86/./UnwindAssemblyx86Tests/Testx86AssemblyInspectionEngine.TestPushEBP (1523 of 2182)
PASS: lldb-unit :: Utility/./UtilityTests/StringExtractorTest.DecodeHexU8_Extra (1524 of 2182)
PASS: lldb-api :: functionalities/inferior-assert/TestInferiorAssert.py (1525 of 2182)
UNSUPPORTED: lldb-api :: lang/objc/objc-dynamic-value/TestObjCDynamicValue.py (1526 of 2182)
PASS: lldb-unit :: tools/lldb-server/tests/./LLDBServerTests/TestBase.DebugserverEnv (1527 of 2182)
PASS: lldb-unit :: ScriptInterpreter/Python/./ScriptInterpreterPythonTests/PythonDataObjectsTest.TestPythonListManipulation (1528 of 2182)
PASS: lldb-api :: functionalities/data-formatter/data-formatter-python-synth/TestDataFormatterPythonSynth.py (1529 of 2182)
PASS: lldb-unit :: Utility/./UtilityTests/StringExtractorTest.GetHexBytesAvail_FullString (1530 of 2182)
PASS: lldb-api :: commands/expression/import_builtin_fileid/TestImportBuiltinFileID.py (1531 of 2182)
PASS: lldb-unit :: Utility/./UtilityTests/NameMatchesTest.RegularExpression (1532 of 2182)
PASS: lldb-api :: commands/target/stop-hooks/TestStopHookScripted.py (1533 of 2182)
PASS: lldb-shell :: Reproducer/Functionalities/TestStepping.test (1534 of 2182)
PASS: lldb-api :: functionalities/memory/cache/TestMemoryCache.py (1535 of 2182)
PASS: lldb-unit :: Utility/./UtilityTests/Flags.IsClear (1536 of 2182)
PASS: lldb-api :: lang/c/set_values/TestSetValues.py (1537 of 2182)
PASS: lldb-api :: lang/c/vla/TestVLA.py (1538 of 2182)
PASS: lldb-unit :: ScriptInterpreter/Python/./ScriptInterpreterPythonTests/PythonDataObjectsTest.TestPythonDictionaryToStructuredDictionary (1539 of 2182)
PASS: lldb-shell :: BuildScript/toolchain-clang.test (1540 of 2182)
PASS: lldb-api :: lang/cpp/class_types/TestClassTypesDisassembly.py (1541 of 2182)
PASS: lldb-unit :: Host/./HostTests/NativeProcessProtocolTest.ReadCStringFromMemory (1542 of 2182)
PASS: lldb-shell :: SymbolFile/DWARF/find-basic-function.cpp (1543 of 2182)
PASS: lldb-api :: functionalities/thread/concurrent_events/TestConcurrentDelaySignalWatch.py (1544 of 2182)
PASS: lldb-api :: python_api/process/read-mem-cstring/TestReadMemCString.py (1545 of 2182)
PASS: lldb-unit :: Symbol/./SymbolTests/TestTypeSystemClang.TestNotDeletingUserCopyCstrDueToMoveCStr (1546 of 2182)
UNSUPPORTED: lldb-api :: commands/watchpoints/variable_out_of_scope/TestWatchedVarHitWhenInScope.py (1547 of 2182)
PASS: lldb-api :: python_api/value_var_update/TestValueVarUpdate.py (1548 of 2182)
PASS: lldb-unit :: Utility/./UtilityTests/StreamTest.PutHex8 (1549 of 2182)
PASS: lldb-unit :: ScriptInterpreter/Python/./ScriptInterpreterPythonTests/PythonDataObjectsTest.TestModuleNameResolutionNoDot (1550 of 2182)
PASS: lldb-unit :: Utility/./UtilityTests/StringExtractorTest.GetU32LittleEndian (1551 of 2182)
PASS: lldb-unit :: Target/./TargetTests/RemoteAwarePlatformTest.TestResolveExecutabelOnClientByPlatform (1552 of 2182)
PASS: lldb-unit :: Utility/./UtilityTests/StructuredDataTest.ParseJSONFromFile (1553 of 2182)
PASS: lldb-api :: commands/gui/basic/TestGuiBasic.py (1554 of 2182)
PASS: lldb-api :: functionalities/breakpoint/breakpoint_locations/TestBreakpointLocations.py (1555 of 2182)
PASS: lldb-api :: lang/cpp/unsigned_types/TestUnsignedTypes.py (1556 of 2182)
PASS: lldb-api :: functionalities/postmortem/elf-core/gcore/TestGCore.py (1557 of 2182)
PASS: lldb-shell :: Settings/TestModuleCacheSanity.test (1558 of 2182)
PASS: lldb-unit :: Utility/./UtilityTests/StreamTest.ShiftOperatorPtr (1559 of 2182)
PASS: lldb-api :: functionalities/wrong_commands/TestWrongCommands.py (1560 of 2182)
UNSUPPORTED: lldb-shell :: SymbolFile/PDB/variables.test (1561 of 2182)
UNSUPPORTED: lldb-api :: functionalities/data-formatter/data-formatter-stl/libstdcpp/string/TestDataFormatterStdString.py (1562 of 2182)
PASS: lldb-api :: lang/objc/objc-struct-return/TestObjCStructReturn.py (1563 of 2182)
UNSUPPORTED: lldb-api :: functionalities/breakpoint/breakpoint_in_delayslot/TestAvoidBreakpointInDelaySlot.py (1564 of 2182)
PASS: lldb-api :: lang/c/complex_int/TestComplexInt.py (1565 of 2182)
PASS: lldb-api :: functionalities/thread/concurrent_events/TestConcurrentWatchpointWithDelayWatchpointThreads.py (1566 of 2182)
PASS: lldb-api :: commands/expression/radar_8638051/Test8638051.py (1567 of 2182)
PASS: lldb-unit :: Utility/./UtilityTests/StringExtractorTest.GetHexU8_Underflow2_NoEof (1568 of 2182)
UNSUPPORTED: lldb-api :: functionalities/darwin_log/source/debug/TestDarwinLogSourceDebug.py (1569 of 2182)
PASS: lldb-api :: commands/watchpoints/hello_watchpoint/TestMyFirstWatchpoint.py (1570 of 2182)
PASS: lldb-api :: macosx/dyld-trie-symbols/TestDyldTrieSymbols.py (1571 of 2182)
PASS: lldb-unit :: Host/./HostTests/SocketTests/SocketTest.DomainGetConnectURI/ipv6 (1572 of 2182)
PASS: lldb-api :: functionalities/data-formatter/data-formatter-proper-plurals/TestFormattersOneIsSingular.py (1573 of 2182)
PASS: lldb-unit :: Utility/./UtilityTests/ArgsTest.BareSingleQuote (1574 of 2182)
PASS: lldb-unit :: Utility/./UtilityTests/StreamTeeTest.Flush (1575 of 2182)
PASS: lldb-unit :: debugserver/./debugserverTests/RNBSocket.AnyListen (1576 of 2182)
PASS: lldb-unit :: Utility/./UtilityTests/StreamTest.AddressRangeSize (1577 of 2182)
PASS: lldb-api :: commands/command/nested_alias/TestNestedAlias.py (1578 of 2182)
PASS: lldb-unit :: Utility/./UtilityTests/StreamTest.SetIndentLevel (1579 of 2182)
PASS: lldb-api :: functionalities/data-formatter/summary-string-onfail/Test-rdar-9974002.py (1580 of 2182)
PASS: lldb-unit :: ObjectFile/Breakpad/./ObjectFileBreakpadTests/ModuleRecord.parse (1581 of 2182)
PASS: lldb-unit :: Language/Highlighting/./HighlighterTests/HighlighterTest.ClangCursorPos (1582 of 2182)
PASS: lldb-shell :: SymbolFile/NativePDB/function-types-calling-conv.cpp (1583 of 2182)
PASS: lldb-api :: macosx/find-app-in-bundle/TestFindAppInBundle.py (1584 of 2182)
PASS: lldb-shell :: Reproducer/TestVerify.test (1585 of 2182)
PASS: lldb-api :: functionalities/thread/concurrent_events/TestConcurrentDelayedCrashWithBreakpointWatchpoint.py (1586 of 2182)
PASS: lldb-shell :: ObjectFile/MachO/lc_build_version.yaml (1587 of 2182)
PASS: lldb-unit :: Language/Highlighting/./HighlighterTests/HighlighterTest.ClangSquareBrackets (1588 of 2182)
PASS: lldb-api :: types/TestCharTypeExpr.py (1589 of 2182)
PASS: lldb-unit :: Language/Highlighting/./HighlighterTests/HighlighterTest.ClangCommas (1590 of 2182)
XFAIL: lldb-shell :: Expr/nodefaultlib.cpp (1591 of 2182)
PASS: lldb-unit :: SymbolFile/NativePDB/./SymbolFileNativePDBTests/PDBFPOProgramToDWARFExpressionTests.UnresolvedRegisterReference (1592 of 2182)
UNSUPPORTED: lldb-shell :: Register/x86-fp-write.test (1593 of 2182)
PASS: lldb-api :: api/multithreaded/TestMultithreaded.py (1594 of 2182)
PASS: lldb-api :: functionalities/data-formatter/data-formatter-synth/TestDataFormatterSynth.py (1595 of 2182)
UNSUPPORTED: lldb-api :: commands/watchpoints/multi_watchpoint_slots/TestWatchpointMultipleSlots.py (1596 of 2182)
PASS: lldb-api :: functionalities/data-formatter/setvaluefromcstring/TestSetValueFromCString.py (1597 of 2182)
PASS: lldb-unit :: Host/./HostTests/NativeProcessProtocolTest.SetBreakpoint (1598 of 2182)
PASS: lldb-shell :: Minidump/memory-region-from-module.yaml (1599 of 2182)
PASS: lldb-unit :: Process/gdb-remote/./ProcessGdbRemoteTests/GDBRemoteClientBaseTest.SendContinueDelegateInterface (1600 of 2182)
PASS: lldb-unit :: Utility/./UtilityTests/StringListTest.InsertStringAtIndexStdString (1601 of 2182)
PASS: lldb-unit :: ScriptInterpreter/Python/./ScriptInterpreterPythonTests/PythonDataObjectsTest.TestPythonInteger (1602 of 2182)
PASS: lldb-unit :: Utility/./UtilityTests/StringListTest.InsertStringAtIndexOutOfBounds (1603 of 2182)
PASS: lldb-api :: functionalities/data-formatter/synthcapping/TestSyntheticCapping.py (1604 of 2182)
PASS: lldb-unit :: Expression/./ExpressionTests/DiagnosticManagerTest.AppendMessageSubsequentDiags (1605 of 2182)
PASS: lldb-unit :: Utility/./UtilityTests/RangeTest.Constructor (1606 of 2182)
PASS: lldb-unit :: Expression/./ExpressionTests/CppModuleConfigurationTest.AmbiguousCLib (1607 of 2182)
PASS: lldb-shell :: SymbolFile/DWARF/DW_AT_declaration-with-children.s (1608 of 2182)
PASS: lldb-api :: lang/cpp/this/TestCPPThis.py (1609 of 2182)
PASS: lldb-unit :: Utility/./UtilityTests/StreamTest.PutULEB128 (1610 of 2182)
PASS: lldb-api :: lang/cpp/exceptions/TestCPPExceptionBreakpoints.py (1611 of 2182)
PASS: lldb-shell :: SymbolFile/DWARF/debug-types-address-ranges.s (1612 of 2182)
UNSUPPORTED: lldb-api :: benchmarks/expression/TestRepeatedExprs.py (1613 of 2182)
PASS: lldb-unit :: ObjectFile/ELF/./ObjectFileELFTests/ObjectFileELFTest.GetSymtab_NoSymEntryPointArmAddressClass (1614 of 2182)
PASS: lldb-unit :: UnwindAssembly/x86/./UnwindAssemblyx86Tests/Testx86AssemblyInspectionEngine.TestPopEDI (1615 of 2182)
PASS: lldb-shell :: Reproducer/TestFinalize.test (1616 of 2182)
PASS: lldb-api :: commands/frame/var-scope/TestFrameVariableScope.py (1617 of 2182)
PASS: lldb-api :: commands/target/modules/search-paths/insert/TestTargetModulesSearchpathsInsert.py (1618 of 2182)
PASS: lldb-unit :: Utility/./UtilityTests/StreamTest.PutCharNull (1619 of 2182)
PASS: lldb-api :: functionalities/data-formatter/data-formatter-objc/TestDataFormatterObjCNSBundle.py (1620 of 2182)
PASS: lldb-shell :: SymbolFile/DWARF/dwp-debug-types.s (1621 of 2182)
PASS: lldb-shell :: SymbolFile/DWARF/gnu-style-compression.cpp (1622 of 2182)
PASS: lldb-api :: macosx/simulator/TestSimulatorPlatform.py (1623 of 2182)
PASS: lldb-unit :: Signals/./SignalsTests/UnixSignalsTest.Iteration (1624 of 2182)
UNSUPPORTED: lldb-shell :: BuildScript/toolchain-msvc.test (1625 of 2182)
PASS: lldb-unit :: Host/./HostTests/NativeProcessProtocolTest.SetBreakpointFailWrite (1626 of 2182)
PASS: lldb-unit :: ScriptInterpreter/Python/./ScriptInterpreterPythonTests/PythonDataObjectsTest.TestPythonString (1627 of 2182)
PASS: lldb-shell :: SymbolFile/Breakpad/line-table.test (1628 of 2182)
PASS: lldb-unit :: Symbol/./SymbolTests/TestClangASTImporter.DeportTypeTagDecl (1629 of 2182)
PASS: lldb-unit :: UnwindAssembly/x86/./UnwindAssemblyx86Tests/Testx86AssemblyInspectionEngine.TestPopRBP (1630 of 2182)
PASS: lldb-unit :: Core/./LLDBCoreTests/SourceFileCache.FindSourceFileNotFound (1631 of 2182)
PASS: lldb-unit :: Host/./HostTests/FileSystemTest.Resolve (1632 of 2182)
PASS: lldb-shell :: SymbolFile/Breakpad/symtab-macho.test (1633 of 2182)
PASS: lldb-shell :: SymbolFile/DWARF/DW_AT_data_bit_offset-DW_OP_stack_value.s (1634 of 2182)
PASS: lldb-api :: functionalities/non-overlapping-index-variable-i/TestIndexVariable.py (1635 of 2182)
PASS: lldb-api :: commands/frame/var/TestFrameVar.py (1636 of 2182)
PASS: lldb-unit :: Utility/./UtilityTests/StringLexerTest.Peek (1637 of 2182)
PASS: lldb-api :: tools/lldb-server/TestAppleSimulatorOSType.py (1638 of 2182)
PASS: lldb-shell :: Minidump/dump-all.test (1639 of 2182)
PASS: lldb-unit :: Host/./HostTests/FileSystemTest.GetByteSize (1640 of 2182)
UNSUPPORTED: lldb-api :: functionalities/darwin_log/filter/regex/subsystem/TestDarwinLogFilterRegexSubsystem.py (1641 of 2182)
PASS: lldb-unit :: Utility/./UtilityTests/RecordReplayTest.InstrumentedBarRef (1642 of 2182)
PASS: lldb-api :: lang/cpp/stl/TestStdCXXDisassembly.py (1643 of 2182)
PASS: lldb-api :: commands/command/script/TestCommandScript.py (1644 of 2182)
PASS: lldb-unit :: Utility/./UtilityTests/UriParserTest.TypicalPortPathIPv6 (1645 of 2182)
PASS: lldb-unit :: Utility/./UtilityTests/ConstStringTest.NullAndEmptyStates (1646 of 2182)
PASS: lldb-shell :: ObjectFile/wasm/basic.yaml (1647 of 2182)
PASS: lldb-unit :: SymbolFile/NativePDB/./SymbolFileNativePDBTests/PDBFPOProgramToDWARFExpressionTests.UnresolvedCyclicRegisterAssignmentReference (1648 of 2182)
PASS: lldb-unit :: Utility/./UtilityTests/SerializationRountripTest.SerializeDeserializeCStringArrayNullptr (1649 of 2182)
PASS: lldb-unit :: Language/Highlighting/./HighlighterTests/HighlighterTest.FallbackHighlighter (1650 of 2182)
PASS: lldb-unit :: Utility/./UtilityTests/StreamTest.PutMaxHex64ByteOrderBig (1651 of 2182)
PASS: lldb-unit :: DataFormatter/./LLDBFormatterTests/TypeMatcherTests.GetMatchStringRegex (1652 of 2182)
PASS: lldb-api :: functionalities/gdb_remote_client/TestRegDefinitionInParts.py (1653 of 2182)
PASS: lldb-api :: macosx/lc-note/kern-ver-str/TestKernVerStrLCNOTE.py (1654 of 2182)
PASS: lldb-unit :: Symbol/./SymbolTests/TestClangASTImporter.MetadataPropagation (1655 of 2182)
PASS: lldb-unit :: Symbol/./SymbolTests/TestClangASTImporter.CanImportInvalidType (1656 of 2182)
UNSUPPORTED: lldb-shell :: Breakpoint/case-insensitive.test (1657 of 2182)
PASS: lldb-unit :: Utility/./UtilityTests/RangeTest.ContainsAddr (1658 of 2182)
PASS: lldb-api :: functionalities/data-formatter/data-formatter-enum-format/TestDataFormatterEnumFormat.py (1659 of 2182)
PASS: lldb-shell :: Register/x86-64-read.test (1660 of 2182)
PASS: lldb-shell :: SymbolFile/DWARF/childless-compile-unit.s (1661 of 2182)
PASS: lldb-unit :: Utility/./UtilityTests/UriParserTest.SchemeHostSeparator2 (1662 of 2182)
PASS: lldb-unit :: Core/./LLDBCoreTests/MangledTest.ResultForValidName (1663 of 2182)
UNSUPPORTED: lldb-shell :: BuildScript/toolchain-clang-cl.test (1664 of 2182)
PASS: lldb-api :: lang/objc/modules/TestObjCModules.py (1665 of 2182)
PASS: lldb-api :: functionalities/abbreviation/TestCommonShortSpellings.py (1666 of 2182)
PASS: lldb-unit :: Process/gdb-remote/./ProcessGdbRemoteTests/GDBRemoteCommunicationClientTest.SendGetMetaDataPacket (1667 of 2182)
PASS: lldb-unit :: Utility/./UtilityTests/RangeTest.ClearWithStarAddress (1668 of 2182)
PASS: lldb-api :: commands/expression/radar_9673664/TestExprHelpExamples.py (1669 of 2182)
PASS: lldb-unit :: Utility/./UtilityTests/FileSpecTest.CopyByAppendingPathComponent (1670 of 2182)
PASS: lldb-api :: functionalities/data-formatter/compactvectors/TestCompactVectors.py (1671 of 2182)
PASS: lldb-api :: functionalities/memory-region/TestMemoryRegion.py (1672 of 2182)
PASS: lldb-api :: lang/cpp/scope/TestCppScope.py (1673 of 2182)
PASS: lldb-shell :: Settings/TestFrameFormatMangling.test (1674 of 2182)
PASS: lldb-unit :: Utility/./UtilityTests/ScalarTest.Comparison (1675 of 2182)
PASS: lldb-api :: commands/command/source/TestCommandSource.py (1676 of 2182)
PASS: lldb-unit :: Utility/./UtilityTests/VMRange.Reset (1677 of 2182)
PASS: lldb-unit :: Utility/./UtilityTests/DataExtractorTest.GetDouble (1678 of 2182)
PASS: lldb-unit :: Utility/./UtilityTests/FileSpecTest.OperatorBool (1679 of 2182)
UNSUPPORTED: lldb-api :: functionalities/darwin_log/filter/exact_match/subsystem/TestDarwinLogFilterMatchSubsystem.py (1680 of 2182)
PASS: lldb-api :: lang/objc/global_ptrs/TestGlobalObjects.py (1681 of 2182)
PASS: lldb-api :: lang/cpp/incomplete-types/TestCppIncompleteTypes.py (1682 of 2182)
PASS: lldb-shell :: SymbolFile/DWARF/find-variable-file.cpp (1683 of 2182)
PASS: lldb-unit :: Host/./HostTests/Host.WaitStatusFormat (1684 of 2182)
PASS: lldb-unit :: Symbol/./SymbolTests/DWARFCallFrameInfoTest.Basic_dwarf3 (1685 of 2182)
PASS: lldb-unit :: Host/./HostTests/HostInfoTest.GetHostname (1686 of 2182)
PASS: lldb-api :: functionalities/thread/create_after_attach/TestCreateAfterAttach.py (1687 of 2182)
PASS: lldb-unit :: Utility/./UtilityTests/DataExtractorTest.UncommonAddressSize (1688 of 2182)
PASS: lldb-shell :: ObjectFile/ELF/section-addresses.yaml (1689 of 2182)
PASS: lldb-unit :: Symbol/./SymbolTests/TestClangASTImporter.DeportDeclTagDecl (1690 of 2182)
PASS: lldb-shell :: ObjectFile/PECOFF/sections-names.yaml (1691 of 2182)
PASS: lldb-unit :: Utility/./UtilityTests/LogTest.Unregister (1692 of 2182)
PASS: lldb-shell :: Breakpoint/debug_rnglist_rlestartend.test (1693 of 2182)
PASS: lldb-api :: functionalities/data-formatter/data-formatter-stl/libcxx/list/TestDataFormatterLibcxxList.py (1694 of 2182)
PASS: lldb-shell :: SymbolFile/DWARF/DW_AT_location-DW_AT_const_value.s (1695 of 2182)
PASS: lldb-api :: python_api/value/TestValueAPI.py (1696 of 2182)
PASS: lldb-api :: functionalities/gdb_remote_client/TestArmRegisterDefinition.py (1697 of 2182)
PASS: lldb-api :: commands/expression/codegen-crash-typedefdecl-not-in_declcontext/TestCodegenCrashTypedefDeclNotInDeclContext.py (1698 of 2182)
PASS: lldb-unit :: debugserver/./debugserverTests/RNBSocket.LoopBackConnectIPv4 (1699 of 2182)
PASS: lldb-unit :: Utility/./UtilityTests/XcodeSDKTest.GetSDKTypeForTriple (1700 of 2182)
PASS: lldb-api :: lang/cpp/inlines/TestInlines.py (1701 of 2182)
PASS: lldb-api :: lang/cpp/limit-debug-info/TestWithLimitDebugInfo.py (1702 of 2182)
PASS: lldb-unit :: Utility/./UtilityTests/ArchSpecTest.TestParseMachCPUDashSubtypeTripleSimple (1703 of 2182)
PASS: lldb-unit :: Expression/./ExpressionTests/DiagnosticManagerTest.AddDiagnostic (1704 of 2182)
PASS: lldb-unit :: Symbol/./SymbolTests/SymbolsTest.TerminateLocateExecutableSymbolFileForUnknownExecutableAndUnknownSymbolFile (1705 of 2182)
UNSUPPORTED: lldb-shell :: SymbolFile/NativePDB/local-variables.cpp (1706 of 2182)
PASS: lldb-unit :: Utility/./UtilityTests/StreamTest.AddressEmptyPrefix (1707 of 2182)
PASS: lldb-shell :: ObjectFile/wasm/unified-debug-sections.yaml (1708 of 2182)
PASS: lldb-api :: tools/lldb-server/TestGdbRemoteRegisterState.py (1709 of 2182)
PASS: lldb-unit :: Host/./HostTests/SocketTests/SocketTest.DecodeHostAndPort/ipv6 (1710 of 2182)
PASS: lldb-api :: lang/objc/print-obj/TestPrintObj.py (1711 of 2182)
PASS: lldb-unit :: Interpreter/./InterpreterTests/OptionValueFileColonLine.setFromString (1712 of 2182)
PASS: lldb-api :: commands/disassemble/basic/TestDisassembleBreakpoint.py (1713 of 2182)
PASS: lldb-api :: lang/objc/foundation/TestSymbolTable.py (1714 of 2182)
PASS: lldb-unit :: Host/./HostTests/FileSystemTest.Exists (1715 of 2182)
PASS: lldb-api :: commands/expression/inline-namespace/TestInlineNamespace.py (1716 of 2182)
PASS: lldb-api :: functionalities/data-formatter/language_category_updates/TestDataFormatterLanguageCategoryUpdates.py (1717 of 2182)
UNSUPPORTED: lldb-api :: android/platform/TestDefaultCacheLineSize.py (1718 of 2182)
PASS: lldb-api :: lang/cpp/signed_types/TestSignedTypes.py (1719 of 2182)
PASS: lldb-unit :: Utility/./UtilityTests/DataExtractorTest.GetSLEB128_bit63 (1720 of 2182)
UNSUPPORTED: lldb-shell :: SymbolFile/PDB/calling-conventions.test (1721 of 2182)
PASS: lldb-unit :: Symbol/./SymbolTests/TestTypeSystemClang.TestConvertAccessTypeToAccessSpecifier (1722 of 2182)
PASS: lldb-api :: lang/objc/hidden-ivars/TestHiddenIvars.py (1723 of 2182)
PASS: lldb-unit :: Utility/./UtilityTests/ProcessInstanceInfo.DumpTable (1724 of 2182)
PASS: lldb-api :: functionalities/breakpoint/address_breakpoints/TestAddressBreakpoints.py (1725 of 2182)
PASS: lldb-api :: functionalities/float-display/TestFloatDisplay.py (1726 of 2182)
PASS: lldb-unit :: SymbolFile/NativePDB/./SymbolFileNativePDBTests/PDBFPOProgramToDWARFExpressionTests.MultipleIndependentAssignments (1727 of 2182)
PASS: lldb-api :: python_api/type/TestTypeList.py (1728 of 2182)
PASS: lldb-shell :: Breakpoint/split-dwarf5-debug-stroffsets.test (1729 of 2182)
PASS: lldb-api :: tools/lldb-vscode/launch/TestVSCode_launch.py (1730 of 2182)
PASS: lldb-unit :: Utility/./UtilityTests/Flags.Reset (1731 of 2182)
PASS: lldb-api :: functionalities/data-formatter/data-formatter-globals/TestDataFormatterGlobals.py (1732 of 2182)
PASS: lldb-unit :: Utility/./UtilityTests/StreamTeeTest.DefaultConstructor (1733 of 2182)
PASS: lldb-unit :: ScriptInterpreter/Python/./ScriptInterpreterPythonTests/PythonDataObjectsTest.TestGlobalNameResolutionWithDot (1734 of 2182)
PASS: lldb-unit :: Symbol/./SymbolTests/TestTypeSystemClang.TestIsClangType (1735 of 2182)
PASS: lldb-api :: functionalities/breakpoint/source_regexp/TestSourceRegexBreakpoints.py (1736 of 2182)
PASS: lldb-api :: functionalities/postmortem/minidump/TestMiniDump.py (1737 of 2182)
PASS: lldb-unit :: Utility/./UtilityTests/BinaryStreamTest.PutSLEB128MaxValue (1738 of 2182)
PASS: lldb-shell :: Reproducer/TestSynchronous.test (1739 of 2182)
PASS: lldb-unit :: Utility/./UtilityTests/StringExtractorTest.GetU64BigEndian (1740 of 2182)
PASS: lldb-unit :: UnwindAssembly/x86/./UnwindAssemblyx86Tests/Testx86AssemblyInspectionEngine.TestMovRSPtoRBP (1741 of 2182)
PASS: lldb-unit :: Expression/./ExpressionTests/CppModuleConfigurationTest.IgnoreLibStdCpp (1742 of 2182)
PASS: lldb-api :: lang/cpp/accelerator-table/TestCPPAccelerator.py (1743 of 2182)
PASS: lldb-shell :: SymbolFile/DWARF/find-method-local-struct.cpp (1744 of 2182)
PASS: lldb-api :: functionalities/thread/concurrent_events/TestConcurrentTwoWatchpointsOneSignal.py (1745 of 2182)
PASS: lldb-unit :: Utility/./UtilityTests/StreamTest.PutCharWhitespace (1746 of 2182)
PASS: lldb-shell :: SymbolFile/NativePDB/source-list.cpp (1747 of 2182)
PASS: lldb-unit :: Process/gdb-remote/./ProcessGdbRemoteTests/GDBRemoteCommunicationClientTest.WriteRegisterNoSuffix (1748 of 2182)
PASS: lldb-api :: functionalities/postmortem/netbsd-core/TestNetBSDCore.py (1749 of 2182)
PASS: lldb-api :: functionalities/breakpoint/breakpoint_set_restart/TestBreakpointSetRestart.py (1750 of 2182)
PASS: lldb-api :: lang/c/record_decl_in_expr/TestRecordDeclInExpr.py (1751 of 2182)
PASS: lldb-api :: functionalities/data-formatter/data-formatter-objc/nsstring/TestDataFormatterNSString.py (1752 of 2182)
PASS: lldb-unit :: Process/gdb-remote/./ProcessGdbRemoteTests/GDBRemoteCommunicationTest.ReadPacket_checksum (1753 of 2182)
UNSUPPORTED: lldb-api :: tools/lldb-server/registers-target-xml-reading/TestGdbRemoteTargetXmlPacket.py (1754 of 2182)
PASS: lldb-api :: python_api/value/change_values/TestChangeValueAPI.py (1755 of 2182)
PASS: lldb-unit :: Utility/./UtilityTests/ArgsTest.TestQuotedTrailingBackslash (1756 of 2182)
PASS: lldb-unit :: Host/./HostTests/HostInfoTest.GetAugmentedArchSpec (1757 of 2182)
PASS: lldb-api :: functionalities/tail_call_frames/thread_step_out_message/TestArtificialFrameStepOutMessage.py (1758 of 2182)
PASS: lldb-api :: functionalities/thread/backtrace_limit/TestBacktraceLimit.py (1759 of 2182)
PASS: lldb-shell :: SymbolFile/DWARF/win-i386-line-table.s (1760 of 2182)
PASS: lldb-unit :: ScriptInterpreter/Python/./ScriptInterpreterPythonTests/PythonDataObjectsTest.TestPythonTupleInitializerList2 (1761 of 2182)
PASS: lldb-unit :: Utility/./UtilityTests/FileSpecTest.AppendPathComponent (1762 of 2182)
PASS: lldb-unit :: Language/Highlighting/./HighlighterTests/HighlighterTest.ClangUnterminatedString (1763 of 2182)
PASS: lldb-unit :: Utility/./UtilityTests/ProcessInstanceInfo.DumpTable_invalidUID (1764 of 2182)
PASS: lldb-unit :: Utility/./UtilityTests/StringExtractorTest.InitMisc (1765 of 2182)
PASS: lldb-unit :: Utility/./UtilityTests/FileSpecTest.EqualSeparator (1766 of 2182)
PASS: lldb-unit :: Utility/./UtilityTests/ArgsTest.GetQuotedCommandString (1767 of 2182)
PASS: lldb-api :: lang/objc/objc-static-method/TestObjCStaticMethod.py (1768 of 2182)
PASS: lldb-api :: functionalities/thread/backtrace_all/TestBacktraceAll.py (1769 of 2182)
PASS: lldb-api :: functionalities/data-formatter/data-formatter-stl/libcxx/list/loop/TestDataFormatterLibcxxListLoop.py (1770 of 2182)
PASS: lldb-unit :: Utility/./UtilityTests/OptionsWithRawTest.EmptySuffix (1771 of 2182)
PASS: lldb-unit :: Target/./TargetTests/MemoryRegionInfoTest.Formatv (1772 of 2182)
PASS: lldb-api :: functionalities/limit-debug-info/TestLimitDebugInfo.py (1773 of 2182)
PASS: lldb-unit :: Utility/./UtilityTests/ArchSpecTest.MergeFromMachOUnknown (1774 of 2182)
PASS: lldb-unit :: Utility/./UtilityTests/RangeTest.Equal (1775 of 2182)
PASS: lldb-api :: commands/expression/regression-access-function-template-in-record/TestRegressionAccessFunctionTemplateInRecord.py (1776 of 2182)
PASS: lldb-api :: python_api/class_members/TestSBTypeClassMembers.py (1777 of 2182)
PASS: lldb-api :: functionalities/data-formatter/data-formatter-stl/libcxx/atomic/TestLibCxxAtomic.py (1778 of 2182)
PASS: lldb-api :: tools/lldb-vscode/breakpoint/TestVSCode_setExceptionBreakpoints.py (1779 of 2182)
PASS: lldb-unit :: Utility/./UtilityTests/OptionsWithRawTest.UnterminatedQuote (1780 of 2182)
PASS: lldb-unit :: Utility/./UtilityTests/DataExtractorTest.GetCStrAtNullOffset (1781 of 2182)
PASS: lldb-unit :: Utility/./UtilityTests/ArgsTest.TestUnknownEscape (1782 of 2182)
PASS: lldb-unit :: UnwindAssembly/x86/./UnwindAssemblyx86Tests/Testx86AssemblyInspectionEngine.TestDisassemblyMidFunctionEpilogues (1783 of 2182)
PASS: lldb-unit :: Utility/./UtilityTests/ConstStringTest.CompareStringRef (1784 of 2182)
PASS: lldb-api :: lang/c/strings/TestCStrings.py (1785 of 2182)
PASS: lldb-shell :: Driver/TestUseColor.test (1786 of 2182)
PASS: lldb-unit :: Interpreter/./InterpreterTests/OptionArgParserTest.toScriptLanguage (1787 of 2182)
PASS: lldb-api :: functionalities/data-formatter/data-formatter-script/TestDataFormatterScript.py (1788 of 2182)
PASS: lldb-api :: functionalities/gdb_remote_client/TestWasm.py (1789 of 2182)
PASS: lldb-api :: lang/objcxx/class-name-clash/TestNameClash.py (1790 of 2182)
PASS: lldb-api :: lang/objc/objc-stepping/TestObjCStepping.py (1791 of 2182)
UNSUPPORTED: lldb-shell :: Unwind/eh-frame-augment-noop.test (1792 of 2182)
PASS: lldb-unit :: Utility/./UtilityTests/DataExtractorTest.GetFloat (1793 of 2182)
PASS: lldb-unit :: Utility/./UtilityTests/DeserializerTest.HasData (1794 of 2182)
PASS: lldb-api :: types/TestLongTypesExpr.py (1795 of 2182)
PASS: lldb-shell :: Settings/TestSettingsSet.test (1796 of 2182)
PASS: lldb-api :: commands/thread/select/TestThreadSelect.py (1797 of 2182)
PASS: lldb-api :: functionalities/fat_archives/TestFatArchives.py (1798 of 2182)
PASS: lldb-api :: commands/expression/import-std-module/shared_ptr-dbg-info-content/TestSharedPtrDbgInfoContentFromStdModule.py (1799 of 2182)
PASS: lldb-api :: lang/cpp/dynamic-value-same-basename/TestDynamicValueSameBase.py (1800 of 2182)
PASS: lldb-unit :: Process/minidump/./LLDBMinidumpTests/MinidumpParserTest.GetThreadsAndGetThreadContext (1801 of 2182)
PASS: lldb-api :: functionalities/source-map/TestTargetSourceMap.py (1802 of 2182)
PASS: lldb-unit :: Utility/./UtilityTests/StringExtractorTest.GetHexU8_Extra_NoEof (1803 of 2182)
PASS: lldb-api :: functionalities/inferior-crashing/recursive-inferior/TestRecursiveInferior.py (1804 of 2182)
PASS: lldb-unit :: Utility/./UtilityTests/ArgsTest.TestInsertArg (1805 of 2182)
PASS: lldb-api :: functionalities/thread/exit_during_step/TestExitDuringStep.py (1806 of 2182)
PASS: lldb-unit :: Utility/./UtilityTests/StreamTeeTest.Constructor1Stream (1807 of 2182)
PASS: lldb-unit :: Host/./HostTests/NativeProcessProtocolTest.SetBreakpointFailVerify (1808 of 2182)
PASS: lldb-unit :: Host/./HostTests/SocketTests/SocketTest.TCPListen0ConnectAccept/ipv6 (1809 of 2182)
PASS: lldb-unit :: UnwindAssembly/x86/./UnwindAssemblyx86Tests/Testx86AssemblyInspectionEngine.TestSpillRegToStackViaMOVx86_64 (1810 of 2182)
PASS: lldb-api :: functionalities/tail_call_frames/disambiguate_paths_to_common_sink/TestDisambiguatePathsToCommonSink.py (1811 of 2182)
PASS: lldb-api :: commands/watchpoints/watchpoint_events/TestWatchpointEvents.py (1812 of 2182)
PASS: lldb-shell :: ObjectFile/Breakpad/uuid-matching-mac.test (1813 of 2182)
UNSUPPORTED: lldb-shell :: SymbolFile/PDB/vbases.test (1814 of 2182)
PASS: lldb-shell :: ObjectFile/MachO/subsections.yaml (1815 of 2182)
PASS: lldb-unit :: Process/minidump/./LLDBMinidumpTests/RegisterContextMinidump.CheckRegisterContextMinidump_ARM (1816 of 2182)
PASS: lldb-unit :: UnwindAssembly/x86/./UnwindAssemblyx86Tests/Testx86AssemblyInspectionEngine.TestPushR14 (1817 of 2182)
PASS: lldb-api :: lang/cpp/function-qualifiers/TestCppFunctionQualifiers.py (1818 of 2182)
PASS: lldb-unit :: Utility/./UtilityTests/FileSpecTest.FileAndDirectoryComponents (1819 of 2182)
PASS: lldb-unit :: Utility/./UtilityTests/StringListTest.SplitIntoLinesSingleTrailingCR (1820 of 2182)
PASS: lldb-unit :: SymbolFile/NativePDB/./SymbolFileNativePDBTests/PDBFPOProgramToDWARFExpressionTests.InvalidAssignmentSingle (1821 of 2182)
PASS: lldb-api :: lang/objc/foundation/TestObjCMethodsNSError.py (1822 of 2182)
PASS: lldb-shell :: Driver/TestFile.test (1823 of 2182)
PASS: lldb-shell :: Watchpoint/SetErrorCases.test (1824 of 2182)
PASS: lldb-unit :: Utility/./UtilityTests/GeneratorTest.Get (1825 of 2182)
PASS: lldb-unit :: Utility/./UtilityTests/StringListTest.LongestCommonPrefixSingleElement (1826 of 2182)
PASS: lldb-api :: functionalities/type_lookup/TestTypeLookup.py (1827 of 2182)
PASS: lldb-unit :: UnwindAssembly/x86/./UnwindAssemblyx86Tests/Testx86AssemblyInspectionEngine.TestPushR15 (1828 of 2182)
PASS: lldb-api :: python_api/disassemble-raw-data/TestDisassemble_VST1_64.py (1829 of 2182)
PASS: lldb-unit :: Utility/./UtilityTests/LogChannelEnabledTest.LogGetLogThread (1830 of 2182)
PASS: lldb-unit :: Platform/./LLDBPlatformTests/PlatformAppleSimulatorTest.TestHostPlatformToSim (1831 of 2182)
PASS: lldb-unit :: Symbol/./SymbolTests/TestTypeSystemClang.TestGetTypeClassDeclType (1832 of 2182)
PASS: lldb-api :: tools/lldb-server/TestGdbRemote_vCont.py (1833 of 2182)
PASS: lldb-shell :: Commands/command-regex-unalias.test (1834 of 2182)
PASS: lldb-unit :: UnwindAssembly/x86/./UnwindAssemblyx86Tests/Testx86AssemblyInspectionEngine.TestSimple32bitFrameFunction (1835 of 2182)
PASS: lldb-unit :: Utility/./UtilityTests/UriParserTest.BadPort2 (1836 of 2182)
PASS: lldb-api :: commands/expression/import-std-module/conflicts/TestStdModuleWithConflicts.py (1837 of 2182)
PASS: lldb-shell :: Commands/command-target-modules-dump-sections.yaml (1838 of 2182)
PASS: lldb-unit :: Utility/./UtilityTests/ScalarTest.SetValueFromData (1839 of 2182)
PASS: lldb-api :: commands/expression/import-std-module/list-dbg-info-content/TestDbgInfoContentListFromStdModule.py (1840 of 2182)
PASS: lldb-shell :: SymbolFile/DWARF/parallel-indexing-stress.s (1841 of 2182)
PASS: lldb-unit :: Host/./HostTests/ConnectionFileDescriptorTest.TCPGetURIv4 (1842 of 2182)
PASS: lldb-shell :: SymbolFile/NativePDB/s_constant.cpp (1843 of 2182)
PASS: lldb-unit :: Instruction/./EmulatorTests/TestAArch64Emulator.TestOverflow (1844 of 2182)
PASS: lldb-unit :: ScriptInterpreter/Python/./ScriptInterpreterPythonTests/PythonDataObjectsTest.TestPythonCallableInvoke (1845 of 2182)
PASS: lldb-api :: commands/target/dump-symtab-demangle/TestDumpSymtabDemangle.py (1846 of 2182)
PASS: lldb-unit :: UnwindAssembly/x86/./UnwindAssemblyx86Tests/Testx86AssemblyInspectionEngine.TestAddESP (1847 of 2182)
PASS: lldb-unit :: ObjectFile/Breakpad/./ObjectFileBreakpadTests/InfoRecord.parse (1848 of 2182)
PASS: lldb-unit :: ObjectFile/PECOFF/./ObjectFilePECOFFTests/PECallFrameInfoTest.Basic_eh (1849 of 2182)
PASS: lldb-api :: lang/objc/objc-runtime-ivars/TestRuntimeIvars.py (1850 of 2182)
UNSUPPORTED: lldb-api :: functionalities/longjmp/TestLongjmp.py (1851 of 2182)
PASS: lldb-unit :: Utility/./UtilityTests/StatusTest.Formatv (1852 of 2182)
PASS: lldb-unit :: Utility/./UtilityTests/RangeTest.SetRangeBase (1853 of 2182)
PASS: lldb-api :: python_api/module_section/TestModuleAndSection.py (1854 of 2182)
PASS: lldb-api :: macosx/DBGSourcePathRemapping/TestDSYMSourcePathRemapping.py (1855 of 2182)
PASS: lldb-api :: functionalities/tail_call_frames/inlining_and_tail_calls/TestInliningAndTailCalls.py (1856 of 2182)
PASS: lldb-api :: functionalities/thread/concurrent_events/TestConcurrentCrashWithSignal.py (1857 of 2182)
PASS: lldb-shell :: ScriptInterpreter/Python/eof.test (1858 of 2182)
PASS: lldb-unit :: Symbol/./SymbolTests/TestClangASTImporter.MetadataPropagationIndirectImport (1859 of 2182)
PASS: lldb-api :: macosx/version_zero/TestGetVersionZeroVersion.py (1860 of 2182)
PASS: lldb-api :: functionalities/thread/concurrent_events/TestConcurrentWatchBreak.py (1861 of 2182)
PASS: lldb-unit :: UnwindAssembly/ARM64/./Arm64InstEmulationTests/TestArm64InstEmulation.TestCFARegisterTrackedAcrossJumps (1862 of 2182)
PASS: lldb-api :: lang/objc/conflicting-definition/TestConflictingDefinition.py (1863 of 2182)
PASS: lldb-unit :: Utility/./UtilityTests/StringListTest.GetSize (1864 of 2182)
PASS: lldb-unit :: ScriptInterpreter/Python/./ScriptInterpreterPythonTests/PythonDataObjectsTest.TestExceptions (1865 of 2182)
UNSUPPORTED: lldb-api :: linux/sepdebugsymlink/TestTargetSymbolsSepDebugSymlink.py (1866 of 2182)
PASS: lldb-shell :: Driver/TestTarget.test (1867 of 2182)
PASS: lldb-unit :: Utility/./UtilityTests/AnsiTerminal.Basic (1868 of 2182)
PASS: lldb-api :: functionalities/breakpoint/dummy_target_breakpoints/TestBreakpointsWithNoTargets.py (1869 of 2182)
PASS: lldb-unit :: Process/./ProcessEventDataTests/ProcessEventDataTest.ShouldStop (1870 of 2182)
PASS: lldb-api :: commands/expression/import-std-module/vector/TestVectorFromStdModule.py (1871 of 2182)
UNSUPPORTED: lldb-api :: linux/mix-dwo-and-regular-objects/TestMixedDwarfBinary.py (1872 of 2182)
PASS: lldb-shell :: Reproducer/TestCaptureEnvOverride.test (1873 of 2182)
PASS: lldb-shell :: Commands/command-source.test (1874 of 2182)
PASS: lldb-shell :: Reproducer/TestDiscard.test (1875 of 2182)
PASS: lldb-shell :: SymbolFile/DWARF/array-sizes.s (1876 of 2182)
PASS: lldb-shell :: Breakpoint/case-sensitive.test (1877 of 2182)
FAIL: lldb-api :: functionalities/data-formatter/data-formatter-stl/libcxx/iterator/TestDataFormatterLibccIterator.py (1878 of 2182)
******************** TEST 'lldb-api :: functionalities/data-formatter/data-formatter-stl/libcxx/iterator/TestDataFormatterLibccIterator.py' FAILED ********************
Script:
--
/usr/local/Frameworks/Python.framework/Versions/3.7/bin/python3.7 /Users/buildslave/jenkins/workspace/lldb-cmake/llvm-project/lldb/test/API/dotest.py -S nm -u CXXFLAGS -u CFLAGS --codesign-identity - --arch x86_64 --build-dir /Users/buildslave/jenkins/workspace/lldb-cmake/lldb-build/lldb-test-build.noindex -s=/Users/buildslave/jenkins/workspace/lldb-cmake/test/logs -t --env TERM=vt100 --env LLVM_LIBS_DIR=/Users/buildslave/jenkins/workspace/lldb-cmake/lldb-build/./lib --arch x86_64 --build-dir /Users/buildslave/jenkins/workspace/lldb-cmake/lldb-build/lldb-test-build.noindex -s /Users/buildslave/jenkins/workspace/lldb-cmake/lldb-build/lldb-test-traces --lldb-module-cache-dir /Users/buildslave/jenkins/workspace/lldb-cmake/lldb-build/lldb-test-build.noindex/module-cache-lldb/lldb-api --clang-module-cache-dir /Users/buildslave/jenkins/workspace/lldb-cmake/lldb-build/lldb-test-build.noindex/module-cache-clang/lldb-api --executable /Users/buildslave/jenkins/workspace/lldb-cmake/lldb-build/./bin/lldb --compiler /Users/buildslave/jenkins/workspace/lldb-cmake/lldb-build/./bin/clang --dsymutil /Users/buildslave/jenkins/workspace/lldb-cmake/lldb-build/./bin/dsymutil --filecheck /Users/buildslave/jenkins/workspace/lldb-cmake/lldb-build/./bin/FileCheck --yaml2obj /Users/buildslave/jenkins/workspace/lldb-cmake/lldb-build/./bin/yaml2obj --server /Users/buildslave/jenkins/workspace/lldb-cmake/lldb-build/./bin/debugserver --lldb-libs-dir /Users/buildslave/jenkins/workspace/lldb-cmake/lldb-build/./lib /Users/buildslave/jenkins/workspace/lldb-cmake/llvm-project/lldb/test/API/functionalities/data-formatter/data-formatter-stl/libcxx/iterator -p TestDataFormatterLibccIterator.py
--
Exit Code: 1

Hide Details

Command Output (stdout): -- lldb version 12.0.99 (http://labmaster3.local/git/llvm-project.git revision eda450bb27c4638ba191deaa92526c5ad0fcb87f) clang revision eda450bb27c4638ba191deaa92526c5ad0fcb87f llvm revision eda450bb27c4638ba191deaa92526c5ad0fcb87f libstdcxx tests will not be run because: Don't know how to build with libstdcxx on macosx Skipping following debug info categories: ['dwo']

Hide Details

-- Command Output (stderr): --

Hide Details

Session logs for test failures/errors/unexpected successes will go into directory '/Users/buildslave/jenkins/workspace/lldb-cmake/lldb-build/lldb-test-traces' Change dir to: /Users/buildslave/jenkins/workspace/lldb-cmake/llvm-project/lldb/test/API/functionalities/data-formatter/data-formatter-stl/libcxx/iterator runCmd: settings clear -all output:

Hide Details

runCmd: settings set symbols.enable-external-lookup false output:

Hide Details

runCmd: settings set target.inherit-tcc true output:

Hide Details

runCmd: settings set target.auto-apply-fixits false output:

Hide Details

runCmd: settings set plugin.process.gdb-remote.packet-timeout 60 output:

Hide Details

runCmd: settings set symbols.clang-modules-cache-path "/Users/buildslave/jenkins/workspace/lldb-cmake/lldb-build/lldb-test-build.noindex/module-cache-lldb/lldb-api" output:

Hide Details

runCmd: settings set use-color false output:

Hide Details

runCmd: setting set target.prefer-dynamic-value no-dynamic-values output:

Hide Details

runCmd: file /Users/buildslave/jenkins/workspace/lldb-cmake/lldb-build/lldb-test-build.noindex/functionalities/data-formatter/data-formatter-stl/libcxx/iterator/TestDataFormatterLibccIterator.test_with_run_command_dsym/a.out output: Current executable set to '/Users/buildslave/jenkins/workspace/lldb-cmake/lldb-build/lldb-test-build.noindex/functionalities/data-formatter/data-formatter-stl/libcxx/iterator/TestDataFormatterLibccIterator.test_with_run_command_dsym/a.out' (x86_64).

Hide Details

Hide Details

runCmd: breakpoint set -f "main.cpp" -l 37 output: Breakpoint 1: where = a.out`main + 354 at main.cpp:37:2, address = 0x0000000100000eb2

Hide Details

Hide Details

Expecting pattern: ^Breakpoint (?P<bpno>[0-9]+): (?P<num_locations>[0-9]+) locations\.$ Not matched

Hide Details

Expecting pattern: ^Breakpoint (?P<bpno>[0-9]+): (?P<num_locations>no) locations \(pending\)\. Not matched

Hide Details

Expecting pattern: ^Breakpoint (?P<bpno>[0-9]+): where = (?P<module>.*)`(?P<symbol>[+\-]{0,1}[^+]+)( \+ (?P<offset>[0-9]+)){0,1}( \[inlined\] (?P<inline_symbol>.*)){0,1} at (?P<file>[^:]+):(?P<line_no>[0-9]+)(?P<column>(:[0-9]+)?), address = (?P<address>0x[0-9a-fA-F]+)$ Matched

Hide Details

runCmd: run output: Process 98012 stopped * thread #1, queue = 'com.apple.main-thread', stop reason = breakpoint 1.1 frame #0: 0x0000000100000eb2 a.out`main at main.cpp:37:2 34 ivter ivI = iv.begin(); 35 svter svI = sv.begin(); 36 -> 37 return 0; // Set break point at this line. ^ 38 }

Hide Details

Process 98012 launched: '/Users/buildslave/jenkins/workspace/lldb-cmake/lldb-build/lldb-test-build.noindex/functionalities/data-formatter/data-formatter-stl/libcxx/iterator/TestDataFormatterLibccIterator.test_with_run_command_dsym/a.out' (x86_64)

Hide Details

Hide Details

runCmd: thread list output: Process 98012 stopped * thread #1: tid = 0xd82115, 0x0000000100000eb2 a.out`main at main.cpp:37:2, queue = 'com.apple.main-thread', stop reason = breakpoint 1.1

Hide Details

Hide Details

Ran command: "thread list"

Hide Details

Got output: Process 98012 stopped * thread #1: tid = 0xd82115, 0x0000000100000eb2 a.out`main at main.cpp:37:2, queue = 'com.apple.main-thread', stop reason = breakpoint 1.1

Hide Details

Expecting sub string: "stopped" (was found) Expecting sub string: "stop reason = breakpoint" (was found)

Hide Details

Adding tearDown hook: def cleanup(): self.runCmd('type format clear', check=False) self.runCmd('type summary clear', check=False) self.runCmd('type filter clear', check=False) self.runCmd('type synth clear', check=False) self.runCmd( "settings set target.max-children-count 256", check=False)

Hide Details

Hide Details

runCmd: frame variable ivI output: (ivter) ivI = (item = 3)

Hide Details

Hide Details

Ran command: "frame variable ivI"

Hide Details

Got output: (ivter) ivI = (item = 3)

Hide Details

Expecting sub string: "item = 3" (was found)

Hide Details

runCmd: expr ivI output: (ivter) $0 = (item = 3)

Hide Details

Hide Details

Ran command: "expr ivI"

Hide Details

Got output: (ivter) $0 = (item = 3)

Hide Details

Expecting sub string: "item = 3" (was found)

Hide Details

runCmd: frame variable iimI output: (iimter) iimI = (first = 43981, second = 61681)

Hide Details

Hide Details

Ran command: "frame variable iimI"

Hide Details

Got output: (iimter) iimI = (first = 43981, second = 61681)

Hide Details

Expecting sub string: "first = 43981" (was found) Expecting sub string: "second = 61681" (was found)

Hide Details

runCmd: expr iimI output: (iimter) $1 = (first = 43981, second = 61681)

Hide Details

Hide Details

Ran command: "expr iimI"

Hide Details

Got output: (iimter) $1 = (first = 43981, second = 61681)

Hide Details

Expecting sub string: "first = 43981" (was found) Expecting sub string: "second = 61681" (was found)

Hide Details

runCmd: frame variable simI output: (simter) simI = (first = "world", second = 42)

Hide Details

Hide Details

Ran command: "frame variable simI"

Hide Details

Got output: (simter) simI = (first = "world", second = 42)

Hide Details

Expecting sub string: "first = "world"" (was found) Expecting sub string: "second = 42" (was found)

Hide Details

runCmd: expr simI output: (simter) $2 = (first = "world", second = 42)

Hide Details

Hide Details

Ran command: "expr simI"

Hide Details

Got output: (simter) $2 = (first = "world", second = 42)

Hide Details

Expecting sub string: "first = "world"" (was found) Expecting sub string: "second = 42" (was found)

Hide Details

runCmd: frame variable svI output: (svter) svI = (item = "hello")

Hide Details

Hide Details

Ran command: "frame variable svI"

Hide Details

Got output: (svter) svI = (item = "hello")

Hide Details

Expecting sub string: "item = "hello"" (was found)

Hide Details

runCmd: expr svI output: (svter) $3 = (item = "hello")

Hide Details

Hide Details

Ran command: "expr svI"

Hide Details

Got output: (svter) $3 = (item = "hello")

Hide Details

Expecting sub string: "item = "hello"" (was found)

Hide Details

<bound method SBProcess.Kill of <lldb.SBProcess; proxy of <Swig Object of type 'lldb::SBProcess *' at 0x108905f60> >>: success

Hide Details

Executing tearDown hook: def cleanup(): self.runCmd('type format clear', check=False) self.runCmd('type summary clear', check=False) self.runCmd('type filter clear', check=False) self.runCmd('type synth clear', check=False) self.runCmd( "settings set target.max-children-count 256", check=False)

Hide Details

Hide Details

runCmd: type format clear check of return status not required output:

Hide Details

runCmd: type summary clear check of return status not required output:

Hide Details

runCmd: type filter clear check of return status not required output:

Hide Details

runCmd: type synth clear check of return status not required output:

Hide Details

runCmd: settings set target.max-children-count 256 check of return status not required output:

Hide Details

PASS: LLDB (/Users/buildslave/jenkins/workspace/lldb-cmake/lldb-build/bin/clang-x86_64) :: test_with_run_command_dsym (TestDataFormatterLibccIterator.LibcxxIteratorDataFormatterTestCase) runCmd: settings clear -all output:

Hide Details

runCmd: settings set symbols.enable-external-lookup false output:

Hide Details

runCmd: settings set target.inherit-tcc true output:

Hide Details

runCmd: settings set target.auto-apply-fixits false output:

Hide Details

runCmd: settings set plugin.process.gdb-remote.packet-timeout 60 output:

Hide Details

runCmd: settings set symbols.clang-modules-cache-path "/Users/buildslave/jenkins/workspace/lldb-cmake/lldb-build/lldb-test-build.noindex/module-cache-lldb/lldb-api" output:

Hide Details

runCmd: settings set use-color false output:

Hide Details

runCmd: setting set target.prefer-dynamic-value no-dynamic-values output:

Hide Details

runCmd: file /Users/buildslave/jenkins/workspace/lldb-cmake/lldb-build/lldb-test-build.noindex/functionalities/data-formatter/data-formatter-stl/libcxx/iterator/TestDataFormatterLibccIterator.test_with_run_command_dwarf/a.out output: Current executable set to '/Users/buildslave/jenkins/workspace/lldb-cmake/lldb-build/lldb-test-build.noindex/functionalities/data-formatter/data-formatter-stl/libcxx/iterator/TestDataFormatterLibccIterator.test_with_run_command_dwarf/a.out' (x86_64).

Hide Details

Hide Details

runCmd: breakpoint set -f "main.cpp" -l 37 output: Breakpoint 1: where = a.out`main + 354 at main.cpp:37:2, address = 0x0000000100000eb2

Hide Details

Hide Details

Expecting pattern: ^Breakpoint (?P<bpno>[0-9]+): (?P<num_locations>[0-9]+) locations\.$ Not matched

Hide Details

Expecting pattern: ^Breakpoint (?P<bpno>[0-9]+): (?P<num_locations>no) locations \(pending\)\. Not matched

Hide Details

Expecting pattern: ^Breakpoint (?P<bpno>[0-9]+): where = (?P<module>.*)`(?P<symbol>[+\-]{0,1}[^+]+)( \+ (?P<offset>[0-9]+)){0,1}( \[inlined\] (?P<inline_symbol>.*)){0,1} at (?P<file>[^:]+):(?P<line_no>[0-9]+)(?P<column>(:[0-9]+)?), address = (?P<address>0x[0-9a-fA-F]+)$ Matched

Hide Details

runCmd: run output: Process 98167 stopped * thread #1, queue = 'com.apple.main-thread', stop reason = breakpoint 1.1 frame #0: 0x0000000100000eb2 a.out`main at main.cpp:37:2 34 ivter ivI = iv.begin(); 35 svter svI = sv.begin(); 36 -> 37 return 0; // Set break point at this line. ^ 38 }

Hide Details

Process 98167 launched: '/Users/buildslave/jenkins/workspace/lldb-cmake/lldb-build/lldb-test-build.noindex/functionalities/data-formatter/data-formatter-stl/libcxx/iterator/TestDataFormatterLibccIterator.test_with_run_command_dwarf/a.out' (x86_64)

Hide Details

Hide Details

runCmd: thread list output: Process 98167 stopped * thread #1: tid = 0xd82351, 0x0000000100000eb2 a.out`main at main.cpp:37:2, queue = 'com.apple.main-thread', stop reason = breakpoint 1.1

Hide Details

Hide Details

Ran command: "thread list"

Hide Details

Got output: Process 98167 stopped * thread #1: tid = 0xd82351, 0x0000000100000eb2 a.out`main at main.cpp:37:2, queue = 'com.apple.main-thread', stop reason = breakpoint 1.1

Hide Details

Expecting sub string: "stopped" (was found) Expecting sub string: "stop reason = breakpoint" (was found)

Hide Details

Adding tearDown hook: def cleanup(): self.runCmd('type format clear', check=False) self.runCmd('type summary clear', check=False) self.runCmd('type filter clear', check=False) self.runCmd('type synth clear', check=False) self.runCmd( "settings set target.max-children-count 256", check=False)

Hide Details

Hide Details

runCmd: frame variable ivI output: (ivter) ivI = (item = 3)

Hide Details

Hide Details

Ran command: "frame variable ivI"

Hide Details

Got output: (ivter) ivI = (item = 3)

Hide Details

Expecting sub string: "item = 3" (was found)

Hide Details

runCmd: expr ivI output: (ivter) $0 = (item = 3)

Hide Details

Hide Details

Ran command: "expr ivI"

Hide Details

Got output: (ivter) $0 = (item = 3)

Hide Details

Expecting sub string: "item = 3" (was found)

Hide Details

runCmd: frame variable iimI output: (iimter) iimI = (first = 43981, second = 61681)

Hide Details

Hide Details

Ran command: "frame variable iimI"

Hide Details

Got output: (iimter) iimI = (first = 43981, second = 61681)

Hide Details

Expecting sub string: "first = 43981" (was found) Expecting sub string: "second = 61681" (was found)

Hide Details

runCmd: expr iimI output: (iimter) $1 = (first = 43981, second = 61681)

Hide Details

Hide Details

Ran command: "expr iimI"

Hide Details

Got output: (iimter) $1 = (first = 43981, second = 61681)

Hide Details

Expecting sub string: "first = 43981" (was found) Expecting sub string: "second = 61681" (was found)

Hide Details

runCmd: frame variable simI output: (simter) simI = (first = "world", second = 42)

Hide Details

Hide Details

Ran command: "frame variable simI"

Hide Details

Got output: (simter) simI = (first = "world", second = 42)

Hide Details

Expecting sub string: "first = "world"" (was found) Expecting sub string: "second = 42" (was found)

Hide Details

runCmd: expr simI output: (simter) $2 = (first = "world", second = 42)

Hide Details

Hide Details

Ran command: "expr simI"

Hide Details

Got output: (simter) $2 = (first = "world", second = 42)

Hide Details

Expecting sub string: "first = "world"" (was found) Expecting sub string: "second = 42" (was found)

Hide Details

runCmd: frame variable svI output: (svter) svI = (item = "hello")

Hide Details

Hide Details

Ran command: "frame variable svI"

Hide Details

Got output: (svter) svI = (item = "hello")

Hide Details

Expecting sub string: "item = "hello"" (was found)

Hide Details

runCmd: expr svI output: (svter) $3 = (item = "hello")

Hide Details

Hide Details

Ran command: "expr svI"

Hide Details

Got output: (svter) $3 = (item = "hello")

Hide Details

Expecting sub string: "item = "hello"" (was found)

Hide Details

<bound method SBProcess.Kill of <lldb.SBProcess; proxy of <Swig Object of type 'lldb::SBProcess *' at 0x10861fc90> >>: success

Hide Details

Executing tearDown hook: def cleanup(): self.runCmd('type format clear', check=False) self.runCmd('type summary clear', check=False) self.runCmd('type filter clear', check=False) self.runCmd('type synth clear', check=False) self.runCmd( "settings set target.max-children-count 256", check=False)

Hide Details

Hide Details

runCmd: type format clear check of return status not required output:

Hide Details

runCmd: type summary clear check of return status not required output:

Hide Details

runCmd: type filter clear check of return status not required output:

Hide Details

runCmd: type synth clear check of return status not required output:

Hide Details

runCmd: settings set target.max-children-count 256 check of return status not required output:

Hide Details

PASS: LLDB (/Users/buildslave/jenkins/workspace/lldb-cmake/lldb-build/bin/clang-x86_64) :: test_with_run_command_dwarf (TestDataFormatterLibccIterator.LibcxxIteratorDataFormatterTestCase) UNSUPPORTED: LLDB (/Users/buildslave/jenkins/workspace/lldb-cmake/lldb-build/bin/clang-x86_64) :: test_with_run_command_dwo (TestDataFormatterLibccIterator.LibcxxIteratorDataFormatterTestCase) (test case does not fall in any category of interest for this run) runCmd: settings clear -all output:

Hide Details

runCmd: settings set symbols.enable-external-lookup false output:

Hide Details

runCmd: settings set target.inherit-tcc true output:

Hide Details

runCmd: settings set target.auto-apply-fixits false output:

Hide Details

runCmd: settings set plugin.process.gdb-remote.packet-timeout 60 output:

Hide Details

runCmd: settings set symbols.clang-modules-cache-path "/Users/buildslave/jenkins/workspace/lldb-cmake/lldb-build/lldb-test-build.noindex/module-cache-lldb/lldb-api" output:

Hide Details

runCmd: settings set use-color false output:

Hide Details

runCmd: setting set target.prefer-dynamic-value no-dynamic-values output:

Hide Details

runCmd: file /Users/buildslave/jenkins/workspace/lldb-cmake/lldb-build/lldb-test-build.noindex/functionalities/data-formatter/data-formatter-stl/libcxx/iterator/TestDataFormatterLibccIterator.test_with_run_command_gmodules/a.out output: Current executable set to '/Users/buildslave/jenkins/workspace/lldb-cmake/lldb-build/lldb-test-build.noindex/functionalities/data-formatter/data-formatter-stl/libcxx/iterator/TestDataFormatterLibccIterator.test_with_run_command_gmodules/a.out' (x86_64).

Hide Details

Hide Details

runCmd: breakpoint set -f "main.cpp" -l 37 output: Breakpoint 1: where = a.out`main + 354 at main.cpp:37:2, address = 0x0000000100000eb2

Hide Details

Hide Details

Expecting pattern: ^Breakpoint (?P<bpno>[0-9]+): (?P<num_locations>[0-9]+) locations\.$ Not matched

Hide Details

Expecting pattern: ^Breakpoint (?P<bpno>[0-9]+): (?P<num_locations>no) locations \(pending\)\. Not matched

Hide Details

Expecting pattern: ^Breakpoint (?P<bpno>[0-9]+): where = (?P<module>.*)`(?P<symbol>[+\-]{0,1}[^+]+)( \+ (?P<offset>[0-9]+)){0,1}( \[inlined\] (?P<inline_symbol>.*)){0,1} at (?P<file>[^:]+):(?P<line_no>[0-9]+)(?P<column>(:[0-9]+)?), address = (?P<address>0x[0-9a-fA-F]+)$ Matched

Hide Details

runCmd: run runCmd failed! error: process exited with status -1 (tried to attach to process already being debugged)

Hide Details

Hide Details

Command 'run' failed!

Hide Details

FAIL: LLDB (/Users/buildslave/jenkins/workspace/lldb-cmake/lldb-build/bin/clang-x86_64) :: test_with_run_command_gmodules (TestDataFormatterLibccIterator.LibcxxIteratorDataFormatterTestCase) <bound method SBProcess.Kill of <lldb.SBProcess; proxy of <Swig Object of type 'lldb::SBProcess *' at 0x1087287b0> >>: success

Hide Details

Restore dir to: /Users/buildslave/jenkins/workspace/lldb-cmake/lldb-build/tools/lldb/test ====================================================================== FAIL: test_with_run_command_gmodules (TestDataFormatterLibccIterator.LibcxxIteratorDataFormatterTestCase) Test that libc++ iterators format properly. ---------------------------------------------------------------------- Traceback (most recent call last): File "/Users/buildslave/jenkins/workspace/lldb-cmake/llvm-project/lldb/packages/Python/lldbsuite/test/lldbtest.py", line 1823, in test_method return attrvalue(self) File "/Users/buildslave/jenkins/workspace/lldb-cmake/llvm-project/lldb/test/API/functionalities/data-formatter/data-formatter-stl/libcxx/iterator/TestDataFormatterLibccIterator.py", line 33, in test_with_run_command self.runCmd("run", RUN_SUCCEEDED) File "/Users/buildslave/jenkins/workspace/lldb-cmake/llvm-project/lldb/packages/Python/lldbsuite/test/lldbtest.py", line 2153, in runCmd msg if (msg) else CMD_MSG(cmd)) AssertionError: False is not True : Process is launched successfully Error output: error: process exited with status -1 (tried to attach to process already being debugged)

Hide Details

Config=x86_64-/Users/buildslave/jenkins/workspace/lldb-cmake/lldb-build/bin/clang ---------------------------------------------------------------------- Ran 4 tests in 8.391s

Hide Details

RESULT: FAILED (2 passes, 1 failures, 0 errors, 1 skipped, 0 expected failures, 0 unexpected successes)

Hide Details

--

Hide Details

******************** PASS: lldb-unit :: DataFormatter/./LLDBFormatterTests/TypeMatcherTests.GetMatchStringExactName (1879 of 2182) PASS: lldb-shell :: Reproducer/Functionalities/TestExpressionEvaluation.test (1880 of 2182) PASS: lldb-api :: commands/expression/scoped_enums/TestScopedEnumType.py (1881 of 2182) PASS: lldb-unit :: Core/./LLDBCoreTests/ModuleSpecTest.TestCOFFFile (1882 of 2182) PASS: lldb-api :: linux/builtin_trap/TestBuiltinTrap.py (1883 of 2182) PASS: lldb-unit :: Host/./HostTests/FileSystemTest.GetPermissions (1884 of 2182) PASS: lldb-unit :: Process/minidump/./LLDBMinidumpTests/MinidumpParserTest.GetLinuxProcStatus_no_stream (1885 of 2182) PASS: lldb-unit :: Utility/./UtilityTests/LogChannelEnabledTest.log_options (1886 of 2182) PASS: lldb-api :: lang/objc/foundation/TestConstStrings.py (1887 of 2182) PASS: lldb-unit :: Target/./TargetTests/ModuleCacheTest.GetAndPutStrangeHostname (1888 of 2182) PASS: lldb-shell :: SymbolFile/DWARF/DW_OP_piece-smaller-than-struct.s (1889 of 2182) PASS: lldb-unit :: ObjectFile/PECOFF/./ObjectFilePECOFFTests/PECallFrameInfoTest.Chained_eh (1890 of 2182) PASS: lldb-unit :: Utility/./UtilityTests/RecordReplayTest.InstrumentedBar (1891 of 2182) PASS: lldb-api :: lang/objcxx/hide-runtime-values/TestObjCXXHideRuntimeValues.py (1892 of 2182) PASS: lldb-unit :: DataFormatter/./LLDBFormatterTests/TypeMatcherTests.RegexMatchPart (1893 of 2182) PASS: lldb-unit :: Utility/./UtilityTests/LogChannelTest.Enable (1894 of 2182) PASS: lldb-unit :: Expression/./ExpressionTests/DiagnosticManagerTest.PutStringMultiple (1895 of 2182) PASS: lldb-unit :: Utility/./UtilityTests/RangeTest.Copy (1896 of 2182) UNSUPPORTED: lldb-shell :: ScriptInterpreter/Lua/independent_state.test (1897 of 2182) UNSUPPORTED: lldb-shell :: Reproducer/TestLuaImport.test (1898 of 2182) PASS: lldb-unit :: Host/./HostTests/NativeProcessProtocolTest.ReadCStringFromMemory_CrossPageBoundary (1899 of 2182) PASS: lldb-unit :: Utility/./UtilityTests/StringListTest.Join (1900 of 2182) PASS: lldb-unit :: Utility/./UtilityTests/RangeTest.LessThan (1901 of 2182) PASS: lldb-unit :: ObjectFile/Breakpad/./ObjectFileBreakpadTests/LineRecord.parse (1902 of 2182) PASS: lldb-unit :: UnwindAssembly/x86/./UnwindAssemblyx86Tests/Testx86AssemblyInspectionEngine.TestPopESI (1903 of 2182) UNSUPPORTED: lldb-shell :: ScriptInterpreter/Lua/breakpoint_callback.test (1904 of 2182) PASS: lldb-unit :: Language/Highlighting/./HighlighterTests/HighlighterTest.ClangCursorPosBeforeOtherToken (1905 of 2182) PASS: lldb-api :: lang/objc/exceptions/TestObjCExceptions.py (1906 of 2182) PASS: lldb-shell :: Breakpoint/debug_rnglistx_rlex.test (1907 of 2182) PASS: lldb-unit :: Language/Highlighting/./HighlighterTests/HighlighterTest.ClangOperators (1908 of 2182) PASS: lldb-api :: lang/cpp/namespace_conflicts/TestNamespaceConflicts.py (1909 of 2182) PASS: lldb-unit :: Core/./LLDBCoreTests/ModuleSpecTest.InvalidInMemoryBufferValidFile (1910 of 2182) PASS: lldb-api :: commands/process/launch-with-shellexpand/TestLaunchWithShellExpand.py (1911 of 2182) PASS: lldb-unit :: ObjectFile/Breakpad/./ObjectFileBreakpadTests/FileRecord.parse (1912 of 2182) PASS: lldb-shell :: Commands/CommandScriptImmediateOutput/CommandScriptImmediateOutputFile.test (1913 of 2182) PASS: lldb-unit :: Utility/./UtilityTests/OptionsWithRawTest.ArgsButNoLeadingDash (1914 of 2182) PASS: lldb-api :: lang/objc/objc-class-method/TestObjCClassMethod.py (1915 of 2182) PASS: lldb-unit :: Host/./HostTests/MainLoopTest.ReadObject (1916 of 2182) PASS: lldb-unit :: Utility/./UtilityTests/CompletionRequest.DuplicateFilteringWithComments (1917 of 2182) PASS: lldb-unit :: Utility/./UtilityTests/StructuredDataTest.StringDump (1918 of 2182) PASS: lldb-api :: functionalities/thread/concurrent_events/TestConcurrentTwoBreakpointsOneWatchpoint.py (1919 of 2182) PASS: lldb-api :: functionalities/archives/TestBSDArchives.py (1920 of 2182) PASS: lldb-unit :: Process/gdb-remote/./ProcessGdbRemoteTests/GDBRemoteCommunicationClientTest.SendStartTracePacket (1921 of 2182) PASS: lldb-unit :: Utility/./UtilityTests/StringLexerTest.NextIf (1922 of 2182) UNSUPPORTED: lldb-shell :: Register/x86-64-ymm16-read.test (1923 of 2182) PASS: lldb-unit :: SymbolFile/DWARF/./SymbolFileDWARFTests/SymbolFileDWARFTests.TestAbilitiesForDWARF (1924 of 2182) PASS: lldb-unit :: Utility/./UtilityTests/StreamTest.AddressRangeInvalidRange (1925 of 2182) PASS: lldb-api :: lang/cpp/template-function/TestTemplateFunctions.py (1926 of 2182) PASS: lldb-unit :: Symbol/./SymbolTests/TestTypeSystemClang.TestGetEnumIntegerTypeUnexpectedType (1927 of 2182) PASS: lldb-unit :: Utility/./UtilityTests/OptionsWithRawTest.ArgsButNoDelimiter (1928 of 2182) UNSUPPORTED: lldb-api :: lang/cpp/printf/TestPrintf.py (1929 of 2182) PASS: lldb-api :: commands/expression/no-deadlock/TestExprDoesntBlock.py (1930 of 2182) PASS: lldb-api :: functionalities/lazy-loading/TestLazyLoading.py (1931 of 2182) PASS: lldb-shell :: SymbolFile/NativePDB/global-classes.cpp (1932 of 2182) PASS: lldb-unit :: Utility/./UtilityTests/ProcessInstanceInfoList.Yaml (1933 of 2182) PASS: lldb-api :: tools/lldb-vscode/variables/TestVSCode_variables.py (1934 of 2182) PASS: lldb-api :: functionalities/process_crash_info/TestProcessCrashInfo.py (1935 of 2182) UNSUPPORTED: lldb-shell :: SymbolFile/PDB/function-level-linking.test (1936 of 2182) PASS: lldb-api :: functionalities/testid/TestTestId.py (1937 of 2182) UNSUPPORTED: lldb-shell :: Register/x86-64-ymm16-write.test (1938 of 2182) UNSUPPORTED: lldb-shell :: SymbolFile/PDB/enums-layout.test (1939 of 2182) PASS: lldb-shell :: SymbolFile/DWARF/split-dwarf-multiple-cu.ll (1940 of 2182) PASS: lldb-api :: functionalities/postmortem/minidump-new/TestMiniDumpUUID.py (1941 of 2182) PASS: lldb-api :: lang/cpp/subst_template_type_param/TestSubstTemplateTypeParam.py (1942 of 2182) PASS: lldb-unit :: Utility/./UtilityTests/ConstStringTest.MangledCounterpart (1943 of 2182) UNSUPPORTED: lldb-api :: commands/expression/macros/TestMacros.py (1944 of 2182) PASS: lldb-unit :: Utility/./UtilityTests/LogChannelEnabledTest.LLDB_LOG_ERROR (1945 of 2182) PASS: lldb-unit :: SymbolFile/DWARF/./SymbolFileDWARFTests/DWARFASTParserClangTests.EnsureAllDIEsInDeclContextHaveBeenParsedParsesOnlyMatchingEntries (1946 of 2182) PASS: lldb-unit :: Language/Highlighting/./HighlighterTests/HighlighterTest.ClangBraces (1947 of 2182) PASS: lldb-unit :: Symbol/./SymbolTests/TestTypeSystemClang.TestGetBasicTypeFromName (1948 of 2182) UNSUPPORTED: lldb-api :: linux/add-symbols/TestTargetSymbolsAddCommand.py (1949 of 2182) UNSUPPORTED: lldb-api :: commands/expression/completion-crash-invalid-iterator/TestInvalidIteratorCompletionCrash.py (1950 of 2182) PASS: lldb-api :: macosx/add-dsym/TestAddDsymMidExecutionCommand.py (1951 of 2182) PASS: lldb-api :: sanity/TestSettingSkipping.py (1952 of 2182) PASS: lldb-api :: python_api/watchpoint/watchlocation/TestSetWatchlocation.py (1953 of 2182) PASS: lldb-api :: lang/cpp/virtual-functions/TestCppVirtualFunctions.py (1954 of 2182) PASS: lldb-unit :: Target/./TargetTests/PathMappingListTest.AbsoluteTests (1955 of 2182) PASS: lldb-unit :: Symbol/./SymbolTests/TestTypeSystemClang.TestFunctionTemplateConstruction (1956 of 2182) PASS: lldb-unit :: Utility/./UtilityTests/ScalarTest.GetValue (1957 of 2182) PASS: lldb-api :: macosx/find-dsym/deep-bundle/TestDeepBundle.py (1958 of 2182) PASS: lldb-unit :: Utility/./UtilityTests/ListenerTest.GetEventImmediate (1959 of 2182) PASS: lldb-unit :: Process/./ProcessEventDataTests/ProcessEventDataTest.DoOnRemoval (1960 of 2182) PASS: lldb-unit :: SymbolFile/DWARF/./SymbolFileDWARFTests/SymbolFileDWARFTests.TestAbbrevOrder1Start5 (1961 of 2182) PASS: lldb-unit :: Utility/./UtilityTests/StringListTest.GetMaxStringLengthEqualSize (1962 of 2182) PASS: lldb-unit :: Utility/./UtilityTests/BinaryStreamTest.PutSLEB128OneByte (1963 of 2182) PASS: lldb-api :: functionalities/breakpoint/breakpoint_language/TestBreakpointLanguage.py (1964 of 2182) UNSUPPORTED: lldb-api :: functionalities/unwind/standard/TestStandardUnwind.py (1965 of 2182) PASS: lldb-api :: commands/expression/import-std-module/forward_list/TestForwardListFromStdModule.py (1966 of 2182) PASS: lldb-api :: functionalities/thread/step_until/TestStepUntil.py (1967 of 2182) PASS: lldb-unit :: Utility/./UtilityTests/StringExtractorTest.DecodeHexU8_Underflow2 (1968 of 2182) PASS: lldb-unit :: Core/./LLDBCoreTests/UniqueCStringMap.NoDefaultConstructor (1969 of 2182) PASS: lldb-unit :: UnwindAssembly/x86/./UnwindAssemblyx86Tests/Testx86AssemblyInspectionEngine.TestPopEBX (1970 of 2182) PASS: lldb-api :: commands/watchpoints/watchpoint_size/TestWatchpointSizes.py (1971 of 2182) PASS: lldb-unit :: Utility/./UtilityTests/LogChannelEnabledTest.LogVerboseThread (1972 of 2182) PASS: lldb-unit :: UnwindAssembly/x86/./UnwindAssemblyx86Tests/Testx86AssemblyInspectionEngine.TestPopR12 (1973 of 2182) PASS: lldb-unit :: ScriptInterpreter/Python/./ScriptInterpreterPythonTests/PythonDataObjectsTest.TestOwnedReferences (1974 of 2182) PASS: lldb-shell :: SymbolFile/DWARF/dir-separator-no-comp-dir.s (1975 of 2182) PASS: lldb-unit :: Interpreter/./InterpreterTests/CompletionTest.FileCompletionAbsolute (1976 of 2182) PASS: lldb-shell :: ObjectFile/PECOFF/invalid-export-table.yaml (1977 of 2182) PASS: lldb-api :: functionalities/data-formatter/data-formatter-stl/libcxx/string/TestDataFormatterLibcxxString.py (1978 of 2182) PASS: lldb-shell :: SymbolFile/DWARF/debug_loc.s (1979 of 2182) PASS: lldb-api :: python_api/symbol-context/two-files/TestSymbolContextTwoFiles.py (1980 of 2182) PASS: lldb-shell :: Breakpoint/jitbp_elf.test (1981 of 2182) PASS: lldb-api :: lang/cpp/class_types/TestClassTypes.py (1982 of 2182) PASS: lldb-api :: lang/objc/objc-struct-argument/TestObjCStructArgument.py (1983 of 2182) PASS: lldb-unit :: Language/CPlusPlus/./LanguageCPlusPlusTests/CPlusPlusLanguage.MethodNameParsing (1984 of 2182) PASS: lldb-unit :: Target/./TargetTests/MCBasedABI.MapRegisterName (1985 of 2182) PASS: lldb-unit :: Expression/./ExpressionTests/CppModuleConfigurationTest.UnknownLibCppFile (1986 of 2182) PASS: lldb-api :: macosx/indirect_symbol/TestIndirectSymbols.py (1987 of 2182) PASS: lldb-api :: functionalities/data-formatter/data-formatter-stl/libcxx/variant/TestDataFormatterLibcxxVariant.py (1988 of 2182) PASS: lldb-shell :: ObjectFile/ELF/netbsd-core-amd64.test (1989 of 2182) PASS: lldb-api :: python_api/function_symbol/TestDisasmAPI.py (1990 of 2182) PASS: lldb-shell :: Reproducer/Functionalities/TestImageList.test (1991 of 2182) PASS: lldb-api :: functionalities/breakpoint/scripted_bkpt/TestScriptedResolver.py (1992 of 2182) PASS: lldb-api :: commands/expression/import-std-module/no-std-module/TestMissingStdModule.py (1993 of 2182) PASS: lldb-unit :: Expression/./ExpressionTests/DWARFExpression.DW_OP_pick (1994 of 2182) PASS: lldb-api :: functionalities/thread/concurrent_events/TestConcurrentManyCrash.py (1995 of 2182) PASS: lldb-api :: lang/cpp/elaborated-types/TestElaboratedTypes.py (1996 of 2182) PASS: lldb-unit :: Utility/./UtilityTests/StreamTeeTest.AppendStream (1997 of 2182) PASS: lldb-api :: commands/expression/expr-in-syscall/TestExpressionInSyscall.py (1998 of 2182) PASS: lldb-api :: commands/expression/context-object-objc/TestContextObjectObjc.py (1999 of 2182) PASS: lldb-unit :: Language/Highlighting/./HighlighterTests/HighlighterTest.ClangCursorPosEndOfLine (2000 of 2182) PASS: lldb-api :: commands/expression/test/TestExprs2.py (2001 of 2182) PASS: lldb-api :: functionalities/target_var/TestTargetVar.py (2002 of 2182) PASS: lldb-unit :: Utility/./UtilityTests/StringListTest.ShiftStdString (2003 of 2182) PASS: lldb-shell :: Minidump/no-process-id.yaml (2004 of 2182) PASS: lldb-api :: functionalities/data-formatter/data-formatter-objc/cmtime/TestDataFormatterCMTime.py (2005 of 2182) PASS: lldb-unit :: Utility/./UtilityTests/ArchSpecTest.Compatibility (2006 of 2182) PASS: lldb-api :: lang/objc/objc-checker/TestObjCCheckers.py (2007 of 2182) PASS: lldb-unit :: Utility/./UtilityTests/StringExtractorTest.GetHexBytes_Partial (2008 of 2182) PASS: lldb-api :: lang/cpp/operator-overload/TestOperatorOverload.py (2009 of 2182) PASS: lldb-unit :: Process/gdb-remote/./ProcessGdbRemoteTests/GDBRemoteClientBaseTest.SendContinueAndInterrupt (2010 of 2182) PASS: lldb-api :: lang/objc/objc-new-syntax/TestObjCNewSyntaxLiteral.py (2011 of 2182) PASS: lldb-api :: tools/lldb-vscode/attach/TestVSCode_attach.py (2012 of 2182) PASS: lldb-shell :: Commands/command-script-import.test (2013 of 2182) PASS: lldb-unit :: Symbol/./SymbolTests/TestTypeSystemClang.TestGetBasicTypeFromEnum (2014 of 2182) PASS: lldb-unit :: Process/minidump/./LLDBMinidumpTests/MinidumpParserTest.GetExceptionStream (2015 of 2182) PASS: lldb-api :: commands/gui/breakpoints/TestGuiBreakpoints.py (2016 of 2182) PASS: lldb-api :: commands/expression/test/TestExprs.py (2017 of 2182) PASS: lldb-shell :: Commands/CommandScriptImmediateOutput/CommandScriptImmediateOutputConsole.test (2018 of 2182) PASS: lldb-api :: python_api/watchpoint/TestWatchpointIgnoreCount.py (2019 of 2182) PASS: lldb-unit :: Expression/./ExpressionTests/CppModuleConfigurationTest.Sysroot (2020 of 2182) PASS: lldb-unit :: Utility/./UtilityTests/Flags.Test (2021 of 2182) PASS: lldb-shell :: Breakpoint/split-dwarf-5-addrbase.test (2022 of 2182) PASS: lldb-unit :: UnwindAssembly/PPC64/./PPC64InstEmulationTests/TestPPC64InstEmulation.TestSimpleFunction (2023 of 2182) PASS: lldb-api :: lang/c/complex/TestComplexC99.py (2024 of 2182) PASS: lldb-unit :: Core/./LLDBCoreTests/StreamCallbackTest.Callback (2025 of 2182) PASS: lldb-api :: lang/cpp/gmodules-templates/TestGModules.py (2026 of 2182) PASS: lldb-unit :: SymbolFile/NativePDB/./SymbolFileNativePDBTests/PDBFPOProgramToDWARFExpressionTests.SingleAssignmentRegisterRef (2027 of 2182) PASS: lldb-api :: commands/expression/ir-interpreter-phi-nodes/TestIRInterpreterPHINodes.py (2028 of 2182) PASS: lldb-unit :: Utility/./UtilityTests/StringExtractorTest.InitEmpty (2029 of 2182) PASS: lldb-api :: functionalities/exec/TestExec.py (2030 of 2182) PASS: lldb-unit :: Utility/./UtilityTests/ArgsTest.TestArgv (2031 of 2182) PASS: lldb-shell :: Breakpoint/debug_addrx.test (2032 of 2182) PASS: lldb-unit :: Utility/./UtilityTests/ArgsTest.TestAppendArg (2033 of 2182) PASS: lldb-unit :: UnwindAssembly/x86/./UnwindAssemblyx86Tests/Testx86AssemblyInspectionEngine.TestPushR13 (2034 of 2182) PASS: lldb-unit :: Interpreter/./InterpreterTests/OptionArgParserTest.toChar (2035 of 2182) PASS: lldb-shell :: Minidump/breakpad-symbols.test (2036 of 2182) PASS: lldb-unit :: Signals/./SignalsTests/UnixSignalsTest.GetFilteredSignals (2037 of 2182) PASS: lldb-unit :: Utility/./UtilityTests/StringExtractorTest.GetHexBytesAvail (2038 of 2182) PASS: lldb-shell :: ObjectFile/ELF/section-types.yaml (2039 of 2182) PASS: lldb-api :: lang/cpp/bitfields/TestCppBitfields.py (2040 of 2182) PASS: lldb-api :: functionalities/breakpoint/cpp_exception/TestCPPExceptionBreakpoint.py (2041 of 2182) PASS: lldb-unit :: DataFormatter/./LLDBFormatterTests/FormatManagerTests.CompatibleLangs (2042 of 2182) PASS: lldb-api :: functionalities/unwind/noreturn/TestNoreturnUnwind.py (2043 of 2182) PASS: lldb-unit :: Utility/./UtilityTests/StreamTest.AddressRange (2044 of 2182) PASS: lldb-api :: commands/target/select/TestTargetSelect.py (2045 of 2182) PASS: lldb-api :: python_api/breakpoint/TestBreakpointAPI.py (2046 of 2182) PASS: lldb-unit :: Utility/./UtilityTests/StringExtractorTest.GetHexU8_Exact_NoEof (2047 of 2182) UNSUPPORTED: lldb-api :: functionalities/data-formatter/data-formatter-stl/libstdcpp/unique_ptr/TestDataFormatterStdUniquePtr.py (2048 of 2182) PASS: lldb-api :: commands/expression/cast_int_to_anonymous_enum/TestCastIntToAnonymousEnum.py (2049 of 2182) PASS: lldb-unit :: Utility/./UtilityTests/RangeTest.DoesIntersect (2050 of 2182) PASS: lldb-shell :: SymbolFile/DWARF/dwp-separate-debug-file.cpp (2051 of 2182) UNSUPPORTED: lldb-shell :: SymbolFile/PDB/class-layout.test (2052 of 2182) PASS: lldb-unit :: Expression/./ExpressionTests/DiagnosticManagerTest.GetStringPreserveOrder (2053 of 2182) PASS: lldb-unit :: UnwindAssembly/x86/./UnwindAssemblyx86Tests/Testx86AssemblyInspectionEngine.TestSubESP (2054 of 2182) PASS: lldb-api :: commands/settings/TestSettings.py (2055 of 2182) PASS: lldb-unit :: Host/./HostTests/FileSystemTest.Readable (2056 of 2182) PASS: lldb-unit :: Language/Highlighting/./HighlighterTests/HighlighterTest.ClangCursorOutOfBounds (2057 of 2182) PASS: lldb-unit :: Utility/./UtilityTests/StreamTest.AddressSize (2058 of 2182) PASS: lldb-unit :: Expression/./ExpressionTests/CppModuleConfigurationTest.Linux (2059 of 2182) PASS: lldb-api :: python_api/frame/get-variables/TestGetVariables.py (2060 of 2182) PASS: lldb-api :: commands/expression/import-std-module/pair/TestPairFromStdModule.py (2061 of 2182) PASS: lldb-unit :: Utility/./UtilityTests/FileSpecTest.Yaml (2062 of 2182) PASS: lldb-unit :: Utility/./UtilityTests/ScalarTest.GetBytes (2063 of 2182) PASS: lldb-shell :: SymbolFile/Breakpad/unwind-via-raSearch.test (2064 of 2182) PASS: lldb-api :: python_api/section/TestSectionAPI.py (2065 of 2182) PASS: lldb-api :: lang/objc/self/TestObjCSelf.py (2066 of 2182) PASS: lldb-api :: functionalities/data-formatter/data-formatter-objc/TestDataFormatterObjCNSDate.py (2067 of 2182) PASS: lldb-api :: lang/cpp/trivial_abi/TestTrivialABI.py (2068 of 2182) PASS: lldb-api :: python_api/thread/TestThreadAPI.py (2069 of 2182) UNSUPPORTED: lldb-api :: functionalities/thread/create_during_step/TestCreateDuringStep.py (2070 of 2182) PASS: lldb-shell :: Commands/command-disassemble-process.yaml (2071 of 2182) PASS: lldb-shell :: Reproducer/TestWorkingDir.test (2072 of 2182) PASS: lldb-unit :: Expression/./ExpressionTests/CppModuleConfigurationTest.MissingUsrInclude (2073 of 2182) PASS: lldb-unit :: Utility/./UtilityTests/StringExtractorTest.GetHexBytes_Underflow (2074 of 2182) PASS: lldb-unit :: SymbolFile/NativePDB/./SymbolFileNativePDBTests/PDBFPOProgramToDWARFExpressionTests.UnresolvedDependentCyclicRegisterAssignmentReference (2075 of 2182) PASS: lldb-api :: functionalities/tsan/global_location/TestTsanGlobalLocation.py (2076 of 2182) PASS: lldb-unit :: Target/./TargetTests/PathMappingListTest.RelativeTests (2077 of 2182) PASS: lldb-unit :: Utility/./UtilityTests/ProcessInstanceInfo.Dump (2078 of 2182) PASS: lldb-unit :: Host/./HostTests/NativeProcessProtocolTest.ReadMemoryWithoutTrap (2079 of 2182) PASS: lldb-shell :: SymbolFile/DWARF/anon_class_w_and_wo_export_symbols.ll (2080 of 2182) PASS: lldb-api :: functionalities/data-formatter/data-formatter-stl/libcxx/multimap/TestDataFormatterLibccMultiMap.py (2081 of 2182) PASS: lldb-api :: lang/cpp/call-function/TestCallCPPFunction.py (2082 of 2182) PASS: lldb-shell :: Reproducer/TestDriverOptions.test (2083 of 2182) PASS: lldb-shell :: Driver/TestSingleQuote.test (2084 of 2182) PASS: lldb-api :: iohandler/resize/TestIOHandlerResize.py (2085 of 2182) PASS: lldb-shell :: SymbolFile/NativePDB/nested-types.cpp (2086 of 2182) PASS: lldb-unit :: Utility/./UtilityTests/StreamTeeTest.CopyConstructor (2087 of 2182) PASS: lldb-api :: functionalities/data-formatter/data-formatter-stl/libcxx/unordered/TestDataFormatterUnordered.py (2088 of 2182) PASS: lldb-unit :: Utility/./UtilityTests/StringListTest.LongestCommonPrefixEmpty (2089 of 2182) UNSUPPORTED: lldb-api :: tools/lldb-server/thread-name/TestGdbRemoteThreadName.py (2090 of 2182) UNSUPPORTED: lldb-api :: tools/lldb-server/platform-process-connect/TestPlatformProcessConnect.py (2091 of 2182) PASS: lldb-api :: lang/objc/foundation/TestRuntimeTypes.py (2092 of 2182) PASS: lldb-api :: functionalities/data-formatter/refpointer-recursion/TestDataFormatterRefPtrRecursion.py (2093 of 2182) PASS: lldb-unit :: Utility/./UtilityTests/ArchSpecTest.TestSetTriple (2094 of 2182) PASS: lldb-shell :: Breakpoint/ppc64-localentry.test (2095 of 2182) PASS: lldb-api :: commands/expression/rdar42038760/TestScalarURem.py (2096 of 2182) UNSUPPORTED: lldb-shell :: SymbolFile/PDB/expressions.test (2097 of 2182) PASS: lldb-unit :: UnwindAssembly/x86/./UnwindAssemblyx86Tests/Testx86AssemblyInspectionEngine.TestPopR14 (2098 of 2182) UNSUPPORTED: lldb-api :: functionalities/darwin_log/filter/exact_match/activity-chain/TestDarwinLogFilterMatchActivityChain.py (2099 of 2182) PASS: lldb-unit :: UnwindAssembly/x86/./UnwindAssemblyx86Tests/Testx86AssemblyInspectionEngine.TestSimplex86_64Augmented (2100 of 2182) PASS: lldb-unit :: SymbolFile/DWARF/./SymbolFileDWARFTests/SymbolFileDWARFTests.TestAbbrevInvalidNULLTag (2101 of 2182) PASS: lldb-api :: functionalities/data-formatter/nsarraysynth/TestNSArraySynthetic.py (2102 of 2182) PASS: lldb-api :: commands/breakpoint/set/func-regex/TestBreakpointRegexError.py (2103 of 2182) PASS: lldb-unit :: Utility/./UtilityTests/BinaryStreamTest.PutULEB128Zero (2104 of 2182) PASS: lldb-api :: lang/c/modules/TestCModules.py (2105 of 2182) PASS: lldb-unit :: Utility/./UtilityTests/UserIDResolver.GetGroupName (2106 of 2182) PASS: lldb-api :: functionalities/breakpoint/breakpoint_command/TestRegexpBreakCommand.py (2107 of 2182) PASS: lldb-unit :: UnwindAssembly/ARM64/./Arm64InstEmulationTests/TestArm64InstEmulation.TestSimpleDarwinFunction (2108 of 2182) PASS: lldb-unit :: Utility/./UtilityTests/FileSpecTest.EqualDotsPosix (2109 of 2182) PASS: lldb-unit :: Host/./HostTests/SocketTests/SocketTest.TCPGetConnectURI/ipv6 (2110 of 2182) UNSUPPORTED: lldb-api :: functionalities/darwin_log/filter/exact_match/message/TestDarwinLogFilterMatchMessage.py (2111 of 2182) UNSUPPORTED: lldb-shell :: Register/x86-64-zmm-write.test (2112 of 2182) PASS: lldb-unit :: Utility/./UtilityTests/RegularExpression.Match (2113 of 2182) PASS: lldb-unit :: Utility/./UtilityTests/StreamTest.AddressSuffix (2114 of 2182) UNSUPPORTED: lldb-api :: lang/objc/rdar-12408181/TestRdar12408181.py (2115 of 2182) PASS: lldb-unit :: UnwindAssembly/x86/./UnwindAssemblyx86Tests/Testx86AssemblyInspectionEngine.TestPushEDI (2116 of 2182) PASS: lldb-api :: api/command-return-object/TestSBCommandReturnObject.py (2117 of 2182) PASS: lldb-shell :: Breakpoint/implicit_const_form_support.test (2118 of 2182) UNSUPPORTED: lldb-shell :: Register/x86-ymm-write.test (2119 of 2182) PASS: lldb-api :: tools/lldb-vscode/breakpoint/TestVSCode_setBreakpoints.py (2120 of 2182) UNSUPPORTED: lldb-api :: tools/lldb-server/signal-filtering/TestGdbRemote_QPassSignals.py (2121 of 2182) PASS: lldb-unit :: UnwindAssembly/x86/./UnwindAssemblyx86Tests/Testx86AssemblyInspectionEngine.TestPushEDX (2122 of 2182) PASS: lldb-shell :: Reproducer/TestCrash.test (2123 of 2182) PASS: lldb-api :: functionalities/gdb_remote_client/TestTargetXMLArch.py (2124 of 2182) PASS: lldb-unit :: Utility/./UtilityTests/StringExtractorTest.DecodeHexU8_Exact (2125 of 2182) UNSUPPORTED: lldb-api :: commands/register/register/intel_xtended_registers/TestMPXRegisters.py (2126 of 2182) PASS: lldb-unit :: Utility/./UtilityTests/StringListTest.CopyListSingle (2127 of 2182) PASS: lldb-unit :: Utility/./UtilityTests/ArgsTest.GetArgumentArrayRef (2128 of 2182) PASS: lldb-unit :: Utility/./UtilityTests/StringListTest.JoinEmpty (2129 of 2182) PASS: lldb-api :: functionalities/target_var/no_vars/TestTargetVarNoVars.py (2130 of 2182) PASS: lldb-api :: lang/cpp/constructors/TestCppConstructors.py (2131 of 2182) PASS: lldb-unit :: Utility/./UtilityTests/UserIDResolver.GetUserName (2132 of 2182) PASS: lldb-api :: python_api/process/TestProcessAPI.py (2133 of 2182) PASS: lldb-unit :: Utility/./UtilityTests/ScalarTest.ComparisonFloat (2134 of 2182) PASS: lldb-unit :: Utility/./UtilityTests/StreamTest.PutCString (2135 of 2182) PASS: lldb-unit :: Symbol/./SymbolTests/LineEntryTest.GetSameLineContiguousAddressRangeNoInlines (2136 of 2182) PASS: lldb-shell :: Minidump/disassemble-no-module.yaml (2137 of 2182) PASS: lldb-unit :: Host/./HostTests/SocketTests/SocketTest.TCPListen0ConnectAccept/ipv4 (2138 of 2182) PASS: lldb-unit :: Utility/./UtilityTests/StringExtractorTest.GetHexU8_Exact (2139 of 2182) PASS: lldb-unit :: Utility/./UtilityTests/BroadcasterTest.BroadcastEvent (2140 of 2182) UNSUPPORTED: lldb-shell :: ScriptInterpreter/Lua/io.test (2141 of 2182) PASS: lldb-shell :: ObjectFile/PECOFF/basic-info-arm.yaml (2142 of 2182) PASS: lldb-unit :: Utility/./UtilityTests/UriParserTest.BracketedHostnameWithColon (2143 of 2182) PASS: lldb-api :: functionalities/data-formatter/builtin-formats/TestBuiltinFormats.py (2144 of 2182) PASS: lldb-api :: commands/target/stop-hooks/TestStopHooks.py (2145 of 2182) PASS: lldb-api :: api/multiple-targets/TestMultipleTargets.py (2146 of 2182) PASS: lldb-unit :: Utility/./UtilityTests/CompletionRequest.TryCompleteCurrentArgBad (2147 of 2182) PASS: lldb-unit :: Utility/./UtilityTests/RecordReplayTest.InstrumentedBarPtr (2148 of 2182) PASS: lldb-unit :: UnwindAssembly/x86/./UnwindAssemblyx86Tests/Testx86AssemblyInspectionEngine.TestStackRealignMSVC_i386 (2149 of 2182) PASS: lldb-api :: functionalities/thread/concurrent_events/TestConcurrentCrashWithWatchpoint.py (2150 of 2182) PASS: lldb-api :: python_api/watchpoint/TestWatchpointIter.py (2151 of 2182) PASS: lldb-api :: lang/cpp/gmodules/TestWithModuleDebugging.py (2152 of 2182) PASS: lldb-api :: tools/lldb-server/TestGdbRemoteExpeditedRegisters.py (2153 of 2182) PASS: lldb-api :: types/TestFloatTypes.py (2154 of 2182) UNSUPPORTED: lldb-shell :: Unwind/eh-frame-small-fde.test (2155 of 2182) PASS: lldb-shell :: Register/x86-64-ymm-read.test (2156 of 2182) PASS: lldb-api :: functionalities/postmortem/minidump-new/TestMiniDumpNew.py (2157 of 2182) PASS: lldb-shell :: Recognizer/assert.test (2158 of 2182) PASS: lldb-unit :: Utility/./UtilityTests/ProcessInstanceInfo.Yaml (2159 of 2182) PASS: lldb-api :: commands/platform/process/list/TestProcessList.py (2160 of 2182) PASS: lldb-api :: lang/objc/rdar-11355592/TestRdar11355592.py (2161 of 2182) PASS: lldb-unit :: Utility/./UtilityTests/XcodeSDKTest.SDKSupportsSwift (2162 of 2182) PASS: lldb-api :: functionalities/dynamic_value_child_count/TestDynamicValueChildCount.py (2163 of 2182) PASS: lldb-api :: functionalities/breakpoint/auto_continue/TestBreakpointAutoContinue.py (2164 of 2182) PASS: lldb-api :: tools/lldb-server/TestGdbRemoteProcessInfo.py (2165 of 2182) PASS: lldb-api :: functionalities/data-formatter/data-formatter-objc/TestDataFormatterObjCKVO.py (2166 of 2182) PASS: lldb-api :: functionalities/data-formatter/format-propagation/TestFormatPropagation.py (2167 of 2182) PASS: lldb-shell :: Reproducer/TestPythonImport.test (2168 of 2182) PASS: lldb-api :: functionalities/multidebugger_commands/TestMultipleDebuggersCommands.py (2169 of 2182) PASS: lldb-api :: lang/cpp/unique-types/TestUniqueTypes.py (2170 of 2182) UNSUPPORTED: lldb-api :: functionalities/darwin_log/source/info/TestDarwinLogSourceInfo.py (2171 of 2182) PASS: lldb-unit :: Expression/./ExpressionTests/CppModuleConfigurationTest.MissingLibCpp (2172 of 2182) UNSUPPORTED: lldb-shell :: SymbolFile/PDB/typedefs.test (2173 of 2182) PASS: lldb-unit :: Utility/./UtilityTests/StreamTest.AddressPrefix (2174 of 2182) PASS: lldb-unit :: DataFormatter/./LLDBFormatterTests/TypeMatcherTests.RegexName (2175 of 2182) PASS: lldb-shell :: ObjectFile/ELF/PT_LOAD.yaml (2176 of 2182) PASS: lldb-shell :: ObjectFile/MachO/lc_build_version_notools.yaml (2177 of 2182) PASS: lldb-api :: functionalities/data-formatter/vector-types/TestVectorTypesFormatting.py (2178 of 2182) PASS: lldb-shell :: Driver/TestError.test (2179 of 2182) PASS: lldb-shell :: Process/TestEnvironment.test (2180 of 2182) PASS: lldb-api :: lang/c/forward/TestForwardDeclaration.py (2181 of 2182) Cancelling nested steps due to timeout Sending interrupt signal to process ninja: build stopped: interrupted by user. script returned exit code 143 [Pipeline] } [Pipeline] // timeout [Pipeline] } [Pipeline] // stage [Pipeline] stage [Pipeline] { (Declarative: Post Actions) [Pipeline] scanForIssues [Clang (LLVM based)] Sleeping for 5 seconds due to JENKINS-32191... [Clang (LLVM based)] Parsing console log (workspace: '/Users/buildslave/jenkins/workspace/lldb-cmake') [Clang (LLVM based)] Successfully parsed console log [Clang (LLVM based)] -> found 12 issues (skipped 19 duplicates) [Clang (LLVM based)] Post processing issues on 'green-dragon-10' with source code encoding 'UTF-8' [Clang (LLVM based)] Creating SCM blamer to obtain author and commit information for affected files [Clang (LLVM based)] Creating SCM miner to obtain statistics for affected repository files [Clang (LLVM based)] Resolving file names for all issues in source directory '/Users/buildslave/jenkins/workspace/lldb-cmake' [Clang (LLVM based)] -> resolved paths in source directory (9 found, 0 not found) [Clang (LLVM based)] Resolving module names from module definitions (build.xml, pom.xml, or Manifest.mf files) [Clang (LLVM based)] -> resolved module names for 12 issues [Clang (LLVM based)] Resolving package names (or namespaces) by parsing the affected files [Clang (LLVM based)] -> resolved package names of 8 affected files [Clang (LLVM based)] No filter has been set, publishing all 11 issues [Clang (LLVM based)] Creating fingerprints for all affected code blocks to track issues over different builds [Clang (LLVM based)] -> created fingerprints for 11 issues (skipped 0 issues) [Clang (LLVM based)] Copying affected files to Jenkins' build folder '/Users/Shared/Jenkins/Home/jobs/lldb-cmake/builds/24598/files-with-issues' [Clang (LLVM based)] -> 6 copied, 2 not in workspace, 0 not-found, 0 with I/O error [Pipeline] junit Recording test results [Pipeline] emailext Warning: rahmanl@google.com is not a recognized user, but sending mail anyway Warning: zinenko@google.com is not a recognized user, but sending mail anyway Warning: tianshilei1992@gmail.com is not a recognized user, but sending mail anyway Warning: qcolombet@apple.com is not a recognized user, but sending mail anyway Warning: carl.ritson@amd.com is not a recognized user, but sending mail anyway Warning: riddleriver@gmail.com is not a recognized user, but sending mail anyway Warning: jan.kratochvil@redhat.com is not a recognized user, but sending mail anyway Warning: czhengsz@cn.ibm.com is not a recognized user, but sending mail anyway Warning: ravishankarm@google.com is not a recognized user, but sending mail anyway Warning: amy.kwan1@ibm.com is not a recognized user, but sending mail anyway Warning: stephen.neuendorffer@xilinx.com is not a recognized user, but sending mail anyway Warning: tu.da.wei@gmail.com is not a recognized user, but sending mail anyway Warning: Stanislav.Mekhanoshin@amd.com is not a recognized user, but sending mail anyway Warning: chandlerc@gmail.com is not a recognized user, but sending mail anyway Warning: richard@metafoo.co.uk is not a recognized user, but sending mail anyway Warning: n.james93@hotmail.co.uk is not a recognized user, but sending mail anyway Warning: gjn@google.com is not a recognized user, but sending mail anyway Warning: craig.topper@intel.com is not a recognized user, but sending mail anyway Warning: akhuang@google.com is not a recognized user, but sending mail anyway Warning: zequanwu@google.com is not a recognized user, but sending mail anyway Warning: tu.da.wei@gmail.com is not a recognized user, but sending mail anyway Warning: chandlerc@gmail.com is not a recognized user, but sending mail anyway Warning: tianshilei1992@gmail.com is not a recognized user, but sending mail anyway Warning: carl.ritson@amd.com is not a recognized user, but sending mail anyway Warning: craig.topper@intel.com is not a recognized user, but sending mail anyway Warning: riddleriver@gmail.com is not a recognized user, but sending mail anyway Warning: czhengsz@cn.ibm.com is not a recognized user, but sending mail anyway

Hide Details

Begin Pre-Send Script... Sending email to: Akira Hatanaka <ahatanaka@apple.com> Akira Hatanaka <ahatanaka@apple.com> Azhar Mohammed <azhar@apple.com>
[Pipeline] } [Pipeline] // stage [Pipeline] } [Pipeline] // withEnv [Pipeline] } [Pipeline] // node [Pipeline] End of Pipeline [Checks API] No suitable checks publisher found. Timeout has been exceeded Finished: ABORTED