AbortedConsole Output

Skipping 8,163 KB.. Full Log
AppendingPathComponent (639 of 2142)
UNSUPPORTED: lldb-shell :: Register/x86-64-xmm16-read.test (640 of 2142)
PASS: lldb-api :: functionalities/thread/concurrent_events/TestConcurrentTwoWatchpointsOneBreakpoint.py (641 of 2142)
PASS: lldb-api :: commands/expression/namespace_local_var_same_name_obj_c/TestNamespaceLocalVarSameNameObjC.py (642 of 2142)
PASS: lldb-api :: tools/lldb-server/inferior-crash/TestGdbRemoteAbort.py (643 of 2142)
PASS: lldb-unit :: Utility/./UtilityTests/LogTest.Unregister (644 of 2142)
UNSUPPORTED: lldb-api :: functionalities/process_save_core/TestProcessSaveCore.py (645 of 2142)
UNSUPPORTED: lldb-api :: benchmarks/expression/TestRepeatedExprs.py (646 of 2142)
PASS: lldb-shell :: ObjectFile/ELF/PT_TLS-overlap-PT_LOAD.yaml (647 of 2142)
PASS: lldb-shell :: SymbolFile/NativePDB/function-types-classes.cpp (648 of 2142)
PASS: lldb-api :: commands/expression/persistent_types/TestPersistentTypes.py (649 of 2142)
PASS: lldb-unit :: Symbol/./SymbolTests/DWARFCallFrameInfoTest.Basic_dwarf4 (650 of 2142)
PASS: lldb-unit :: Utility/./UtilityTests/AnsiTerminal.KnownPrefix (651 of 2142)
PASS: lldb-unit :: Expression/./ExpressionTests/DiagnosticManagerTest.FixedExpression (652 of 2142)
PASS: lldb-unit :: Utility/./UtilityTests/StringListTest.GetMaxStringLengthMixed (653 of 2142)
PASS: lldb-shell :: SymbolFile/NativePDB/ast-types.cpp (654 of 2142)
PASS: lldb-unit :: Utility/./UtilityTests/BinaryStreamTest.PutSLEB128SixBytes (655 of 2142)
PASS: lldb-unit :: Utility/./UtilityTests/UriParserTest.BadPort2 (656 of 2142)
PASS: lldb-api :: functionalities/tail_call_frames/thread_step_out_message/TestArtificialFrameStepOutMessage.py (657 of 2142)
UNSUPPORTED: lldb-api :: linux/sepdebugsymlink/TestTargetSymbolsSepDebugSymlink.py (658 of 2142)
PASS: lldb-api :: functionalities/dynamic_value_child_count/TestDynamicValueChildCount.py (659 of 2142)
PASS: lldb-unit :: Utility/./UtilityTests/Flags.Clear (660 of 2142)
PASS: lldb-unit :: UnwindAssembly/x86/./UnwindAssemblyx86Tests/Testx86AssemblyInspectionEngine.TestLEAVE (661 of 2142)
PASS: lldb-unit :: Utility/./UtilityTests/StringExtractorTest.GetHexBytesAvail_OddPair2 (662 of 2142)
UNSUPPORTED: lldb-api :: functionalities/data-formatter/data-formatter-stl/libstdcpp/string/TestDataFormatterStdString.py (663 of 2142)
PASS: lldb-api :: commands/expression/diagnostics/TestExprDiagnostics.py (664 of 2142)
PASS: lldb-unit :: Utility/./UtilityTests/OptionsWithRawTest.EmptyArgsOnlySuffix (665 of 2142)
PASS: lldb-api :: iohandler/resize/TestIOHandlerResizeNoEditline.py (666 of 2142)
PASS: lldb-unit :: Utility/./UtilityTests/NameMatchesTest.RegularExpression (667 of 2142)
PASS: lldb-api :: lang/objc/foundation/TestObjCMethodsString.py (668 of 2142)
PASS: lldb-unit :: Target/./TargetTests/ExecutionContextTest.GetByteOrder (669 of 2142)
PASS: lldb-shell :: ObjectFile/ELF/minidebuginfo-corrupt-xz.yaml (670 of 2142)
PASS: lldb-unit :: Utility/./UtilityTests/ScalarTest.APIntConstructor (671 of 2142)
PASS: lldb-unit :: Utility/./UtilityTests/VASprintfTest.BufferResize (672 of 2142)
PASS: lldb-api :: api/log/TestAPILog.py (673 of 2142)
PASS: lldb-unit :: Core/./LLDBCoreTests/StreamCallbackTest.Callback (674 of 2142)
PASS: lldb-unit :: Utility/./UtilityTests/VMRange.CollectionContains (675 of 2142)
PASS: lldb-unit :: debugserver/./debugserverTests/RNBSocket.LoopBackListenIPv6 (676 of 2142)
UNSUPPORTED: lldb-shell :: SymbolFile/NativePDB/stack_unwinding01.cpp (677 of 2142)
PASS: lldb-shell :: Expr/TestMultilineExpr.test (678 of 2142)
PASS: lldb-unit :: Utility/./UtilityTests/StreamTest.ShiftOperatorPtr (679 of 2142)
PASS: lldb-api :: functionalities/data-formatter/data-formatter-objc/TestDataFormatterObjCNSContainer.py (680 of 2142)
PASS: lldb-api :: commands/expression/top-level/TestTopLevelExprs.py (681 of 2142)
PASS: lldb-unit :: Utility/./UtilityTests/StringListTest.AppendStringMove (682 of 2142)
PASS: lldb-unit :: ScriptInterpreter/Python/./ScriptInterpreterPythonTests/PythonDataObjectsTest.TestResetting (683 of 2142)
PASS: lldb-api :: functionalities/thread/concurrent_events/TestConcurrentCrashWithWatchpoint.py (684 of 2142)
PASS: lldb-unit :: DataFormatter/./LLDBFormatterTests/StringPrinterTests.CxxASCII (685 of 2142)
PASS: lldb-api :: functionalities/process_crash_info/TestProcessCrashInfo.py (686 of 2142)
UNSUPPORTED: lldb-shell :: SymbolFile/PDB/type-quals.test (687 of 2142)
PASS: lldb-api :: python_api/watchpoint/TestSetWatchpoint.py (688 of 2142)
PASS: lldb-unit :: Utility/./UtilityTests/StreamTest.PutNHex8 (689 of 2142)
PASS: lldb-api :: functionalities/breakpoint/debugbreak/TestDebugBreak.py (690 of 2142)
PASS: lldb-api :: python_api/sbenvironment/TestSBEnvironment.py (691 of 2142)
PASS: lldb-unit :: Utility/./UtilityTests/RangeDataVector.FindEntryThatContains (692 of 2142)
PASS: lldb-unit :: Core/./LLDBCoreTests/MangledTest.EmptyForInvalidName (693 of 2142)
PASS: lldb-api :: functionalities/thread/concurrent_events/TestConcurrentManyCrash.py (694 of 2142)
PASS: lldb-unit :: ObjectFile/Breakpad/./ObjectFileBreakpadTests/InfoRecord.parse (695 of 2142)
PASS: lldb-api :: commands/expression/codegen-crash-typedefdecl-not-in_declcontext/TestCodegenCrashTypedefDeclNotInDeclContext.py (696 of 2142)
PASS: lldb-api :: functionalities/data-formatter/data-formatter-stl/libcxx/unique_ptr/TestDataFormatterLibcxxUniquePtr.py (697 of 2142)
PASS: lldb-api :: functionalities/thread/backtrace_all/TestBacktraceAll.py (698 of 2142)
PASS: lldb-shell :: ObjectFile/wasm/unified-debug-sections.yaml (699 of 2142)
PASS: lldb-unit :: Utility/./UtilityTests/ScalarTest.Promotion (700 of 2142)
PASS: lldb-shell :: Breakpoint/debug_rnglist_offset_pair.test (701 of 2142)
UNSUPPORTED: lldb-api :: functionalities/thread/break_after_join/TestBreakAfterJoin.py (702 of 2142)
PASS: lldb-api :: macosx/thread-names/TestInterruptThreadNames.py (703 of 2142)
PASS: lldb-api :: lang/cpp/breakpoint_in_member_func_w_non_primitive_params/TestBreakpointInMemberFuncWNonPrimitiveParams.py (704 of 2142)
PASS: lldb-shell :: Reproducer/TestDiscard.test (705 of 2142)
UNSUPPORTED: lldb-shell :: SymbolFile/PDB/enums-layout.test (706 of 2142)
PASS: lldb-api :: functionalities/data-formatter/data-formatter-objc/TestDataFormatterObjCNSDate.py (707 of 2142)
PASS: lldb-api :: functionalities/data-formatter/data-formatter-stl/libcxx/set/TestDataFormatterLibcxxSet.py (708 of 2142)
PASS: lldb-unit :: UnwindAssembly/x86/./UnwindAssemblyx86Tests/Testx86AssemblyInspectionEngine.Test32bitFramelessSmallStackFrame (709 of 2142)
PASS: lldb-api :: python_api/formatters/TestFormattersSBAPI.py (710 of 2142)
UNSUPPORTED: lldb-api :: lang/cpp/static_members/TestCPPStaticMembers.py (711 of 2142)
PASS: lldb-api :: macosx/safe-to-func-call/TestSafeFuncCalls.py (712 of 2142)
PASS: lldb-api :: functionalities/data-formatter/data-formatter-objc/nsstring/TestDataFormatterNSString.py (713 of 2142)
PASS: lldb-api :: arm/emulation/TestEmulations.py (714 of 2142)
PASS: lldb-api :: lang/cpp/typedef/TestCppTypedef.py (715 of 2142)
PASS: lldb-shell :: SymbolFile/DWARF/static_scope.s (716 of 2142)
PASS: lldb-unit :: Utility/./UtilityTests/DataExtractorTest.GetDouble (717 of 2142)
PASS: lldb-unit :: Process/minidump/./LLDBMinidumpTests/RegisterContextMinidump.CheckRegisterContextMinidump_ARM (718 of 2142)
PASS: lldb-api :: functionalities/object-file/TestImageListMultiArchitecture.py (719 of 2142)
PASS: lldb-api :: functionalities/data-formatter/synthcapping/TestSyntheticCapping.py (720 of 2142)
PASS: lldb-api :: lang/cpp/alignas_base_class/TestAlignAsBaseClass.py (721 of 2142)
PASS: lldb-shell :: ObjectFile/PECOFF/dep-modules.yaml (722 of 2142)
PASS: lldb-shell :: SymbolFile/NativePDB/global-classes.cpp (723 of 2142)
PASS: lldb-unit :: ScriptInterpreter/Python/./ScriptInterpreterPythonTests/PythonDataObjectsTest.TestPythonDictionaryManipulation (724 of 2142)
PASS: lldb-api :: functionalities/gdb_remote_client/TestRecognizeBreakpoint.py (725 of 2142)
PASS: lldb-unit :: Utility/./UtilityTests/StringLexerTest.Next (726 of 2142)
UNSUPPORTED: lldb-api :: lang/objc/objc-dynamic-value/TestObjCDynamicValue.py (727 of 2142)
PASS: lldb-api :: functionalities/limit-debug-info/TestLimitDebugInfo.py (728 of 2142)
PASS: lldb-unit :: Utility/./UtilityTests/LogChannelEnabledTest.LLDB_LOG_ERROR (729 of 2142)
UNSUPPORTED: lldb-shell :: Register/arm-fp-read.test (730 of 2142)
PASS: lldb-shell :: ObjectFile/MachO/lc_build_version.yaml (731 of 2142)
PASS: lldb-unit :: Utility/./UtilityTests/StringListTest.AppendListCStringArrayEmpty (732 of 2142)
PASS: lldb-unit :: Utility/./UtilityTests/ArchSpecTest.YAML (733 of 2142)
PASS: lldb-unit :: Utility/./UtilityTests/FileSpecTest.EqualDotsWindows (734 of 2142)
PASS: lldb-unit :: Process/gdb-remote/./ProcessGdbRemoteTests/GDBRemoteCommunicationServerTest.SendErrorResponse_ErrorList (735 of 2142)
PASS: lldb-shell :: Commands/command-disassemble.s (736 of 2142)
PASS: lldb-shell :: Reproducer/Functionalities/TestStepping.test (737 of 2142)
UNSUPPORTED: lldb-api :: lang/cpp/printf/TestPrintf.py (738 of 2142)
UNSUPPORTED: lldb-shell :: SymbolFile/NativePDB/ast-functions-msvc.cpp (739 of 2142)
PASS: lldb-api :: lang/c/blocks/TestBlocks.py (740 of 2142)
PASS: lldb-api :: lang/cpp/constructors/TestCppConstructors.py (741 of 2142)
PASS: lldb-shell :: SymbolFile/DWARF/find-qualified-variable.cpp (742 of 2142)
PASS: lldb-shell :: Minidump/breakpad-symbols.test (743 of 2142)
PASS: lldb-api :: lang/mixed/TestMixedLanguages.py (744 of 2142)
PASS: lldb-api :: lang/cpp/type_lookup/TestCppTypeLookup.py (745 of 2142)
PASS: lldb-api :: python_api/watchpoint/condition/TestWatchpointConditionAPI.py (746 of 2142)
PASS: lldb-unit :: Utility/./UtilityTests/TimeoutTest.Format (747 of 2142)
PASS: lldb-unit :: Utility/./UtilityTests/LogTest.Register (748 of 2142)
PASS: lldb-unit :: UnwindAssembly/x86/./UnwindAssemblyx86Tests/Testx86AssemblyInspectionEngine.TestPushEAX (749 of 2142)
PASS: lldb-unit :: Utility/./UtilityTests/SerializationRountripTest.SerializeDeserializeObjectReference (750 of 2142)
PASS: lldb-unit :: Utility/./UtilityTests/ScalarTest.SetValueFromCString (751 of 2142)
PASS: lldb-unit :: SymbolFile/NativePDB/./SymbolFileNativePDBTests/PDBFPOProgramToDWARFExpressionTests.SingleAssignmentRegisterRef (752 of 2142)
PASS: lldb-unit :: Process/minidump/./LLDBMinidumpTests/MinidumpParserTest.MinidumpModuleOrder (753 of 2142)
PASS: lldb-unit :: Interpreter/./InterpreterTests/OptionArgParserTest.toScriptLanguage (754 of 2142)
PASS: lldb-unit :: Utility/./UtilityTests/RangeTest.DoesAdjoinOrIntersect (755 of 2142)
PASS: lldb-shell :: ObjectFile/ELF/section-types-edgecases.yaml (756 of 2142)
PASS: lldb-shell :: Reproducer/TestReuseDirectory.test (757 of 2142)
PASS: lldb-unit :: Target/./TargetTests/MCBasedABI.MapRegisterName (758 of 2142)
PASS: lldb-unit :: Utility/./UtilityTests/StringListTest.InsertStringAtIndexEnd (759 of 2142)
PASS: lldb-shell :: Minidump/dump-all.test (760 of 2142)
PASS: lldb-unit :: SymbolFile/DWARF/./SymbolFileDWARFTests/SymbolFileDWARFTests.TestAbbrevNullAttrValidForm (761 of 2142)
PASS: lldb-api :: lang/cpp/template-specialization-type/TestTemplateSpecializationType.py (762 of 2142)
UNSUPPORTED: lldb-api :: commands/expression/completion-crash-invalid-iterator/TestInvalidIteratorCompletionCrash.py (763 of 2142)
UNSUPPORTED: lldb-shell :: Register/arm-gp-read.test (764 of 2142)
PASS: lldb-api :: commands/frame/diagnose/virtual-method-call/TestDiagnoseDereferenceVirtualMethodCall.py (765 of 2142)
PASS: lldb-unit :: Language/Highlighting/./HighlighterTests/HighlighterTest.DefaultHighlighterWithCursorOutOfBounds (766 of 2142)
PASS: lldb-api :: tools/lldb-server/TestGdbRemoteProcessInfo.py (767 of 2142)
PASS: lldb-api :: functionalities/breakpoint/cpp_exception/TestCPPExceptionBreakpoint.py (768 of 2142)
PASS: lldb-shell :: Breakpoint/debug_addrx.test (769 of 2142)
PASS: lldb-api :: macosx/function-starts/TestFunctionStarts.py (770 of 2142)
PASS: lldb-unit :: Utility/./UtilityTests/XcodeSDKTest.GetCanonicalNameAndConstruct (771 of 2142)
PASS: lldb-shell :: Driver/TestCore.test (772 of 2142)
PASS: lldb-api :: lang/cpp/virtual-overload/TestVirtualOverload.py (773 of 2142)
PASS: lldb-api :: tools/lldb-vscode/breakpoint/TestVSCode_setBreakpoints.py (774 of 2142)
PASS: lldb-unit :: ScriptInterpreter/Python/./ScriptInterpreterPythonTests/PythonDataObjectsTest.TestPythonIntegerToStr (775 of 2142)
PASS: lldb-unit :: Utility/./UtilityTests/NameMatchesTest.Ignore (776 of 2142)
PASS: lldb-api :: functionalities/thread/concurrent_events/TestConcurrentSignalWatchBreak.py (777 of 2142)
PASS: lldb-unit :: Utility/./UtilityTests/DataExtractorTest.GetCStrUnterminated (778 of 2142)
PASS: lldb-unit :: Utility/./UtilityTests/StringListTest.SetSize (779 of 2142)
PASS: lldb-unit :: Utility/./UtilityTests/ProcessInstanceInfo.Dump (780 of 2142)
PASS: lldb-api :: lang/objc/foundation/TestObjCMethods2.py (781 of 2142)
PASS: lldb-api :: commands/expression/import-std-module/vector-bool/TestVectorBoolFromStdModule.py (782 of 2142)
PASS: lldb-shell :: SymbolFile/Breakpad/unwind-via-stack-cfi.test (783 of 2142)
PASS: lldb-api :: functionalities/data-formatter/data-formatter-stl/libcxx/optional/TestDataFormatterLibcxxOptional.py (784 of 2142)
PASS: lldb-shell :: SymbolFile/Breakpad/line-table-edgecases.test (785 of 2142)
PASS: lldb-shell :: ObjectFile/Breakpad/uuid-matching-mac.test (786 of 2142)
PASS: lldb-unit :: Utility/./UtilityTests/ArchSpecTest.Compatibility (787 of 2142)
PASS: lldb-api :: lang/objc/objc-builtin-types/TestObjCBuiltinTypes.py (788 of 2142)
PASS: lldb-unit :: Utility/./UtilityTests/StringExtractorTest.GetHexBytes_OddPair (789 of 2142)
PASS: lldb-api :: functionalities/breakpoint/breakpoint_language/TestBreakpointLanguage.py (790 of 2142)
PASS: lldb-unit :: Utility/./UtilityTests/BinaryStreamTest.PutULEB128OneByte (791 of 2142)
PASS: lldb-unit :: Expression/./ExpressionTests/DWARFExpression.DW_OP_stack_value (792 of 2142)
PASS: lldb-unit :: Platform/./LLDBPlatformTests/PlatformDarwinTest.TestParseVersionBuildDir (793 of 2142)
PASS: lldb-api :: functionalities/gdb_remote_client/TestGDBRemoteLoad.py (794 of 2142)
PASS: lldb-unit :: ScriptInterpreter/Python/./ScriptInterpreterPythonTests/PythonDataObjectsTest.TestPythonIntegerToStructuredInteger (795 of 2142)
PASS: lldb-api :: lang/c/array_types/TestArrayTypes.py (796 of 2142)
PASS: lldb-api :: commands/expression/import-std-module/empty-module/TestEmptyStdModule.py (797 of 2142)
PASS: lldb-api :: lang/objc/hidden-ivars/TestHiddenIvars.py (798 of 2142)
UNSUPPORTED: lldb-api :: functionalities/data-formatter/data-formatter-stl/libstdcpp/vector/TestDataFormatterStdVector.py (799 of 2142)
PASS: lldb-api :: functionalities/data-formatter/language_category_updates/TestDataFormatterLanguageCategoryUpdates.py (800 of 2142)
PASS: lldb-unit :: Language/CLanguages/./LanguageCLanguagesTests/CLanguages.LookupCLanguagesByLanguageType (801 of 2142)
PASS: lldb-unit :: UnwindAssembly/x86/./UnwindAssemblyx86Tests/Testx86AssemblyInspectionEngine.TestPushR14 (802 of 2142)
PASS: lldb-unit :: Utility/./UtilityTests/StreamTeeTest.Write (803 of 2142)
PASS: lldb-api :: macosx/load-kext/TestLoadKext.py (804 of 2142)
PASS: lldb-api :: lang/objc/foundation/TestConstStrings.py (805 of 2142)
PASS: lldb-unit :: Utility/./UtilityTests/XcodeSDKTest.GetSDKTypeForTriple (806 of 2142)
PASS: lldb-unit :: Utility/./UtilityTests/RecordReplayTest.InstrumentedFooSameThis (807 of 2142)
PASS: lldb-unit :: Symbol/./SymbolTests/TestTypeSystemClang.TestGetBasicTypeFromEnum (808 of 2142)
PASS: lldb-api :: lang/cpp/symbols/TestSymbols.py (809 of 2142)
PASS: lldb-unit :: Utility/./UtilityTests/ReproducerTest.SetCapture (810 of 2142)
PASS: lldb-unit :: Symbol/./SymbolTests/TestTypeSystemClang.TestGetEnumIntegerTypeInvalid (811 of 2142)
PASS: lldb-unit :: SymbolFile/NativePDB/./SymbolFileNativePDBTests/PDBFPOProgramToDWARFExpressionTests.MultipleIndependentAssignments (812 of 2142)
PASS: lldb-unit :: Target/./TargetTests/PathMappingListTest.AbsoluteTests (813 of 2142)
PASS: lldb-unit :: Core/./LLDBCoreTests/MangledTest.ResultForValidName (814 of 2142)
PASS: lldb-api :: functionalities/type_lookup/TestTypeLookup.py (815 of 2142)
PASS: lldb-api :: macosx/lc-note/firmware-corefile/TestFirmwareCorefiles.py (816 of 2142)
PASS: lldb-unit :: DataFormatter/./LLDBFormatterTests/TypeMatcherTests.RegexName (817 of 2142)
PASS: lldb-shell :: SymbolFile/NativePDB/tag-types.cpp (818 of 2142)
UNSUPPORTED: lldb-api :: functionalities/breakpoint/hardware_breakpoints/write_memory_with_hw_breakpoint/TestWriteMemoryWithHWBreakpoint.py (819 of 2142)
UNSUPPORTED: lldb-shell :: SymbolFile/DWARF/DW_TAG_GNU_call_site-DW_AT_low_pc.s (820 of 2142)
PASS: lldb-unit :: Utility/./UtilityTests/ArgsTest.TestSingleQuotedArgWithSpace (821 of 2142)
PASS: lldb-api :: commands/expression/import-std-module/vector-of-vectors/TestVectorOfVectorsFromStdModule.py (822 of 2142)
PASS: lldb-unit :: Utility/./UtilityTests/Predicate.WaitForValueNotEqualTo (823 of 2142)
PASS: lldb-api :: lang/c/anonymous/TestAnonymous.py (824 of 2142)
PASS: lldb-shell :: ObjectFile/PECOFF/basic-info.yaml (825 of 2142)
PASS: lldb-unit :: Utility/./UtilityTests/UriParserTest.BracketedHostnamePort (826 of 2142)
PASS: lldb-api :: lang/cpp/lambdas/TestLambdas.py (827 of 2142)
PASS: lldb-unit :: Host/./HostTests/SocketTest.TCPGetAddress (828 of 2142)
PASS: lldb-unit :: Utility/./UtilityTests/GeneratorTest.YamlMultiProvider (829 of 2142)
PASS: lldb-shell :: SymbolFile/NativePDB/disassembly.cpp (830 of 2142)
PASS: lldb-unit :: SymbolFile/DWARF/./SymbolFileDWARFTests/XcodeSDKModuleTests.TestModuleGetXcodeSDK (831 of 2142)
PASS: lldb-unit :: ScriptInterpreter/Python/./ScriptInterpreterPythonTests/PythonDataObjectsTest.TestPythonTupleSize (832 of 2142)
PASS: lldb-unit :: Utility/./UtilityTests/StreamTeeTest.Assignment (833 of 2142)
PASS: lldb-shell :: SymbolFile/DWARF/dir-separator-no-comp-dir-relative-name.s (834 of 2142)
PASS: lldb-api :: functionalities/thread/concurrent_events/TestConcurrentDelayedCrashWithBreakpointSignal.py (835 of 2142)
PASS: lldb-unit :: Core/./LLDBCoreTests/RichManglingContextTest.IPDRealloc (836 of 2142)
PASS: lldb-api :: functionalities/paths/TestPaths.py (837 of 2142)
PASS: lldb-api :: functionalities/mtc/simple/TestMTCSimple.py (838 of 2142)
PASS: lldb-unit :: Symbol/./SymbolTests/TestTypeSystemClang.TestDisplayNameEmpty (839 of 2142)
PASS: lldb-unit :: Utility/./UtilityTests/PassiveReplayTest.InstrumentedBarPtr (840 of 2142)
PASS: lldb-unit :: Utility/./UtilityTests/UriParserTest.Empty (841 of 2142)
PASS: lldb-shell :: Minidump/memory-region-from-module.yaml (842 of 2142)
UNSUPPORTED: lldb-shell :: SymbolFile/PDB/calling-conventions.test (843 of 2142)
PASS: lldb-api :: functionalities/inferior-changed/TestInferiorChanged.py (844 of 2142)
PASS: lldb-unit :: Utility/./UtilityTests/StringListTest.AppendList (845 of 2142)
PASS: lldb-unit :: Host/./HostTests/ConnectionFileDescriptorTest.TCPGetURIv6 (846 of 2142)
PASS: lldb-api :: functionalities/thread/concurrent_events/TestConcurrentCrashWithWatchpointBreakpointSignal.py (847 of 2142)
PASS: lldb-shell :: Quit/TestQuitExitCode0.test (848 of 2142)
PASS: lldb-unit :: Utility/./UtilityTests/SubsystemRAIITest.SubsystemWithErrorFailure (849 of 2142)
PASS: lldb-unit :: Utility/./UtilityTests/StringExtractorTest.GetU64LittleEndian (850 of 2142)
PASS: lldb-api :: python_api/objc_type/TestObjCType.py (851 of 2142)
PASS: lldb-api :: functionalities/breakpoint/source_regexp/TestSourceRegexBreakpoints.py (852 of 2142)
PASS: lldb-unit :: Utility/./UtilityTests/ConstStringTest.NullAndEmptyStates (853 of 2142)
PASS: lldb-api :: lang/objc/modules-incomplete/TestIncompleteModules.py (854 of 2142)
PASS: lldb-unit :: UnwindAssembly/x86/./UnwindAssemblyx86Tests/Testx86AssemblyInspectionEngine.TestSpillRegToStackViaMOVi386 (855 of 2142)
PASS: lldb-unit :: Process/minidump/./LLDBMinidumpTests/RegisterContextMinidump.ConvertMinidumpContext_x86_64 (856 of 2142)
PASS: lldb-api :: lang/cpp/modules-import/TestCXXModulesImport.py (857 of 2142)
PASS: lldb-unit :: Language/Highlighting/./HighlighterTests/HighlighterTest.ClangCursorPosBeforeOtherToken (858 of 2142)
UNSUPPORTED: lldb-shell :: ScriptInterpreter/Lua/breakpoint_callback.test (859 of 2142)
PASS: lldb-shell :: ObjectFile/ELF/PT_LOAD-empty.yaml (860 of 2142)
PASS: lldb-unit :: Utility/./UtilityTests/StringListTest.InsertStringAtIndexOutOfBounds (861 of 2142)
PASS: lldb-unit :: Symbol/./SymbolTests/TestClangASTImporter.CopyDeclTagDecl (862 of 2142)
PASS: lldb-unit :: Utility/./UtilityTests/FileSpecTest.RemoveLastPathComponent (863 of 2142)
PASS: lldb-shell :: Breakpoint/split-dwarf-5-addrbase.test (864 of 2142)
PASS: lldb-unit :: Utility/./UtilityTests/ProcessInfoTest.Constructor (865 of 2142)
PASS: lldb-unit :: Utility/./UtilityTests/FileSpecTest.EqualDotsPosix (866 of 2142)
PASS: lldb-unit :: Symbol/./SymbolTests/LineEntryTest.GetSameLineContiguousAddressRangeNestedInline (867 of 2142)
PASS: lldb-shell :: Quit/TestQuitExitCode30.test (868 of 2142)
PASS: lldb-shell :: Expr/TestIRMemoryMap.test (869 of 2142)
PASS: lldb-unit :: Expression/./ExpressionTests/CppModuleConfigurationTest.Sysroot (870 of 2142)
PASS: lldb-unit :: Utility/./UtilityTests/PassiveReplayTest.InstrumentedFoo (871 of 2142)
UNSUPPORTED: lldb-api :: iohandler/unicode/TestUnicode.py (872 of 2142)
PASS: lldb-shell :: SymbolFile/NativePDB/function-types-builtins.cpp (873 of 2142)
PASS: lldb-unit :: Host/./HostTests/MainLoopTest.DetectsEOF (874 of 2142)
PASS: lldb-unit :: ScriptInterpreter/Python/./ScriptInterpreterPythonTests/PythonDataObjectsTest.TestBorrowedReferences (875 of 2142)
PASS: lldb-api :: functionalities/signal/TestSendSignal.py (876 of 2142)
PASS: lldb-api :: lang/cpp/nsimport/TestCppNsImport.py (877 of 2142)
PASS: lldb-api :: lang/objc/print-obj/TestPrintObj.py (878 of 2142)
PASS: lldb-api :: commands/expression/invalid-args/TestInvalidArgsExpression.py (879 of 2142)
PASS: lldb-api :: functionalities/data-formatter/ostypeformatting/TestFormattersOsType.py (880 of 2142)
PASS: lldb-api :: python_api/sbdata/TestSBData.py (881 of 2142)
PASS: lldb-unit :: Utility/./UtilityTests/OptionsWithRawTest.WhitespaceInput (882 of 2142)
PASS: lldb-unit :: Utility/./UtilityTests/ScalarTest.Comparison (883 of 2142)
PASS: lldb-shell :: SymbolFile/DWARF/find-variable-dwo.cpp (884 of 2142)
PASS: lldb-api :: lang/cpp/global_operators/TestCppGlobalOperators.py (885 of 2142)
PASS: lldb-unit :: Process/gdb-remote/./ProcessGdbRemoteTests/GDBRemoteCommunicationClientTest.WriteRegister (886 of 2142)
PASS: lldb-api :: functionalities/load_unload/TestLoadUnload.py (887 of 2142)
PASS: lldb-unit :: ObjectFile/Breakpad/./ObjectFileBreakpadTests/PublicRecord.parse (888 of 2142)
UNSUPPORTED: lldb-api :: tools/lldb-server/thread-name/TestGdbRemoteThreadName.py (889 of 2142)
PASS: lldb-api :: python_api/get-value-32bit-int/TestGetValue32BitInt.py (890 of 2142)
PASS: lldb-unit :: Symbol/./SymbolTests/TestTypeSystemClang.TestFunctionTemplateInRecordConstruction (891 of 2142)
PASS: lldb-shell :: Commands/command-disassemble-process.yaml (892 of 2142)
PASS: lldb-shell :: SymbolFile/NativePDB/break-by-function.cpp (893 of 2142)
PASS: lldb-api :: lang/objc/foundation/TestSymbolTable.py (894 of 2142)
UNSUPPORTED: lldb-shell :: Register/x86-gp-write.test (895 of 2142)
PASS: lldb-api :: python_api/section/TestSectionAPI.py (896 of 2142)
PASS: lldb-unit :: Utility/./UtilityTests/SubsystemRAIITest.NormalSubsystem (897 of 2142)
PASS: lldb-unit :: Host/./HostTests/SocketAddressTest.Set (898 of 2142)
PASS: lldb-unit :: Utility/./UtilityTests/CompletionRequest.TryCompleteCurrentArgMode (899 of 2142)
PASS: lldb-api :: lang/c/struct_types/TestStructTypes.py (900 of 2142)
PASS: lldb-api :: functionalities/data-formatter/data-formatter-objc/TestDataFormatterObjCNSBundle.py (901 of 2142)
PASS: lldb-api :: functionalities/gdb_remote_client/TestThreadSelectionBug.py (902 of 2142)
PASS: lldb-shell :: Settings/TestFrameFormatNoColor.test (903 of 2142)
PASS: lldb-unit :: Utility/./UtilityTests/StringListTest.CopyListSingle (904 of 2142)
PASS: lldb-unit :: Utility/./UtilityTests/StringExtractorTest.GetHexU8_Underflow2_NoEof (905 of 2142)
UNSUPPORTED: lldb-shell :: Breakpoint/ppc64-localentry.test (906 of 2142)
PASS: lldb-unit :: Utility/./UtilityTests/LogChannelEnabledTest.LogGetLogThread (907 of 2142)
UNSUPPORTED: lldb-shell :: Watchpoint/netbsd-nouserdbregs.test (908 of 2142)
PASS: lldb-api :: tools/lldb-vscode/breakpoint/TestVSCode_setFunctionBreakpoints.py (909 of 2142)
PASS: lldb-api :: commands/breakpoint/set/func-regex/TestBreakpointRegexError.py (910 of 2142)
PASS: lldb-api :: functionalities/data-formatter/parray/TestPrintArray.py (911 of 2142)
PASS: lldb-api :: commands/frame/diagnose/complicated-expression/TestComplicatedExpression.py (912 of 2142)
PASS: lldb-api :: python_api/process/TestProcessAPI.py (913 of 2142)
PASS: lldb-api :: macosx/profile_vrs_detach/TestDetachVrsProfile.py (914 of 2142)
PASS: lldb-unit :: Core/./LLDBCoreTests/SourceFileCache.FindSourceFileFound (915 of 2142)
UNSUPPORTED: lldb-api :: functionalities/darwin_log/filter/exact_match/category/TestDarwinLogFilterMatchCategory.py (916 of 2142)
PASS: lldb-shell :: SymbolFile/NativePDB/locate-pdb.cpp (917 of 2142)
PASS: lldb-unit :: Utility/./UtilityTests/StringListTest.AppendListCStringArray (918 of 2142)
PASS: lldb-shell :: SymbolFile/DWARF/debug_rnglists.s (919 of 2142)
PASS: lldb-api :: commands/expression/persist_objc_pointeetype/TestPersistObjCPointeeType.py (920 of 2142)
PASS: lldb-shell :: ExecControl/StopHook/stop-hook.test (921 of 2142)
PASS: lldb-shell :: Quit/TestQuitExitCodeNonInt.test (922 of 2142)
PASS: lldb-api :: macosx/thread_suspend/TestInternalThreadSuspension.py (923 of 2142)
PASS: lldb-shell :: SymbolFile/DWARF/debug_aranges-empty-section.s (924 of 2142)
PASS: lldb-api :: commands/watchpoints/watchpoint_disable/TestWatchpointDisable.py (925 of 2142)
PASS: lldb-api :: functionalities/data-formatter/data-formatter-objc/TestDataFormatterObjNSException.py (926 of 2142)
PASS: lldb-unit :: Utility/./UtilityTests/Flags.GetBitSize (927 of 2142)
PASS: lldb-unit :: UnwindAssembly/x86/./UnwindAssemblyx86Tests/Testx86AssemblyInspectionEngine.TestSubESP (928 of 2142)
PASS: lldb-unit :: ObjectFile/PECOFF/./ObjectFilePECOFFTests/PECallFrameInfoTest.Basic_eh (929 of 2142)
PASS: lldb-api :: functionalities/data-formatter/synthupdate/TestSyntheticFilterRecompute.py (930 of 2142)
UNSUPPORTED: lldb-api :: functionalities/asan/TestReportData.py (931 of 2142)
PASS: lldb-api :: functionalities/breakpoint/serialize/TestBreakpointSerialization.py (932 of 2142)
PASS: lldb-unit :: UnwindAssembly/x86/./UnwindAssemblyx86Tests/Testx86AssemblyInspectionEngine.TestPushECX (933 of 2142)
UNSUPPORTED: lldb-api :: functionalities/darwin_log/format/TestDarwinLogMessageFormat.py (934 of 2142)
PASS: lldb-shell :: SymbolFile/DWARF/split-dwarf-multiple-cu.ll (935 of 2142)
PASS: lldb-unit :: Utility/./UtilityTests/ConstStringTest.format_provider (936 of 2142)
UNSUPPORTED: lldb-shell :: SymbolFile/PDB/vbases.test (937 of 2142)
PASS: lldb-api :: types/TestIntegerTypeExpr.py (938 of 2142)
PASS: lldb-shell :: SymbolFile/DWARF/debug_line-relative_path.s (939 of 2142)
PASS: lldb-unit :: Process/gdb-remote/./ProcessGdbRemoteTests/GDBRemoteCommunicationClientTest.GetQOffsets (940 of 2142)
PASS: lldb-shell :: Commands/command-thread-select.test (941 of 2142)
UNSUPPORTED: lldb-api :: terminal/TestEditline.py (942 of 2142)
PASS: lldb-unit :: Utility/./UtilityTests/StringListTest.LongestCommonPrefixNoPrefix (943 of 2142)
PASS: lldb-unit :: Symbol/./SymbolTests/TestTypeSystemClang.TestIsClangType (944 of 2142)
PASS: lldb-api :: functionalities/thread/thread_exit/TestThreadExit.py (945 of 2142)
PASS: lldb-shell :: Reproducer/TestVerify.test (946 of 2142)
PASS: lldb-api :: functionalities/tail_call_frames/disambiguate_call_site/TestDisambiguateCallSite.py (947 of 2142)
PASS: lldb-api :: commands/watchpoints/multiple_threads/TestWatchpointMultipleThreads.py (948 of 2142)
PASS: lldb-unit :: Utility/./UtilityTests/StreamTest.PutBytesAsRawHex8ToMixedEndian (949 of 2142)
PASS: lldb-api :: commands/expression/import-std-module/forward_list/TestForwardListFromStdModule.py (950 of 2142)
UNSUPPORTED: lldb-api :: commands/expression/multiline-completion/TestMultilineCompletion.py (951 of 2142)
UNSUPPORTED: lldb-shell :: ScriptInterpreter/Lua/watchpoint_callback.test (952 of 2142)
PASS: lldb-api :: commands/expression/expr-in-syscall/TestExpressionInSyscall.py (953 of 2142)
PASS: lldb-api :: commands/expression/no-deadlock/TestExprDoesntBlock.py (954 of 2142)
PASS: lldb-unit :: Utility/./UtilityTests/ArgsTest.StringListConstructor (955 of 2142)
PASS: lldb-unit :: Utility/./UtilityTests/StreamTeeTest.Constructor2Streams (956 of 2142)
PASS: lldb-unit :: Language/Highlighting/./HighlighterTests/HighlighterTest.Colons (957 of 2142)
PASS: lldb-unit :: Utility/./UtilityTests/StringListTest.GetMaxStringLengthIncreasingSize (958 of 2142)
PASS: lldb-api :: lang/cpp/class_types/TestClassTypesDisassembly.py (959 of 2142)
PASS: lldb-unit :: Utility/./UtilityTests/StringListTest.ShiftMove (960 of 2142)
PASS: lldb-unit :: Process/gdb-remote/./ProcessGdbRemoteTests/GDBRemoteCommunicationClientTest.TestPacketSpeedJSON (961 of 2142)
PASS: lldb-unit :: Utility/./UtilityTests/StreamTest.PutHex32ByteOrderLittle (962 of 2142)
PASS: lldb-unit :: Utility/./UtilityTests/RangeTest.Equal (963 of 2142)
PASS: lldb-api :: lang/cpp/dynamic-value/TestCppValueCast.py (964 of 2142)
PASS: lldb-unit :: Utility/./UtilityTests/RangeTest.LessThanInvalid (965 of 2142)
PASS: lldb-api :: functionalities/breakpoint/breakpoint_by_file_colon_line/TestBreakpointByFileColonLine.py (966 of 2142)
PASS: lldb-api :: functionalities/data-formatter/data-formatter-stl/libcxx/list/loop/TestDataFormatterLibcxxListLoop.py (967 of 2142)
PASS: lldb-unit :: Host/./HostTests/SocketTest.DomainListenConnectAccept (968 of 2142)
PASS: lldb-api :: lang/objc/modules-cache/TestClangModulesCache.py (969 of 2142)
PASS: lldb-unit :: ScriptInterpreter/Python/./ScriptInterpreterPythonTests/PythonDataObjectsTest.TestModuleNameResolutionNoDot (970 of 2142)
PASS: lldb-unit :: Expression/./ExpressionTests/ClangExpressionDeclMapTest.TestPersistentDeclLookup (971 of 2142)
PASS: lldb-api :: lang/cpp/unsigned_types/TestUnsignedTypes.py (972 of 2142)
PASS: lldb-api :: functionalities/data-formatter/data-formatter-stl/libcxx/list/TestDataFormatterLibcxxList.py (973 of 2142)
UNSUPPORTED: lldb-api :: iohandler/completion/TestIOHandlerCompletion.py (974 of 2142)
PASS: lldb-shell :: SymbolFile/NativePDB/source-list.cpp (975 of 2142)
PASS: lldb-unit :: Utility/./UtilityTests/VMRange.IsValid (976 of 2142)
PASS: lldb-unit :: Interpreter/./InterpreterTests/OptionValueFileColonLine.setFromString (977 of 2142)
PASS: lldb-shell :: Settings/TestDisassemblyFormat.test (978 of 2142)
UNSUPPORTED: lldb-api :: commands/watchpoints/hello_watchlocation/TestWatchLocation.py (979 of 2142)
PASS: lldb-unit :: Utility/./UtilityTests/TimerTest.CategoryTimesStats (980 of 2142)
PASS: lldb-unit :: Process/minidump/./LLDBMinidumpTests/MinidumpParserTest.GetThreadContext_x86_32_wow64 (981 of 2142)
PASS: lldb-api :: functionalities/gdb_remote_client/TestRegDefinitionInParts.py (982 of 2142)
UNSUPPORTED: lldb-shell :: ScriptInterpreter/Lua/lua.test (983 of 2142)
PASS: lldb-shell :: Reproducer/TestVersionCheck.test (984 of 2142)
PASS: lldb-unit :: Utility/./UtilityTests/RangeDataVector.FindEntryIndexesThatContain_Overlap (985 of 2142)
PASS: lldb-api :: python_api/breakpoint/TestBreakpointAPI.py (986 of 2142)
PASS: lldb-api :: python_api/watchpoint/watchlocation/TestSetWatchlocation.py (987 of 2142)
PASS: lldb-shell :: SymbolFile/DWARF/find-variable-file.cpp (988 of 2142)
UNSUPPORTED: lldb-api :: linux/mix-dwo-and-regular-objects/TestMixedDwarfBinary.py (989 of 2142)
PASS: lldb-api :: python_api/process/io/TestProcessIO.py (990 of 2142)
PASS: lldb-unit :: Utility/./UtilityTests/StreamTest.PutHex16ByteOrderBig (991 of 2142)
PASS: lldb-api :: commands/source/info/TestSourceInfo.py (992 of 2142)
PASS: lldb-api :: tools/lldb-server/TestLldbGdbServer.py (993 of 2142)
PASS: lldb-api :: functionalities/thread/concurrent_events/TestConcurrentManyBreakpoints.py (994 of 2142)
UNSUPPORTED: lldb-shell :: ScriptInterpreter/Lua/lua-python.test (995 of 2142)
PASS: lldb-unit :: Host/./HostTests/SocketTest.UDPGetConnectURI (996 of 2142)
PASS: lldb-unit :: ScriptInterpreter/Python/./ScriptInterpreterPythonTests/PythonDataObjectsTest.TestPythonFile (997 of 2142)
PASS: lldb-unit :: Host/./HostTests/SocketTest.DecodeHostAndPort (998 of 2142)
UNSUPPORTED: lldb-api :: functionalities/darwin_log/filter/regex/subsystem/TestDarwinLogFilterRegexSubsystem.py (999 of 2142)
PASS: lldb-shell :: Heap/heap-cstr.test (1000 of 2142)
PASS: lldb-shell :: ScriptInterpreter/Python/sb_address_exception.test (1001 of 2142)
PASS: lldb-unit :: Utility/./UtilityTests/RangeTest.ClearWithStarAddress (1002 of 2142)
PASS: lldb-shell :: SymbolFile/symbol-binding.test (1003 of 2142)
PASS: lldb-unit :: Language/Highlighting/./HighlighterTests/HighlighterTest.ClangSquareBrackets (1004 of 2142)
PASS: lldb-shell :: Process/TestEnvironment.test (1005 of 2142)
PASS: lldb-unit :: Utility/./UtilityTests/StreamTest.PutCString (1006 of 2142)
PASS: lldb-unit :: UnwindAssembly/x86/./UnwindAssemblyx86Tests/Testx86AssemblyInspectionEngine.TestSpArithx86_64Augmented (1007 of 2142)
PASS: lldb-unit :: Utility/./UtilityTests/StringListTest.JoinThree (1008 of 2142)
PASS: lldb-api :: lang/objc/objc-checker/TestObjCCheckers.py (1009 of 2142)
PASS: lldb-shell :: SymbolFile/DWARF/DW_AT_declaration-with-children.s (1010 of 2142)
PASS: lldb-api :: functionalities/postmortem/elf-core/thread_crash/TestLinuxCoreThreads.py (1011 of 2142)
UNSUPPORTED: lldb-api :: tools/lldb-server/libraries-svr4/TestGdbRemoteLibrariesSvr4Support.py (1012 of 2142)
PASS: lldb-api :: macosx/add-dsym/TestAddDsymMidExecutionCommand.py (1013 of 2142)
PASS: lldb-api :: commands/add-dsym/uuid/TestAddDsymCommand.py (1014 of 2142)
UNSUPPORTED: lldb-api :: lang/objc/rdar-12408181/TestRdar12408181.py (1015 of 2142)
PASS: lldb-unit :: ObjectFile/Breakpad/./ObjectFileBreakpadTests/StackCFIRecord.parse (1016 of 2142)
PASS: lldb-unit :: Symbol/./SymbolTests/TestClangASTImporter.MetadataPropagationAfterCopying (1017 of 2142)
PASS: lldb-api :: functionalities/data-formatter/data-formatter-objc/nsindexpath/TestDataFormatterNSIndexPath.py (1018 of 2142)
PASS: lldb-unit :: Utility/./UtilityTests/StringListTest.Assignment (1019 of 2142)
PASS: lldb-unit :: UnwindAssembly/x86/./UnwindAssemblyx86Tests/Testx86AssemblyInspectionEngine.TestPushRBP (1020 of 2142)
PASS: lldb-unit :: Utility/./UtilityTests/StreamTest.PutCharWhitespace (1021 of 2142)
PASS: lldb-api :: lang/cpp/template-function/TestTemplateFunctions.py (1022 of 2142)
PASS: lldb-api :: functionalities/pre_run_dylibs/TestPreRunDylibs.py (1023 of 2142)
PASS: lldb-api :: python_api/value/empty_class/TestValueAPIEmptyClass.py (1024 of 2142)
PASS: lldb-shell :: Commands/command-source.test (1025 of 2142)
PASS: lldb-shell :: Breakpoint/debug_rnglist_basic.test (1026 of 2142)
PASS: lldb-api :: functionalities/load_using_paths/TestLoadUsingPaths.py (1027 of 2142)
PASS: lldb-unit :: Utility/./UtilityTests/SerializationRountripTest.SerializeDeserializeCStringArray (1028 of 2142)
PASS: lldb-api :: functionalities/pointer_num_children/TestPointerNumChildren.py (1029 of 2142)
PASS: lldb-unit :: Platform/./LLDBPlatformTests/PlatformAppleSimulatorTest.TestSimHasSimEnvionament (1030 of 2142)
PASS: lldb-unit :: Utility/./UtilityTests/BinaryStreamTest.PutSLEB128FourBytes (1031 of 2142)
PASS: lldb-api :: tools/lldb-vscode/launch/TestVSCode_launch.py (1032 of 2142)
XFAIL: lldb-shell :: Unwind/prefer-debug-over-eh-frame.test (1033 of 2142)
PASS: lldb-api :: lang/c/complex/TestComplexC99.py (1034 of 2142)
PASS: lldb-unit :: Host/./HostTests/MainLoopTest.UnmonitoredSignal (1035 of 2142)
PASS: lldb-api :: commands/expression/persistent_ptr_update/TestPersistentPtrUpdate.py (1036 of 2142)
PASS: lldb-unit :: Symbol/./SymbolTests/TestTypeSystemClang.TestFunctionTemplateConstruction (1037 of 2142)
UNSUPPORTED: lldb-shell :: Register/x86-gp-read.test (1038 of 2142)
PASS: lldb-api :: functionalities/data-formatter/cstring-utf8-summary/TestCstringUnicode.py (1039 of 2142)
PASS: lldb-api :: lang/objc/objc-ivar-protocols/TestIvarProtocols.py (1040 of 2142)
PASS: lldb-unit :: Utility/./UtilityTests/UriParserTest.MinimalPort (1041 of 2142)
PASS: lldb-shell :: SymbolFile/DWARF/find-method-local-struct.cpp (1042 of 2142)
PASS: lldb-unit :: Utility/./UtilityTests/StringListTest.GetMaxStringLengthEqualSize (1043 of 2142)
PASS: lldb-unit :: Host/./HostTests/NativeProcessProtocolTest.ReadCStringFromMemory (1044 of 2142)
PASS: lldb-unit :: SymbolFile/DWARF/./SymbolFileDWARFTests/SymbolFileDWARFTests.TestAbbrevMissingTerminator (1045 of 2142)
PASS: lldb-api :: lang/c/const_variables/TestConstVariables.py (1046 of 2142)
PASS: lldb-api :: functionalities/data-formatter/data-formatter-stl/libcxx/unordered/TestDataFormatterUnordered.py (1047 of 2142)
UNSUPPORTED: lldb-api :: commands/target/auto-install-main-executable/TestAutoInstallMainExecutable.py (1048 of 2142)
PASS: lldb-api :: functionalities/data-formatter/data-formatter-caching/TestDataFormatterCaching.py (1049 of 2142)
PASS: lldb-shell :: SymbolFile/DWARF/dwarf5-partial-index.cpp (1050 of 2142)
PASS: lldb-unit :: Symbol/./SymbolTests/PostfixExpression.ParseOneExpression (1051 of 2142)
PASS: lldb-api :: types/TestFloatTypesExpr.py (1052 of 2142)
PASS: lldb-shell :: ObjectFile/ELF/duplicate-section.yaml (1053 of 2142)
PASS: lldb-unit :: Language/Highlighting/./HighlighterTests/HighlighterTest.ClangTrailingBackslashBeforeNewline (1054 of 2142)
PASS: lldb-unit :: Utility/./UtilityTests/StreamTest.AddressRangeEmptyRange (1055 of 2142)
PASS: lldb-unit :: Utility/./UtilityTests/VMRange.Comparison (1056 of 2142)
PASS: lldb-api :: lang/objc/objc-new-syntax/TestObjCNewSyntaxLiteral.py (1057 of 2142)
PASS: lldb-shell :: SymbolFile/Breakpad/symtab.test (1058 of 2142)
PASS: lldb-unit :: ScriptInterpreter/Python/./ScriptInterpreterPythonTests/PythonDataObjectsTest.TestPythonTupleToStructuredList (1059 of 2142)
PASS: lldb-api :: commands/expression/import-std-module/no-std-module/TestMissingStdModule.py (1060 of 2142)
PASS: lldb-api :: functionalities/gdb_remote_client/TestTargetXMLArch.py (1061 of 2142)
PASS: lldb-unit :: ScriptInterpreter/Python/./ScriptInterpreterPythonTests/PythonDataObjectsTest.TestPythonDictionaryValueEquality (1062 of 2142)
PASS: lldb-unit :: Symbol/./SymbolTests/SymbolsTest.TerminateLocateExecutableSymbolFileForUnknownExecutableAndUnknownSymbolFile (1063 of 2142)
PASS: lldb-api :: macosx/nslog/TestDarwinNSLogOutput.py (1064 of 2142)
PASS: lldb-unit :: Utility/./UtilityTests/SerializationRountripTest.SerializeDeserializeObjectPointer (1065 of 2142)
PASS: lldb-unit :: Interpreter/./InterpreterTests/CompletionTest.DirCompletionAbsolute (1066 of 2142)
PASS: lldb-unit :: Expression/./ExpressionTests/ClangHostTest.ComputeClangResourceDirectory (1067 of 2142)
PASS: lldb-shell :: Settings/TestSettingsWrite.test (1068 of 2142)
PASS: lldb-api :: lang/objc/variadic_methods/TestVariadicMethods.py (1069 of 2142)
UNSUPPORTED: lldb-api :: linux/add-symbols/TestTargetSymbolsAddCommand.py (1070 of 2142)
PASS: lldb-api :: commands/thread/select/TestThreadSelect.py (1071 of 2142)
PASS: lldb-api :: functionalities/data-formatter/data-formatter-stl/libcxx/vector/TestDataFormatterLibcxxVector.py (1072 of 2142)
PASS: lldb-unit :: Symbol/./SymbolTests/PostfixExpression.ParseFPOProgram (1073 of 2142)
PASS: lldb-unit :: Utility/./UtilityTests/StringListTest.Join (1074 of 2142)
PASS: lldb-unit :: ObjectFile/ELF/./ObjectFileELFTests/ObjectFileELFTest.GetModuleSpecifications_EarlySectionHeaders (1075 of 2142)
PASS: lldb-shell :: Settings/TestSettingsSet.test (1076 of 2142)
PASS: lldb-unit :: Utility/./UtilityTests/VASprintfTest.EncodingError (1077 of 2142)
PASS: lldb-shell :: SymbolFile/DWARF/apple-index-is-used.cpp (1078 of 2142)
PASS: lldb-unit :: Utility/./UtilityTests/StringListTest.JoinEmpty (1079 of 2142)
PASS: lldb-unit :: Utility/./UtilityTests/UserIDResolver.GetGroupName (1080 of 2142)
PASS: lldb-unit :: Process/gdb-remote/./ProcessGdbRemoteTests/GDBRemoteCommunicationClientTest.SyncThreadState (1081 of 2142)
PASS: lldb-unit :: Utility/./UtilityTests/AnsiTerminal.Empty (1082 of 2142)
UNSUPPORTED: lldb-shell :: SymbolFile/DWARF/debug-types-expressions.test (1083 of 2142)
PASS: lldb-shell :: Settings/TestFrameFormatMangling.test (1084 of 2142)
PASS: lldb-api :: functionalities/tail_call_frames/disambiguate_tail_call_seq/TestDisambiguateTailCallSeq.py (1085 of 2142)
PASS: lldb-unit :: Host/./HostTests/FileActionTest.Open (1086 of 2142)
PASS: lldb-api :: lang/objc/modules-non-objc-target/TestObjCModulesNonObjCTarget.py (1087 of 2142)
PASS: lldb-api :: functionalities/gdb_remote_client/TestProcessConnect.py (1088 of 2142)
PASS: lldb-api :: functionalities/data-formatter/data-formatter-skip-summary/TestDataFormatterSkipSummary.py (1089 of 2142)
PASS: lldb-api :: functionalities/thread/concurrent_events/TestConcurrentBreakpointDelayBreakpointOneSignal.py (1090 of 2142)
PASS: lldb-unit :: Utility/./UtilityTests/StringExtractorTest.GetHexU8_Exact (1091 of 2142)
PASS: lldb-api :: commands/disassemble/basic/TestDisassembleBreakpoint.py (1092 of 2142)
PASS: lldb-api :: commands/watchpoints/watchpoint_commands/command/TestWatchpointCommandPython.py (1093 of 2142)
PASS: lldb-api :: tools/lldb-server/TestGdbRemoteExitCode.py (1094 of 2142)
PASS: lldb-unit :: Utility/./UtilityTests/StreamTest.ChangingByteOrder (1095 of 2142)
PASS: lldb-unit :: Symbol/./SymbolTests/TestClangASTImporter.RecordLayout (1096 of 2142)
PASS: lldb-api :: commands/expression/context-object-objc/TestContextObjectObjc.py (1097 of 2142)
UNSUPPORTED: lldb-api :: python_api/event/TestEvents.py (1098 of 2142)
PASS: lldb-unit :: Utility/./UtilityTests/Predicate.WaitForValueEqualTo (1099 of 2142)
PASS: lldb-api :: functionalities/step_scripted/TestStepScripted.py (1100 of 2142)
PASS: lldb-unit :: Expression/./ExpressionTests/ClangExpressionDeclMapTest.TestUnknownIdentifierLookup (1101 of 2142)
PASS: lldb-unit :: DataFormatter/./LLDBFormatterTests/TypeMatcherTests.RegexMatchPart (1102 of 2142)
PASS: lldb-api :: functionalities/non-overlapping-index-variable-i/TestIndexVariable.py (1103 of 2142)
PASS: lldb-shell :: SymbolFile/NativePDB/ast-methods.cpp (1104 of 2142)
PASS: lldb-shell :: SymbolFile/Breakpad/symtab-macho.test (1105 of 2142)
PASS: lldb-shell :: ObjectFile/MachO/subsections.yaml (1106 of 2142)
PASS: lldb-unit :: Utility/./UtilityTests/StreamTeeTest.GetStreamAtIndexOutOfBounds (1107 of 2142)
PASS: lldb-unit :: ScriptInterpreter/Python/./ScriptInterpreterPythonTests/PythonDataObjectsTest.TestOwnedReferences (1108 of 2142)
PASS: lldb-api :: python_api/value/linked_list/TestValueAPILinkedList.py (1109 of 2142)
PASS: lldb-unit :: Utility/./UtilityTests/ArgsTest.TestOverwriteArgs (1110 of 2142)
PASS: lldb-unit :: Platform/Android/./AdbClientTests/AdbClientTest.CreateByDeviceId (1111 of 2142)
PASS: lldb-shell :: Reproducer/TestDump.test (1112 of 2142)
PASS: lldb-unit :: ObjectFile/Breakpad/./ObjectFileBreakpadTests/LineRecord.parse (1113 of 2142)
PASS: lldb-unit :: Utility/./UtilityTests/StreamTest.PutHex64ByteOrderBig (1114 of 2142)
PASS: lldb-api :: commands/expression/import-std-module/queue/TestQueueFromStdModule.py (1115 of 2142)
PASS: lldb-unit :: Process/minidump/./LLDBMinidumpTests/MinidumpParserTest.GetLinuxProcStatus (1116 of 2142)
PASS: lldb-shell :: SymbolFile/DWARF/debug_rnglists-dwo.s (1117 of 2142)
PASS: lldb-unit :: Process/minidump/./LLDBMinidumpTests/MinidumpParserTest.GetMemory (1118 of 2142)
PASS: lldb-api :: commands/breakpoint/command/list/TestBreakpointCommandList.py (1119 of 2142)
PASS: lldb-shell :: Reproducer/Functionalities/TestExpressionEvaluation.test (1120 of 2142)
PASS: lldb-unit :: ScriptInterpreter/Python/./ScriptInterpreterPythonTests/PythonDataObjectsTest.TestExceptions (1121 of 2142)
PASS: lldb-api :: functionalities/data-formatter/data-formatter-objc/TestDataFormatterObjCNSURL.py (1122 of 2142)
PASS: lldb-shell :: SymbolFile/DWARF/DW_AT_const_value-bitfields.s (1123 of 2142)
PASS: lldb-unit :: Utility/./UtilityTests/StringExtractorTest.GetU64BigEndian (1124 of 2142)
PASS: lldb-api :: functionalities/thread/jump/TestThreadJump.py (1125 of 2142)
PASS: lldb-unit :: Symbol/./SymbolTests/TestTypeSystemClang.TestUnifyAccessSpecifiers (1126 of 2142)
PASS: lldb-unit :: Utility/./UtilityTests/BinaryStreamTest.PutSLEB128Zero (1127 of 2142)
PASS: lldb-unit :: Symbol/./SymbolTests/LineEntryTest.GetSameLineContiguousAddressRangeOneInline (1128 of 2142)
PASS: lldb-api :: lang/cpp/call-function/TestCallCPPFunction.py (1129 of 2142)
PASS: lldb-api :: lang/cpp/function_refs/TestFunctionRefs.py (1130 of 2142)
PASS: lldb-unit :: Utility/./UtilityTests/StringListTest.GetSize (1131 of 2142)
PASS: lldb-shell :: SymbolFile/DWARF/find-basic-function.cpp (1132 of 2142)
PASS: lldb-unit :: Expression/./ExpressionTests/DWARFExpression.DW_OP_convert (1133 of 2142)
PASS: lldb-unit :: ScriptInterpreter/Python/./ScriptInterpreterPythonTests/PythonDataObjectsTest.TestExtractingUInt64ThroughStructuredData (1134 of 2142)
PASS: lldb-unit :: DataFormatter/./LLDBFormatterTests/TypeMatcherTests.ExactName (1135 of 2142)
PASS: lldb-unit :: Target/./TargetTests/RemoteAwarePlatformTest.TestResolveExecutabelOnClientByPlatform (1136 of 2142)
PASS: lldb-unit :: Utility/./UtilityTests/OptionsWithRawTest.UnterminatedQuote (1137 of 2142)
PASS: lldb-api :: functionalities/tail_call_frames/ambiguous_tail_call_seq1/TestAmbiguousTailCallSeq1.py (1138 of 2142)
PASS: lldb-unit :: Utility/./UtilityTests/ScalarTest.TruncOrExtendTo (1139 of 2142)
PASS: lldb-api :: functionalities/thread/concurrent_events/TestConcurrentWatchBreakDelay.py (1140 of 2142)
PASS: lldb-unit :: Utility/./UtilityTests/UriParserTest.SchemeHostSeparator4 (1141 of 2142)
PASS: lldb-api :: functionalities/history/TestHistoryRecall.py (1142 of 2142)
PASS: lldb-api :: functionalities/signal/raise/TestRaise.py (1143 of 2142)
PASS: lldb-api :: functionalities/data-formatter/data-formatter-objc/TestDataFormatterObjCNSData.py (1144 of 2142)
PASS: lldb-unit :: Process/gdb-remote/./ProcessGdbRemoteTests/GDBRemoteClientBaseTest.SendContinueAndWait (1145 of 2142)
PASS: lldb-unit :: ScriptInterpreter/Python/./ScriptInterpreterPythonTests/PythonDataObjectsTest.TestPythonListValueEquality (1146 of 2142)
PASS: lldb-unit :: Utility/./UtilityTests/StreamTest.PutULEB128 (1147 of 2142)
PASS: lldb-api :: commands/watchpoints/watchpoint_events/TestWatchpointEvents.py (1148 of 2142)
PASS: lldb-unit :: UnwindAssembly/x86/./UnwindAssemblyx86Tests/Testx86AssemblyInspectionEngine.TestPopESI (1149 of 2142)
PASS: lldb-unit :: Utility/./UtilityTests/BinaryStreamTest.PutSLEB128EightBytes (1150 of 2142)
PASS: lldb-unit :: SymbolFile/DWARF/./SymbolFileDWARFTests/SymbolFileDWARFTests.TestAbbrevInvalidNULLTag (1151 of 2142)
PASS: lldb-unit :: Symbol/./SymbolTests/TestTypeSystemClang.TestGetEnumIntegerTypeBasicTypes (1152 of 2142)
PASS: lldb-api :: api/multiple-targets/TestMultipleTargets.py (1153 of 2142)
PASS: lldb-unit :: Target/./TargetTests/PathMappingListTest.RemapRoot (1154 of 2142)
PASS: lldb-unit :: Utility/./UtilityTests/Flags.IsClear (1155 of 2142)
PASS: lldb-api :: commands/expression/radar_9531204/TestPrintfAfterUp.py (1156 of 2142)
PASS: lldb-unit :: Utility/./UtilityTests/RangeTest.ContainsAddrInvalid (1157 of 2142)
PASS: lldb-unit :: Utility/./UtilityTests/StreamTeeTest.Flush (1158 of 2142)
PASS: lldb-unit :: Symbol/./SymbolTests/TestTypeSystemClang.TestGetEnumIntegerTypeUnexpectedType (1159 of 2142)
PASS: lldb-unit :: SymbolFile/NativePDB/./SymbolFileNativePDBTests/PDBFPOProgramToDWARFExpressionTests.MultipleDependentAssignments (1160 of 2142)
PASS: lldb-unit :: Utility/./UtilityTests/ArgsTest.ReplaceArgumentAtIndexEqual (1161 of 2142)
UNSUPPORTED: lldb-api :: functionalities/signal/handle-segv/TestHandleSegv.py (1162 of 2142)
PASS: lldb-unit :: Host/./HostTests/MainLoopTest.TerminatesImmediately (1163 of 2142)
PASS: lldb-unit :: Utility/./UtilityTests/StringExtractorTest.GetHexU8_Underflow2 (1164 of 2142)
PASS: lldb-unit :: ScriptInterpreter/Python/./ScriptInterpreterPythonTests/PythonDataObjectsTest.TestPythonStringToStructuredString (1165 of 2142)
PASS: lldb-unit :: Utility/./UtilityTests/AnsiTerminal.WhiteSpace (1166 of 2142)
PASS: lldb-unit :: UnwindAssembly/x86/./UnwindAssemblyx86Tests/Testx86AssemblyInspectionEngine.TestDisassemblyJunkBytes (1167 of 2142)
PASS: lldb-api :: functionalities/data-formatter/poarray/TestPrintObjectArray.py (1168 of 2142)
PASS: lldb-api :: lang/c/global_variables/TestGlobalVariables.py (1169 of 2142)
PASS: lldb-shell :: Quit/TestQuitExitCodeHexA.test (1170 of 2142)
PASS: lldb-unit :: Utility/./UtilityTests/ArgsTest.BareSingleQuote (1171 of 2142)
PASS: lldb-api :: functionalities/data-formatter/data-formatter-stl/libcxx/variant/TestDataFormatterLibcxxVariant.py (1172 of 2142)
PASS: lldb-unit :: Utility/./UtilityTests/AnsiTerminal.Unknown (1173 of 2142)
UNSUPPORTED: lldb-shell :: ScriptInterpreter/Lua/independent_state.test (1174 of 2142)
PASS: lldb-unit :: ScriptInterpreter/Python/./ScriptInterpreterPythonTests/PythonDataObjectsTest.TestInstanceNameResolutionNoDot (1175 of 2142)
PASS: lldb-unit :: Utility/./UtilityTests/SerializationRountripTest.SerializeDeserializePod (1176 of 2142)
PASS: lldb-unit :: Utility/./UtilityTests/StringListTest.ShiftStdString (1177 of 2142)
PASS: lldb-api :: functionalities/inferior-crashing/recursive-inferior/TestRecursiveInferiorStep.py (1178 of 2142)
UNSUPPORTED: lldb-api :: functionalities/darwin_log/source/info/TestDarwinLogSourceInfo.py (1179 of 2142)
PASS: lldb-unit :: SymbolFile/DWARF/./SymbolFileDWARFTests/SymbolFileDWARFTests.ParseArangesNonzeroSegmentSize (1180 of 2142)
PASS: lldb-api :: commands/expression/call-throws/TestCallThatThrows.py (1181 of 2142)
PASS: lldb-unit :: Utility/./UtilityTests/SerializationRountripTest.SerializeDeserializeCString (1182 of 2142)
PASS: lldb-unit :: Expression/./ExpressionTests/CppModuleConfigurationTest.IgnoreLibStdCpp (1183 of 2142)
PASS: lldb-api :: lang/cpp/namespace/TestNamespace.py (1184 of 2142)
PASS: lldb-unit :: Utility/./UtilityTests/NameMatchesTest.Equals (1185 of 2142)
PASS: lldb-api :: commands/expression/import-std-module/weak_ptr-dbg-info-content/TestDbgInfoContentWeakPtrFromStdModule.py (1186 of 2142)
PASS: lldb-api :: functionalities/data-formatter/nsarraysynth/TestNSArraySynthetic.py (1187 of 2142)
PASS: lldb-api :: lang/objc/radar-9691614/TestObjCMethodReturningBOOL.py (1188 of 2142)
PASS: lldb-api :: functionalities/float-display/TestFloatDisplay.py (1189 of 2142)
PASS: lldb-shell :: SymbolFile/DWARF/debug-names-compressed.cpp (1190 of 2142)
PASS: lldb-unit :: Utility/./UtilityTests/StreamTest.PutRawBytesToBigEndian (1191 of 2142)
PASS: lldb-api :: tools/lldb-server/commandline/TestStubReverseConnect.py (1192 of 2142)
PASS: lldb-api :: functionalities/reproducers/attach/TestReproducerAttach.py (1193 of 2142)
UNSUPPORTED: lldb-shell :: Breakpoint/case-insensitive.test (1194 of 2142)
PASS: lldb-unit :: Utility/./UtilityTests/StreamTest.AddressEmptyPrefix (1195 of 2142)
PASS: lldb-unit :: Symbol/./SymbolTests/TestClangASTImporter.MetadataPropagationIndirectImport (1196 of 2142)
PASS: lldb-unit :: Core/./LLDBCoreTests/ModuleSpecTest.TestCOFFFile (1197 of 2142)
PASS: lldb-unit :: Utility/./UtilityTests/StreamTest.AddressSuffix (1198 of 2142)
UNSUPPORTED: lldb-api :: functionalities/data-formatter/data-formatter-stl/libstdcpp/unique_ptr/TestDataFormatterStdUniquePtr.py (1199 of 2142)
PASS: lldb-unit :: Utility/./UtilityTests/FileSpecTest.GetPath (1200 of 2142)
PASS: lldb-shell :: ObjectFile/PECOFF/sections.yaml (1201 of 2142)
PASS: lldb-api :: commands/expression/result_numbering/TestResultNumbering.py (1202 of 2142)
PASS: lldb-shell :: Reproducer/TestDebugSymbols.test (1203 of 2142)
PASS: lldb-unit :: Utility/./UtilityTests/RegularExpression.CopyAssignment (1204 of 2142)
PASS: lldb-unit :: Expression/./ExpressionTests/DiagnosticManagerTest.GetStringSeverityLabels (1205 of 2142)
UNSUPPORTED: lldb-shell :: SymbolFile/PDB/func-symbols.test (1206 of 2142)
PASS: lldb-unit :: Language/Highlighting/./HighlighterTests/HighlighterTest.ClangCursorPosAfterOtherToken (1207 of 2142)
PASS: lldb-api :: functionalities/fat_archives/TestFatArchives.py (1208 of 2142)
PASS: lldb-shell :: ObjectFile/ELF/section-types.yaml (1209 of 2142)
UNSUPPORTED: lldb-api :: tools/lldb-server/TestGdbRemoteAuxvSupport.py (1210 of 2142)
PASS: lldb-unit :: Language/Highlighting/./HighlighterTests/HighlighterTest.ClangCursorPosInOtherToken (1211 of 2142)
PASS: lldb-shell :: Unwind/thread-step-out-ret-addr-check.test (1212 of 2142)
PASS: lldb-api :: functionalities/data-formatter/nsdictionarysynth/TestNSDictionarySynthetic.py (1213 of 2142)
PASS: lldb-shell :: ObjectFile/PECOFF/sections-names.yaml (1214 of 2142)
PASS: lldb-unit :: Language/Highlighting/./HighlighterTests/HighlighterTest.ClangPPDirectives (1215 of 2142)
PASS: lldb-unit :: Process/gdb-remote/./ProcessGdbRemoteTests/GDBRemoteCommunicationServerTest.SendErrorResponse_ErrorNumber (1216 of 2142)
PASS: lldb-api :: functionalities/data-formatter/data-formatter-named-summaries/TestDataFormatterNamedSummaries.py (1217 of 2142)
PASS: lldb-api :: functionalities/gdb_remote_client/TestIOSSimulator.py (1218 of 2142)
PASS: lldb-api :: functionalities/data-formatter/var-in-aggregate-misuse/TestVarInAggregateMisuse.py (1219 of 2142)
PASS: lldb-unit :: Utility/./UtilityTests/FileSpecTest.GuessPathStyle (1220 of 2142)
PASS: lldb-unit :: Utility/./UtilityTests/StringExtractorTest.GetHexBytes_FullString (1221 of 2142)
PASS: lldb-shell :: Minidump/disassemble-no-module.yaml (1222 of 2142)
PASS: lldb-unit :: Utility/./UtilityTests/FileSpecTest.IsRelative (1223 of 2142)
UNSUPPORTED: lldb-api :: benchmarks/continue/TestBenchmarkContinue.py (1224 of 2142)
PASS: lldb-api :: python_api/disassemble-raw-data/TestDisassembleRawData.py (1225 of 2142)
PASS: lldb-unit :: Process/minidump/./LLDBMinidumpTests/MinidumpParserTest.FindMemoryRange (1226 of 2142)
PASS: lldb-unit :: Utility/./UtilityTests/AnsiTerminal.Twice (1227 of 2142)
PASS: lldb-unit :: Platform/Android/./AdbClientTests/AdbClientTest.CreateByDeviceId_ByEnvVar (1228 of 2142)
PASS: lldb-api :: functionalities/data-formatter/nssetsynth/TestNSSetSynthetic.py (1229 of 2142)
PASS: lldb-unit :: Target/./TargetTests/ExecutionContextTest.GetByteOrderProcess (1230 of 2142)
PASS: lldb-shell :: SymbolFile/DWARF/debug_loc.s (1231 of 2142)
PASS: lldb-api :: functionalities/data-formatter/refpointer-recursion/TestDataFormatterRefPtrRecursion.py (1232 of 2142)
PASS: lldb-shell :: SymbolFile/DWARF/deterministic-build.cpp (1233 of 2142)
UNSUPPORTED: lldb-shell :: ObjectFile/PECOFF/disassemble-thumb.yaml (1234 of 2142)
UNSUPPORTED: lldb-api :: tools/lldb-vscode/disconnect/TestVSCode_disconnect.py (1235 of 2142)
PASS: lldb-shell :: Host/TestCustomShell.test (1236 of 2142)
PASS: lldb-api :: lang/cpp/scope/TestCppScope.py (1237 of 2142)
PASS: lldb-unit :: Utility/./UtilityTests/StreamTest.PutHex64ByteOrderLittle (1238 of 2142)
PASS: lldb-api :: commands/apropos/with-process/TestAproposWithProcess.py (1239 of 2142)
PASS: lldb-unit :: Host/./HostTests/FileSystemTest.GetPermissions (1240 of 2142)
PASS: lldb-api :: lang/objc/objc-ivar-offsets/TestObjCIvarOffsets.py (1241 of 2142)
PASS: lldb-api :: lang/objc/global_ptrs/TestGlobalObjects.py (1242 of 2142)
PASS: lldb-api :: functionalities/conditional_break/TestConditionalBreak.py (1243 of 2142)
PASS: lldb-shell :: SymbolFile/DWARF/dwo-type-in-main-file.s (1244 of 2142)
PASS: lldb-api :: python_api/lldbutil/iter/TestLLDBIterator.py (1245 of 2142)
PASS: lldb-api :: lang/cpp/extern_c/TestExternCSymbols.py (1246 of 2142)
PASS: lldb-unit :: Utility/./UtilityTests/OptionsWithRawTest.WhitespaceSuffix (1247 of 2142)
PASS: lldb-unit :: UnwindAssembly/x86/./UnwindAssemblyx86Tests/Testx86AssemblyInspectionEngine.Test64bitFramelessBigStackFrame (1248 of 2142)
PASS: lldb-unit :: Process/gdb-remote/./ProcessGdbRemoteTests/GDBRemoteCommunicationClientTest.SendGetMetaDataPacket (1249 of 2142)
PASS: lldb-api :: tools/lldb-vscode/breakpoint/TestVSCode_setExceptionBreakpoints.py (1250 of 2142)
UNSUPPORTED: lldb-api :: macosx/macCatalystAppMacOSFramework/TestMacCatalystAppWithMacOSFramework.py (1251 of 2142)
PASS: lldb-unit :: Utility/./UtilityTests/ArgsTest.TestSingleArgWithQuotedSpace (1252 of 2142)
PASS: lldb-api :: lang/cpp/const_this/TestConstThis.py (1253 of 2142)
PASS: lldb-api :: lang/objc/foundation/TestObjCMethods.py (1254 of 2142)
PASS: lldb-api :: macosx/duplicate-archive-members/TestDuplicateMembers.py (1255 of 2142)
PASS: lldb-api :: lang/c/shared_lib/TestSharedLib.py (1256 of 2142)
PASS: lldb-api :: functionalities/data-formatter/data-formatter-synthtype/TestDataFormatterSynthType.py (1257 of 2142)
PASS: lldb-shell :: Minidump/memory-region.yaml (1258 of 2142)
UNSUPPORTED: lldb-api :: benchmarks/libcxxlist/TestBenchmarkLibcxxList.py (1259 of 2142)
PASS: lldb-unit :: Symbol/./SymbolTests/TestClangASTImporter.CanImportInvalidType (1260 of 2142)
UNSUPPORTED: lldb-api :: arm/breakpoint-it/TestBreakpointIt.py (1261 of 2142)
PASS: lldb-api :: functionalities/data-formatter/hexcaps/TestDataFormatterHexCaps.py (1262 of 2142)
PASS: lldb-unit :: Host/./HostTests/ProcessLaunchInfoTest.Constructor (1263 of 2142)
PASS: lldb-unit :: Utility/./UtilityTests/VMRange.Clear (1264 of 2142)
PASS: lldb-api :: lang/cpp/trivial_abi/TestTrivialABI.py (1265 of 2142)
PASS: lldb-unit :: Host/./HostTests/FileSystemTest.OpenErrno (1266 of 2142)
PASS: lldb-unit :: UnwindAssembly/x86/./UnwindAssemblyx86Tests/Testx86AssemblyInspectionEngine.TestSimple32bitFrameFunction (1267 of 2142)
PASS: lldb-shell :: Settings/TestDisableColor.test (1268 of 2142)
PASS: lldb-api :: python_api/sbstructureddata/TestStructuredDataAPI.py (1269 of 2142)
PASS: lldb-api :: python_api/value_var_update/TestValueVarUpdate.py (1270 of 2142)
UNSUPPORTED: lldb-api :: lang/objc/foundation/TestFoundationDisassembly.py (1271 of 2142)
PASS: lldb-shell :: SymbolFile/DWARF/debug-types-missing-signature.test (1272 of 2142)
PASS: lldb-unit :: Utility/./UtilityTests/BroadcasterTest.EventTypeHasListeners (1273 of 2142)
PASS: lldb-unit :: Utility/./UtilityTests/GeneratorTest.Create (1274 of 2142)
PASS: lldb-unit :: Process/minidump/./LLDBMinidumpTests/MinidumpParserTest.GetThreadContext_x86_64 (1275 of 2142)
PASS: lldb-unit :: Utility/./UtilityTests/LogChannelTest.List (1276 of 2142)
PASS: lldb-api :: functionalities/recursion/TestValueObjectRecursion.py (1277 of 2142)
PASS: lldb-unit :: DataFormatter/./LLDBFormatterTests/FormatManagerTests.CompatibleLangs (1278 of 2142)
PASS: lldb-unit :: Utility/./UtilityTests/StreamTest.PutSLEB128 (1279 of 2142)
UNSUPPORTED: lldb-api :: functionalities/tsan/basic/TestTsanBasic.py (1280 of 2142)
PASS: lldb-shell :: ScriptInterpreter/Python/crashlog.test (1281 of 2142)
PASS: lldb-api :: functionalities/unwind/zeroth_frame/TestZerothFrame.py (1282 of 2142)
PASS: lldb-unit :: Process/minidump/./LLDBMinidumpTests/MinidumpParserTest.MinidumpDuplicateModuleMappedSecond (1283 of 2142)
PASS: lldb-api :: lang/objc/rdar-10967107/TestRdar10967107.py (1284 of 2142)
PASS: lldb-shell :: SymbolFile/DWARF/debug-types-address-ranges.s (1285 of 2142)
UNSUPPORTED: lldb-api :: commands/watchpoints/multi_watchpoint_slots/TestWatchpointMultipleSlots.py (1286 of 2142)
PASS: lldb-api :: functionalities/postmortem/wow64_minidump/TestWow64MiniDump.py (1287 of 2142)
PASS: lldb-shell :: Reproducer/TestFileRepro.test (1288 of 2142)
PASS: lldb-unit :: Interpreter/./InterpreterTests/OptionArgParserTest.toBoolean (1289 of 2142)
PASS: lldb-api :: commands/expression/namespace_local_var_same_name_cpp_and_c/TestNamespaceLocalVarSameNameCppAndC.py (1290 of 2142)
PASS: lldb-unit :: Host/./HostTests/HostInfoTest.GetHostname (1291 of 2142)
UNSUPPORTED: lldb-shell :: Unwind/unwind-plan-dwarf-dump.test (1292 of 2142)
PASS: lldb-api :: commands/expression/dont_allow_jit/TestAllowJIT.py (1293 of 2142)
PASS: lldb-unit :: Target/./TargetTests/ExecutionContextTest.GetByteOrderTarget (1294 of 2142)
PASS: lldb-unit :: Language/Highlighting/./HighlighterTests/HighlighterTest.HighlighterSelectionType (1295 of 2142)
PASS: lldb-api :: lang/objc/orderedset/TestOrderedSet.py (1296 of 2142)
PASS: lldb-shell :: Driver/TestConvenienceVariables.test (1297 of 2142)
PASS: lldb-api :: commands/watchpoints/watchpoint_count/TestWatchpointCount.py (1298 of 2142)
PASS: lldb-api :: functionalities/return-value/TestReturnValue.py (1299 of 2142)
PASS: lldb-api :: lang/cpp/bitfields/TestCppBitfields.py (1300 of 2142)
PASS: lldb-shell :: SymbolFile/DWARF/DW_AT_low_pc-addrx.s (1301 of 2142)
PASS: lldb-unit :: Expression/./ExpressionTests/CppModuleConfigurationTest.LinuxLocalLibCpp (1302 of 2142)
PASS: lldb-unit :: Utility/./UtilityTests/UriParserTest.SchemeHostSeparator3 (1303 of 2142)
PASS: lldb-shell :: Commands/command-stop-hook-output.test (1304 of 2142)
PASS: lldb-api :: commands/expression/radar_8638051/Test8638051.py (1305 of 2142)
PASS: lldb-api :: commands/expression/persistent_variables/TestPersistentVariables.py (1306 of 2142)
PASS: lldb-shell :: SymbolFile/DWARF/find-function-regex.cpp (1307 of 2142)
PASS: lldb-unit :: Utility/./UtilityTests/ArgsTest.ReplaceArgumentAtIndexShort (1308 of 2142)
PASS: lldb-api :: functionalities/thread/exit_during_step/TestExitDuringStep.py (1309 of 2142)
PASS: lldb-api :: lang/cpp/limit-debug-info/TestWithLimitDebugInfo.py (1310 of 2142)
PASS: lldb-api :: lang/c/tls_globals/TestTlsGlobals.py (1311 of 2142)
PASS: lldb-unit :: Target/./TargetTests/StackFrameRecognizerTest.NullModuleRegex (1312 of 2142)
PASS: lldb-shell :: SymbolFile/DWARF/array-sizes.s (1313 of 2142)
PASS: lldb-unit :: Utility/./UtilityTests/BinaryStreamTest.PutULEB128TwoBytes (1314 of 2142)
PASS: lldb-unit :: Utility/./UtilityTests/StreamTeeTest.Constructor1Stream (1315 of 2142)
PASS: lldb-api :: functionalities/gdb_remote_client/TestJLink6Armv7RegisterDefinition.py (1316 of 2142)
PASS: lldb-unit :: Language/Highlighting/./HighlighterTests/HighlighterTest.ClangIdentifiers (1317 of 2142)
PASS: lldb-api :: lang/objc/objc-runtime-ivars/TestRuntimeIvars.py (1318 of 2142)
PASS: lldb-shell :: ScriptInterpreter/Python/scripted_breakpoint.test (1319 of 2142)
PASS: lldb-shell :: Minidump/fb-dump.test (1320 of 2142)
PASS: lldb-unit :: UnwindAssembly/x86/./UnwindAssemblyx86Tests/Testx86AssemblyInspectionEngine.Test64bitFramelessSmallStackFrame (1321 of 2142)
PASS: lldb-shell :: ObjectFile/ELF/section-overlap.yaml (1322 of 2142)
PASS: lldb-shell :: SymbolFile/DWARF/dwarf5-debug_line.s (1323 of 2142)
PASS: lldb-api :: commands/watchpoints/hello_watchpoint/TestMyFirstWatchpoint.py (1324 of 2142)
PASS: lldb-api :: commands/expression/import-std-module/deque-dbg-info-content/TestDbgInfoContentDequeFromStdModule.py (1325 of 2142)
UNSUPPORTED: lldb-api :: tools/lldb-vscode/completions/TestVSCode_completions.py (1326 of 2142)
PASS: lldb-unit :: Utility/./UtilityTests/StringListTest.GetMaxStringLengthEmpty (1327 of 2142)
PASS: lldb-unit :: UnwindAssembly/x86/./UnwindAssemblyx86Tests/Testx86AssemblyInspectionEngine.TestAddESP (1328 of 2142)
PASS: lldb-api :: functionalities/data-formatter/type_summary_list_script/TestTypeSummaryListScript.py (1329 of 2142)
PASS: lldb-unit :: Language/Highlighting/./HighlighterTests/HighlighterTest.HighlighterSelectionPath (1330 of 2142)
PASS: lldb-api :: commands/expression/issue_11588/Test11588.py (1331 of 2142)
PASS: lldb-unit :: Utility/./UtilityTests/OptionsWithRawTest.SingleWordSuffix (1332 of 2142)
PASS: lldb-unit :: Utility/./UtilityTests/CompletionRequest.TryCompleteCurrentArgGood (1333 of 2142)
PASS: lldb-unit :: Process/gdb-remote/./ProcessGdbRemoteTests/GDBRemoteClientBaseTest.SendContinueDelegateInterface (1334 of 2142)
PASS: lldb-api :: commands/expression/calculator_mode/TestCalculatorMode.py (1335 of 2142)
PASS: lldb-unit :: Utility/./UtilityTests/CompletionRequest.Constructor (1336 of 2142)
UNSUPPORTED: lldb-shell :: Register/x86-64-zmm-write.test (1337 of 2142)
PASS: lldb-shell :: SymbolFile/DWARF/debug_line-tombstone.s (1338 of 2142)
UNSUPPORTED: lldb-api :: tools/lldb-server/registers-target-xml-reading/TestGdbRemoteTargetXmlPacket.py (1339 of 2142)
PASS: lldb-unit :: Host/./HostTests/Host.GetEnvironment (1340 of 2142)
PASS: lldb-shell :: BuildScript/modes.test (1341 of 2142)
UNSUPPORTED: lldb-api :: functionalities/thread/create_during_step/TestCreateDuringStep.py (1342 of 2142)
PASS: lldb-api :: functionalities/rerun/TestRerun.py (1343 of 2142)
PASS: lldb-api :: python_api/function_symbol/TestSymbolAPI.py (1344 of 2142)
PASS: lldb-api :: commands/watchpoints/watchpoint_commands/TestWatchpointCommands.py (1345 of 2142)
PASS: lldb-unit :: Expression/./ExpressionTests/DiagnosticManagerTest.GetStringBasic (1346 of 2142)
UNSUPPORTED: lldb-api :: lang/objc/ptr_refs/TestPtrRefsObjC.py (1347 of 2142)
PASS: lldb-api :: commands/expression/call-function/TestCallStdStringFunction.py (1348 of 2142)
PASS: lldb-api :: lang/cpp/typeof/TestTypeOfDeclTypeExpr.py (1349 of 2142)
PASS: lldb-unit :: Utility/./UtilityTests/VMRange.Reset (1350 of 2142)
PASS: lldb-api :: functionalities/abbreviation/TestCommonShortSpellings.py (1351 of 2142)
PASS: lldb-api :: functionalities/breakpoint/objc/TestObjCBreakpoints.py (1352 of 2142)
PASS: lldb-unit :: Utility/./UtilityTests/ListenerTest.GetEventWait (1353 of 2142)
PASS: lldb-unit :: tools/lldb-server/tests/./LLDBServerTests/TestBase.DebugserverEnv (1354 of 2142)
PASS: lldb-unit :: DataFormatter/./LLDBFormatterTests/TypeMatcherTests.CreatedBySameMatchString (1355 of 2142)
PASS: lldb-unit :: Host/./HostTests/SocketTest.UDPConnect (1356 of 2142)
PASS: lldb-api :: functionalities/data-formatter/format-propagation/TestFormatPropagation.py (1357 of 2142)
PASS: lldb-unit :: Utility/./UtilityTests/ConstStringTest.CompareConstString (1358 of 2142)
PASS: lldb-shell :: Commands/command-regex-unalias.test (1359 of 2142)
PASS: lldb-unit :: Utility/./UtilityTests/ArgsTest.TestInsertArg (1360 of 2142)
PASS: lldb-api :: python_api/sbplatform/TestSBPlatform.py (1361 of 2142)
PASS: lldb-api :: lang/c/conflicting-symbol/TestConflictingSymbol.py (1362 of 2142)
PASS: lldb-api :: lang/cpp/class_static/TestStaticVariables.py (1363 of 2142)
PASS: lldb-api :: commands/expression/timeout/TestCallWithTimeout.py (1364 of 2142)
PASS: lldb-unit :: SymbolFile/NativePDB/./SymbolFileNativePDBTests/PDBFPOProgramToDWARFExpressionTests.UnresolvedDependentCyclicRegisterAssignmentReference (1365 of 2142)
PASS: lldb-unit :: Host/./HostTests/NativeProcessProtocolTest.SetBreakpoint (1366 of 2142)
UNSUPPORTED: lldb-api :: functionalities/darwin_log/filter/regex/message/TestDarwinLogFilterRegexMessage.py (1367 of 2142)
PASS: lldb-api :: functionalities/tail_call_frames/sbapi_support/TestTailCallFrameSBAPI.py (1368 of 2142)
PASS: lldb-unit :: Utility/./UtilityTests/DataExtractorTest.GetMaxU64 (1369 of 2142)
PASS: lldb-unit :: Utility/./UtilityTests/ArchSpecTest.MergeFrom (1370 of 2142)
PASS: lldb-unit :: ScriptInterpreter/Python/./ScriptInterpreterPythonTests/PythonDataObjectsTest.TestGlobalNameResolutionWithDot (1371 of 2142)
PASS: lldb-unit :: UnwindAssembly/x86/./UnwindAssemblyx86Tests/Testx86AssemblyInspectionEngine.TestDisassemblyMidFunctionEpilogues (1372 of 2142)
PASS: lldb-unit :: Process/minidump/./LLDBMinidumpTests/MinidumpParserTest.MinidumpDuplicateModuleSeparateCode (1373 of 2142)
XFAIL: lldb-shell :: SymbolFile/DWARF/find-type-in-function.cpp (1374 of 2142)
PASS: lldb-api :: lang/cpp/covariant-return-types/TestCovariantReturnTypes.py (1375 of 2142)
PASS: lldb-api :: commands/expression/vector_of_enums/TestVectorOfEnums.py (1376 of 2142)
PASS: lldb-unit :: Utility/./UtilityTests/StreamTest.QuotedCString (1377 of 2142)
UNSUPPORTED: lldb-api :: functionalities/tsan/global_location/TestTsanGlobalLocation.py (1378 of 2142)
PASS: lldb-api :: commands/frame/var-scope/TestFrameVariableScope.py (1379 of 2142)
PASS: lldb-api :: functionalities/thread/concurrent_events/TestConcurrentDelaySignalWatch.py (1380 of 2142)
PASS: lldb-unit :: SymbolFile/NativePDB/./SymbolFileNativePDBTests/PDBFPOProgramToDWARFExpressionTests.UnresolvedRegisterAssignmentReference (1381 of 2142)
PASS: lldb-unit :: Utility/./UtilityTests/RegularExpression.Match (1382 of 2142)
PASS: lldb-unit :: UnwindAssembly/x86/./UnwindAssemblyx86Tests/Testx86AssemblyInspectionEngine.TestPopEDI (1383 of 2142)
PASS: lldb-unit :: Host/./HostTests/File.GetStreamFromDescriptor (1384 of 2142)
PASS: lldb-api :: driver/batch_mode/TestBatchMode.py (1385 of 2142)
PASS: lldb-api :: functionalities/breakpoint/breakpoint_ids/TestBreakpointIDs.py (1386 of 2142)
PASS: lldb-shell :: SymbolFile/DWARF/dir-separator-windows.s (1387 of 2142)
UNSUPPORTED: lldb-shell :: ObjectFile/ELF/minidebuginfo-no-lzma.yaml (1388 of 2142)
PASS: lldb-unit :: UnwindAssembly/x86/./UnwindAssemblyx86Tests/Testx86AssemblyInspectionEngine.TestAddRSP (1389 of 2142)
PASS: lldb-api :: python_api/debugger/TestDebuggerAPI.py (1390 of 2142)
PASS: lldb-api :: functionalities/inferior-crashing/recursive-inferior/TestRecursiveInferior.py (1391 of 2142)
PASS: lldb-unit :: Process/gdb-remote/./ProcessGdbRemoteTests/GDBRemoteCommunicationServerTest.SendErrorResponse_StringError (1392 of 2142)
PASS: lldb-shell :: SymbolFile/DWARF/limit-debug-info.s (1393 of 2142)
PASS: lldb-unit :: Host/./HostTests/FileSystemTest.Readable (1394 of 2142)
PASS: lldb-shell :: BuildScript/script-args.test (1395 of 2142)
PASS: lldb-api :: functionalities/gdb_remote_client/TestGDBRemoteClient.py (1396 of 2142)
PASS: lldb-api :: lang/objc/objc-super/TestObjCSuper.py (1397 of 2142)
PASS: lldb-shell :: Driver/LocalLLDBInit.test (1398 of 2142)
PASS: lldb-shell :: SymbolFile/DWARF/parallel-indexing-stress.s (1399 of 2142)
PASS: lldb-api :: commands/expression/completion/TestExprCompletion.py (1400 of 2142)
PASS: lldb-api :: commands/log/basic/TestLogging.py (1401 of 2142)
PASS: lldb-unit :: Utility/./UtilityTests/StreamTest.PutMaxHex64ByteOrderLittle (1402 of 2142)
PASS: lldb-unit :: Utility/./UtilityTests/LogChannelEnabledTest.log_options (1403 of 2142)
PASS: lldb-api :: functionalities/lazy-loading/TestLazyLoading.py (1404 of 2142)
PASS: lldb-unit :: Process/gdb-remote/./ProcessGdbRemoteTests/GDBRemoteCommunicationClientTest.GetModulesInfoInvalidResponse (1405 of 2142)
PASS: lldb-shell :: Driver/TestRepl.test (1406 of 2142)
PASS: lldb-unit :: debugserver/./debugserverTests/RNBSocket.LoopBackConnectIPv6 (1407 of 2142)
PASS: lldb-unit :: Utility/./UtilityTests/BinaryStreamTest.PutULEB128FiveBytes (1408 of 2142)
UNSUPPORTED: lldb-api :: arm/breakpoint-thumb-codesection/TestBreakpointThumbCodesection.py (1409 of 2142)
PASS: lldb-unit :: Utility/./UtilityTests/OptionsWithRawTest.ArgsButNoDelimiter (1410 of 2142)
PASS: lldb-shell :: SymbolFile/DWARF/dir-separator-no-comp-dir.s (1411 of 2142)
PASS: lldb-api :: python_api/module_section/TestModuleAndSection.py (1412 of 2142)
PASS: lldb-api :: commands/expression/call-function/TestCallBuiltinFunction.py (1413 of 2142)
PASS: lldb-api :: functionalities/breakpoint/breakpoint_names/TestBreakpointNames.py (1414 of 2142)
PASS: lldb-unit :: Utility/./UtilityTests/LogTest.LLDB_LOG_nullptr (1415 of 2142)
PASS: lldb-api :: python_api/process/read-mem-cstring/TestReadMemCString.py (1416 of 2142)
UNSUPPORTED: lldb-api :: commands/trace/TestTraceSchema.py (1417 of 2142)
PASS: lldb-unit :: Utility/./UtilityTests/ArgsTest.GetArgumentArrayRef (1418 of 2142)
PASS: lldb-unit :: Breakpoint/./LLDBBreakpointTests/BreakpointIDTest.StringIsBreakpointName (1419 of 2142)
PASS: lldb-api :: commands/frame/diagnose/bad-reference/TestBadReference.py (1420 of 2142)
PASS: lldb-api :: lang/cpp/llvm-style/TestLLVMStyle.py (1421 of 2142)
UNSUPPORTED: lldb-shell :: Register/x86-64-xmm16-write.test (1422 of 2142)
PASS: lldb-unit :: Utility/./UtilityTests/Flags.Reset (1423 of 2142)
PASS: lldb-unit :: Utility/./UtilityTests/RangeTest.DefaultConstructor (1424 of 2142)
PASS: lldb-unit :: Process/gdb-remote/./ProcessGdbRemoteTests/GDBRemoteCommunicationClientTest.GetModulesInfo (1425 of 2142)
PASS: lldb-api :: python_api/default-constructor/TestDefaultConstructorForAPIObjects.py (1426 of 2142)
PASS: lldb-shell :: BuildScript/compiler-full-path.test (1427 of 2142)
PASS: lldb-unit :: Utility/./UtilityTests/StreamTest.PutBytesAsRawHex8ToLittleEndian (1428 of 2142)
UNSUPPORTED: lldb-api :: functionalities/unwind/standard/TestStandardUnwind.py (1429 of 2142)
PASS: lldb-api :: functionalities/data-formatter/data-formatter-synthval/TestDataFormatterSynthVal.py (1430 of 2142)
PASS: lldb-unit :: Utility/./UtilityTests/RangeTest.NotEqual (1431 of 2142)
PASS: lldb-api :: python_api/watchpoint/watchlocation/TestTargetWatchAddress.py (1432 of 2142)
UNSUPPORTED: lldb-shell :: Register/aarch64-gp-read.test (1433 of 2142)
PASS: lldb-shell :: SymbolFile/DWARF/DW_OP_piece-smaller-than-struct.s (1434 of 2142)
PASS: lldb-api :: lang/cpp/overloaded-functions/TestOverloadedFunctions.py (1435 of 2142)
PASS: lldb-api :: python_api/class_members/TestSBTypeClassMembers.py (1436 of 2142)
PASS: lldb-unit :: Utility/./UtilityTests/RangeTest.ContainsEndInclusiveInvalid (1437 of 2142)
PASS: lldb-api :: lang/cpp/unicode-literals/TestUnicodeLiterals.py (1438 of 2142)
PASS: lldb-shell :: Reproducer/TestWorkingDir.test (1439 of 2142)
PASS: lldb-unit :: Expression/./ExpressionTests/DiagnosticManagerTest.GetStringMultipleDiags (1440 of 2142)
PASS: lldb-unit :: DataFormatter/./LLDBFormatterTests/TypeMatcherTests.GetMatchStringRegex (1441 of 2142)
PASS: lldb-unit :: Language/Highlighting/./HighlighterTests/HighlighterTest.ClangCursorPos (1442 of 2142)
PASS: lldb-unit :: Utility/./UtilityTests/ScalarTest.GetBytes (1443 of 2142)
PASS: lldb-api :: commands/command/script/TestCommandScript.py (1444 of 2142)
PASS: lldb-unit :: ScriptInterpreter/Python/./ScriptInterpreterPythonTests/PythonDataObjectsTest.TestPythonStringToStr (1445 of 2142)
PASS: lldb-unit :: Utility/./UtilityTests/ScalarTest.Getters (1446 of 2142)
PASS: lldb-api :: commands/expression/import-std-module/pair/TestPairFromStdModule.py (1447 of 2142)
PASS: lldb-api :: python_api/exprpath_synthetic/TestExprPathSynthetic.py (1448 of 2142)
PASS: lldb-unit :: Utility/./UtilityTests/ScalarTest.Equality (1449 of 2142)
PASS: lldb-unit :: Host/./HostTests/FileSystemTest.FileAndDirectoryComponents (1450 of 2142)
UNSUPPORTED: lldb-api :: functionalities/gdb_remote_client/TestWasm.py (1451 of 2142)
PASS: lldb-api :: commands/expression/unicode-in-variable/TestUnicodeInVariable.py (1452 of 2142)
PASS: lldb-unit :: Utility/./UtilityTests/StringListTest.InsertStringAtIndexStart (1453 of 2142)
PASS: lldb-api :: functionalities/thread/concurrent_events/TestConcurrentWatchpointDelayWatchpointOneBreakpoint.py (1454 of 2142)
PASS: lldb-unit :: Expression/./ExpressionTests/CppModuleConfigurationTest.MissingLibCpp (1455 of 2142)
PASS: lldb-api :: lang/c/vla/TestVLA.py (1456 of 2142)
PASS: lldb-shell :: SymbolFile/DWARF/DW_TAG_basic_type_DW_ATE_UTF_nonC.ll (1457 of 2142)
PASS: lldb-unit :: Utility/./UtilityTests/BinaryStreamTest.PutSLEB128FiveBytes (1458 of 2142)
PASS: lldb-unit :: Expression/./ExpressionTests/CppModuleConfigurationTest.Linux (1459 of 2142)
PASS: lldb-api :: commands/expression/import-std-module/vector/TestVectorFromStdModule.py (1460 of 2142)
PASS: lldb-api :: functionalities/breakpoint/breakpoint_set_restart/TestBreakpointSetRestart.py (1461 of 2142)
PASS: lldb-unit :: Utility/./UtilityTests/StreamTest.AddressRangeInvalidRange (1462 of 2142)
PASS: lldb-api :: functionalities/data-formatter/data-formatter-advanced/TestDataFormatterAdv.py (1463 of 2142)
PASS: lldb-api :: commands/expression/call-function/TestCallStopAndContinue.py (1464 of 2142)
PASS: lldb-shell :: SymbolFile/DWARF/find-method.cpp (1465 of 2142)
UNSUPPORTED: lldb-api :: functionalities/data-formatter/data-formatter-stl/libstdcpp/vbool/TestDataFormatterStdVBool.py (1466 of 2142)
PASS: lldb-api :: commands/expression/formatters/TestFormatters.py (1467 of 2142)
PASS: lldb-shell :: SymbolFile/DWARF/dir-separator-posix.s (1468 of 2142)
UNSUPPORTED: lldb-api :: functionalities/darwin_log/filter/exact_match/activity-chain/TestDarwinLogFilterMatchActivityChain.py (1469 of 2142)
PASS: lldb-shell :: SymbolFile/NativePDB/globals-bss.cpp (1470 of 2142)
PASS: lldb-api :: lang/c/local_variables/TestLocalVariables.py (1471 of 2142)
PASS: lldb-api :: lang/cpp/this_class_type_mixing/TestThisClassTypeMixing.py (1472 of 2142)
PASS: lldb-unit :: Core/./LLDBCoreTests/ModuleSpecTest.InvalidInMemoryBufferValidFile (1473 of 2142)
PASS: lldb-api :: functionalities/target-new-solib-notifications/TestModuleLoadedNotifys.py (1474 of 2142)
PASS: lldb-unit :: Symbol/./SymbolTests/TestTypeSystemClang.TestConvertAccessTypeToAccessSpecifier (1475 of 2142)
PASS: lldb-shell :: SymbolFile/DWARF/debug-types-basic.test (1476 of 2142)
PASS: lldb-api :: macosx/simulator/TestSimulatorPlatform.py (1477 of 2142)
PASS: lldb-api :: functionalities/data-formatter/summary-string-onfail/Test-rdar-9974002.py (1478 of 2142)
PASS: lldb-api :: lang/cpp/gmodules-templates/TestGModules.py (1479 of 2142)
UNSUPPORTED: lldb-api :: tools/intel-features/intel-pt/test/TestIntelPTSimpleBinary.py (1480 of 2142)
PASS: lldb-shell :: Driver/TestProcessAttach.test (1481 of 2142)
PASS: lldb-shell :: Reproducer/TestHomeDir.test (1482 of 2142)
UNSUPPORTED: lldb-api :: commands/gui/breakpoints/TestGuiBreakpoints.py (1483 of 2142)
PASS: lldb-api :: commands/expression/test/TestExprs2.py (1484 of 2142)
PASS: lldb-unit :: DataFormatter/./LLDBFormatterTests/StringPrinterTests.SwiftUTF8 (1485 of 2142)
PASS: lldb-api :: commands/watchpoints/watchpoint_commands/command/TestWatchpointCommandLLDB.py (1486 of 2142)
PASS: lldb-api :: sample_test/TestSampleTest.py (1487 of 2142)
PASS: lldb-shell :: Driver/TestError.test (1488 of 2142)
PASS: lldb-unit :: ObjectFile/Breakpad/./ObjectFileBreakpadTests/StackWinRecord.parse (1489 of 2142)
PASS: lldb-unit :: Utility/./UtilityTests/StreamTest.ShiftOperatorStrings (1490 of 2142)
PASS: lldb-api :: lang/objc/bitfield_ivars/TestBitfieldIvars.py (1491 of 2142)
PASS: lldb-unit :: Utility/./UtilityTests/ProcessInstanceInfo.Yaml (1492 of 2142)
PASS: lldb-unit :: Utility/./UtilityTests/RangeTest.SizeTypes (1493 of 2142)
PASS: lldb-api :: commands/command/script/import/rdar-12586188/TestRdar12586188.py (1494 of 2142)
PASS: lldb-unit :: Utility/./UtilityTests/StringListTest.JoinMultiCharSeparator (1495 of 2142)
PASS: lldb-api :: lang/objc/modules-update/TestClangModulesUpdate.py (1496 of 2142)
PASS: lldb-api :: lang/objc/objc-foundation-dictionary-empty/TestNSDictionary0.py (1497 of 2142)
PASS: lldb-api :: commands/expression/import-std-module/vector-dbg-info-content/TestDbgInfoContentVectorFromStdModule.py (1498 of 2142)
PASS: lldb-api :: commands/target/stop-hook/disable/TestTargetStopHookDisable.py (1499 of 2142)
PASS: lldb-api :: functionalities/thread/concurrent_events/TestConcurrentBreakpointOneDelayBreakpointThreads.py (1500 of 2142)
PASS: lldb-api :: lang/objcxx/objcxx-ivar-vector/TestIvarVector.py (1501 of 2142)
PASS: lldb-unit :: Utility/./UtilityTests/FileSpecTest.AppendPathComponent (1502 of 2142)
PASS: lldb-api :: functionalities/avoids-fd-leak/TestFdLeak.py (1503 of 2142)
PASS: lldb-api :: python_api/signals/TestSignalsAPI.py (1504 of 2142)
PASS: lldb-unit :: Utility/./UtilityTests/BinaryStreamTest.PutULEB128FourBytes (1505 of 2142)
UNSUPPORTED: lldb-api :: android/platform/TestDefaultCacheLineSize.py (1506 of 2142)
PASS: lldb-unit :: Utility/./UtilityTests/DataExtractorTest.GetFloat (1507 of 2142)
UNSUPPORTED: lldb-api :: functionalities/thread/concurrent_events/TestConcurrentManySignals.py (1508 of 2142)
PASS: lldb-unit :: SymbolFile/DWARF/./SymbolFileDWARFTests/SymbolFileDWARFTests.TestAbbrevOutOfOrder (1509 of 2142)
PASS: lldb-unit :: Utility/./UtilityTests/StringLexerTest.HasAtLeast (1510 of 2142)
PASS: lldb-api :: functionalities/data-formatter/data-formatter-stl/libcxx/string/TestDataFormatterLibcxxString.py (1511 of 2142)
PASS: lldb-shell :: BuildScript/toolchain-clang.test (1512 of 2142)
PASS: lldb-api :: functionalities/dlopen_other_executable/TestDlopenOtherExecutable.py (1513 of 2142)
PASS: lldb-api :: functionalities/data-formatter/data-formatter-objc/TestDataFormatterObjCNSError.py (1514 of 2142)
PASS: lldb-api :: functionalities/thread/state_after_expression/TestStateAfterExpression.py (1515 of 2142)
PASS: lldb-api :: functionalities/thread/step_until/TestStepUntil.py (1516 of 2142)
UNSUPPORTED: lldb-shell :: ObjectFile/ELF/minidebuginfo-set-and-hit-breakpoint.test (1517 of 2142)
PASS: lldb-shell :: SymbolFile/DWARF/DW_AT_data_bit_offset-DW_OP_stack_value.s (1518 of 2142)
PASS: lldb-unit :: Symbol/./SymbolTests/TestTypeSystemClang.TestGetTypeClassNested (1519 of 2142)
PASS: lldb-api :: commands/process/attach/TestProcessAttach.py (1520 of 2142)
PASS: lldb-unit :: Utility/./UtilityTests/Flags.AnySet (1521 of 2142)
PASS: lldb-api :: commands/settings/use_source_cache/TestUseSourceCache.py (1522 of 2142)
PASS: lldb-unit :: Utility/./UtilityTests/AnsiTerminal.Basic (1523 of 2142)
PASS: lldb-api :: commands/expression/import-std-module/conflicts/TestStdModuleWithConflicts.py (1524 of 2142)
PASS: lldb-api :: lang/cpp/char1632_t/TestChar1632T.py (1525 of 2142)
PASS: lldb-shell :: Reproducer/TestDriverOptions.test (1526 of 2142)
PASS: lldb-api :: commands/process/signal/TestProcessSignal.py (1527 of 2142)
PASS: lldb-unit :: Utility/./UtilityTests/StringListTest.SplitIntoLines (1528 of 2142)
UNSUPPORTED: lldb-shell :: ScriptInterpreter/Lua/bindings.test (1529 of 2142)
PASS: lldb-unit :: Expression/./ExpressionTests/DiagnosticManagerTest.AddDiagnostic (1530 of 2142)
PASS: lldb-unit :: Utility/./UtilityTests/StringExtractorTest.GetHexU8_InvalidHex (1531 of 2142)
PASS: lldb-unit :: Process/gdb-remote/./ProcessGdbRemoteTests/GDBRemoteCommunicationClientTest.SendGetTraceConfigPacket (1532 of 2142)
PASS: lldb-unit :: SymbolFile/DWARF/./SymbolFileDWARFTests/SymbolFileDWARFTests.TestAbbrevValidAttrNullForm (1533 of 2142)
PASS: lldb-api :: types/TestDoubleTypesExpr.py (1534 of 2142)
PASS: lldb-unit :: Utility/./UtilityTests/FileSpecTest.Yaml (1535 of 2142)
PASS: lldb-unit :: Utility/./UtilityTests/ReproducerTest.SetReplay (1536 of 2142)
PASS: lldb-api :: macosx/queues/TestQueues.py (1537 of 2142)
PASS: lldb-unit :: ScriptInterpreter/Python/./ScriptInterpreterPythonTests/PythonDataObjectsTest.TestPythonInteger (1538 of 2142)
PASS: lldb-unit :: Expression/./ExpressionTests/CppModuleConfigurationTest.UnknownLibCppFile (1539 of 2142)
PASS: lldb-shell :: SymbolFile/Breakpad/unwind-via-raSearch.test (1540 of 2142)
PASS: lldb-api :: commands/expression/import-std-module/list/TestListFromStdModule.py (1541 of 2142)
PASS: lldb-unit :: Utility/./UtilityTests/RangeTest.ContainsRangeStartingFromZero (1542 of 2142)
PASS: lldb-unit :: Utility/./UtilityTests/UriParserTest.MinimalPath (1543 of 2142)
PASS: lldb-unit :: Expression/./ExpressionTests/DiagnosticManagerTest.PutString (1544 of 2142)
PASS: lldb-api :: commands/expression/ir-interpreter-phi-nodes/TestIRInterpreterPHINodes.py (1545 of 2142)
PASS: lldb-api :: functionalities/memory-region/TestMemoryRegion.py (1546 of 2142)
PASS: lldb-shell :: Driver/TestCommands.test (1547 of 2142)
UNSUPPORTED: lldb-api :: functionalities/data-formatter/data-formatter-stl/libstdcpp/list/TestDataFormatterStdList.py (1548 of 2142)
PASS: lldb-unit :: Utility/./UtilityTests/OptionsWithRawTest.EmptySuffix (1549 of 2142)
PASS: lldb-shell :: ObjectFile/ELF/PT_LOAD-overlap.yaml (1550 of 2142)
UNSUPPORTED: lldb-api :: functionalities/breakpoint/hardware_breakpoints/hardware_breakpoint_on_multiple_threads/TestHWBreakMultiThread.py (1551 of 2142)
PASS: lldb-api :: functionalities/breakpoint/breakpoint_command/TestBreakpointCommandsFromPython.py (1552 of 2142)
PASS: lldb-unit :: UnwindAssembly/x86/./UnwindAssemblyx86Tests/Testx86AssemblyInspectionEngine.TestPushImm (1553 of 2142)
PASS: lldb-api :: functionalities/thread/concurrent_events/TestConcurrentCrashWithSignal.py (1554 of 2142)
PASS: lldb-api :: functionalities/gdb_remote_client/TestGDBRemoteDiskFileCompletion.py (1555 of 2142)
PASS: lldb-unit :: Editline/./EditlineTests/EditlineTestFixture.EditlineReceivesSingleLineText (1556 of 2142)
PASS: lldb-shell :: SymbolFile/Breakpad/unwind-via-stack-win.test (1557 of 2142)
PASS: lldb-shell :: SymbolFile/DWARF/DW_AT_loclists_base.s (1558 of 2142)
PASS: lldb-unit :: Utility/./UtilityTests/DataExtractorTest.GetSLEB128_bit63 (1559 of 2142)
PASS: lldb-api :: functionalities/data-formatter/varscript_formatting/TestDataFormatterVarScriptFormatting.py (1560 of 2142)
PASS: lldb-unit :: Utility/./UtilityTests/BinaryStreamTest.PutULEB128One (1561 of 2142)
UNSUPPORTED: lldb-api :: benchmarks/turnaround/TestCompileRunToBreakpointTurnaround.py (1562 of 2142)
PASS: lldb-unit :: Utility/./UtilityTests/ArgsTest.TestArgv (1563 of 2142)
PASS: lldb-api :: functionalities/thread/concurrent_events/TestConcurrentWatchpointWithDelayWatchpointThreads.py (1564 of 2142)
PASS: lldb-shell :: ObjectFile/Breakpad/sections.test (1565 of 2142)
PASS: lldb-unit :: Utility/./UtilityTests/LogChannelEnabledTest.LogVerboseThread (1566 of 2142)
PASS: lldb-api :: lang/cpp/gmodules/TestWithModuleDebugging.py (1567 of 2142)
PASS: lldb-api :: lang/objc/objc-property/TestObjCProperty.py (1568 of 2142)
PASS: lldb-api :: functionalities/breakpoint/address_breakpoints/TestBadAddressBreakpoints.py (1569 of 2142)
PASS: lldb-api :: lang/cpp/std-function-step-into-callable/TestStdFunctionStepIntoCallable.py (1570 of 2142)
PASS: lldb-api :: commands/expression/po_verbosity/TestPoVerbosity.py (1571 of 2142)
PASS: lldb-api :: functionalities/thread/crash_during_step/TestCrashDuringStep.py (1572 of 2142)
PASS: lldb-shell :: Watchpoint/SetErrorCases.test (1573 of 2142)
PASS: lldb-unit :: Utility/./UtilityTests/StreamTest.AddressRange (1574 of 2142)
PASS: lldb-api :: functionalities/stats_api/TestStatisticsAPI.py (1575 of 2142)
PASS: lldb-unit :: Utility/./UtilityTests/CompletionRequest.DuplicateFiltering (1576 of 2142)
PASS: lldb-unit :: Host/./HostTests/File.GetWaitableHandleFileno (1577 of 2142)
PASS: lldb-unit :: SymbolFile/NativePDB/./SymbolFileNativePDBTests/PDBFPOProgramToDWARFExpressionTests.UnsupportedRASearch (1578 of 2142)
PASS: lldb-api :: commands/platform/basic/TestPlatformPython.py (1579 of 2142)
PASS: lldb-api :: tools/lldb-vscode/console/TestVSCode_console.py (1580 of 2142)
PASS: lldb-unit :: Utility/./UtilityTests/ArgsTest.TestUnknownEscape (1581 of 2142)
PASS: lldb-api :: lang/objc/foundation/TestObjCMethodsNSArray.py (1582 of 2142)
PASS: lldb-unit :: Utility/./UtilityTests/RangeTest.ContainsAddr (1583 of 2142)
PASS: lldb-api :: lang/objc/rdar-11355592/TestRdar11355592.py (1584 of 2142)
PASS: lldb-shell :: SymbolFile/Breakpad/unwind-via-stack-win-no-memory-info.yaml (1585 of 2142)
PASS: lldb-unit :: Process/gdb-remote/./ProcessGdbRemoteTests/GDBRemoteClientBaseTest.SendContinueAndAsyncPacket (1586 of 2142)
PASS: lldb-api :: commands/disassemble/basic/TestFrameDisassemble.py (1587 of 2142)
PASS: lldb-shell :: ScriptInterpreter/Python/python.test (1588 of 2142)
PASS: lldb-api :: commands/expression/unwind_expression/TestUnwindExpression.py (1589 of 2142)
PASS: lldb-unit :: Utility/./UtilityTests/StringExtractorTest.GetHexBytes_Partial (1590 of 2142)
PASS: lldb-api :: python_api/function_symbol/TestDisasmAPI.py (1591 of 2142)
PASS: lldb-api :: functionalities/data-formatter/data-formatter-stl/libcxx/forward_list/TestDataFormatterLibcxxForwardList.py (1592 of 2142)
PASS: lldb-api :: lang/cpp/enum_types/TestCPP11EnumTypes.py (1593 of 2142)
PASS: lldb-unit :: Utility/./UtilityTests/ArchSpecTest.TestParseMachCPUDashSubtypeTripleExtra (1594 of 2142)
PASS: lldb-unit :: Utility/./UtilityTests/StringListTest.SplitIntoLinesEmpty (1595 of 2142)
PASS: lldb-api :: sample_test/TestSampleInlineTest.py (1596 of 2142)
PASS: lldb-unit :: Utility/./UtilityTests/LogChannelEnabledTest.LogThread (1597 of 2142)
PASS: lldb-api :: lang/cpp/bool/TestCPPBool.py (1598 of 2142)
UNSUPPORTED: lldb-shell :: SymbolFile/Breakpad/stack-cfi-arm.yaml (1599 of 2142)
PASS: lldb-unit :: Utility/./UtilityTests/EventTest.DumpEventDataBytes (1600 of 2142)
PASS: lldb-api :: macosx/version_zero/TestGetVersionZeroVersion.py (1601 of 2142)
PASS: lldb-api :: functionalities/data-formatter/pyobjsynthprovider/TestPyObjSynthProvider.py (1602 of 2142)
PASS: lldb-unit :: Core/./LLDBCoreTests/MangledTest.NameIndexes_FindFunctionSymbols (1603 of 2142)
UNSUPPORTED: lldb-shell :: Register/x86-zmm-write.test (1604 of 2142)
PASS: lldb-unit :: Utility/./UtilityTests/BinaryStreamTest.PutULEB128Zero (1605 of 2142)
PASS: lldb-api :: functionalities/thread/concurrent_events/TestConcurrentNWatchNBreak.py (1606 of 2142)
PASS: lldb-unit :: Interpreter/./InterpreterTests/OptionArgParserTest.toChar (1607 of 2142)
PASS: lldb-api :: functionalities/data-formatter/builtin-formats/TestBuiltinFormats.py (1608 of 2142)
PASS: lldb-unit :: Utility/./UtilityTests/StringExtractorTest.DecodeHexU8_InvalidHex2 (1609 of 2142)
PASS: lldb-api :: commands/process/launch-with-shellexpand/TestLaunchWithShellExpand.py (1610 of 2142)
PASS: lldb-api :: functionalities/thread/concurrent_events/TestConcurrentWatchBreak.py (1611 of 2142)
PASS: lldb-api :: functionalities/param_entry_vals/basic_entry_values/TestBasicEntryValues.py (1612 of 2142)
PASS: lldb-unit :: Process/minidump/./LLDBMinidumpTests/MinidumpParserTest.GetThreadContext_x86_32 (1613 of 2142)
PASS: lldb-unit :: Utility/./UtilityTests/StreamTest.AddressPrefix (1614 of 2142)
PASS: lldb-unit :: ObjectFile/PECOFF/./ObjectFilePECOFFTests/PECallFrameInfoTest.Chained_eh (1615 of 2142)
PASS: lldb-api :: commands/session/save/TestSessionSave.py (1616 of 2142)
PASS: lldb-api :: tools/lldb-server/commandline/TestStubSetSID.py (1617 of 2142)
PASS: lldb-api :: lang/objc/foundation/TestObjCMethodsNSError.py (1618 of 2142)
PASS: lldb-unit :: Utility/./UtilityTests/StreamTeeTest.CopyConstructor (1619 of 2142)
PASS: lldb-shell :: VSCode/TestOptions.test (1620 of 2142)
PASS: lldb-api :: commands/expression/import-std-module/list-dbg-info-content/TestDbgInfoContentListFromStdModule.py (1621 of 2142)
PASS: lldb-unit :: Language/Highlighting/./HighlighterTests/HighlighterTest.ClangEmptyInput (1622 of 2142)
PASS: lldb-api :: functionalities/data-formatter/data-formatter-stl/libcxx/atomic/TestLibCxxAtomic.py (1623 of 2142)
PASS: lldb-api :: lang/cpp/dynamic-value/TestDynamicValue.py (1624 of 2142)
PASS: lldb-unit :: Utility/./UtilityTests/ArgsTest.GetQuotedCommandString (1625 of 2142)
UNSUPPORTED: lldb-api :: functionalities/longjmp/TestLongjmp.py (1626 of 2142)
PASS: lldb-api :: lang/cpp/namespace/TestNamespaceLookup.py (1627 of 2142)
PASS: lldb-unit :: Core/./LLDBCoreTests/SourceFileCache.FindSourceFileNotFound (1628 of 2142)
PASS: lldb-api :: functionalities/data-formatter/data-formatter-stl/libstdcpp/unique_ptr/invalid/TestDataFormatterInvalidStdUniquePtr.py (1629 of 2142)
PASS: lldb-unit :: UnwindAssembly/x86/./UnwindAssemblyx86Tests/Testx86AssemblyInspectionEngine.TestSimplex86_64Augmented (1630 of 2142)
PASS: lldb-unit :: Utility/./UtilityTests/XcodeSDKTest.FindXcodeContentsDirectoryInPath (1631 of 2142)
PASS: lldb-unit :: Utility/./UtilityTests/StreamTest.PutRawBytesToMixedEndian (1632 of 2142)
PASS: lldb-api :: lang/c/inlines/TestRedefinitionsInInlines.py (1633 of 2142)
PASS: lldb-unit :: Process/gdb-remote/./ProcessGdbRemoteTests/GDBRemoteClientBaseTest.SendContinueAndLateInterrupt (1634 of 2142)
PASS: lldb-unit :: Utility/./UtilityTests/StringExtractorTest.GetU32LittleEndian (1635 of 2142)
PASS: lldb-unit :: Utility/./UtilityTests/ScalarTest.Scalar_512 (1636 of 2142)
PASS: lldb-unit :: DataFormatter/./LLDBFormatterTests/TypeMatcherTests.GetMatchStringExactName (1637 of 2142)
PASS: lldb-shell :: Breakpoint/implicit_const_form_support.test (1638 of 2142)
PASS: lldb-api :: commands/apropos/basic/TestApropos.py (1639 of 2142)
PASS: lldb-shell :: SymbolFile/DWARF/dwarf5_locations.s (1640 of 2142)
PASS: lldb-api :: functionalities/var_path/TestVarPath.py (1641 of 2142)
PASS: lldb-unit :: Utility/./UtilityTests/FileSpecTest.FileAndDirectoryComponents (1642 of 2142)
UNSUPPORTED: lldb-api :: commands/register/register/intel_xtended_registers/mpx_offset_intersection/TestMPXOffsetIntersection.py (1643 of 2142)
PASS: lldb-api :: commands/watchpoints/watchpoint_size/TestWatchpointSizes.py (1644 of 2142)
PASS: lldb-unit :: Utility/./UtilityTests/ScalarTest.RightShiftOperator (1645 of 2142)
PASS: lldb-unit :: SymbolFile/DWARF/./SymbolFileDWARFTests/SymbolFileDWARFTests.ParseAranges (1646 of 2142)
PASS: lldb-unit :: Utility/./UtilityTests/ArgsTest.TestQuotedUnknownEscape (1647 of 2142)
PASS: lldb-unit :: Utility/./UtilityTests/DeserializerTest.HasData (1648 of 2142)
PASS: lldb-shell :: Process/UnsupportedLanguage.test (1649 of 2142)
PASS: lldb-shell :: Reproducer/TestSynchronous.test (1650 of 2142)
PASS: lldb-unit :: Utility/./UtilityTests/BroadcasterTest.BroadcastEvent (1651 of 2142)
PASS: lldb-unit :: Utility/./UtilityTests/StringListTest.LongestCommonPrefixSingleElement (1652 of 2142)
PASS: lldb-unit :: Utility/./UtilityTests/ScalarTest.ComparisonFloat (1653 of 2142)
UNSUPPORTED: lldb-shell :: SymbolFile/NativePDB/typedefs.cpp (1654 of 2142)
PASS: lldb-unit :: Utility/./UtilityTests/StringLexerTest.Peek (1655 of 2142)
PASS: lldb-unit :: Process/gdb-remote/./ProcessGdbRemoteTests/GDBRemoteClientBaseTest.SendContinueAndAsyncSignal (1656 of 2142)
PASS: lldb-shell :: SymbolFile/NativePDB/bitfields.cpp (1657 of 2142)
PASS: lldb-unit :: Utility/./UtilityTests/DataExtractorTest.GetULEB128_bit63 (1658 of 2142)
PASS: lldb-api :: lang/cpp/namespace_definitions/TestNamespaceDefinitions.py (1659 of 2142)
PASS: lldb-shell :: ObjectFile/Breakpad/discontiguous-sections.test (1660 of 2142)
PASS: lldb-shell :: SymbolFile/DWARF/debug-line-basic.s (1661 of 2142)
PASS: lldb-unit :: UnwindAssembly/x86/./UnwindAssemblyx86Tests/Testx86AssemblyInspectionEngine.Test32bitFramelessBigStackFrame (1662 of 2142)
PASS: lldb-unit :: Utility/./UtilityTests/StreamTest.PutHex16ByteOrderLittle (1663 of 2142)
PASS: lldb-shell :: SymbolFile/Breakpad/line-table.test (1664 of 2142)
PASS: lldb-api :: functionalities/data-formatter/data-formatter-python-synth/TestDataFormatterPythonSynth.py (1665 of 2142)
PASS: lldb-unit :: Utility/./UtilityTests/RangeTest.LessThan (1666 of 2142)
UNSUPPORTED: lldb-shell :: SymbolFile/target-symbols-add-unwind.test (1667 of 2142)
UNSUPPORTED: lldb-shell :: SymbolFile/PDB/variables-locations.test (1668 of 2142)
PASS: lldb-unit :: Utility/./UtilityTests/StringListTest.Clear (1669 of 2142)
PASS: lldb-unit :: Utility/./UtilityTests/SerializationRountripTest.SerializeDeserializeCStringNull (1670 of 2142)
PASS: lldb-api :: sanity/TestModuleCacheSanity.py (1671 of 2142)
PASS: lldb-api :: functionalities/thread/exit_during_break/TestExitDuringBreak.py (1672 of 2142)
PASS: lldb-unit :: Interpreter/./InterpreterTests/CompletionTest.DirCompletionUsername (1673 of 2142)
PASS: lldb-api :: lang/objc/objc-struct-return/TestObjCStructReturn.py (1674 of 2142)
PASS: lldb-api :: lang/cpp/signed_types/TestSignedTypes.py (1675 of 2142)
PASS: lldb-unit :: SymbolFile/NativePDB/./SymbolFileNativePDBTests/PDBFPOProgramToDWARFExpressionTests.UnknownOp (1676 of 2142)
UNSUPPORTED: lldb-api :: functionalities/ptr_refs/TestPtrRefs.py (1677 of 2142)
PASS: lldb-api :: lang/cpp/subst_template_type_param/TestSubstTemplateTypeParam.py (1678 of 2142)
PASS: lldb-api :: terminal/TestSTTYBeforeAndAfter.py (1679 of 2142)
PASS: lldb-unit :: Utility/./UtilityTests/RangeDataVector.FindEntryIndexesThatContain (1680 of 2142)
PASS: lldb-api :: functionalities/data-formatter/dump_dynamic/TestDumpDynamic.py (1681 of 2142)
PASS: lldb-api :: functionalities/gdb_remote_client/TestqOffsets.py (1682 of 2142)
PASS: lldb-api :: functionalities/data-formatter/data-formatter-cpp/TestDataFormatterCpp.py (1683 of 2142)
UNSUPPORTED: lldb-api :: functionalities/darwin_log/filter/exact_match/message/TestDarwinLogFilterMatchMessage.py (1684 of 2142)
PASS: lldb-api :: functionalities/thread/concurrent_events/TestConcurrentSignalDelayWatch.py (1685 of 2142)
PASS: lldb-shell :: ObjectFile/ELF/base-address.yaml (1686 of 2142)
XFAIL: lldb-shell :: Register/x86-mm-xmm-read.test (1687 of 2142)
PASS: lldb-unit :: Utility/./UtilityTests/StringExtractorTest.InitEmpty (1688 of 2142)
PASS: lldb-api :: functionalities/plugins/python_os_plugin/TestPythonOSPlugin.py (1689 of 2142)
UNSUPPORTED: lldb-shell :: SymbolFile/DWARF/split-dwarf-expression-eval-bug.cpp (1690 of 2142)
PASS: lldb-api :: commands/frame/diagnose/inheritance/TestDiagnoseInheritance.py (1691 of 2142)
PASS: lldb-api :: functionalities/thread/concurrent_events/TestConcurrentCrashWithBreak.py (1692 of 2142)
XFAIL: lldb-shell :: Register/x86-64-ymm-write.test (1693 of 2142)
PASS: lldb-shell :: Breakpoint/jitbp_elf.test (1694 of 2142)
UNSUPPORTED: lldb-api :: lang/c/typedef/Testtypedef.py (1695 of 2142)
PASS: lldb-unit :: Process/minidump/./LLDBMinidumpTests/MinidumpParserTest.GetMiscInfoWindows (1696 of 2142)
PASS: lldb-api :: functionalities/process_group/TestChangeProcessGroup.py (1697 of 2142)
PASS: lldb-unit :: Utility/./UtilityTests/StreamTest.AddressNoSuffix (1698 of 2142)
PASS: lldb-unit :: Symbol/./SymbolTests/TestClangASTImporter.DeportDeclTagDecl (1699 of 2142)
PASS: lldb-api :: tools/lldb-vscode/attach/TestVSCode_attach.py (1700 of 2142)
PASS: lldb-shell :: ObjectFile/PECOFF/section-types.yaml (1701 of 2142)
PASS: lldb-unit :: Utility/./UtilityTests/StringListTest.LongestCommonPrefixEmpty (1702 of 2142)
PASS: lldb-unit :: Utility/./UtilityTests/StringExtractorTest.DecodeHexU8_InvalidHex (1703 of 2142)
PASS: lldb-unit :: ScriptInterpreter/Python/./ScriptInterpreterPythonTests/PythonDataObjectsTest.TestPythonString (1704 of 2142)
PASS: lldb-api :: functionalities/data-formatter/frameformat_smallstruct/TestFrameFormatSmallStruct.py (1705 of 2142)
PASS: lldb-api :: commands/frame/diagnose/dereference-function-return/TestDiagnoseDereferenceFunctionReturn.py (1706 of 2142)
PASS: lldb-api :: lang/cpp/elaborated-types/TestElaboratedTypes.py (1707 of 2142)
PASS: lldb-unit :: Process/gdb-remote/./ProcessGdbRemoteTests/GDBRemoteCommunicationClientTest.SendSignalsToIgnore (1708 of 2142)
PASS: lldb-unit :: ObjectFile/Breakpad/./ObjectFileBreakpadTests/FuncRecord.parse (1709 of 2142)
PASS: lldb-shell :: SymbolFile/DWARF/debug_loc_and_loclists.s (1710 of 2142)
PASS: lldb-unit :: Utility/./UtilityTests/UriParserTest.SchemeHostSeparator (1711 of 2142)
PASS: lldb-shell :: SymbolFile/DWARF/childless-compile-unit.s (1712 of 2142)
PASS: lldb-unit :: Utility/./UtilityTests/StringListTest.LongestCommonPrefix (1713 of 2142)
PASS: lldb-shell :: SymbolFile/DWARF/debug_loclists-dwo.s (1714 of 2142)
PASS: lldb-unit :: Host/./HostTests/HostInfoTest.GetXcodeSDK (1715 of 2142)
PASS: lldb-api :: lang/cpp/diamond/TestDiamond.py (1716 of 2142)
PASS: lldb-api :: functionalities/jitloader_gdb/TestJITLoaderGDB.py (1717 of 2142)
PASS: lldb-unit :: Editline/./EditlineTests/EditlineTestFixture.EditlineReceivesMultiLineText (1718 of 2142)
PASS: lldb-unit :: UnwindAssembly/x86/./UnwindAssemblyx86Tests/Testx86AssemblyInspectionEngine.Testi386IgnoredRegisters (1719 of 2142)
PASS: lldb-api :: macosx/find-dsym/bundle-with-dot-in-filename/TestBundleWithDotInFilename.py (1720 of 2142)
PASS: lldb-api :: lang/cpp/stl/TestStdCXXDisassembly.py (1721 of 2142)
PASS: lldb-unit :: SymbolFile/NativePDB/./SymbolFileNativePDBTests/PDBFPOProgramToDWARFExpressionTests.UnresolvedCyclicRegisterAssignmentReference (1722 of 2142)
PASS: lldb-api :: commands/expression/import-std-module/forward_decl_from_module/TestForwardDeclFromStdModule.py (1723 of 2142)
PASS: lldb-unit :: Utility/./UtilityTests/DataExtractorTest.GetMaxU64_unchecked (1724 of 2142)
PASS: lldb-api :: functionalities/breakpoint/breakpoint_locations/TestBreakpointLocations.py (1725 of 2142)
PASS: lldb-unit :: Utility/./UtilityTests/UUIDTest.SetFromStringRef (1726 of 2142)
PASS: lldb-shell :: SymbolFile/DWARF/gnu-style-compression.cpp (1727 of 2142)
PASS: lldb-shell :: SymbolFile/DWARF/DW_TAG_variable-invalid_location.s (1728 of 2142)
UNSUPPORTED: lldb-shell :: SymbolFile/PDB/pointers.test (1729 of 2142)
PASS: lldb-api :: commands/frame/language/TestGuessLanguage.py (1730 of 2142)
PASS: lldb-api :: lang/cpp/inlines/TestInlines.py (1731 of 2142)
PASS: lldb-unit :: Utility/./UtilityTests/BinaryStreamTest.PutULEB128EightBytes (1732 of 2142)
PASS: lldb-unit :: Utility/./UtilityTests/OptionsWithRawTest.MultiWordSuffix (1733 of 2142)
UNSUPPORTED: lldb-shell :: Register/x86-64-ymm16-write.test (1734 of 2142)
PASS: lldb-api :: commands/expression/import-std-module/shared_ptr/TestSharedPtrFromStdModule.py (1735 of 2142)
PASS: lldb-unit :: Utility/./UtilityTests/StringExtractorTest.GetHexBytes_OddPair2 (1736 of 2142)
PASS: lldb-unit :: Process/./ProcessEventDataTests/ProcessEventDataTest.DoOnRemoval (1737 of 2142)
PASS: lldb-api :: commands/process/attach-resume/TestAttachResume.py (1738 of 2142)
PASS: lldb-unit :: UnwindAssembly/x86/./UnwindAssemblyx86Tests/Testx86AssemblyInspectionEngine.TestPopRBPWithREX (1739 of 2142)
PASS: lldb-unit :: Process/./ProcessEventDataTests/ProcessEventDataTest.ShouldStop (1740 of 2142)
PASS: lldb-api :: lang/c/step-target/TestStepTarget.py (1741 of 2142)
PASS: lldb-api :: python_api/lldbutil/iter/TestRegistersIterator.py (1742 of 2142)
PASS: lldb-api :: tools/lldb-vscode/breakpoint-events/TestVSCode_breakpointEvents.py (1743 of 2142)
PASS: lldb-api :: functionalities/signal/handle-abrt/TestHandleAbort.py (1744 of 2142)
PASS: lldb-api :: functionalities/breakpoint/breakpoint_options/TestBreakpointOptions.py (1745 of 2142)
PASS: lldb-unit :: Core/./LLDBCoreTests/ModuleSpecTest.InvalidInMemoryBuffer (1746 of 2142)
PASS: lldb-unit :: Utility/./UtilityTests/DataExtractorTest.UncommonAddressSize (1747 of 2142)
PASS: lldb-unit :: Utility/./UtilityTests/StreamTeeTest.DefaultConstructor (1748 of 2142)
PASS: lldb-api :: python_api/thread/TestThreadAPI.py (1749 of 2142)
PASS: lldb-unit :: Utility/./UtilityTests/UriParserTest.TypicalPortPathIPv6 (1750 of 2142)
PASS: lldb-api :: commands/expression/argument_passing_restrictions/TestArgumentPassingRestrictions.py (1751 of 2142)
PASS: lldb-unit :: Utility/./UtilityTests/RecordReplayTest.InstrumentedBarPtr (1752 of 2142)
PASS: lldb-unit :: Process/gdb-remote/./ProcessGdbRemoteTests/GDBRemoteCommunicationClientTest.ReadRegister (1753 of 2142)
PASS: lldb-api :: functionalities/thread/concurrent_events/TestConcurrentDelaySignalBreak.py (1754 of 2142)
UNSUPPORTED: lldb-api :: benchmarks/frame_variable/TestFrameVariableResponse.py (1755 of 2142)
PASS: lldb-api :: lang/c/find_struct_type/TestFindStructTypes.py (1756 of 2142)
PASS: lldb-api :: linux/builtin_trap/TestBuiltinTrap.py (1757 of 2142)
PASS: lldb-api :: lang/objc/exceptions/TestObjCExceptions.py (1758 of 2142)
PASS: lldb-unit :: Utility/./UtilityTests/StreamTest.PutPtr (1759 of 2142)
PASS: lldb-api :: functionalities/memory/read/TestMemoryRead.py (1760 of 2142)
PASS: lldb-unit :: Utility/./UtilityTests/ArchSpecTest.OperatorBool (1761 of 2142)
PASS: lldb-api :: sanity/TestSettingSkipping.py (1762 of 2142)
PASS: lldb-unit :: Process/gdb-remote/./ProcessGdbRemoteTests/GDBRemoteClientBaseTest.SendContinueDelegateStructuredDataReceipt (1763 of 2142)
PASS: lldb-unit :: Utility/./UtilityTests/OptionsWithRawTest.ArgsButNoLeadingDash (1764 of 2142)
PASS: lldb-api :: functionalities/target_var/no_vars/TestTargetVarNoVars.py (1765 of 2142)
PASS: lldb-unit :: Utility/./UtilityTests/StringLexerTest.GetUnlexed (1766 of 2142)
PASS: lldb-shell :: Minidump/Windows/broken-unwind.test (1767 of 2142)
PASS: lldb-api :: lang/objc/ivar-IMP/TestObjCiVarIMP.py (1768 of 2142)
PASS: lldb-unit :: Utility/./UtilityTests/StringExtractorTest.GetHexBytesAvail_FullString (1769 of 2142)
PASS: lldb-api :: commands/frame/diagnose/dereference-this/TestDiagnoseDereferenceThis.py (1770 of 2142)
PASS: lldb-api :: functionalities/postmortem/elf-core/gcore/TestGCore.py (1771 of 2142)
PASS: lldb-shell :: SymbolFile/DWARF/debug-types-signature-loop.s (1772 of 2142)
PASS: lldb-shell :: ObjectFile/ELF/build-id-case.yaml (1773 of 2142)
PASS: lldb-unit :: ScriptInterpreter/Python/./ScriptInterpreterPythonTests/PythonDataObjectsTest.TestPythonTupleInitializerList (1774 of 2142)
PASS: lldb-unit :: Utility/./UtilityTests/StringListTest.ForRange (1775 of 2142)
PASS: lldb-unit :: Process/gdb-remote/./ProcessGdbRemoteTests/GDBRemoteClientBaseTest.SendContinueAndInterrupt (1776 of 2142)
PASS: lldb-unit :: Utility/./UtilityTests/BinaryStreamTest.PutSLEB128MaxValue (1777 of 2142)
PASS: lldb-api :: commands/expression/completion-crash-incomplete-record/TestCompletionCrashIncompleteRecord.py (1778 of 2142)
PASS: lldb-shell :: Quit/TestQuitExitCodeHex0.test (1779 of 2142)
PASS: lldb-unit :: Language/CPlusPlus/./LanguageCPlusPlusTests/CPlusPlusLanguage.CPlusPlusNameParser (1780 of 2142)
PASS: lldb-api :: commands/target/modules/search-paths/insert/TestTargetModulesSearchpathsInsert.py (1781 of 2142)
PASS: lldb-api :: functionalities/data-formatter/data-formatter-stl/libcxx/initializerlist/TestInitializerList.py (1782 of 2142)
PASS: lldb-unit :: Utility/./UtilityTests/NameMatchesTest.EndsWith (1783 of 2142)
PASS: lldb-unit :: Expression/./ExpressionTests/DiagnosticManagerTest.AppendMessageSubsequentDiags (1784 of 2142)
PASS: lldb-api :: commands/watchpoints/watchpoint_on_vectors/TestValueOfVectorVariable.py (1785 of 2142)
PASS: lldb-unit :: Utility/./UtilityTests/StreamTest.PutHex32ByteOrderBig (1786 of 2142)
PASS: lldb-api :: functionalities/data-formatter/data-formatter-stl/libcxx/tuple/TestDataFormatterLibcxxTuple.py (1787 of 2142)
PASS: lldb-unit :: Host/./HostTests/FileSystemTest.Resolve (1788 of 2142)
PASS: lldb-unit :: Utility/./UtilityTests/OptionsWithRawTest.SingleWhitespaceInput (1789 of 2142)
PASS: lldb-api :: commands/target/stop-hook/enable/TestTargetStopHookEnable.py (1790 of 2142)
PASS: lldb-unit :: Language/Highlighting/./HighlighterTests/HighlighterTest.ClangTrailingBackslashMissingNewLine (1791 of 2142)
PASS: lldb-unit :: API/./APITests/SBCommandInterpreterTest.SingleWordCommand (1792 of 2142)
PASS: lldb-api :: functionalities/breakpoint/auto_continue/TestBreakpointAutoContinue.py (1793 of 2142)
PASS: lldb-unit :: Target/./TargetTests/ModuleCacheTest.GetAndPut (1794 of 2142)
PASS: lldb-api :: lang/c/function_types/TestFunctionTypes.py (1795 of 2142)
PASS: lldb-api :: tools/lldb-vscode/module/TestVSCode_module.py (1796 of 2142)
PASS: lldb-api :: functionalities/thread/concurrent_events/TestConcurrentDelayWatchBreak.py (1797 of 2142)
PASS: lldb-api :: lang/cpp/static_methods/TestCPPStaticMethods.py (1798 of 2142)
PASS: lldb-unit :: Expression/./ExpressionTests/DiagnosticManagerTest.GetStringMultiline (1799 of 2142)
PASS: lldb-unit :: ScriptInterpreter/Python/./ScriptInterpreterPythonTests/PythonDataObjectsTest.TestGlobalNameResolutionNoDot (1800 of 2142)
PASS: lldb-unit :: Utility/./UtilityTests/RecordReplayTest.InstrumentedBar (1801 of 2142)
PASS: lldb-unit :: Utility/./UtilityTests/Flags.AllClear (1802 of 2142)
PASS: lldb-unit :: Expression/./ExpressionTests/DWARFExpression.DW_OP_unknown (1803 of 2142)
PASS: lldb-unit :: Utility/./UtilityTests/OptionsWithRawTest.LeadingSpaceArgs (1804 of 2142)
PASS: lldb-api :: commands/log/invalid-args/TestInvalidArgsLog.py (1805 of 2142)
PASS: lldb-unit :: Utility/./UtilityTests/ArgsTest.Yaml (1806 of 2142)
PASS: lldb-unit :: Utility/./UtilityTests/FileSpecTest.EqualSeparator (1807 of 2142)
FAIL: lldb-api :: commands/target/stop-hooks/TestStopHookScripted.py (1808 of 2142)
******************** TEST 'lldb-api :: commands/target/stop-hooks/TestStopHookScripted.py' FAILED ********************
Script:
--
/Users/buildslave/jenkins/workspace/lldb-cmake-sanitized/lldb-build/lldb-test-build.noindex/copied-python /Users/buildslave/jenkins/workspace/lldb-cmake-sanitized/llvm-project/lldb/test/API/dotest.py -s /Users/buildslave/jenkins/workspace/lldb-cmake-sanitized/lldb-build/lldb-test-traces -S nm -u CXXFLAGS -u CFLAGS --codesign-identity lldb_codesign --server /Users/buildslave/jenkins/workspace/lldb-cmake-sanitized/lldb-build/./bin/debugserver --arch x86_64 --build-dir /Users/buildslave/jenkins/workspace/lldb-cmake-sanitized/lldb-build/lldb-test-build.noindex -s=/Users/buildslave/jenkins/workspace/lldb-cmake-sanitized/test/logs -t --env TERM=vt100 --env LLVM_LIBS_DIR=/Users/buildslave/jenkins/workspace/lldb-cmake-sanitized/lldb-build/./lib --inferior-env ASAN_OPTIONS=detect_stack_use_after_return=1 --inferior-env DYLD_INSERT_LIBRARIES=/Users/buildslave/jenkins/workspace/lldb-cmake-sanitized/host-compiler/lib/clang/12.0.0/lib/darwin/libclang_rt.asan_osx_dynamic.dylib --arch x86_64 --build-dir /Users/buildslave/jenkins/workspace/lldb-cmake-sanitized/lldb-build/lldb-test-build.noindex --lldb-module-cache-dir /Users/buildslave/jenkins/workspace/lldb-cmake-sanitized/lldb-build/lldb-test-build.noindex/module-cache-lldb/lldb-api --clang-module-cache-dir /Users/buildslave/jenkins/workspace/lldb-cmake-sanitized/lldb-build/lldb-test-build.noindex/module-cache-clang/lldb-api --executable /Users/buildslave/jenkins/workspace/lldb-cmake-sanitized/lldb-build/./bin/lldb --compiler /Users/buildslave/jenkins/workspace/lldb-cmake-sanitized/lldb-build/./bin/clang --dsymutil /Users/buildslave/jenkins/workspace/lldb-cmake-sanitized/lldb-build/./bin/dsymutil --filecheck /Users/buildslave/jenkins/workspace/lldb-cmake-sanitized/lldb-build/./bin/FileCheck --yaml2obj /Users/buildslave/jenkins/workspace/lldb-cmake-sanitized/lldb-build/./bin/yaml2obj --lldb-libs-dir /Users/buildslave/jenkins/workspace/lldb-cmake-sanitized/lldb-build/./lib /Users/buildslave/jenkins/workspace/lldb-cmake-sanitized/llvm-project/lldb/test/API/commands/target/stop-hooks -p TestStopHookScripted.py
--
Exit Code: 1

Hide Details

Command Output (stdout): -- lldb version 12.0.99 clang revision c6c5629f2fb4ddabd376fbe7c218733283e91d09 llvm revision c6c5629f2fb4ddabd376fbe7c218733283e91d09 libstdcxx tests will not be run because: Don't know how to build with libstdcxx on macosx Skipping following debug info categories: ['dwo'] Running command: target stop-hook add -P stop_hook.stop_handler -k increment -v 5 -k return_false -v 1 -n step_out_of_me I have stopped 1 times.

Hide Details

-- Command Output (stderr): --

Hide Details

Session logs for test failures/errors/unexpected successes will go into directory '/Users/buildslave/jenkins/workspace/lldb-cmake-sanitized/test/logs' Change dir to: /Users/buildslave/jenkins/workspace/lldb-cmake-sanitized/llvm-project/lldb/test/API/commands/target/stop-hooks runCmd: settings clear -all output:

Hide Details

runCmd: settings set symbols.enable-external-lookup false output:

Hide Details

runCmd: settings set target.inherit-tcc true output:

Hide Details

runCmd: settings set target.auto-apply-fixits false output:

Hide Details

runCmd: settings set plugin.process.gdb-remote.packet-timeout 60 output:

Hide Details

runCmd: settings set symbols.clang-modules-cache-path "/Users/buildslave/jenkins/workspace/lldb-cmake-sanitized/lldb-build/lldb-test-build.noindex/module-cache-lldb/lldb-api" output:

Hide Details

runCmd: settings set use-color false output:

Hide Details

runCmd: setting set target.prefer-dynamic-value no-dynamic-values output:

Hide Details

runCmd: settings set target.env-vars ASAN_OPTIONS=detect_stack_use_after_return=1 DYLD_INSERT_LIBRARIES=/Users/buildslave/jenkins/workspace/lldb-cmake-sanitized/host-compiler/lib/clang/12.0.0/lib/darwin/libclang_rt.asan_osx_dynamic.dylib output:

Hide Details

runCmd: settings set target.env-vars ASAN_OPTIONS=detect_stack_use_after_return=1 DYLD_INSERT_LIBRARIES=/Users/buildslave/jenkins/workspace/lldb-cmake-sanitized/host-compiler/lib/clang/12.0.0/lib/darwin/libclang_rt.asan_osx_dynamic.dylib output:

Hide Details

FAIL: LLDB (/Users/buildslave/jenkins/workspace/lldb-cmake-sanitized/lldb-build/bin/clang-x86_64) :: test_stop_hooks_scripted_return_false (TestStopHookScripted.TestStopHooks) <bound method SBProcess.Kill of <lldb.SBProcess; proxy of <Swig Object of type 'lldb::SBProcess *' at 0x112dbf6f0> >>: success

Hide Details

Restore dir to: /Users/buildslave/jenkins/workspace/lldb-cmake-sanitized/lldb-build/tools/lldb/test ====================================================================== FAIL: test_stop_hooks_scripted_return_false (TestStopHookScripted.TestStopHooks) Test that the returning False from a stop hook works ---------------------------------------------------------------------- Traceback (most recent call last): File "/Users/buildslave/jenkins/workspace/lldb-cmake-sanitized/llvm-project/lldb/test/API/commands/target/stop-hooks/TestStopHookScripted.py", line 54, in test_stop_hooks_scripted_return_false self.do_test_auto_continue(True) File "/Users/buildslave/jenkins/workspace/lldb-cmake-sanitized/llvm-project/lldb/test/API/commands/target/stop-hooks/TestStopHookScripted.py", line 91, in do_test_auto_continue self.assertEqual("main", func_name, "Didn't stop at the expected function.") AssertionError: 'main' != 'step_out_of_me' - main+ step_out_of_me : Didn't stop at the expected function. Config=x86_64-/Users/buildslave/jenkins/workspace/lldb-cmake-sanitized/lldb-build/bin/clang ---------------------------------------------------------------------- Ran 1 test in 3.253s

Hide Details

RESULT: FAILED (0 passes, 1 failures, 0 errors, 0 skipped, 0 expected failures, 0 unexpected successes)

Hide Details

--

Hide Details

******************** PASS: lldb-api :: python_api/frame/get-variables/TestGetVariables.py (1809 of 2142) PASS: lldb-unit :: UnwindAssembly/x86/./UnwindAssemblyx86Tests/Testx86AssemblyInspectionEngine.TestPopEBX (1810 of 2142) UNSUPPORTED: lldb-shell :: SymbolFile/dissassemble-entry-point.s (1811 of 2142) PASS: lldb-unit :: Utility/./UtilityTests/BinaryStreamTest.PutSLEB128SevenBytes (1812 of 2142) PASS: lldb-shell :: Breakpoint/debug_rnglist_rlestartend.test (1813 of 2142) UNSUPPORTED: lldb-shell :: SymbolFile/PDB/udt-layout.test (1814 of 2142) PASS: lldb-api :: lang/objc/objc-stepping/TestObjCStepping.py (1815 of 2142) PASS: lldb-unit :: ScriptInterpreter/Python/./ScriptInterpreterPythonTests/PythonDataObjectsTest.TestPythonBytes (1816 of 2142) PASS: lldb-api :: types/TestLongTypesExpr.py (1817 of 2142) PASS: lldb-unit :: Utility/./UtilityTests/StringLexerTest.AdvanceIf (1818 of 2142) PASS: lldb-shell :: Reproducer/TestPythonImport.test (1819 of 2142) PASS: lldb-unit :: Utility/./UtilityTests/RangeVector.CombineConsecutiveRanges (1820 of 2142) PASS: lldb-unit :: Process/minidump/./LLDBMinidumpTests/MinidumpParserTest.GetPidWindows (1821 of 2142) PASS: lldb-unit :: Language/Highlighting/./HighlighterTests/HighlighterTest.ClangPreserveNewLine (1822 of 2142) PASS: lldb-unit :: UnwindAssembly/x86/./UnwindAssemblyx86Tests/Testx86AssemblyInspectionEngine.TestCALLNextInsn (1823 of 2142) PASS: lldb-shell :: Reproducer/Modules/TestModuleCXX.test (1824 of 2142) PASS: lldb-api :: lang/objc/objc-static-method/TestObjCStaticMethod.py (1825 of 2142) PASS: lldb-unit :: Utility/./UtilityTests/StringListTest.LongestCommonPrefixDuplicateElement (1826 of 2142) PASS: lldb-unit :: Utility/./UtilityTests/StringLexerTest.NextIf (1827 of 2142) PASS: lldb-unit :: Utility/./UtilityTests/StreamTest.Indent (1828 of 2142) PASS: lldb-api :: commands/watchpoints/watchpoint_set_command/TestWatchLocationWithWatchSet.py (1829 of 2142) PASS: lldb-unit :: UnwindAssembly/x86/./UnwindAssemblyx86Tests/Testx86AssemblyInspectionEngine.TestPush0 (1830 of 2142) PASS: lldb-unit :: ObjectFile/PECOFF/./ObjectFilePECOFFTests/PECallFrameInfoTest.Frame_reg_eh (1831 of 2142) PASS: lldb-shell :: ObjectFile/ELF/netbsd-exec-8.99.30-amd64.yaml (1832 of 2142) PASS: lldb-unit :: ScriptInterpreter/Python/./ScriptInterpreterPythonTests/PythonDataObjectsTest.TestPythonCallableCheck (1833 of 2142) PASS: lldb-unit :: Utility/./UtilityTests/RangeTest.Union (1834 of 2142) UNSUPPORTED: lldb-api :: lang/cpp/function-template-parameter-pack/TestFunctionTemplateParameterPack.py (1835 of 2142) PASS: lldb-api :: commands/expression/entry-bp/TestExprEntryBP.py (1836 of 2142) PASS: lldb-api :: lang/cpp/namespace_conflicts/TestNamespaceConflicts.py (1837 of 2142) PASS: lldb-api :: functionalities/data-formatter/array_typedef/TestArrayTypedef.py (1838 of 2142) UNSUPPORTED: lldb-api :: commands/register/register/aarch64_sve_registers/rw_access_static_config/TestSVERegisters.py (1839 of 2142) PASS: lldb-shell :: SymbolFile/NativePDB/break-by-line.cpp (1840 of 2142) PASS: lldb-shell :: ObjectFile/ELF/section-addresses.yaml (1841 of 2142) PASS: lldb-api :: functionalities/breakpoint/breakpoint_by_line_and_column/TestBreakpointByLineAndColumn.py (1842 of 2142) PASS: lldb-unit :: Utility/./UtilityTests/ScalarTest.ExtractBitfield (1843 of 2142) PASS: lldb-unit :: Utility/./UtilityTests/XcodeSDKTest.SDKSupportsModules (1844 of 2142) PASS: lldb-unit :: Utility/./UtilityTests/ArgsTest.TestTrailingBackslash (1845 of 2142) PASS: lldb-shell :: SymbolFile/DWARF/debug_ranges_and_rnglists.test (1846 of 2142) PASS: lldb-api :: commands/frame/select/TestFrameSelect.py (1847 of 2142) PASS: lldb-unit :: Language/Highlighting/./HighlighterTests/HighlighterTest.ClangCommas (1848 of 2142) PASS: lldb-shell :: SymbolFile/DWARF/dwp-separate-debug-file.cpp (1849 of 2142) PASS: lldb-shell :: ObjectFile/ELF/PT_LOAD.yaml (1850 of 2142) PASS: lldb-unit :: Symbol/./SymbolTests/PostfixExpression.ToDWARF (1851 of 2142) PASS: lldb-unit :: Expression/./ExpressionTests/DWARFExpression.DW_OP_piece (1852 of 2142) PASS: lldb-unit :: ObjectFile/MachO/./ObjectFileMachOTests/ObjectFileMachOTest.ModuleFromSharedCacheInfo (1853 of 2142) PASS: lldb-unit :: Host/./HostTests/SocketTest.TCPListen0GetPort (1854 of 2142) PASS: lldb-api :: lang/objc/forward-decl/TestForwardDecl.py (1855 of 2142) PASS: lldb-unit :: Utility/./UtilityTests/ConstStringTest.UpdateMangledCounterpart (1856 of 2142) PASS: lldb-shell :: SymbolFile/Breakpad/line-table-missing-file.test (1857 of 2142) PASS: lldb-api :: tools/lldb-server/TestGdbRemoteThreadsInStopReply.py (1858 of 2142) PASS: lldb-api :: functionalities/breakpoint/global_constructor/TestBreakpointInGlobalConstructor.py (1859 of 2142) PASS: lldb-unit :: Utility/./UtilityTests/FileSpecTest.Equal (1860 of 2142) PASS: lldb-unit :: Utility/./UtilityTests/StringExtractorTest.GetHexU8_Underflow (1861 of 2142) PASS: lldb-api :: functionalities/data-formatter/data-formatter-stl/libcxx/iterator/TestDataFormatterLibccIterator.py (1862 of 2142) PASS: lldb-unit :: UnwindAssembly/x86/./UnwindAssemblyx86Tests/Testx86AssemblyInspectionEngine.TestPushESI (1863 of 2142) PASS: lldb-unit :: Process/minidump/./LLDBMinidumpTests/MinidumpParserTest.GetMemoryRegionInfoLinuxMaps (1864 of 2142) PASS: lldb-unit :: Utility/./UtilityTests/StringListTest.AppendStringStdString (1865 of 2142) PASS: lldb-shell :: Register/x86-64-ymm-read.test (1866 of 2142) PASS: lldb-unit :: Utility/./UtilityTests/ProcessInstanceInfoMatch.Name (1867 of 2142) PASS: lldb-api :: functionalities/gdb_remote_client/TestStopPCs.py (1868 of 2142) PASS: lldb-api :: python_api/sbtype_typeclass/TestSBTypeTypeClass.py (1869 of 2142) PASS: lldb-unit :: Utility/./UtilityTests/StringExtractorTest.GetHexU8_InvalidHex_NoEof (1870 of 2142) PASS: lldb-api :: commands/expression/char/TestExprsChar.py (1871 of 2142) PASS: lldb-shell :: Commands/command-backtrace.test (1872 of 2142) PASS: lldb-unit :: Utility/./UtilityTests/DataExtractorTest.GetCStr (1873 of 2142) PASS: lldb-unit :: Target/./TargetTests/ModuleCacheTest.GetAndPutUuidExists (1874 of 2142) PASS: lldb-api :: commands/expression/import-std-module/deque-basic/TestDequeFromStdModule.py (1875 of 2142) PASS: lldb-api :: types/TestDoubleTypes.py (1876 of 2142) UNSUPPORTED: lldb-api :: commands/trace/TestTraceLoad.py (1877 of 2142) PASS: lldb-unit :: Utility/./UtilityTests/StringListTest.ShiftCString (1878 of 2142) PASS: lldb-shell :: SymbolFile/DWARF/clang-ast-from-dwarf-unamed-and-anon-structs.cpp (1879 of 2142) PASS: lldb-api :: commands/expression/import-std-module/shared_ptr-dbg-info-content/TestSharedPtrDbgInfoContentFromStdModule.py (1880 of 2142) PASS: lldb-shell :: Commands/command-script-import.test (1881 of 2142) PASS: lldb-unit :: Host/./HostTests/NativeProcessProtocolTest.SetBreakpointFailVerify (1882 of 2142) UNSUPPORTED: lldb-api :: functionalities/darwin_log/basic/TestDarwinLogBasic.py (1883 of 2142) PASS: lldb-unit :: Utility/./UtilityTests/DataExtractorTest.GetMaxS64 (1884 of 2142) PASS: lldb-unit :: SymbolFile/DWARF/./SymbolFileDWARFTests/SymbolFileDWARFTests.TestAbbrevOrder1Start1 (1885 of 2142) UNSUPPORTED: lldb-shell :: SymbolFile/PDB/ast-restore.test (1886 of 2142) UNSUPPORTED: lldb-api :: functionalities/thread/thread_specific_break_plus_condition/TestThreadSpecificBpPlusCondition.py (1887 of 2142) PASS: lldb-api :: lang/cpp/member-and-local-vars-with-same-name/TestMembersAndLocalsWithSameName.py (1888 of 2142) PASS: lldb-unit :: Utility/./UtilityTests/StringExtractorTest.GetHexBytes (1889 of 2142) PASS: lldb-shell :: SymbolFile/NativePDB/globals-fundamental.cpp (1890 of 2142) PASS: lldb-api :: lang/objc/objc-new-syntax/TestObjCNewSyntaxDictionary.py (1891 of 2142) PASS: lldb-unit :: Process/gdb-remote/./ProcessGdbRemoteTests/GDBRemoteCommunicationClientTest.WriteRegisterNoSuffix (1892 of 2142) PASS: lldb-unit :: Symbol/./SymbolTests/TestTypeSystemClang.TestGetTypeClassTypeOfExpr (1893 of 2142) PASS: lldb-api :: python_api/sbvalue_persist/TestSBValuePersist.py (1894 of 2142) UNSUPPORTED: lldb-api :: tools/lldb-server/TestGdbRemoteCompletion.py (1895 of 2142) PASS: lldb-unit :: Utility/./UtilityTests/StringListTest.CopyListEmpty (1896 of 2142) PASS: lldb-unit :: Language/CPlusPlus/./LanguageCPlusPlusTests/CPlusPlusLanguage.MethodNameParsing (1897 of 2142) PASS: lldb-api :: functionalities/postmortem/elf-core/TestLinuxCore.py (1898 of 2142) PASS: lldb-api :: functionalities/thread/concurrent_events/TestConcurrentTwoBreakpointsOneWatchpoint.py (1899 of 2142) PASS: lldb-api :: lang/objc/modules/TestObjCModules.py (1900 of 2142) PASS: lldb-api :: commands/watchpoints/step_over_watchpoint/TestStepOverWatchpoint.py (1901 of 2142) PASS: lldb-unit :: Utility/./UtilityTests/RangeTest.SetRangeBase (1902 of 2142) PASS: lldb-shell :: ObjectFile/PECOFF/export-dllfunc.yaml (1903 of 2142) PASS: lldb-api :: lang/cpp/offsetof/TestOffsetofCpp.py (1904 of 2142) PASS: lldb-unit :: Signals/./SignalsTests/UnixSignalsTest.GetInfo (1905 of 2142) PASS: lldb-unit :: Utility/./UtilityTests/Flags.AnyClear (1906 of 2142) PASS: lldb-unit :: UnwindAssembly/x86/./UnwindAssemblyx86Tests/Testx86AssemblyInspectionEngine.TestStackRealign32BitDisp_x86_64 (1907 of 2142) PASS: lldb-api :: commands/session/history/TestSessionHistory.py (1908 of 2142) PASS: lldb-shell :: SymbolFile/NativePDB/ast-functions.cpp (1909 of 2142) PASS: lldb-api :: functionalities/unwind/noreturn/module-end/TestNoReturnModuleEnd.py (1910 of 2142) PASS: lldb-unit :: Utility/./UtilityTests/SerializationRountripTest.SerializeDeserializeCStringArrayNullptrElem (1911 of 2142) PASS: lldb-unit :: Utility/./UtilityTests/UriParserTest.BracketedHostname (1912 of 2142) PASS: lldb-api :: macosx/macCatalyst/TestMacCatalyst.py (1913 of 2142) PASS: lldb-shell :: SymbolFile/DWARF/inline-function-address.ll (1914 of 2142) PASS: lldb-unit :: Utility/./UtilityTests/SerializationRountripTest.SerializeDeserializePodPointers (1915 of 2142) PASS: lldb-api :: functionalities/breakpoint/cpp/TestCPPBreakpointLocations.py (1916 of 2142) PASS: lldb-api :: functionalities/data-formatter/ptr_ref_typedef/TestPtrRef2Typedef.py (1917 of 2142) PASS: lldb-api :: functionalities/breakpoint/breakpoint_command/TestRegexpBreakCommand.py (1918 of 2142) PASS: lldb-api :: lang/cpp/auto/TestCPPAuto.py (1919 of 2142) PASS: lldb-api :: macosx/save_crashlog/TestSaveCrashlog.py (1920 of 2142) PASS: lldb-api :: commands/frame/diagnose/local-variable/TestLocalVariable.py (1921 of 2142) UNSUPPORTED: lldb-api :: functionalities/data-formatter/data-formatter-stl/libstdcpp/smart_ptr/TestDataFormatterStdSmartPtr.py (1922 of 2142) PASS: lldb-api :: lang/cpp/this/TestCPPThis.py (1923 of 2142) PASS: lldb-unit :: Utility/./UtilityTests/BinaryStreamTest.PutULEB128MaxValue (1924 of 2142) UNSUPPORTED: lldb-api :: benchmarks/expression/TestExpressionCmd.py (1925 of 2142) PASS: lldb-unit :: Utility/./UtilityTests/TildeExpressionResolver.ResolveFullPath (1926 of 2142) PASS: lldb-api :: functionalities/data-formatter/data-formatter-synth/TestDataFormatterSynth.py (1927 of 2142) PASS: lldb-api :: functionalities/inferior-crashing/TestInferiorCrashingStep.py (1928 of 2142) UNSUPPORTED: lldb-shell :: Register/x86-64-ymm16-read.test (1929 of 2142) PASS: lldb-api :: functionalities/postmortem/minidump-new/TestMiniDumpNew.py (1930 of 2142) UNSUPPORTED: lldb-api :: functionalities/darwin_log/filter/exact_match/activity/TestDarwinLogFilterMatchActivity.py (1931 of 2142) PASS: lldb-unit :: Utility/./UtilityTests/VASprintfTest.NoBufferResize (1932 of 2142) PASS: lldb-unit :: Symbol/./SymbolTests/SymbolsTest.LocateExecutableSymbolFileForUnknownExecutableAndMissingSymbolFile (1933 of 2142) UNSUPPORTED: lldb-shell :: ExecControl/StopHook/stop-hook-threads.test (1934 of 2142) PASS: lldb-api :: lang/c/local_types/TestUseClosestType.py (1935 of 2142) PASS: lldb-unit :: Utility/./UtilityTests/StreamTest.PutStringAsRawHex8 (1936 of 2142) PASS: lldb-api :: python_api/file_handle/TestFileHandle.py (1937 of 2142) PASS: lldb-api :: functionalities/optimized_code/TestNoASanExceptionAfterEvalOP_piece.py (1938 of 2142) PASS: lldb-api :: lang/cpp/multiple-inheritance/TestCppMultipleInheritance.py (1939 of 2142) PASS: lldb-unit :: Utility/./UtilityTests/StringListTest.RemoveBlankLines (1940 of 2142) PASS: lldb-unit :: Utility/./UtilityTests/SubsystemRAIITest.SubsystemWithErrorSuccess (1941 of 2142) PASS: lldb-api :: tools/lldb-server/TestAppleSimulatorOSType.py (1942 of 2142) PASS: lldb-unit :: Utility/./UtilityTests/StringListTest.JoinNonSpace (1943 of 2142) PASS: lldb-api :: functionalities/data-formatter/data-formatter-script/TestDataFormatterScript.py (1944 of 2142) PASS: lldb-unit :: Utility/./UtilityTests/ArgsTest.DoubleQuotedItem (1945 of 2142) PASS: lldb-api :: lang/objcxx/class-name-clash/TestNameClash.py (1946 of 2142) PASS: lldb-api :: functionalities/thread/backtrace_limit/TestBacktraceLimit.py (1947 of 2142) PASS: lldb-unit :: Process/minidump/./LLDBMinidumpTests/MinidumpParserTest.FindMemoryRangeWithFullMemoryMinidump (1948 of 2142) PASS: lldb-unit :: Symbol/./SymbolTests/TestTypeSystemClang.TestDisplayName (1949 of 2142) PASS: lldb-unit :: Core/./LLDBCoreTests/RichManglingContextTest.Basic (1950 of 2142) PASS: lldb-unit :: Utility/./UtilityTests/RangeTest.SlideZero (1951 of 2142) UNSUPPORTED: lldb-api :: functionalities/thread/multi_break/TestMultipleBreakpoints.py (1952 of 2142) PASS: lldb-unit :: SymbolFile/NativePDB/./SymbolFileNativePDBTests/PDBFPOProgramToDWARFExpressionTests.InvalidAssignmentMultiple (1953 of 2142) PASS: lldb-unit :: Utility/./UtilityTests/StreamTeeTest.SetStreamAtIndexOutOfBounds (1954 of 2142) PASS: lldb-api :: commands/target/basic/TestTargetCommand.py (1955 of 2142) PASS: lldb-api :: functionalities/data-formatter/boolreference/TestFormattersBoolRefPtr.py (1956 of 2142) PASS: lldb-api :: functionalities/data-formatter/user-format-vs-summary/TestUserFormatVsSummary.py (1957 of 2142) PASS: lldb-unit :: Utility/./UtilityTests/StreamTest.AddressSize (1958 of 2142) PASS: lldb-api :: lang/cpp/template/TestTemplateArgs.py (1959 of 2142) PASS: lldb-api :: commands/expression/import-std-module/weak_ptr/TestWeakPtrFromStdModule.py (1960 of 2142) PASS: lldb-api :: python_api/symbol-context/two-files/TestSymbolContextTwoFiles.py (1961 of 2142) PASS: lldb-api :: functionalities/thread/concurrent_events/TestConcurrentTwoBreakpointsOneDelaySignal.py (1962 of 2142) PASS: lldb-unit :: Utility/./UtilityTests/StringListTest.InsertStringAtIndexMove (1963 of 2142) UNSUPPORTED: lldb-api :: functionalities/breakpoint/breakpoint_callback_command_source/TestBreakpointCallbackCommandSource.py (1964 of 2142) PASS: lldb-unit :: Utility/./UtilityTests/ScalarTest.Division (1965 of 2142) PASS: lldb-api :: functionalities/data-formatter/data-formatter-stl/libcxx/bitset/TestDataFormatterLibcxxBitset.py (1966 of 2142) PASS: lldb-unit :: UnwindAssembly/x86/./UnwindAssemblyx86Tests/Testx86AssemblyInspectionEngine.TestPushR12 (1967 of 2142) PASS: lldb-api :: functionalities/thread/concurrent_events/TestConcurrentTwoBreakpointsOneSignal.py (1968 of 2142) PASS: lldb-api :: assert_messages_test/TestAssertMessages.py (1969 of 2142) UNSUPPORTED: lldb-api :: commands/register/register/intel_xtended_registers/mpx_bound_violation/TestBoundViolation.py (1970 of 2142) PASS: lldb-api :: functionalities/source-map/TestTargetSourceMap.py (1971 of 2142) PASS: lldb-api :: tools/lldb-vscode/step/TestVSCode_step.py (1972 of 2142) PASS: lldb-api :: tools/lldb-server/TestGdbRemote_qThreadStopInfo.py (1973 of 2142) PASS: lldb-api :: commands/expression/persistent_types/TestNestedPersistentTypes.py (1974 of 2142) PASS: lldb-unit :: Platform/./LLDBPlatformTests/PlatformAppleSimulatorTest.TestHostPlatformToSim (1975 of 2142) UNSUPPORTED: lldb-shell :: ScriptInterpreter/Lua/persistent_state.test (1976 of 2142) PASS: lldb-unit :: ObjectFile/ELF/./ObjectFileELFTests/ObjectFileELFTest.GetSymtab_NoSymEntryPointArmAddressClass (1977 of 2142) PASS: lldb-api :: functionalities/data-formatter/data-formatter-objc/cmtime/TestDataFormatterCMTime.py (1978 of 2142) PASS: lldb-unit :: Utility/./UtilityTests/ArgsTest.AppendArguments (1979 of 2142) PASS: lldb-api :: commands/platform/file/read/TestPlatformFileRead.py (1980 of 2142) UNSUPPORTED: lldb-shell :: SymbolFile/PDB/class-layout.test (1981 of 2142) PASS: lldb-api :: functionalities/data-formatter/data-formatter-enum-format/TestDataFormatterEnumFormat.py (1982 of 2142) PASS: lldb-api :: lang/cpp/nested-class-other-compilation-unit/TestNestedClassWithParentInAnotherCU.py (1983 of 2142) UNSUPPORTED: lldb-shell :: Register/x86-ymm-write.test (1984 of 2142) PASS: lldb-unit :: ScriptInterpreter/Python/./ScriptInterpreterPythonTests/PythonDataObjectsTest.TestScript (1985 of 2142) PASS: lldb-shell :: Reproducer/TestRelativePath.test (1986 of 2142) XFAIL: lldb-shell :: Register/x86-mm-xmm-write.test (1987 of 2142) PASS: lldb-unit :: Core/./LLDBCoreTests/ModuleSpecTest.TestELFFile (1988 of 2142) PASS: lldb-shell :: Commands/command-target-modules-dump-sections.yaml (1989 of 2142) PASS: lldb-api :: commands/expression/import-std-module/stack/TestStackFromStdModule.py (1990 of 2142) UNSUPPORTED: lldb-api :: functionalities/breakpoint/breakpoint_in_delayslot/TestAvoidBreakpointInDelaySlot.py (1991 of 2142) PASS: lldb-unit :: Utility/./UtilityTests/BinaryStreamTest.PutULEB128SixBytes (1992 of 2142) PASS: lldb-api :: functionalities/thread/exit_during_expression/TestExitDuringExpression.py (1993 of 2142) PASS: lldb-unit :: Host/./HostTests/Host.WaitStatusFormat (1994 of 2142) PASS: lldb-api :: functionalities/tail_call_frames/disambiguate_paths_to_common_sink/TestDisambiguatePathsToCommonSink.py (1995 of 2142) PASS: lldb-unit :: Utility/./UtilityTests/BinaryStreamTest.PutULEB128NineBytes (1996 of 2142) PASS: lldb-unit :: Utility/./UtilityTests/ArgsTest.ReplaceArgumentAtIndexOutOfRange (1997 of 2142) PASS: lldb-api :: api/check_public_api_headers/TestPublicAPIHeaders.py (1998 of 2142) PASS: lldb-shell :: SymbolFile/NativePDB/function-types-calling-conv.cpp (1999 of 2142) PASS: lldb-unit :: Utility/./UtilityTests/CompletionRequest.ShiftArguments (2000 of 2142) PASS: lldb-unit :: DataFormatter/./LLDBFormatterTests/StringPrinterTests.CxxUTF8 (2001 of 2142) PASS: lldb-unit :: Utility/./UtilityTests/DataExtractorTest.GetCStrEmpty (2002 of 2142) PASS: lldb-unit :: Utility/./UtilityTests/StatusTest.ErrorConversion (2003 of 2142) PASS: lldb-unit :: ObjectFile/Breakpad/./ObjectFileBreakpadTests/Record.classify (2004 of 2142) PASS: lldb-api :: macosx/DBGSourcePathRemapping/TestDSYMSourcePathRemapping.py (2005 of 2142) PASS: lldb-api :: python_api/lldbutil/process/TestPrintStackTraces.py (2006 of 2142) PASS: lldb-shell :: Register/x86-64-read.test (2007 of 2142) PASS: lldb-unit :: Utility/./UtilityTests/DataExtractorTest.GetBitfield (2008 of 2142) PASS: lldb-shell :: Reproducer/Functionalities/TestImageList.test (2009 of 2142) PASS: lldb-unit :: Utility/./UtilityTests/ProcessInstanceInfo.DumpTable_invalidUID (2010 of 2142) UNSUPPORTED: lldb-shell :: Minidump/Windows/arm-fp-unwind.test (2011 of 2142) PASS: lldb-unit :: Process/minidump/./LLDBMinidumpTests/MinidumpParserTest.GetMemoryRegionInfoFromMemoryList (2012 of 2142) PASS: lldb-unit :: Utility/./UtilityTests/StreamTest.PutCStringWithStringRef (2013 of 2142) UNSUPPORTED: lldb-api :: functionalities/tsan/multiple/TestTsanMultiple.py (2014 of 2142) PASS: lldb-unit :: Utility/./UtilityTests/ArchSpecTest.TripleComponentsWereSpecified (2015 of 2142) PASS: lldb-api :: functionalities/data-formatter/data-formatter-objc/TestDataFormatterObjCPlain.py (2016 of 2142) PASS: lldb-shell :: SymbolFile/DWARF/win-i386-line-table.s (2017 of 2142) PASS: lldb-unit :: Utility/./UtilityTests/StringListTest.GetMaxStringLengthDecreasingSize (2018 of 2142) PASS: lldb-api :: functionalities/thread/num_threads/TestNumThreads.py (2019 of 2142) PASS: lldb-unit :: Host/./HostTests/FileSystemTest.GetByteSize (2020 of 2142) UNSUPPORTED: lldb-api :: commands/register/register/intel_xtended_registers/TestMPXRegisters.py (2021 of 2142) PASS: lldb-api :: api/multiple-debuggers/TestMultipleDebuggers.py (2022 of 2142) UNSUPPORTED: lldb-shell :: ScriptInterpreter/Lua/nested_sessions.test (2023 of 2142) UNSUPPORTED: lldb-api :: commands/gui/basic/TestGuiBasic.py (2024 of 2142) PASS: lldb-api :: python_api/value/change_values/TestChangeValueAPI.py (2025 of 2142) PASS: lldb-unit :: Expression/./ExpressionTests/DiagnosticManagerTest.AppendMessageNoDiag (2026 of 2142) PASS: lldb-unit :: Utility/./UtilityTests/VMRange.ContainsAddr (2027 of 2142) PASS: lldb-unit :: Core/./LLDBCoreTests/RichManglingContextTest.SwitchProvider (2028 of 2142) UNSUPPORTED: lldb-api :: functionalities/data-formatter/data-formatter-stl/libstdcpp/map/TestDataFormatterStdMap.py (2029 of 2142) PASS: lldb-shell :: ObjectFile/ELF/compressed-sections.yaml (2030 of 2142) PASS: lldb-unit :: Target/./TargetTests/MemoryRegionInfoTest.Formatv (2031 of 2142) PASS: lldb-unit :: Utility/./UtilityTests/StringListTest.JoinSingle (2032 of 2142) PASS: lldb-shell :: SymbolFile/DWARF/find-basic-type.cpp (2033 of 2142) PASS: lldb-unit :: Utility/./UtilityTests/RangeTest.ContainsRange (2034 of 2142) PASS: lldb-api :: functionalities/tail_call_frames/inlining_and_tail_calls/TestInliningAndTailCalls.py (2035 of 2142) PASS: lldb-api :: functionalities/tail_call_frames/unambiguous_sequence/TestUnambiguousTailCalls.py (2036 of 2142) PASS: lldb-unit :: Target/./TargetTests/PathMappingListTest.RelativeTests (2037 of 2142) PASS: lldb-shell :: Driver/TestSingleQuote.test (2038 of 2142) PASS: lldb-unit :: SymbolFile/DWARF/./SymbolFileDWARFTests/SymbolFileDWARFTests.TestAbilitiesForDWARF (2039 of 2142) PASS: lldb-unit :: Utility/./UtilityTests/Flags.AllSet (2040 of 2142) PASS: lldb-api :: python_api/value/TestValueAPI.py (2041 of 2142) PASS: lldb-unit :: Process/minidump/./LLDBMinidumpTests/MinidumpParserTest.GetLinuxProcStatus_no_stream (2042 of 2142) UNSUPPORTED: lldb-shell :: SymbolFile/PDB/compilands.test (2043 of 2142) PASS: lldb-shell :: SymbolFile/DWARF/dwp-debug-types.s (2044 of 2142) PASS: lldb-unit :: Host/./HostTests/MainLoopTest.Signal (2045 of 2142) PASS: lldb-unit :: Process/minidump/./LLDBMinidumpTests/MinidumpParserTest.InvalidMinidump (2046 of 2142) PASS: lldb-unit :: Utility/./UtilityTests/StatusTest.Formatv (2047 of 2142) PASS: lldb-unit :: ScriptInterpreter/Python/./ScriptInterpreterPythonTests/PythonDataObjectsTest.TestRun (2048 of 2142) PASS: lldb-unit :: Symbol/./SymbolTests/TestTypeSystemClang.TestDeletingImplicitCopyCstrDueToMoveCStr (2049 of 2142) PASS: lldb-api :: functionalities/testid/TestTestId.py (2050 of 2142) PASS: lldb-unit :: UnwindAssembly/x86/./UnwindAssemblyx86Tests/Testx86AssemblyInspectionEngine.TestPushEBX (2051 of 2142) PASS: lldb-unit :: UnwindAssembly/x86/./UnwindAssemblyx86Tests/Testx86AssemblyInspectionEngine.TestPushRBPWithREX (2052 of 2142) PASS: lldb-unit :: Symbol/./SymbolTests/TestTypeSystemClang.TestGetTypeClassDeclType (2053 of 2142) PASS: lldb-unit :: Utility/./UtilityTests/StringListTest.PopBack (2054 of 2142) PASS: lldb-unit :: Utility/./UtilityTests/FileSpecTest.OperatorBool (2055 of 2142) PASS: lldb-api :: functionalities/backticks/TestBackticksWithoutATarget.py (2056 of 2142) PASS: lldb-api :: lang/c/unicode/TestUnicodeSymbols.py (2057 of 2142) PASS: lldb-unit :: Host/./HostTests/NativeProcessProtocolTest.ReadCStringFromMemory_MaxSize (2058 of 2142) PASS: lldb-unit :: DataFormatter/./LLDBFormatterTests/TypeMatcherTests.CreatedBySameMatchStringExactNamePrefixes (2059 of 2142) PASS: lldb-unit :: Utility/./UtilityTests/VMRange.SetEndAddress (2060 of 2142) UNSUPPORTED: lldb-shell :: ScriptInterpreter/Lua/command_script_import.test (2061 of 2142) PASS: lldb-shell :: Driver/TestNoUseColor.test (2062 of 2142) PASS: lldb-unit :: Utility/./UtilityTests/FileSpecTest.PrependPathComponent (2063 of 2142) PASS: lldb-unit :: Utility/./UtilityTests/StringListTest.SplitIntoLinesSingleTrailingCR (2064 of 2142) PASS: lldb-api :: python_api/lldbutil/TestSwigVersion.py (2065 of 2142) PASS: lldb-unit :: Utility/./UtilityTests/VMRange.Ordering (2066 of 2142) PASS: lldb-unit :: Host/./HostTests/NativeProcessProtocolTest.SetBreakpointFailWrite (2067 of 2142) PASS: lldb-api :: functionalities/breakpoint/breakpoint_ignore_count/TestBreakpointIgnoreCount.py (2068 of 2142) PASS: lldb-api :: python_api/watchpoint/TestWatchpointIter.py (2069 of 2142) PASS: lldb-unit :: Utility/./UtilityTests/StringExtractorTest.GetNameColonValueSuccess (2070 of 2142) PASS: lldb-api :: functionalities/data-formatter/data-formatter-smart-array/TestDataFormatterSmartArray.py (2071 of 2142) PASS: lldb-unit :: Language/Highlighting/./HighlighterTests/HighlighterTest.DefaultHighlighter (2072 of 2142) PASS: lldb-api :: functionalities/data-formatter/data-formatter-proper-plurals/TestFormattersOneIsSingular.py (2073 of 2142) PASS: lldb-api :: commands/expression/context-object/TestContextObject.py (2074 of 2142) PASS: lldb-unit :: Process/minidump/./LLDBMinidumpTests/MinidumpParserTest.MinidumpDuplicateModuleMappedFirst (2075 of 2142) PASS: lldb-api :: commands/expression/dollar-in-variable/TestDollarInVariable.py (2076 of 2142) PASS: lldb-api :: functionalities/data-formatter/typedef_array/TestTypedefArray.py (2077 of 2142) PASS: lldb-api :: lang/objc/self/TestObjCSelf.py (2078 of 2142) UNSUPPORTED: lldb-api :: commands/watchpoints/variable_out_of_scope/TestWatchedVarHitWhenInScope.py (2079 of 2142) PASS: lldb-api :: lang/cpp/class-template-parameter-pack/TestClassTemplateParameterPack.py (2080 of 2142) PASS: lldb-api :: commands/gui/invalid-args/TestInvalidArgsGui.py (2081 of 2142) PASS: lldb-unit :: Process/minidump/./LLDBMinidumpTests/MinidumpParserTest.MinidumpDuplicateModuleMinAddress (2082 of 2142) PASS: lldb-api :: commands/target/stop-hook/delete/TestTargetStopHookDelete.py (2083 of 2142) PASS: lldb-unit :: Utility/./UtilityTests/StringExtractorTest.GetHexBytesAvail_Partial (2084 of 2142) PASS: lldb-shell :: SymbolFile/Breakpad/line-table-discontinuous-file-ids.test (2085 of 2142) PASS: lldb-unit :: Utility/./UtilityTests/StreamTest.PutHex8 (2086 of 2142) PASS: lldb-shell :: ObjectFile/ELF/short-build-id.yaml (2087 of 2142) PASS: lldb-api :: functionalities/postmortem/netbsd-core/TestNetBSDCore.py (2088 of 2142) PASS: lldb-unit :: Utility/./UtilityTests/BinaryStreamTest.PutULEB128SevenBytes (2089 of 2142) PASS: lldb-unit :: ScriptInterpreter/Python/./ScriptInterpreterPythonTests/PythonDataObjectsTest.TestPythonTupleInitializerList2 (2090 of 2142) PASS: lldb-unit :: Utility/./UtilityTests/ArgsTest.ReplaceArgumentAtIndexLonger (2091 of 2142) PASS: lldb-unit :: Utility/./UtilityTests/GeneratorTest.GetOrCreate (2092 of 2142) PASS: lldb-unit :: Utility/./UtilityTests/StringExtractorTest.DecodeHexU8_Underflow (2093 of 2142) PASS: lldb-unit :: Process/minidump/./LLDBMinidumpTests/MinidumpParserTest.GetMiscInfo_no_stream (2094 of 2142) PASS: lldb-api :: commands/help/TestHelp.py (2095 of 2142) PASS: lldb-api :: functionalities/thread_plan/TestThreadPlanCommands.py (2096 of 2142) PASS: lldb-shell :: Breakpoint/single-file-split-dwarf.test (2097 of 2142) PASS: lldb-api :: source-manager/TestSourceManager.py (2098 of 2142) PASS: lldb-api :: lang/objc/modules-hash-mismatch/TestClangModulesHashMismatch.py (2099 of 2142) PASS: lldb-api :: functionalities/target_var/TestTargetVar.py (2100 of 2142) PASS: lldb-shell :: SymbolFile/DWARF/anon_class_w_and_wo_export_symbols.ll (2101 of 2142) PASS: lldb-unit :: Language/Highlighting/./HighlighterTests/HighlighterTest.ClangTrailingBackslashWithWhitespace (2102 of 2142) PASS: lldb-unit :: Utility/./UtilityTests/XcodeSDKTest.SDKSupportsSwift (2103 of 2142) PASS: lldb-api :: lang/objc/objc-baseclass-sbtype/TestObjCBaseClassSBType.py (2104 of 2142) PASS: lldb-api :: commands/expression/xvalue/TestXValuePrinting.py (2105 of 2142) UNSUPPORTED: lldb-api :: tools/lldb-server/platform-process-connect/TestPlatformProcessConnect.py (2106 of 2142) PASS: lldb-shell :: Minidump/no-process-id.yaml (2107 of 2142) PASS: lldb-unit :: UnwindAssembly/x86/./UnwindAssemblyx86Tests/Testx86AssemblyInspectionEngine.TestMovRSPtoRBP (2108 of 2142) PASS: lldb-shell :: SymbolFile/DWARF/debug_ranges.s (2109 of 2142) PASS: lldb-unit :: Utility/./UtilityTests/StringExtractorTest.GetHexBytes_Underflow (2110 of 2142) PASS: lldb-shell :: Commands/command-breakpoint-col.test (2111 of 2142) PASS: lldb-unit :: Utility/./UtilityTests/UriParserTest.BracketedHostnameWithPortIPv6 (2112 of 2142) PASS: lldb-api :: lang/cpp/unique-types/TestUniqueTypes.py (2113 of 2142) PASS: lldb-api :: functionalities/breakpoint/breakpoint_conditions/TestBreakpointConditions.py (2114 of 2142) PASS: lldb-api :: functionalities/thread/concurrent_events/TestConcurrentTwoWatchpointThreads.py (2115 of 2142) PASS: lldb-api :: lang/cpp/incomplete-types/TestCppIncompleteTypes.py (2116 of 2142) PASS: lldb-unit :: UnwindAssembly/x86/./UnwindAssemblyx86Tests/Testx86AssemblyInspectionEngine.TestPushR13 (2117 of 2142) PASS: lldb-api :: commands/expression/import-std-module/unique_ptr-dbg-info-content/TestUniquePtrDbgInfoContent.py (2118 of 2142) PASS: lldb-unit :: Process/gdb-remote/./ProcessGdbRemoteTests/GDBRemoteCommunicationClientTest.GetModulesInfo_UUID20 (2119 of 2142) PASS: lldb-unit :: Core/./LLDBCoreTests/CommunicationTest.SynchronizeWhileClosing (2120 of 2142) PASS: lldb-unit :: Symbol/./SymbolTests/Type.GetTypeScopeAndBasename (2121 of 2142) UNSUPPORTED: lldb-api :: functionalities/darwin_log/filter/regex/activity/TestDarwinLogFilterRegexActivity.py (2122 of 2142) PASS: lldb-unit :: ScriptInterpreter/Python/./ScriptInterpreterPythonTests/PythonDataObjectsTest.TestPythonBoolean (2123 of 2142) PASS: lldb-unit :: Process/gdb-remote/./ProcessGdbRemoteTests/GDBRemoteClientBaseTest.SendPacketAndReceiveResponseWithOutputSupport (2124 of 2142) PASS: lldb-unit :: Language/Highlighting/./HighlighterTests/HighlighterTest.ClangCursorPosEndOfLine (2125 of 2142) PASS: lldb-unit :: Utility/./UtilityTests/LogChannelTest.Enable (2126 of 2142) PASS: lldb-api :: commands/expression/completion-in-lambda-and-unnamed-class/TestCompletionInLambdaAndUnnamedClass.py (2127 of 2142) PASS: lldb-unit :: Utility/./UtilityTests/RegularExpression.Invalid (2128 of 2142) PASS: lldb-api :: commands/command/delete/TestCommandDelete.py (2129 of 2142) PASS: lldb-unit :: SymbolFile/DWARF/./SymbolFileDWARFTests/SymbolFileDWARFTests.TestAbbrevOrder1Start5 (2130 of 2142) PASS: lldb-api :: lang/cpp/operator-overload/TestOperatorOverload.py (2131 of 2142) PASS: lldb-api :: commands/expression/rdar42038760/TestScalarURem.py (2132 of 2142) PASS: lldb-unit :: Utility/./UtilityTests/RangeTest.Copy (2133 of 2142) PASS: lldb-api :: commands/command/nested_alias/TestNestedAlias.py (2134 of 2142) PASS: lldb-api :: lang/objc/objc-struct-argument/TestObjCStructArgument.py (2135 of 2142) PASS: lldb-unit :: Utility/./UtilityTests/ArchSpecTest.MergeFromMachOUnknown (2136 of 2142) PASS: lldb-unit :: Utility/./UtilityTests/CompletionRequest.TryCompleteCurrentArgBad (2137 of 2142) PASS: lldb-shell :: ObjectFile/ELF/avr-basic-info.yaml (2138 of 2142) PASS: lldb-shell :: ObjectFile/ELF/many-sections.s (2139 of 2142) PASS: lldb-api :: lang/objc/real-definition/TestRealDefinition.py (2140 of 2142) PASS: lldb-api :: functionalities/completion/TestCompletion.py (2141 of 2142) Cancelling nested steps due to timeout Sending interrupt signal to process ninja: build stopped: interrupted by user. script returned exit code 143 [Pipeline] } [Pipeline] // timeout [Pipeline] } [Pipeline] // stage [Pipeline] stage [Pipeline] { (Declarative: Post Actions) [Pipeline] scanForIssues [Clang (LLVM based)] Sleeping for 5 seconds due to JENKINS-32191... [Clang (LLVM based)] Parsing console log (workspace: '/Users/buildslave/jenkins/workspace/lldb-cmake-sanitized') [Clang (LLVM based)] Successfully parsed console log [Clang (LLVM based)] -> found 1 issue (skipped 0 duplicates) [Clang (LLVM based)] Post processing issues on 'green-dragon-23' with source code encoding 'UTF-8' [Clang (LLVM based)] Creating SCM blamer to obtain author and commit information for affected files [Clang (LLVM based)] Creating SCM miner to obtain statistics for affected repository files [Clang (LLVM based)] Resolving file names for all issues in source directory '/Users/buildslave/jenkins/workspace/lldb-cmake-sanitized' [Clang (LLVM based)] -> resolved paths in source directory (1 found, 0 not found) [Clang (LLVM based)] Resolving module names from module definitions (build.xml, pom.xml, or Manifest.mf files) [Clang (LLVM based)] -> resolved module names for 1 issues [Clang (LLVM based)] Resolving package names (or namespaces) by parsing the affected files [Clang (LLVM based)] -> resolved package names of 1 affected files [Clang (LLVM based)] No filter has been set, publishing all 1 issues [Clang (LLVM based)] Creating fingerprints for all affected code blocks to track issues over different builds [Clang (LLVM based)] -> created fingerprints for 1 issues (skipped 0 issues) [Clang (LLVM based)] Copying affected files to Jenkins' build folder '/Users/Shared/Jenkins/Home/jobs/lldb-cmake-sanitized/builds/1820/files-with-issues' [Clang (LLVM based)] -> 1 copied, 0 not in workspace, 0 not-found, 0 with I/O error [Pipeline] junit Recording test results No test report files were found. Configuration error? Error when executing always post condition: Also: hudson.remoting.Channel$CallSiteStackTrace: Remote call to green-dragon-23 at hudson.remoting.Channel.attachCallSiteStackTrace(Channel.java:1788) at hudson.remoting.UserRequest$ExceptionResponse.retrieve(UserRequest.java:356) at hudson.remoting.Channel.call(Channel.java:998) at hudson.FilePath.act(FilePath.java:1069) at hudson.FilePath.act(FilePath.java:1058) at hudson.tasks.junit.JUnitParser.parseResult(JUnitParser.java:114) at hudson.tasks.junit.JUnitResultArchiver.parse(JUnitResultArchiver.java:137) at hudson.tasks.junit.JUnitResultArchiver.parseAndAttach(JUnitResultArchiver.java:167) at hudson.tasks.junit.pipeline.JUnitResultsStepExecution.run(JUnitResultsStepExecution.java:52) at hudson.tasks.junit.pipeline.JUnitResultsStepExecution.run(JUnitResultsStepExecution.java:25) at org.jenkinsci.plugins.workflow.steps.SynchronousNonBlockingStepExecution.lambda$start$0(SynchronousNonBlockingStepExecution.java:47) at java.util.concurrent.Executors$RunnableAdapter.call(Executors.java:511) hudson.AbortException: No test report files were found. Configuration error? at hudson.tasks.junit.JUnitParser$ParseResultCallable.invoke(JUnitParser.java:154) at hudson.tasks.junit.JUnitParser$ParseResultCallable.invoke(JUnitParser.java:118) at hudson.FilePath$FileCallableWrapper.call(FilePath.java:3073) at hudson.remoting.UserRequest.perform(UserRequest.java:211) at hudson.remoting.UserRequest.perform(UserRequest.java:54) at hudson.remoting.Request$2.run(Request.java:369) at hudson.remoting.InterceptingExecutorService$1.call(InterceptingExecutorService.java:72) at java.util.concurrent.FutureTask.run(FutureTask.java:266) at java.util.concurrent.ThreadPoolExecutor.runWorker(ThreadPoolExecutor.java:1149) at java.util.concurrent.ThreadPoolExecutor$Worker.run(ThreadPoolExecutor.java:624) at java.lang.Thread.run(Thread.java:748)

Hide Details

[Pipeline] } [Pipeline] // stage [Pipeline] } [Pipeline] // withEnv [Pipeline] } [Pipeline] // node [Pipeline] End of Pipeline Timeout has been exceeded Finished: ABORTED