UnstableConsole Output

Skipping 80,171 KB.. Full Log
TestStatisticsAPI.py (861 of 2138)
PASS: lldb-api :: functionalities/unwind/sigtramp/TestSigtrampUnwind.py (862 of 2138)
PASS: lldb-unit :: Utility/./UtilityTests/ProcessInstanceInfo.DumpTable (863 of 2138)
UNSUPPORTED: lldb-api :: functionalities/asan/TestReportData.py (864 of 2138)
PASS: lldb-unit :: Language/CPlusPlus/./LanguageCPlusPlusTests/CPlusPlusLanguage.ExtractContextAndIdentifier (865 of 2138)
PASS: lldb-unit :: Utility/./UtilityTests/StringListTest.GetSize (866 of 2138)
PASS: lldb-shell :: SymbolFile/DWARF/find-method-local-struct.cpp (867 of 2138)
PASS: lldb-unit :: Utility/./UtilityTests/BinaryStreamTest.PutSLEB128OneByte (868 of 2138)
PASS: lldb-api :: macosx/save_crashlog/TestSaveCrashlog.py (869 of 2138)
PASS: lldb-unit :: ScriptInterpreter/Python/./ScriptInterpreterPythonTests/PythonDataObjectsTest.TestOwnedReferences (870 of 2138)
PASS: lldb-unit :: Utility/./UtilityTests/ArchSpecTest.TestParseMachCPUDashSubtypeTripleSimple (871 of 2138)
UNSUPPORTED: lldb-api :: commands/expression/import_builtin_fileid/TestImportBuiltinFileID.py (872 of 2138)
PASS: lldb-unit :: Symbol/./SymbolTests/PostfixExpression.ParseOneExpression (873 of 2138)
PASS: lldb-api :: functionalities/breakpoint/consecutive_breakpoints/TestConsecutiveBreakpoints.py (874 of 2138)
UNSUPPORTED: lldb-api :: functionalities/thread/concurrent_events/TestConcurrentTwoWatchpointsOneSignal.py (875 of 2138)
PASS: lldb-api :: functionalities/load_using_paths/TestLoadUsingPaths.py (876 of 2138)
PASS: lldb-unit :: Utility/./UtilityTests/SerializationRountripTest.SerializeDeserializeCStringArrayNullptrElem (877 of 2138)
PASS: lldb-api :: functionalities/data-formatter/summary-string-onfail/Test-rdar-9974002.py (878 of 2138)
PASS: lldb-api :: tools/lldb-vscode/variables/TestVSCode_variables.py (879 of 2138)
PASS: lldb-unit :: ScriptInterpreter/Python/./ScriptInterpreterPythonTests/PythonDataObjectsTest.TestPythonListToStructuredList (880 of 2138)
PASS: lldb-unit :: Host/./HostTests/FileSystemTest.OpenErrno (881 of 2138)
PASS: lldb-api :: commands/gui/viewlarge/TestGuiViewLarge.py (882 of 2138)
PASS: lldb-api :: commands/session/save/TestSessionSave.py (883 of 2138)
PASS: lldb-api :: functionalities/tail_call_frames/disambiguate_call_site/TestDisambiguateCallSite.py (884 of 2138)
PASS: lldb-unit :: Utility/./UtilityTests/UUIDTest.StringConverion (885 of 2138)
PASS: lldb-api :: tools/lldb-vscode/attach/TestVSCode_attach.py (886 of 2138)
PASS: lldb-api :: macosx/DBGSourcePathRemapping/TestDSYMSourcePathRemapping.py (887 of 2138)
UNSUPPORTED: lldb-api :: functionalities/darwin_log/filter/regex/subsystem/TestDarwinLogFilterRegexSubsystem.py (888 of 2138)
PASS: lldb-unit :: Core/./LLDBCoreTests/ModuleSpecTest.TestCOFFFile (889 of 2138)
PASS: lldb-api :: lang/objc/modules-non-objc-target/TestObjCModulesNonObjCTarget.py (890 of 2138)
PASS: lldb-unit :: Utility/./UtilityTests/OptionsWithRawTest.WhitespaceInput (891 of 2138)
PASS: lldb-unit :: tools/lldb-server/tests/./LLDBServerTests/StandardStartupTest.TestStopReplyContainsThreadPcs (892 of 2138)
PASS: lldb-unit :: Process/minidump/./LLDBMinidumpTests/MinidumpParserTest.MinidumpDuplicateModuleMappedSecond (893 of 2138)
PASS: lldb-unit :: Interpreter/./InterpreterTests/OptionArgParserTest.toChar (894 of 2138)
PASS: lldb-unit :: Language/Highlighting/./HighlighterTests/HighlighterTest.HighlighterSelectionPath (895 of 2138)
PASS: lldb-unit :: UnwindAssembly/x86/./UnwindAssemblyx86Tests/Testx86AssemblyInspectionEngine.TestPopEDI (896 of 2138)
PASS: lldb-api :: commands/expression/regression-access-function-template-in-record/TestRegressionAccessFunctionTemplateInRecord.py (897 of 2138)
PASS: lldb-unit :: SymbolFile/DWARF/./SymbolFileDWARFTests/DWARFASTParserClangTests.EnsureAllDIEsInDeclContextHaveBeenParsedParsesOnlyMatchingEntries (898 of 2138)
PASS: lldb-api :: commands/expression/scoped_enums/TestScopedEnumType.py (899 of 2138)
PASS: lldb-api :: functionalities/breakpoint/breakpoint_command/TestRegexpBreakCommand.py (900 of 2138)
PASS: lldb-unit :: Utility/./UtilityTests/LogChannelEnabledTest.log_options (901 of 2138)
PASS: lldb-unit :: Language/Highlighting/./HighlighterTests/HighlighterTest.DefaultHighlighterWithCursor (902 of 2138)
PASS: lldb-unit :: Utility/./UtilityTests/RangeTest.DefaultConstructor (903 of 2138)
PASS: lldb-api :: python_api/target/TestTargetAPI.py (904 of 2138)
PASS: lldb-api :: functionalities/multidebugger_commands/TestMultipleDebuggersCommands.py (905 of 2138)
PASS: lldb-api :: python_api/sbdata/TestSBData.py (906 of 2138)
PASS: lldb-api :: commands/expression/call-function/TestCallStopAndContinue.py (907 of 2138)
PASS: lldb-api :: lang/objc/objc-baseclass-sbtype/TestObjCBaseClassSBType.py (908 of 2138)
UNSUPPORTED: lldb-shell :: SymbolFile/NativePDB/local-variables.cpp (909 of 2138)
PASS: lldb-unit :: ScriptInterpreter/Python/./ScriptInterpreterPythonTests/PythonDataObjectsTest.TestScript (910 of 2138)
PASS: lldb-unit :: Language/Highlighting/./HighlighterTests/HighlighterTest.HighlighterSelectionType (911 of 2138)
PASS: lldb-shell :: Minidump/disassemble-no-module.yaml (912 of 2138)
PASS: lldb-unit :: Utility/./UtilityTests/VMRange.ContainsRange (913 of 2138)
PASS: lldb-unit :: Utility/./UtilityTests/OptionsWithRawTest.SingleWordSuffix (914 of 2138)
PASS: lldb-unit :: DataFormatter/./LLDBFormatterTests/TypeMatcherTests.GetMatchStringRegex (915 of 2138)
PASS: lldb-unit :: DataFormatter/./LLDBFormatterTests/StringPrinterTests.CxxASCII (916 of 2138)
PASS: lldb-shell :: SymbolFile/Breakpad/line-table-mixed-path-styles.test (917 of 2138)
PASS: lldb-api :: functionalities/gdb_remote_client/TestArmRegisterDefinition.py (918 of 2138)
PASS: lldb-api :: functionalities/breakpoint/breakpoint_locations/TestBreakpointLocations.py (919 of 2138)
PASS: lldb-unit :: Utility/./UtilityTests/RangeTest.NotEqualInvalid (920 of 2138)
PASS: lldb-unit :: Utility/./UtilityTests/VASprintfTest.BufferResize (921 of 2138)
PASS: lldb-unit :: Symbol/./SymbolTests/TestTypeSystemClang.TestNotDeletingUserCopyCstrDueToMoveCStr (922 of 2138)
PASS: lldb-unit :: SymbolFile/NativePDB/./SymbolFileNativePDBTests/PDBFPOProgramToDWARFExpressionTests.UnresolvedDependentCyclicRegisterAssignmentReference (923 of 2138)
PASS: lldb-api :: python_api/frame/TestFrames.py (924 of 2138)
PASS: lldb-unit :: Utility/./UtilityTests/StringListTest.CopyListEmpty (925 of 2138)
PASS: lldb-api :: functionalities/data-formatter/varscript_formatting/TestDataFormatterVarScriptFormatting.py (926 of 2138)
PASS: lldb-api :: python_api/section/TestSectionAPI.py (927 of 2138)
PASS: lldb-shell :: Driver/TestPositionalArgs.test (928 of 2138)
PASS: lldb-api :: functionalities/lazy-loading/TestLazyLoading.py (929 of 2138)
PASS: lldb-api :: python_api/value/TestValueAPI.py (930 of 2138)
PASS: lldb-unit :: Thread/./ThreadTests/ThreadTest.SetStopInfo (931 of 2138)
PASS: lldb-unit :: Utility/./UtilityTests/RangeTest.ClearWithStarAddress (932 of 2138)
PASS: lldb-api :: tools/lldb-vscode/stackTrace/TestVSCode_stackTrace.py (933 of 2138)
PASS: lldb-unit :: ObjectFile/Breakpad/./ObjectFileBreakpadTests/PublicRecord.parse (934 of 2138)
PASS: lldb-unit :: Symbol/./SymbolTests/TestClangASTImporter.ImportInvalidType (935 of 2138)
PASS: lldb-api :: functionalities/data-formatter/data-formatter-objc/TestDataFormatterObjCNSData.py (936 of 2138)
PASS: lldb-api :: commands/expression/import-std-module/sysroot/TestStdModuleSysroot.py (937 of 2138)
PASS: lldb-unit :: Target/./TargetTests/ModuleCacheTest.GetAndPutStrangeHostname (938 of 2138)
PASS: lldb-api :: functionalities/plugins/python_os_plugin/TestPythonOSPlugin.py (939 of 2138)
PASS: lldb-api :: iohandler/unicode/TestUnicode.py (940 of 2138)
PASS: lldb-api :: types/TestLongTypesExpr.py (941 of 2138)
PASS: lldb-shell :: ObjectFile/MachO/subsections.yaml (942 of 2138)
PASS: lldb-unit :: Host/./HostTests/SocketTest.DomainListenConnectAccept (943 of 2138)
PASS: lldb-unit :: Process/gdb-remote/./ProcessGdbRemoteTests/GDBRemoteClientBaseTest.SendPacketAndReceiveResponseWithOutputSupport (944 of 2138)
PASS: lldb-api :: python_api/process/read-mem-cstring/TestReadMemCString.py (945 of 2138)
PASS: lldb-api :: macosx/function-starts/TestFunctionStarts.py (946 of 2138)
UNSUPPORTED: lldb-api :: benchmarks/turnaround/TestCompileRunToBreakpointTurnaround.py (947 of 2138)
UNSUPPORTED: lldb-api :: functionalities/darwin_log/filter/exact_match/category/TestDarwinLogFilterMatchCategory.py (948 of 2138)
PASS: lldb-unit :: Process/gdb-remote/./ProcessGdbRemoteTests/GDBRemoteCommunicationClientTest.TestPacketSpeedJSON (949 of 2138)
PASS: lldb-api :: macosx/queues/TestQueues.py (950 of 2138)
PASS: lldb-unit :: Utility/./UtilityTests/XcodeSDKTest.MergeTest (951 of 2138)
PASS: lldb-shell :: Driver/TestFile.test (952 of 2138)
PASS: lldb-api :: functionalities/thread/exit_during_expression/TestExitDuringExpression.py (953 of 2138)
PASS: lldb-api :: python_api/findvalue_duplist/TestSBFrameFindValue.py (954 of 2138)
PASS: lldb-unit :: Expression/./ExpressionTests/ClangExpressionDeclMapTest.TestUnknownIdentifierLookup (955 of 2138)
PASS: lldb-unit :: Process/minidump/./LLDBMinidumpTests/MinidumpParserTest.GetPidWow64 (956 of 2138)
PASS: lldb-unit :: Utility/./UtilityTests/GeneratorTest.Create (957 of 2138)
UNSUPPORTED: lldb-shell :: SymbolFile/DWARF/debug-types-expressions.test (958 of 2138)
PASS: lldb-api :: functionalities/gdb_remote_client/TestGDBRemoteDiskFileCompletion.py (959 of 2138)
UNSUPPORTED: lldb-api :: benchmarks/startup/TestStartupDelays.py (960 of 2138)
PASS: lldb-unit :: Process/minidump/./LLDBMinidumpTests/MinidumpParserTest.MinidumpDuplicateModuleMappedFirst (961 of 2138)
UNSUPPORTED: lldb-api :: functionalities/breakpoint/breakpoint_in_delayslot/TestAvoidBreakpointInDelaySlot.py (962 of 2138)
PASS: lldb-api :: functionalities/data-formatter/data-formatter-stl/libcxx/list/TestDataFormatterLibcxxList.py (963 of 2138)
UNSUPPORTED: lldb-api :: arm/breakpoint-thumb-codesection/TestBreakpointThumbCodesection.py (964 of 2138)
FAIL: lldb-api :: commands/gui/basicdebug/TestGuiBasicDebug.py (965 of 2138)
******************** TEST 'lldb-api :: commands/gui/basicdebug/TestGuiBasicDebug.py' FAILED ********************
Script:
--
/usr/local/Frameworks/Python.framework/Versions/3.7/bin/python3.7 /Users/buildslave/jenkins/workspace/lldb-cmake-matrix/llvm-project/lldb/test/API/dotest.py -s /Users/buildslave/jenkins/workspace/lldb-cmake-matrix/lldb-build/lldb-test-traces -S nm -u CXXFLAGS -u CFLAGS --codesign-identity lldb_codesign --server /Users/buildslave/jenkins/workspace/lldb-cmake-matrix/lldb-build/./bin/debugserver --arch x86_64 --build-dir /Users/buildslave/jenkins/workspace/lldb-cmake-matrix/lldb-build/lldb-test-build.noindex -s=/Users/buildslave/jenkins/workspace/lldb-cmake-matrix/test/logs -t --env TERM=vt100 --skip-category gmodules --skip-category watchpoint --arch=x86_64 --env LLVM_LIBS_DIR=/Users/buildslave/jenkins/workspace/lldb-cmake-matrix/lldb-build/./lib --arch x86_64 --build-dir /Users/buildslave/jenkins/workspace/lldb-cmake-matrix/lldb-build/lldb-test-build.noindex --lldb-module-cache-dir /Users/buildslave/jenkins/workspace/lldb-cmake-matrix/lldb-build/lldb-test-build.noindex/module-cache-lldb/lldb-api --clang-module-cache-dir /Users/buildslave/jenkins/workspace/lldb-cmake-matrix/lldb-build/lldb-test-build.noindex/module-cache-clang/lldb-api --executable /Users/buildslave/jenkins/workspace/lldb-cmake-matrix/lldb-build/./bin/lldb --compiler /Users/buildslave/jenkins/workspace/lldb-cmake-matrix/lldb-build/./bin/clang --dsymutil /Users/buildslave/jenkins/workspace/lldb-cmake-matrix/lldb-build/./bin/dsymutil --filecheck /Users/buildslave/jenkins/workspace/lldb-cmake-matrix/lldb-build/./bin/FileCheck --yaml2obj /Users/buildslave/jenkins/workspace/lldb-cmake-matrix/lldb-build/./bin/yaml2obj --lldb-libs-dir /Users/buildslave/jenkins/workspace/lldb-cmake-matrix/lldb-build/./lib /Users/buildslave/jenkins/workspace/lldb-cmake-matrix/llvm-project/lldb/test/API/commands/gui/basicdebug -p TestGuiBasicDebug.py
--
Exit Code: 1

Hide Details

Command Output (stdout): -- lldb version 12.0.99 clang revision 3bf703fb6d55b23d29c792325a78cd3ead9ad07c llvm revision 3bf703fb6d55b23d29c792325a78cd3ead9ad07c (lldb) settings clear -all (lldb) settings set symbols.enable-external-lookup false (lldb) settings set target.inherit-tcc true (lldb) settings set target.auto-apply-fixits false (lldb) settings set plugin.process.gdb-remote.packet-timeout 60 (lldb) settings set symbols.clang-modules-cache-path "/Users/buildslave/jenkins/workspace/lldb-cmake-matrix/lldb-build/lldb-test-build.noindex/module-cache-lldb/lldb-api" (lldb) settings set use-color false (lldb) setting set target.prefer-dynamic-value no-dynamic-values (lldb) target create "/Users/buildslave/jenkins/workspace/lldb-cmake-matrix/lldb-build/lldb-test-build.noindex/commands/gui/basicdebug/TestGuiBasicDebug.test_gui/a.out" Current executable set to '/Users/buildslave/jenkins/workspace/lldb-cmake-matrix/lldb-build/lldb-test-build.noindex/commands/gui/basicdebug/TestGuiBasicDebug.test_gui/a.out' (x86_64). (lldb) br set -f main.c -p "// Break here" br set -f main.c -p "// Break here" Breakpoint 1: where = a.out`main + 22 at main.c:4:3, address = 0x0000000100000f86 (lldb) run run Process 8174 launched: '/Users/buildslave/jenkins/workspace/lldb-cmake-matrix/lldb-build/lldb-test-build.noindex/commands/gui/basicdebug/TestGuiBasicDebug.test_gui/a.out' (x86_64) Process 8174 stopped * thread #1, queue = 'com.apple.main-thread', stop reason = breakpoint 1.1 frame #0: 0x0000000100000f86 a.out`main(argc=1, argv=0x00007ffeefbff890) at main.c:4:3 1 extern int func(); 2 3 int main(int argc, char **argv) { -> 4 func(); // Break here ^ 5 func(); // Second 6 return 0; 7 } (lldb) gui sgui (B)0[?7h[?1h=| LLDB (F1) | Target (F2) | Process (F3) | Thread (F4) | View (F5) | Help (F6) | lqq<Sources>qqqqqqqqqqqqqqqqqqqqqqqqqqqqqqqqqqqqqqqqqqqqqqqqqqqqqqqqqqqqqqqqqqqqqqqqqqqqqqqqqqqqqqqqqqqqqqqqqqqqqqqqqqqqqqqqqqqqqqqqqqqqqqqqqqqqqqqqqqqqqqqqqqqqqqqqqqqqqqqqqqqqqqqqqqqqqqqqqqqqqqqqqqqqqqqqqqqqqqqqqqqqqqqqqqqqqqqqqqqqqqqqqqqqqqqqqqqqqqqqqqqqqqqqqqqqqqqqqqqqqqqqqqqqqqqqqqqqqqqqqqqqqqqqqqqqqqqqqqqqqqqqqqqqqqqqqqqqqqqqqqqqqqqqqqqqqqqqqqqqqqqqqqqqqqqqqqqqqqqqqqqqqqqqqqqqqqqqqqqqqqqqqqqklqq<Threads>qqqqqqqqqqqqqqqqqqqqqqqqqqqqqqqqqqqqqqqqqqqqqqqqqqqqqqqqqqqqqqqqqqqqqqqqqqqqqqqqqqqqqqqkx a.out`main xx `qprocess 8174xx 1 x extern int func();xxxx 2 xxxxx 3 x int main(int argc, char **argv) {xxxx 4 x` func(); // Break here <<< Thread 1: breakpoint 1.1xxxx 5 x func(); // Secondxxxx 6 x return 0;xxxx 7 x }xxxx 8 xxxxxxxxxxxxxxxxxxxxxxxxxxxxxxxxxxxxxxxxxxxxxxxxxxxxxxxxxxxxxxxxxxxxxxxxxxxxxxxxxxxxxxxxxxxxxxxxxxxxxxxxxxxxxxxxxxxxxxxxxxxxxlqq<Help>qqqqqqqqqqqqqqqqqqqqqqqqqqqqqqqqqqqqqqqqqqqqqqqqqqqqqqqqqqqqqqqqqqqqqqqqqqqqqqqkxxxxx Welcome to the LLDB curses GUI.xxxxxxxxxxxx Press the TAB key to change the selected view.xxxxxx Each view has its own keyboard shortcuts, press 'h' to open a dialog to display them. xxxxxxxxxxxx Common key bindings for all views:xxxxxxxxxxxxtab - Select next viewxxxxxx back-tab key - Select previous viewxxxxxxh - Show help dialog with view specific key bindingsxxxxxx, - Page upxxxxxx. - Page downxxxxxxup - Select previousxxxxxxdown - Select nextxxxxxxleft - Unexpand or select parentxxxxxxright - Expandxxxxxx page-up - Page upxxxxxx page-down - Page downxxxxxmqqqqqqqqqqqqqqqqqqqqqqqqqqqqqqqqqqqqqqqqqqqqqqqqqqqqqqqqqqqqqq[Press any key to exit]qqjxxxxxxxxxxxxxxxxxxxxxxxxxxxxxxxmqqqqqqqqqqqqqqqqqqqqqqqqqqqqqqqqqqqqqqqqqqqqqqqqqqqqqqqqqqqqqqqqqqqqqqqqqqqqqqqqqqqqqqqqqqqqqqqqqqqqqqqqqqqqqqqqqqqqqqqqqqqqqqqqqqqqqqqqqqqqqqqqqqqqqqqqqqqqqqqqqqqqqqqqqqqqqqqqqqqqqqqqqqqqqqqqqqqqqqqqqqqqqqqqqqqqqqqqqqqqqqqqqqqqqqqqqqqqqqqqqqqqqqqqqqqqqqqqqqqqqqqqqqqqqqqqqqqqqqqqqqqqqqqqqqqqqqqqqqqqqqqqqqqqqqqqqqqqqqqqqqqqqqqqqqqqqqqqqqqqqqqqqqqqqqqqqqqqqqqqqqqqqqqqqqqqqqqqqqqqqqqqqqqqqqqqqqqqqqjxxlqq<Variables>qqqqqqqqqqqqqqqqqqqqqqqqqqqqqqqqqqqqqqqqqqqqqqqqqqqqqqqqqqqqqqqqqqqqqqqqqqqqqqqqqqqqqqqqqqqqqqqqqqqqqqqqqqqqqqqqqqqqqqqqqqqqqqqqqqqqqqqqqqqqqqqqqqqqqqqqqqqqqqqqqqqqqqqqqqqqqqqqqqqqqqqqqqqqqqqqqqqqqqqqqqqqqqqqqqqqqqqqqqqqqqqqqqqqqqqqqqqqqqqqqqqqqqqqqqqqqqqqqqqqqqqqqqqqqqqqqqqqqqqqqqqqqqqqqqqqqqqqqqqqqqqqqqqqqqqqqqqqqqqqqqqqqqqqqqqqqqqqqqqqqqqqqqqqqqqqqqqqqqqqqqqqqqqqqqqqqqqqqqqqqqqqqkxxx (int) argc = 1xxxx `q(char **) argv = 0x00007ffeefbff890xxxxxxxxxxxxxxxxxxxxxxxxxxxxxxxxxxxxxxxxxxxxxxxxxxxxxxxxxxxxxxxxxxxxxxxxxxxxxxxxxxxxxxxxxxxxxxxxxxxxxxxxxxxmqqqqqqqqqqqqqqqqqqqqqqqqqqqqqqqqqqqqqqqqqqqqqqqqqqqqqqqqqqqqqqqqqqqqqqqqqqqqqqqqqqqqqqqqqqqqqqqqqqqqqqqqqqqqqqqqqqqqqqqqqqqqqqqqqqqqqqqqqqqqqqqqqqqqqqqqqqqqqqqqqqqqqqqqqqqqqqqqqqqqqqqqqqqqqqqqqqqqqqqqqqqqqqqqqqqqqqqqqqqqqqqqqqqqqqqqqqqqqqqqqqqqqqqqqqqqqqqqqqqqqqqqqqqqqqqqqqqqqqqqqqqqqqqqqqqqqqqqqqqqqqqqqqqqqqqqqqqqqqqqqqqqqqqqqqqqqqqqqqqqqqqqqqqqqqqqqqqqqqqqqqqqqqqqqqqqqqqqqqqqqqqqqqqqqqqqqqqqqqjmqqqqqqqqqqqqqqqqqqqqqqqqqqqqqqqqqqqqqqqqqqqqqqqqqqqqqqqqqqqqqqqqqqqqqqqqqqqqqqqqqqqqqqqqqqqqqqqqqqjProcess: 8174 stopped Thread: 0x1bba7d Frame: 0 PC = 0x0000000100000f86 lqq<Sources>qqqqqqqqqqqqqqqqqqqqqqqqqqqqqqqqqqqqqqqqqqqqqqqqqqqqqqqqqqqqqqqqqqqqqqqqqqqqqqqqqqqqqqqqqqqqqqqqqqqqqqqqqqqqqqqqqqqqqqqqqqqqqqqqqqqqqqqqqqqqqqqqqqqqqqqqqqqqqqqqqqqqqqqqqqqqqqqqqqqqqqqqqqqqqqqqqqqqqqqqqqqqqqqqqqqqqqqqqqqqqqqqqqqqqqqqqqqqqqqqqqqqqqqqqqqqqqqqqqqqqqqqqqqqqqqqqqqqqqqqqqqqqqqqqqqqqqqqqqqqqqqqqqqqqqqqqqqqqqqqqqqqqqqqqqqqqqqqqqqqqqqqqqqqqqqqqqqqqqqqqqqqqqqqqqqqqqqqqqqqqqqqqqqk xx xx xx xx xx xx xx xx xx xx xx xx xx xx xx xx xx xx xx xx xx xx xx xx xx xx xx xx xx xx xx xx xx xx xx xx xx xx xx x x x  x x  x x  x x x x  x x  x x  x x   x x  x x   x x   x x   x x   x x   x x   x x   x x  x x  x x x xx xx xx xx xx xx xx mqqqqqqqqqqqqqqqqqqqqqqqqqqqqqqqqqqqqqqqqqqqqqqqqqqqqqqqqqqqqqqqqqqqqqqqqqqqqqqqqqqqqqqqqqqqqqqqqqqqqqqqqqqqqqqqqqqqqqqqqqqqqqqqqqqqqqqqqqqqqqqqqqqqqqqqqqqqqqqqqqqqqqqqqqqqqqqqqqqqqqqqqqqqqqqqqqqqqqqqqqqqqqqqqqqqqqqqqqqqqqqqqqqqqqqqqqqqqqqqqqqqqqqqqqqqqqqqqqqqqqqqqqqqqqqqqqqqqqqqqqqqqqqqqqqqqqqqqqqqqqqqqqqqqqqqqqqqqqqqqqqqqqqqqqqqqqqqqqqqqqqqqqqqqqqqqqqqqqqqqqqqqqqqqqqqqqqqqqqqqqqqqqqqqqqqqqqqqqqj runningfunc int func() { ` return 1; // In function <<< Thread 1: step in }  4 x       stoppedThread: 0x1bba7d Frame: 0 PC = 0x0000000100000fa4umain extern int func();  int main(int argc, char **argv) {  4 x` func(); // Break here 5 x func(); // Second 6 x return 0; 7 x } 8 x(int) argc = 1 `q(char **) argv = 0x00007ffeefbff89018ddfunc int func() { ` return 1; // In function <<< Thread 1: step in }  4 x       0a4f runningmain extern int func();  int main(int argc, char **argv) {  4 x func(); // Break here 5 x` func(); // Second <<< Thread 1: step out 6 x return 0; 7 x } 8 x(int) argc = 1 `q(char **) argv = 0x00007ffeefbff890stoppedThread: 0x1bba7d Frame: 0 PC = 0x0000000100000f8dsettings set interpreter.prompt-on-quit false quit  running

Hide Details

Hide Details

extern int func();

Hide Details

Hide Details

Hide Details

 func(); // Secondfunc int func() { ` return 1; // In function <<< Thread 1: step in }  4 x       stoppedThread: 0x1bba7d Frame: 0 PC = 0x0000000100000fa4

Hide Details

Hide Details

Hide Details

 2  running  exited with status = 0libstdcxx tests will not be run because: Don't know how to build with libstdcxx on macosx Skipping following debug info categories: ['dwo']

Hide Details

-- Command Output (stderr): --

Hide Details

Session logs for test failures/errors/unexpected successes will go into directory '/Users/buildslave/jenkins/workspace/lldb-cmake-matrix/test/logs' Change dir to: /Users/buildslave/jenkins/workspace/lldb-cmake-matrix/llvm-project/lldb/test/API/commands/gui/basicdebug runCmd: settings clear -all output:

Hide Details

runCmd: settings set symbols.enable-external-lookup false output:

Hide Details

runCmd: settings set target.inherit-tcc true output:

Hide Details

runCmd: settings set target.auto-apply-fixits false output:

Hide Details

runCmd: settings set plugin.process.gdb-remote.packet-timeout 60 output:

Hide Details

runCmd: settings set symbols.clang-modules-cache-path "/Users/buildslave/jenkins/workspace/lldb-cmake-matrix/lldb-build/lldb-test-build.noindex/module-cache-lldb/lldb-api" output:

Hide Details

runCmd: settings set use-color false output:

Hide Details

runCmd: setting set target.prefer-dynamic-value no-dynamic-values output:

Hide Details

FAIL: LLDB (/Users/buildslave/jenkins/workspace/lldb-cmake-matrix/lldb-build/bin/clang-x86_64) :: test_gui (TestGuiBasicDebug.TestGuiBasicDebugCommandTest) tearing down the child process....

Hide Details

Restore dir to: /Users/buildslave/jenkins/workspace/lldb-cmake-matrix/lldb-build/tools/lldb/test ====================================================================== ERROR: test_gui (TestGuiBasicDebug.TestGuiBasicDebugCommandTest) ---------------------------------------------------------------------- Traceback (most recent call last): File "/Users/buildslave/jenkins/workspace/lldb-cmake-matrix/llvm-project/lldb/third_party/Python/module/pexpect-4.6/pexpect/expect.py", line 111, in expect_loop incoming = spawn.read_nonblocking(spawn.maxread, timeout) File "/Users/buildslave/jenkins/workspace/lldb-cmake-matrix/llvm-project/lldb/third_party/Python/module/pexpect-4.6/pexpect/pty_spawn.py", line 482, in read_nonblocking raise TIMEOUT('Timeout exceeded.') pexpect.exceptions.TIMEOUT: Timeout exceeded.

Hide Details

During handling of the above exception, another exception occurred:

Hide Details

Traceback (most recent call last): File "/Users/buildslave/jenkins/workspace/lldb-cmake-matrix/llvm-project/lldb/packages/Python/lldbsuite/test/decorators.py", line 134, in wrapper return func(*args, **kwargs) File "/Users/buildslave/jenkins/workspace/lldb-cmake-matrix/llvm-project/lldb/packages/Python/lldbsuite/test/decorators.py", line 104, in wrapper func(*args, **kwargs) File "/Users/buildslave/jenkins/workspace/lldb-cmake-matrix/llvm-project/lldb/test/API/commands/gui/basicdebug/TestGuiBasicDebug.py", line 40, in test_gui self.child.expect("func\(\); // Break here[^\r\n]+<<< Thread 1: step out") File "/Users/buildslave/jenkins/workspace/lldb-cmake-matrix/llvm-project/lldb/third_party/Python/module/pexpect-4.6/pexpect/spawnbase.py", line 341, in expect timeout, searchwindowsize, async_) File "/Users/buildslave/jenkins/workspace/lldb-cmake-matrix/llvm-project/lldb/third_party/Python/module/pexpect-4.6/pexpect/spawnbase.py", line 369, in expect_list return exp.expect_loop(timeout) File "/Users/buildslave/jenkins/workspace/lldb-cmake-matrix/llvm-project/lldb/third_party/Python/module/pexpect-4.6/pexpect/expect.py", line 119, in expect_loop return self.timeout(e) File "/Users/buildslave/jenkins/workspace/lldb-cmake-matrix/llvm-project/lldb/third_party/Python/module/pexpect-4.6/pexpect/expect.py", line 82, in timeout raise TIMEOUT(msg) pexpect.exceptions.TIMEOUT: Timeout exceeded. <pexpect.pty_spawn.spawn object at 0x10cd1e320> command: /Users/buildslave/jenkins/workspace/lldb-cmake-matrix/lldb-build/bin/lldb args: ['/Users/buildslave/jenkins/workspace/lldb-cmake-matrix/lldb-build/bin/lldb', '--no-lldbinit', '--no-use-colors', '-O', 'settings clear -all', '-O', 'settings set symbols.enable-external-lookup false', '-O', 'settings set target.inherit-tcc true', '-O', 'settings set target.auto-apply-fixits false', '-O', 'settings set plugin.process.gdb-remote.packet-timeout 60', '-O', 'settings set symbols.clang-modules-cache-path "/Users/buildslave/jenkins/workspace/lldb-cmake-matrix/lldb-build/lldb-test-build.noindex/module-cache-lldb/lldb-api"', '-O', 'settings set use-color false', '-O', 'setting set target.prefer-dynamic-value no-dynamic-values', '--file', '/Users/buildslave/jenkins/workspace/lldb-cmake-matrix/lldb-build/lldb-test-build.noindex/commands/gui/basicdebug/TestGuiBasicDebug.test_gui/a.out'] buffer (last 100 chars): b'07ffeefbff890\x1b[100;19Hstopped\x1b[100;41HThread: 0x1bba7d Frame: 0 PC = 0x0000000100000f8d\x1b[m\x0f\x1b[H' before (last 100 chars): b'07ffeefbff890\x1b[100;19Hstopped\x1b[100;41HThread: 0x1bba7d Frame: 0 PC = 0x0000000100000f8d\x1b[m\x0f\x1b[H' after: <class 'pexpect.exceptions.TIMEOUT'> match: None match_index: None exitstatus: None flag_eof: False pid: 7981 child_fd: 6 closed: False timeout: 30 delimiter: <class 'pexpect.exceptions.EOF'> logfile: <_io.BufferedWriter name='<stdout>'> logfile_read: None logfile_send: None maxread: 2000 ignorecase: False searchwindowsize: None delaybeforesend: 0.05 delayafterclose: 0.1 delayafterterminate: 0.1 searcher: searcher_re: 0: re.compile(b'func\\(\\); // Break here[^\r\n]+<<< Thread 1: step out') Config=x86_64-/Users/buildslave/jenkins/workspace/lldb-cmake-matrix/lldb-build/bin/clang ---------------------------------------------------------------------- Ran 1 test in 61.919s

Hide Details

RESULT: FAILED (0 passes, 0 failures, 1 errors, 0 skipped, 0 expected failures, 0 unexpected successes)

Hide Details

--

Hide Details

******************** UNSUPPORTED: lldb-api :: functionalities/gdb_remote_client/TestQemuAArch64TargetXml.py (966 of 2138) PASS: lldb-unit :: Host/./HostTests/MainLoopTest.ReadObject (967 of 2138) PASS: lldb-unit :: Host/./HostTests/SocketTest.UDPGetConnectURI (968 of 2138) PASS: lldb-unit :: Utility/./UtilityTests/AnsiTerminal.Empty (969 of 2138) PASS: lldb-api :: lang/cpp/llvm-style/TestLLVMStyle.py (970 of 2138) PASS: lldb-api :: lang/objc/objc-ivar-stripped/TestObjCIvarStripped.py (971 of 2138) UNSUPPORTED: lldb-shell :: SymbolFile/DWARF/dwp-separate-debug-file.cpp (972 of 2138) PASS: lldb-unit :: Utility/./UtilityTests/OptionsWithRawTest.MultiWordSuffix (973 of 2138) PASS: lldb-api :: lang/objc/hidden-ivars/TestHiddenIvars.py (974 of 2138) PASS: lldb-unit :: Symbol/./SymbolTests/TestClangASTImporter.DeportTypeTagDecl (975 of 2138) PASS: lldb-api :: functionalities/data-formatter/data-formatter-stl/libcxx/vector/TestDataFormatterLibcxxVector.py (976 of 2138) PASS: lldb-api :: lang/cpp/stl/TestSTL.py (977 of 2138) PASS: lldb-unit :: Symbol/./SymbolTests/LineEntryTest.GetSameLineContiguousAddressRangeOneInline (978 of 2138) PASS: lldb-api :: commands/expression/anonymous-struct/TestCallUserAnonTypedef.py (979 of 2138) PASS: lldb-unit :: Utility/./UtilityTests/StreamTeeTest.CopyConstructor (980 of 2138) PASS: lldb-unit :: Utility/./UtilityTests/FileSpecTest.AppendPathComponent (981 of 2138) PASS: lldb-unit :: Expression/./ExpressionTests/CppModuleConfigurationTest.Sysroot (982 of 2138) UNSUPPORTED: lldb-api :: commands/expression/namespace_local_var_same_name_obj_c/TestNamespaceLocalVarSameNameObjC.py (983 of 2138) PASS: lldb-api :: functionalities/paths/TestPaths.py (984 of 2138) PASS: lldb-api :: lang/objc/foundation/TestFoundationDisassembly.py (985 of 2138) PASS: lldb-api :: functionalities/gdb_remote_client/TestNestedRegDefinitions.py (986 of 2138) PASS: lldb-api :: commands/register/register/register_command/TestRegisters.py (987 of 2138) PASS: lldb-unit :: Utility/./UtilityTests/CompletionRequest.Constructor (988 of 2138) PASS: lldb-unit :: ObjectFile/Breakpad/./ObjectFileBreakpadTests/StackWinRecord.parse (989 of 2138) PASS: lldb-unit :: Utility/./UtilityTests/SerializationRountripTest.SerializeDeserializeCStringNull (990 of 2138) PASS: lldb-unit :: Process/gdb-remote/./ProcessGdbRemoteTests/GDBRemoteCommunicationClientTest.SyncThreadState (991 of 2138) PASS: lldb-shell :: SymbolFile/DWARF/DW_TAG_basic_type_DW_ATE_UTF_nonC.ll (992 of 2138) PASS: lldb-unit :: Utility/./UtilityTests/StreamTeeTest.SetStreamAtIndexOverwrite (993 of 2138) PASS: lldb-api :: functionalities/thread/concurrent_events/TestConcurrentManyCrash.py (994 of 2138) UNSUPPORTED: lldb-shell :: SymbolFile/DWARF/find-basic-variable.cpp (995 of 2138) UNSUPPORTED: lldb-shell :: Register/aarch64-gp-read.test (996 of 2138) PASS: lldb-unit :: Utility/./UtilityTests/UriParserTest.TypicalPortPathIPv6 (997 of 2138) PASS: lldb-api :: tools/lldb-vscode/breakpoint/TestVSCode_setBreakpoints.py (998 of 2138) PASS: lldb-unit :: Utility/./UtilityTests/FileSpecTest.PrependPathComponent (999 of 2138) PASS: lldb-unit :: ScriptInterpreter/Python/./ScriptInterpreterPythonTests/PythonDataObjectsTest.TestResetting (1000 of 2138) PASS: lldb-unit :: Utility/./UtilityTests/StringExtractorTest.GetHexBytes (1001 of 2138) PASS: lldb-shell :: SymbolFile/DWARF/debug_line-relative_path.s (1002 of 2138) PASS: lldb-unit :: Utility/./UtilityTests/AnsiTerminal.Basic (1003 of 2138) PASS: lldb-unit :: Utility/./UtilityTests/UriParserTest.BadPort (1004 of 2138) PASS: lldb-shell :: Breakpoint/split-dwarf5-debug-stroffsets.test (1005 of 2138) PASS: lldb-unit :: UnwindAssembly/x86/./UnwindAssemblyx86Tests/Testx86AssemblyInspectionEngine.TestReturnDetect (1006 of 2138) PASS: lldb-api :: commands/command/script/import/rdar-12586188/TestRdar12586188.py (1007 of 2138) PASS: lldb-unit :: Utility/./UtilityTests/StringListTest.GetMaxStringLengthEqualSize (1008 of 2138) UNSUPPORTED: lldb-api :: functionalities/thread/concurrent_events/TestConcurrentDelayedCrashWithBreakpointWatchpoint.py (1009 of 2138) PASS: lldb-api :: types/TestFloatTypes.py (1010 of 2138) PASS: lldb-api :: lang/objc/exceptions/TestObjCExceptions.py (1011 of 2138) UNSUPPORTED: lldb-shell :: ObjectFile/ELF/minidebuginfo-no-lzma.yaml (1012 of 2138) PASS: lldb-api :: functionalities/inferior-changed/TestInferiorChanged.py (1013 of 2138) PASS: lldb-shell :: Settings/TestFrameFormatNoColor.test (1014 of 2138) PASS: lldb-api :: functionalities/breakpoint/breakpoint_hit_count/TestBreakpointHitCount.py (1015 of 2138) UNSUPPORTED: lldb-shell :: SymbolFile/DWARF/dir-separator-posix.s (1016 of 2138) PASS: lldb-api :: python_api/interpreter/TestCommandInterpreterAPI.py (1017 of 2138) PASS: lldb-api :: functionalities/thread/concurrent_events/TestConcurrentDelayedCrashWithBreakpointSignal.py (1018 of 2138) PASS: lldb-api :: lang/objc/foundation/TestObjectDescriptionAPI.py (1019 of 2138) PASS: lldb-unit :: Utility/./UtilityTests/StringListTest.Assignment (1020 of 2138) UNSUPPORTED: lldb-api :: functionalities/ubsan/basic/TestUbsanBasic.py (1021 of 2138) PASS: lldb-shell :: Reproducer/TestDriverOptions.test (1022 of 2138) PASS: lldb-api :: commands/expression/import-std-module/weak_ptr-dbg-info-content/TestDbgInfoContentWeakPtrFromStdModule.py (1023 of 2138) PASS: lldb-shell :: ObjectFile/PECOFF/basic-info-arm.yaml (1024 of 2138) PASS: lldb-unit :: Host/./HostTests/FileActionTest.Open (1025 of 2138) PASS: lldb-shell :: SymbolFile/DWARF/clang-ast-from-dwarf-objc-property.m (1026 of 2138) PASS: lldb-unit :: SymbolFile/DWARF/./SymbolFileDWARFTests/SymbolFileDWARFTests.TestAbbrevMissingTerminator (1027 of 2138) PASS: lldb-api :: tools/lldb-server/inferior-crash/TestGdbRemoteAbort.py (1028 of 2138) PASS: lldb-api :: functionalities/breakpoint/address_breakpoints/TestBadAddressBreakpoints.py (1029 of 2138) UNSUPPORTED: lldb-shell :: ExecControl/StopHook/stop-hook-threads.test (1030 of 2138) UNSUPPORTED: lldb-api :: functionalities/tsan/thread_numbers/TestTsanThreadNumbers.py (1031 of 2138) UNSUPPORTED: lldb-api :: python_api/watchpoint/condition/TestWatchpointConditionAPI.py (1032 of 2138) PASS: lldb-shell :: Minidump/Windows/broken-unwind.test (1033 of 2138) PASS: lldb-unit :: SymbolFile/NativePDB/./SymbolFileNativePDBTests/PDBFPOProgramToDWARFExpressionTests.InvalidOpBinary (1034 of 2138) PASS: lldb-api :: functionalities/inferior-assert/TestInferiorAssert.py (1035 of 2138) UNSUPPORTED: lldb-shell :: SymbolFile/DWARF/array-sizes.s (1036 of 2138) PASS: lldb-api :: functionalities/data-formatter/data-formatter-synthval/TestDataFormatterSynthVal.py (1037 of 2138) UNSUPPORTED: lldb-api :: tools/lldb-server/TestGdbRemoteCompletion.py (1038 of 2138) PASS: lldb-api :: api/listeners/TestListener.py (1039 of 2138) UNSUPPORTED: lldb-api :: commands/trace/TestTraceLoad.py (1040 of 2138) PASS: lldb-unit :: Symbol/./SymbolTests/DWARFCallFrameInfoTest.Basic_dwarf4 (1041 of 2138) PASS: lldb-api :: lang/cpp/offsetof/TestOffsetofCpp.py (1042 of 2138) PASS: lldb-api :: lang/c/strings/TestCStrings.py (1043 of 2138) PASS: lldb-unit :: Utility/./UtilityTests/AnsiTerminal.AtStart (1044 of 2138) UNSUPPORTED: lldb-shell :: ObjectFile/ELF/minidebuginfo-set-and-hit-breakpoint.test (1045 of 2138) PASS: lldb-api :: functionalities/breakpoint/debugbreak/TestDebugBreak.py (1046 of 2138) PASS: lldb-unit :: Platform/Android/./AdbClientTests/AdbClientTest.CreateByDeviceId (1047 of 2138) PASS: lldb-api :: commands/target/create-no-such-arch/TestNoSuchArch.py (1048 of 2138) PASS: lldb-shell :: ObjectFile/MachO/symtab.yaml (1049 of 2138) PASS: lldb-api :: lang/mixed/TestMixedLanguages.py (1050 of 2138) UNSUPPORTED: lldb-shell :: ObjectFile/PECOFF/uuid.yaml (1051 of 2138) PASS: lldb-api :: lang/objcxx/class-name-clash/TestNameClash.py (1052 of 2138) PASS: lldb-api :: types/TestIntegerTypeExpr.py (1053 of 2138) PASS: lldb-unit :: tools/lldb-server/tests/./LLDBServerTests/TestBase.DebugserverEnv (1054 of 2138) PASS: lldb-unit :: Utility/./UtilityTests/EnvironmentTest.EnvpConstruction (1055 of 2138) PASS: lldb-api :: functionalities/postmortem/minidump-new/TestMiniDumpNew.py (1056 of 2138) PASS: lldb-unit :: Utility/./UtilityTests/UriParserTest.LongPath (1057 of 2138) PASS: lldb-api :: functionalities/data-formatter/data-formatter-stl/libcxx/list/loop/TestDataFormatterLibcxxListLoop.py (1058 of 2138) PASS: lldb-unit :: Language/Highlighting/./HighlighterTests/HighlighterTest.FallbackHighlighter (1059 of 2138) PASS: lldb-unit :: Utility/./UtilityTests/ArgsTest.AppendArguments (1060 of 2138) PASS: lldb-shell :: Unwind/thread-step-out-ret-addr-check.test (1061 of 2138) PASS: lldb-unit :: SymbolFile/DWARF/./SymbolFileDWARFTests/XcodeSDKModuleTests.TestModuleGetXcodeSDK (1062 of 2138) PASS: lldb-unit :: Symbol/./SymbolTests/TestTypeSystemClang.TestDisplayNameEmpty (1063 of 2138) PASS: lldb-unit :: ScriptInterpreter/Python/./ScriptInterpreterPythonTests/PythonDataObjectsTest.TestPythonDictionaryValueEquality (1064 of 2138) PASS: lldb-unit :: Utility/./UtilityTests/StringListTest.SplitIntoLinesEmpty (1065 of 2138) UNSUPPORTED: lldb-api :: lang/objc/modules-app-update/TestClangModulesAppUpdate.py (1066 of 2138) PASS: lldb-unit :: Utility/./UtilityTests/StringExtractorTest.DecodeHexU8_InvalidHex (1067 of 2138) PASS: lldb-api :: python_api/lldbutil/iter/TestRegistersIterator.py (1068 of 2138) PASS: lldb-unit :: Process/gdb-remote/./ProcessGdbRemoteTests/GDBRemoteCommunicationClientTest.GetModulesInfo_UUID20 (1069 of 2138) PASS: lldb-unit :: Utility/./UtilityTests/XcodeSDKTest.GetSDKTypeForTriple (1070 of 2138) PASS: lldb-shell :: SymbolFile/Breakpad/unwind-via-stack-win-no-memory-info.yaml (1071 of 2138) PASS: lldb-unit :: Target/./TargetTests/ExecutionContextTest.GetByteOrderProcess (1072 of 2138) PASS: lldb-api :: macosx/dyld-trie-symbols/TestDyldTrieSymbols.py (1073 of 2138) PASS: lldb-shell :: Process/UnsupportedLanguage.test (1074 of 2138) PASS: lldb-api :: functionalities/gdb_remote_client/TestTargetXMLArch.py (1075 of 2138) PASS: lldb-unit :: UnwindAssembly/x86/./UnwindAssemblyx86Tests/Testx86AssemblyInspectionEngine.TestPopRBX (1076 of 2138) PASS: lldb-shell :: ObjectFile/ELF/section-addresses.yaml (1077 of 2138) PASS: lldb-shell :: Reproducer/TestCrash.test (1078 of 2138) PASS: lldb-unit :: SymbolFile/DWARF/./SymbolFileDWARFTests/SymbolFileDWARFTests.TestAbilitiesForDWARF (1079 of 2138) PASS: lldb-api :: lang/cpp/signed_types/TestSignedTypes.py (1080 of 2138) PASS: lldb-shell :: Commands/CommandScriptImmediateOutput/CommandScriptImmediateOutputConsole.test (1081 of 2138) PASS: lldb-unit :: Utility/./UtilityTests/StreamTest.PutHex8 (1082 of 2138) PASS: lldb-api :: functionalities/data-formatter/data-formatter-advanced/TestDataFormatterAdv.py (1083 of 2138) PASS: lldb-unit :: Process/minidump/./LLDBMinidumpTests/MinidumpParserTest.GetLinuxProcStatus_no_stream (1084 of 2138) PASS: lldb-unit :: Utility/./UtilityTests/StreamTest.PutHex32ByteOrderLittle (1085 of 2138) UNSUPPORTED: lldb-shell :: SymbolFile/PDB/class-layout.test (1086 of 2138) UNSUPPORTED: lldb-api :: linux/sepdebugsymlink/TestTargetSymbolsSepDebugSymlink.py (1087 of 2138) PASS: lldb-unit :: Host/./HostTests/MainLoopTest.DetectsEOF (1088 of 2138) UNSUPPORTED: lldb-api :: tools/lldb-vscode/disconnect/TestVSCode_disconnect.py (1089 of 2138) UNSUPPORTED: lldb-shell :: Register/x86-gp-write.test (1090 of 2138) PASS: lldb-api :: lang/objc/objc_direct-methods/TestObjCDirectMethods.py (1091 of 2138) PASS: lldb-api :: api/log/TestAPILog.py (1092 of 2138) PASS: lldb-unit :: Utility/./UtilityTests/RangeTest.Copy (1093 of 2138) PASS: lldb-shell :: ObjectFile/Breakpad/sections.test (1094 of 2138) PASS: lldb-unit :: Process/minidump/./LLDBMinidumpTests/MinidumpParserTest.FindMemoryRange (1095 of 2138) PASS: lldb-api :: commands/reproducer/invalid-args/TestInvalidArgsReproducer.py (1096 of 2138) PASS: lldb-unit :: UnwindAssembly/x86/./UnwindAssemblyx86Tests/Testx86AssemblyInspectionEngine.TestPushRBP (1097 of 2138) PASS: lldb-api :: functionalities/tail_call_frames/cross_dso/TestCrossDSOTailCalls.py (1098 of 2138) PASS: lldb-unit :: Expression/./ExpressionTests/CppModuleConfigurationTest.AmbiguousCLib (1099 of 2138) PASS: lldb-unit :: Utility/./UtilityTests/ConstStringTest.UpdateMangledCounterpart (1100 of 2138) PASS: lldb-unit :: Utility/./UtilityTests/LogChannelTest.List (1101 of 2138) UNSUPPORTED: lldb-api :: functionalities/thread/concurrent_events/TestConcurrentNWatchNBreak.py (1102 of 2138) PASS: lldb-unit :: Utility/./UtilityTests/StringExtractorTest.DecodeHexU8_InvalidHex2 (1103 of 2138) PASS: lldb-api :: arm/emulation/TestEmulations.py (1104 of 2138) PASS: lldb-unit :: Utility/./UtilityTests/Flags.IsClear (1105 of 2138) PASS: lldb-unit :: Utility/./UtilityTests/BinaryStreamTest.PutSLEB128ThreeBytes (1106 of 2138) PASS: lldb-unit :: Target/./TargetTests/ExecutionContextTest.GetByteOrderTarget (1107 of 2138) PASS: lldb-api :: functionalities/data-formatter/data-formatter-skip-summary/TestDataFormatterSkipSummary.py (1108 of 2138) PASS: lldb-api :: commands/expression/import-std-module/unique_ptr-dbg-info-content/TestUniquePtrDbgInfoContent.py (1109 of 2138) UNSUPPORTED: lldb-api :: functionalities/thread/thread_specific_break_plus_condition/TestThreadSpecificBpPlusCondition.py (1110 of 2138) PASS: lldb-unit :: Utility/./UtilityTests/ListenerTest.GetEventImmediate (1111 of 2138) PASS: lldb-unit :: Utility/./UtilityTests/DataExtractorTest.GetULEB128_bit63 (1112 of 2138) PASS: lldb-api :: commands/frame/diagnose/dereference-argument/TestDiagnoseDereferenceArgument.py (1113 of 2138) PASS: lldb-unit :: Utility/./UtilityTests/CompletionRequest.DuplicateFiltering (1114 of 2138) PASS: lldb-api :: tools/lldb-vscode/console/TestVSCode_console.py (1115 of 2138) PASS: lldb-unit :: Utility/./UtilityTests/StreamTeeTest.Write (1116 of 2138) PASS: lldb-api :: commands/process/attach/TestProcessAttach.py (1117 of 2138) PASS: lldb-unit :: Utility/./UtilityTests/StreamTest.PutChar (1118 of 2138) PASS: lldb-unit :: ScriptInterpreter/Python/./ScriptInterpreterPythonTests/PythonDataObjectsTest.TestPythonListManipulation (1119 of 2138) PASS: lldb-api :: lang/c/global_variables/TestGlobalVariables.py (1120 of 2138) PASS: lldb-unit :: Utility/./UtilityTests/DataExtractorTest.GetCStr (1121 of 2138) PASS: lldb-api :: commands/frame/diagnose/inheritance/TestDiagnoseInheritance.py (1122 of 2138) PASS: lldb-shell :: Quit/TestQuitExitCodeImplicit0.test (1123 of 2138) PASS: lldb-api :: lang/c/const_variables/TestConstVariables.py (1124 of 2138) PASS: lldb-api :: lang/cpp/enum_types/TestCPP11EnumTypes.py (1125 of 2138) PASS: lldb-api :: commands/command/script/import/TestImport.py (1126 of 2138) PASS: lldb-api :: functionalities/thread/concurrent_events/TestConcurrentCrashWithSignal.py (1127 of 2138) PASS: lldb-api :: functionalities/data-formatter/nsdictionarysynth/TestNSDictionarySynthetic.py (1128 of 2138) PASS: lldb-unit :: DataFormatter/./LLDBFormatterTests/TypeMatcherTests.CreatedBySameMatchString (1129 of 2138) PASS: lldb-api :: functionalities/data-formatter/data-formatter-stl/libcxx/variant/TestDataFormatterLibcxxVariant.py (1130 of 2138) PASS: lldb-shell :: BuildScript/script-args.test (1131 of 2138) PASS: lldb-api :: functionalities/inferior-crashing/recursive-inferior/TestRecursiveInferiorStep.py (1132 of 2138) PASS: lldb-shell :: ObjectFile/PECOFF/section-types.yaml (1133 of 2138) PASS: lldb-unit :: Utility/./UtilityTests/FileSpecTest.Equal (1134 of 2138) PASS: lldb-api :: lang/c/bitfields/TestBitfields.py (1135 of 2138) PASS: lldb-shell :: Commands/command-source.test (1136 of 2138) PASS: lldb-unit :: Language/Highlighting/./HighlighterTests/HighlighterTest.ClangCursorPosBeforeOtherToken (1137 of 2138) PASS: lldb-unit :: ScriptInterpreter/Python/./ScriptInterpreterPythonTests/PythonDataObjectsTest.TestRun (1138 of 2138) PASS: lldb-unit :: Language/Highlighting/./HighlighterTests/HighlighterTest.ClangBraces (1139 of 2138) UNSUPPORTED: lldb-api :: functionalities/data-formatter/data-formatter-stl/libstdcpp/map/TestDataFormatterStdMap.py (1140 of 2138) PASS: lldb-unit :: UnwindAssembly/x86/./UnwindAssemblyx86Tests/Testx86AssemblyInspectionEngine.TestPopR14 (1141 of 2138) PASS: lldb-unit :: Utility/./UtilityTests/BinaryStreamTest.PutSLEB128NineBytes (1142 of 2138) PASS: lldb-api :: commands/expression/deleting-implicit-copy-constructor/TestDeletingImplicitCopyConstructor.py (1143 of 2138) PASS: lldb-unit :: Utility/./UtilityTests/BinaryStreamTest.PutULEB128Zero (1144 of 2138) PASS: lldb-unit :: Process/gdb-remote/./ProcessGdbRemoteTests/GDBRemoteCommunicationServerTest.SendErrorResponse_ErrorList (1145 of 2138) PASS: lldb-api :: commands/expression/expr-in-syscall/TestExpressionInSyscall.py (1146 of 2138) UNSUPPORTED: lldb-shell :: ScriptInterpreter/Lua/convenience_variables.test (1147 of 2138) PASS: lldb-unit :: Expression/./ExpressionTests/ClangHostTest.MacOSX (1148 of 2138) PASS: lldb-unit :: Utility/./UtilityTests/RangeTest.Clear (1149 of 2138) UNSUPPORTED: lldb-shell :: Register/x86-64-xmm16-read.test (1150 of 2138) PASS: lldb-api :: lang/objc/objc-static-method-stripped/TestObjCStaticMethodStripped.py (1151 of 2138) PASS: lldb-unit :: Core/./LLDBCoreTests/StreamCallbackTest.Callback (1152 of 2138) PASS: lldb-api :: commands/disassemble/basic/TestFrameDisassemble.py (1153 of 2138) UNSUPPORTED: lldb-api :: functionalities/asan/TestMemoryHistory.py (1154 of 2138) PASS: lldb-shell :: Unwind/trap_frame_sym_ctx.test (1155 of 2138) PASS: lldb-api :: lang/c/find_struct_type/TestFindStructTypes.py (1156 of 2138) UNSUPPORTED: lldb-api :: tools/lldb-server/platform-process-connect/TestPlatformProcessConnect.py (1157 of 2138) PASS: lldb-unit :: Utility/./UtilityTests/UUIDTest.SetFromStringRef (1158 of 2138) PASS: lldb-unit :: Utility/./UtilityTests/ProcessInstanceInfoMatch.Name (1159 of 2138) PASS: lldb-shell :: Quit/TestQuitExitCodeHexA.test (1160 of 2138) UNSUPPORTED: lldb-api :: benchmarks/expression/TestExpressionCmd.py (1161 of 2138) PASS: lldb-unit :: Utility/./UtilityTests/StreamTest.PutHex32ByteOrderBig (1162 of 2138) PASS: lldb-api :: functionalities/data-formatter/frameformat_smallstruct/TestFrameFormatSmallStruct.py (1163 of 2138) UNSUPPORTED: lldb-shell :: SymbolFile/DWARF/find-variable-file.cpp (1164 of 2138) PASS: lldb-unit :: Interpreter/./InterpreterTests/CompletionTest.DirCompletionUsername (1165 of 2138) PASS: lldb-api :: api/multiple-debuggers/TestMultipleDebuggers.py (1166 of 2138) UNSUPPORTED: lldb-api :: commands/register/register/intel_xtended_registers/TestMPXRegisters.py (1167 of 2138) PASS: lldb-unit :: Utility/./UtilityTests/StringListTest.Join (1168 of 2138) PASS: lldb-api :: commands/expression/static-initializers/TestStaticInitializers.py (1169 of 2138) PASS: lldb-api :: lang/cpp/virtual-functions/TestCppVirtualFunctions.py (1170 of 2138) PASS: lldb-unit :: Host/./HostTests/NativeProcessProtocolTest.SetBreakpoint (1171 of 2138) PASS: lldb-unit :: Utility/./UtilityTests/StringExtractorTest.GetHexBytes_OddPair2 (1172 of 2138) PASS: lldb-api :: lang/cpp/const_this/TestConstThis.py (1173 of 2138) PASS: lldb-unit :: Utility/./UtilityTests/BinaryStreamTest.PutSLEB128EightBytes (1174 of 2138) PASS: lldb-unit :: Language/Highlighting/./HighlighterTests/HighlighterTest.ClangUnterminatedString (1175 of 2138) UNSUPPORTED: lldb-shell :: SymbolFile/NativePDB/s_constant.cpp (1176 of 2138) UNSUPPORTED: lldb-shell :: SymbolFile/PDB/enums-layout.test (1177 of 2138) PASS: lldb-api :: functionalities/thread/backtrace_limit/TestBacktraceLimit.py (1178 of 2138) PASS: lldb-shell :: ObjectFile/ELF/PT_LOAD-overlap-section.yaml (1179 of 2138) PASS: lldb-shell :: SymbolFile/DWARF/DW_AT_const_value.s (1180 of 2138) PASS: lldb-unit :: ScriptInterpreter/Python/./ScriptInterpreterPythonTests/PythonDataObjectsTest.TestPythonBytes (1181 of 2138) PASS: lldb-api :: lang/objc/conflicting-definition/TestConflictingDefinition.py (1182 of 2138) PASS: lldb-shell :: SymbolFile/DWARF/parallel-indexing-stress.s (1183 of 2138) PASS: lldb-unit :: SymbolFile/DWARF/./SymbolFileDWARFTests/SymbolFileDWARFTests.TestAbbrevOrder1Start1 (1184 of 2138) PASS: lldb-unit :: Utility/./UtilityTests/ArgsTest.TestAppendArg (1185 of 2138) PASS: lldb-unit :: Utility/./UtilityTests/CompletionRequest.TryCompleteCurrentArgGood (1186 of 2138) PASS: lldb-unit :: Utility/./UtilityTests/ScalarTest.ComparisonFloat (1187 of 2138) PASS: lldb-unit :: Thread/./ThreadTests/ThreadTest.GetPrivateStopInfo (1188 of 2138) UNSUPPORTED: lldb-shell :: SymbolFile/NativePDB/tag-types.cpp (1189 of 2138) PASS: lldb-unit :: Utility/./UtilityTests/ArgsTest.TestMultipleArgs (1190 of 2138) PASS: lldb-unit :: Process/gdb-remote/./ProcessGdbRemoteTests/GDBRemoteCommunicationClientTest.ReadRegister (1191 of 2138) PASS: lldb-unit :: Utility/./UtilityTests/RangeTest.LessThan (1192 of 2138) PASS: lldb-api :: types/TestRecursiveTypes.py (1193 of 2138) PASS: lldb-unit :: Utility/./UtilityTests/UriParserTest.SchemeHostSeparator3 (1194 of 2138) PASS: lldb-shell :: SymbolFile/Breakpad/unwind-via-stack-cfi.test (1195 of 2138) PASS: lldb-api :: functionalities/tail_call_frames/ambiguous_tail_call_seq1/TestAmbiguousTailCallSeq1.py (1196 of 2138) PASS: lldb-unit :: Utility/./UtilityTests/UserIDResolver.GetUserName (1197 of 2138) UNSUPPORTED: lldb-shell :: Unwind/unwind-plan-dwarf-dump.test (1198 of 2138) PASS: lldb-unit :: API/./APITests/SBCommandInterpreterTest.MultiWordCommand (1199 of 2138) PASS: lldb-shell :: SymbolFile/DWARF/debug-types-line-tables.s (1200 of 2138) PASS: lldb-api :: functionalities/data-formatter/data-formatter-stl/libcxx/bitset/TestDataFormatterLibcxxBitset.py (1201 of 2138) PASS: lldb-api :: commands/expression/import-std-module/queue/TestQueueFromStdModule.py (1202 of 2138) PASS: lldb-api :: macosx/thread-names/TestInterruptThreadNames.py (1203 of 2138) PASS: lldb-unit :: Utility/./UtilityTests/Flags.AnyClear (1204 of 2138) PASS: lldb-unit :: Platform/./LLDBPlatformTests/PlatformAppleSimulatorTest.TestHostPlatformToSim (1205 of 2138) PASS: lldb-shell :: Minidump/Windows/Sigsegv/sigsegv.test (1206 of 2138) PASS: lldb-api :: functionalities/memory/cache/TestMemoryCache.py (1207 of 2138) PASS: lldb-api :: python_api/file_handle/TestFileHandle.py (1208 of 2138) PASS: lldb-api :: commands/statistics/basic/TestStats.py (1209 of 2138) PASS: lldb-api :: functionalities/data-formatter/typedef_array/TestTypedefArray.py (1210 of 2138) PASS: lldb-api :: lang/objc/direct-dispatch-step/TestObjCDirectDispatchStepping.py (1211 of 2138) UNSUPPORTED: lldb-api :: commands/watchpoints/step_over_watchpoint/TestStepOverWatchpoint.py (1212 of 2138) PASS: lldb-api :: types/TestShortTypeExpr.py (1213 of 2138) PASS: lldb-api :: commands/expression/ir-interpreter-phi-nodes/TestIRInterpreterPHINodes.py (1214 of 2138) PASS: lldb-unit :: Utility/./UtilityTests/OptionsWithRawTest.LeadingSpaceArgs (1215 of 2138) PASS: lldb-unit :: ScriptInterpreter/Python/./ScriptInterpreterPythonTests/PythonDataObjectsTest.TestInstanceNameResolutionNoDot (1216 of 2138) PASS: lldb-api :: functionalities/data-formatter/data-formatter-cpp/TestDataFormatterCpp.py (1217 of 2138) PASS: lldb-api :: functionalities/tail_call_frames/inlining_and_tail_calls/TestInliningAndTailCalls.py (1218 of 2138) PASS: lldb-shell :: ScriptInterpreter/Python/eof.test (1219 of 2138) PASS: lldb-unit :: Utility/./UtilityTests/RangeTest.LessThanInvalid (1220 of 2138) PASS: lldb-unit :: UnwindAssembly/x86/./UnwindAssemblyx86Tests/Testx86AssemblyInspectionEngine.TestPushR12 (1221 of 2138) PASS: lldb-unit :: UnwindAssembly/x86/./UnwindAssemblyx86Tests/Testx86AssemblyInspectionEngine.TestSimple32bitFrameFunction (1222 of 2138) PASS: lldb-api :: source-manager/TestSourceManager.py (1223 of 2138) PASS: lldb-api :: lang/c/stepping/TestStepAndBreakpoints.py (1224 of 2138) PASS: lldb-unit :: Target/./TargetTests/StackFrameRecognizerTest.NullModuleRegex (1225 of 2138) PASS: lldb-api :: functionalities/memory/read/TestMemoryRead.py (1226 of 2138) PASS: lldb-unit :: Utility/./UtilityTests/VMRange.Clear (1227 of 2138) PASS: lldb-unit :: Symbol/./SymbolTests/TestTypeSystemClang.TestIsClangType (1228 of 2138) PASS: lldb-shell :: Driver/TestCore.test (1229 of 2138) PASS: lldb-shell :: Driver/TestError.test (1230 of 2138) PASS: lldb-shell :: Breakpoint/debug_rnglist_offset_pair.test (1231 of 2138) PASS: lldb-shell :: ObjectFile/ELF/duplicate-section.yaml (1232 of 2138) PASS: lldb-api :: types/TestDoubleTypes.py (1233 of 2138) PASS: lldb-api :: lang/cpp/static_methods/TestCPPStaticMethods.py (1234 of 2138) UNSUPPORTED: lldb-api :: commands/watchpoints/watchpoint_events/TestWatchpointEvents.py (1235 of 2138) PASS: lldb-unit :: Utility/./UtilityTests/StreamTest.PutCStringWithStringRef (1236 of 2138) PASS: lldb-unit :: Utility/./UtilityTests/StringListTest.LongestCommonPrefixSingleElement (1237 of 2138) PASS: lldb-unit :: Utility/./UtilityTests/ScalarTest.SetValueFromData (1238 of 2138) UNSUPPORTED: lldb-api :: functionalities/tsan/basic/TestTsanBasic.py (1239 of 2138) PASS: lldb-api :: commands/expression/ir-interpreter/TestIRInterpreter.py (1240 of 2138) PASS: lldb-api :: commands/platform/basic/TestPlatformCommand.py (1241 of 2138) UNSUPPORTED: lldb-api :: tools/lldb-server/TestGdbRemoteModuleInfo.py (1242 of 2138) PASS: lldb-unit :: Language/Highlighting/./HighlighterTests/HighlighterTest.ClangTrailingBackslashBeforeNewline (1243 of 2138) PASS: lldb-api :: macosx/profile_vrs_detach/TestDetachVrsProfile.py (1244 of 2138) PASS: lldb-api :: functionalities/gdb_remote_client/TestRestartBug.py (1245 of 2138) PASS: lldb-api :: functionalities/thread/exit_during_step/TestExitDuringStep.py (1246 of 2138) PASS: lldb-api :: functionalities/data-formatter/language_category_updates/TestDataFormatterLanguageCategoryUpdates.py (1247 of 2138) PASS: lldb-api :: functionalities/data-formatter/data-formatter-stl/libcxx/queue/TestDataFormatterLibcxxQueue.py (1248 of 2138) PASS: lldb-unit :: Utility/./UtilityTests/StreamTest.SetIndentLevel (1249 of 2138) PASS: lldb-api :: functionalities/data-formatter/poarray/TestPrintObjectArray.py (1250 of 2138) PASS: lldb-unit :: Utility/./UtilityTests/PassiveReplayTest.InstrumentedFooInvalid (1251 of 2138) PASS: lldb-api :: commands/frame/diagnose/virtual-method-call/TestDiagnoseDereferenceVirtualMethodCall.py (1252 of 2138) PASS: lldb-shell :: SymbolFile/DWARF/debug_rnglists.s (1253 of 2138) PASS: lldb-shell :: SymbolFile/DWARF/dwp-debug-types.s (1254 of 2138) PASS: lldb-unit :: Utility/./UtilityTests/StructuredDataTest.StringDump (1255 of 2138) PASS: lldb-unit :: Utility/./UtilityTests/SerializationRountripTest.SerializeDeserializePod (1256 of 2138) PASS: lldb-shell :: ObjectFile/MachO/lc_build_version_notools.yaml (1257 of 2138) PASS: lldb-unit :: Utility/./UtilityTests/RangeTest.EqualInvalid (1258 of 2138) UNSUPPORTED: lldb-api :: python_api/event/TestEvents.py (1259 of 2138) PASS: lldb-api :: functionalities/thread/concurrent_events/TestConcurrentTwoBreakpointsOneDelaySignal.py (1260 of 2138) UNSUPPORTED: lldb-api :: lang/objc/modules-hash-mismatch/TestClangModulesHashMismatch.py (1261 of 2138) PASS: lldb-unit :: Utility/./UtilityTests/StringListTest.AppendList (1262 of 2138) PASS: lldb-unit :: Host/./HostTests/SocketTest.UDPConnect (1263 of 2138) PASS: lldb-api :: tools/lldb-vscode/runInTerminal/TestVSCode_runInTerminal.py (1264 of 2138) UNSUPPORTED: lldb-api :: functionalities/thread/concurrent_events/TestConcurrentTwoWatchpointThreads.py (1265 of 2138) PASS: lldb-shell :: Settings/TestSettingsWrite.test (1266 of 2138) PASS: lldb-unit :: Utility/./UtilityTests/StringListTest.ShiftStdString (1267 of 2138) PASS: lldb-unit :: Utility/./UtilityTests/DataExtractorTest.GetSLEB128_bit63 (1268 of 2138) PASS: lldb-unit :: Utility/./UtilityTests/StreamTest.PutStringAsRawHex8 (1269 of 2138) PASS: lldb-api :: python_api/process/io/TestProcessIO.py (1270 of 2138) PASS: lldb-shell :: Minidump/no-process-id.yaml (1271 of 2138) UNSUPPORTED: lldb-api :: functionalities/breakpoint/hardware_breakpoints/hardware_breakpoint_on_multiple_threads/TestHWBreakMultiThread.py (1272 of 2138) PASS: lldb-unit :: Symbol/./SymbolTests/TestClangASTImporter.CanImportInvalidType (1273 of 2138) PASS: lldb-api :: functionalities/limit-debug-info/TestLimitDebugInfo.py (1274 of 2138) PASS: lldb-unit :: Utility/./UtilityTests/DataExtractorTest.GetCStrUnterminated (1275 of 2138) PASS: lldb-shell :: SymbolFile/DWARF/DW_OP_piece-struct.s (1276 of 2138) PASS: lldb-unit :: Language/Highlighting/./HighlighterTests/HighlighterTest.Colons (1277 of 2138) PASS: lldb-unit :: Utility/./UtilityTests/BroadcasterTest.BroadcastEvent (1278 of 2138) PASS: lldb-unit :: Utility/./UtilityTests/OptionsWithRawTest.EmptyInput (1279 of 2138) UNSUPPORTED: lldb-api :: functionalities/thread/concurrent_events/TestConcurrentSignalDelayWatch.py (1280 of 2138) PASS: lldb-unit :: Expression/./ExpressionTests/DiagnosticManagerTest.HasFixits (1281 of 2138) PASS: lldb-shell :: ObjectFile/Breakpad/uuid-matching-mac.test (1282 of 2138) PASS: lldb-unit :: ScriptInterpreter/Python/./ScriptInterpreterPythonTests/PythonDataObjectsTest.TestPythonInteger (1283 of 2138) PASS: lldb-unit :: Process/minidump/./LLDBMinidumpTests/RegisterContextMinidump.CheckRegisterContextMinidump_ARM (1284 of 2138) UNSUPPORTED: lldb-api :: commands/watchpoints/watchpoint_disable/TestWatchpointDisable.py (1285 of 2138) PASS: lldb-unit :: Host/./HostTests/HostInfoTest.GetXcodeSDK (1286 of 2138) PASS: lldb-api :: commands/expression/entry-bp/TestExprEntryBP.py (1287 of 2138) PASS: lldb-unit :: Utility/./UtilityTests/StringListTest.GetMaxStringLengthMixed (1288 of 2138) PASS: lldb-api :: lang/cpp/namespace/TestNamespace.py (1289 of 2138) PASS: lldb-api :: functionalities/breakpoint/cpp/TestCPPBreakpointLocations.py (1290 of 2138) PASS: lldb-api :: functionalities/breakpoint/dummy_target_breakpoints/TestBreakpointsWithNoTargets.py (1291 of 2138) PASS: lldb-api :: functionalities/breakpoint/breakpoint_by_line_and_column/TestBreakpointByLineAndColumn.py (1292 of 2138) PASS: lldb-api :: commands/expression/import-std-module/vector-bool/TestVectorBoolFromStdModule.py (1293 of 2138) PASS: lldb-unit :: Interpreter/./InterpreterTests/CompletionTest.FileCompletionAbsolute (1294 of 2138) PASS: lldb-api :: commands/expression/formatters/TestFormatters.py (1295 of 2138) UNSUPPORTED: lldb-api :: commands/expression/completion-crash-invalid-iterator/TestInvalidIteratorCompletionCrash.py (1296 of 2138) PASS: lldb-shell :: ObjectFile/PECOFF/symbol.yaml (1297 of 2138) PASS: lldb-unit :: Utility/./UtilityTests/StringListTest.GetMaxStringLengthEmpty (1298 of 2138) PASS: lldb-unit :: ScriptInterpreter/Python/./ScriptInterpreterPythonTests/PythonDataObjectsTest.TestExceptions (1299 of 2138) UNSUPPORTED: lldb-shell :: ObjectFile/PECOFF/export-dllfunc.yaml (1300 of 2138) PASS: lldb-unit :: Utility/./UtilityTests/RecordReplayTest.InstrumentedFoo (1301 of 2138) PASS: lldb-api :: functionalities/breakpoint/hardware_breakpoints/require_hw_breakpoints/TestRequireHWBreakpoints.py (1302 of 2138) PASS: lldb-api :: commands/expression/completion-crash-incomplete-record/TestCompletionCrashIncompleteRecord.py (1303 of 2138) PASS: lldb-api :: functionalities/data-formatter/refpointer-recursion/TestDataFormatterRefPtrRecursion.py (1304 of 2138) PASS: lldb-api :: commands/expression/char/TestExprsChar.py (1305 of 2138) PASS: lldb-api :: functionalities/history/TestHistoryRecall.py (1306 of 2138) UNSUPPORTED: lldb-api :: commands/register/register/intel_xtended_registers/mpx_offset_intersection/TestMPXOffsetIntersection.py (1307 of 2138) PASS: lldb-api :: functionalities/data-formatter/data-formatter-synth/TestDataFormatterSynth.py (1308 of 2138) PASS: lldb-unit :: Utility/./UtilityTests/FileSpecTest.RemoveLastPathComponent (1309 of 2138) PASS: lldb-unit :: Host/./HostTests/NativeProcessProtocolTest.ReadMemoryWithoutTrap (1310 of 2138) PASS: lldb-unit :: Host/./HostTests/NativeProcessProtocolTest.ReadCStringFromMemory (1311 of 2138) PASS: lldb-unit :: Host/./HostTests/FileSystemTest.GetPermissions (1312 of 2138) PASS: lldb-shell :: Reproducer/TestMultipleTargets.test (1313 of 2138) UNSUPPORTED: lldb-api :: functionalities/thread/concurrent_events/TestConcurrentCrashWithWatchpoint.py (1314 of 2138) PASS: lldb-unit :: Utility/./UtilityTests/ScalarTest.Equality (1315 of 2138) UNSUPPORTED: lldb-shell :: SymbolFile/NativePDB/break-by-line.cpp (1316 of 2138) UNSUPPORTED: lldb-api :: functionalities/data-formatter/data-formatter-stl/libstdcpp/list/TestDataFormatterStdList.py (1317 of 2138) UNSUPPORTED: lldb-api :: tools/lldb-server/libraries-svr4/TestGdbRemoteLibrariesSvr4Support.py (1318 of 2138) PASS: lldb-api :: lang/objc/foundation/TestObjCMethods.py (1319 of 2138) PASS: lldb-unit :: Utility/./UtilityTests/StateTest.Formatv (1320 of 2138) PASS: lldb-shell :: Process/Optimization.test (1321 of 2138) PASS: lldb-unit :: Utility/./UtilityTests/StatusTest.ErrorConversion (1322 of 2138) PASS: lldb-api :: lang/objc/objc-ivar-protocols/TestIvarProtocols.py (1323 of 2138) PASS: lldb-api :: tools/lldb-server/commandline/TestStubSetSID.py (1324 of 2138) PASS: lldb-api :: lang/objc/objc-runtime-ivars/TestRuntimeIvars.py (1325 of 2138) PASS: lldb-api :: lang/c/modules/TestCModules.py (1326 of 2138) PASS: lldb-shell :: Commands/command-target-modules-dump-sections.yaml (1327 of 2138) PASS: lldb-unit :: Process/minidump/./LLDBMinidumpTests/MinidumpParserTest.GetMemory (1328 of 2138) PASS: lldb-shell :: ObjectFile/ELF/aarch64-relocations.yaml (1329 of 2138) PASS: lldb-unit :: Utility/./UtilityTests/FileSpecTest.EqualSeparator (1330 of 2138) UNSUPPORTED: lldb-shell :: SymbolFile/DWARF/limit-debug-info.s (1331 of 2138) PASS: lldb-api :: functionalities/data-formatter/data-formatter-script/TestDataFormatterScript.py (1332 of 2138) PASS: lldb-api :: functionalities/data-formatter/data-formatter-stl/libcxx/map/TestDataFormatterLibccMap.py (1333 of 2138) PASS: lldb-api :: commands/frame/language/TestGuessLanguage.py (1334 of 2138) PASS: lldb-shell :: SymbolFile/DWARF/dwarf5-atomic.s (1335 of 2138) PASS: lldb-shell :: Reproducer/TestFileRepro.test (1336 of 2138) PASS: lldb-unit :: Utility/./UtilityTests/StringExtractorTest.GetU32LittleEndian (1337 of 2138) PASS: lldb-api :: commands/expression/call-function/TestCallStdStringFunction.py (1338 of 2138) PASS: lldb-api :: functionalities/breakpoint/source_regexp/TestSourceRegexBreakpoints.py (1339 of 2138) UNSUPPORTED: lldb-shell :: SymbolFile/dissassemble-entry-point.s (1340 of 2138) PASS: lldb-unit :: Utility/./UtilityTests/UriParserTest.Empty (1341 of 2138) PASS: lldb-unit :: Expression/./ExpressionTests/DiagnosticManagerTest.FixedExpression (1342 of 2138) PASS: lldb-api :: functionalities/data-formatter/data-formatter-globals/TestDataFormatterGlobals.py (1343 of 2138) PASS: lldb-unit :: Utility/./UtilityTests/RangeTest.ContainsRangeStartingFromZero (1344 of 2138) PASS: lldb-unit :: Expression/./ExpressionTests/CppModuleConfigurationTest.LibCppV2 (1345 of 2138) PASS: lldb-api :: commands/expression/context-object/TestContextObject.py (1346 of 2138) PASS: lldb-unit :: Host/./HostTests/NativeProcessProtocolTest.ReadCStringFromMemory_MaxSize (1347 of 2138) PASS: lldb-api :: functionalities/thread/create_after_attach/TestCreateAfterAttach.py (1348 of 2138) PASS: lldb-shell :: SymbolFile/DWARF/dwp.s (1349 of 2138) PASS: lldb-shell :: Commands/command-script-import.test (1350 of 2138) UNSUPPORTED: lldb-shell :: Register/x86-zmm-write.test (1351 of 2138) PASS: lldb-shell :: Driver/TestSingleQuote.test (1352 of 2138) PASS: lldb-unit :: Utility/./UtilityTests/StringExtractorTest.DecodeHexU8_Extra (1353 of 2138) PASS: lldb-unit :: Utility/./UtilityTests/StringListTest.InsertStringAtIndexOutOfBounds (1354 of 2138) PASS: lldb-shell :: SymbolFile/DWARF/DW_TAG_variable-invalid_location.s (1355 of 2138) PASS: lldb-api :: functionalities/gdb_remote_client/TestGDBRemoteLoad.py (1356 of 2138) PASS: lldb-unit :: Utility/./UtilityTests/BinaryStreamTest.PutSLEB128Zero (1357 of 2138) UNSUPPORTED: lldb-api :: lang/cpp/static_members/TestCPPStaticMembers.py (1358 of 2138) PASS: lldb-unit :: Core/./LLDBCoreTests/MangledTest.NameIndexes_FindFunctionSymbols (1359 of 2138) PASS: lldb-api :: lang/cpp/namespace_conflicts/TestNamespaceConflicts.py (1360 of 2138) PASS: lldb-unit :: DataFormatter/./LLDBFormatterTests/TypeMatcherTests.ExactName (1361 of 2138) PASS: lldb-unit :: Utility/./UtilityTests/DataExtractorTest.GetBitfield (1362 of 2138) PASS: lldb-unit :: Utility/./UtilityTests/StringListTest.LongestCommonPrefixEmpty (1363 of 2138) UNSUPPORTED: lldb-shell :: SymbolFile/NativePDB/disassembly.cpp (1364 of 2138) PASS: lldb-unit :: Utility/./UtilityTests/UriParserTest.BracketedHostnamePort (1365 of 2138) PASS: lldb-unit :: Utility/./UtilityTests/OptionsWithRawTest.SingleWhitespaceInput (1366 of 2138) PASS: lldb-unit :: Utility/./UtilityTests/RangeDataVector.FindEntryIndexesThatContain (1367 of 2138) PASS: lldb-unit :: Utility/./UtilityTests/StringExtractorTest.GetHexU8_Underflow2 (1368 of 2138) PASS: lldb-unit :: Utility/./UtilityTests/StringListTest.AppendStringMove (1369 of 2138) PASS: lldb-unit :: UnwindAssembly/x86/./UnwindAssemblyx86Tests/Testx86AssemblyInspectionEngine.TestMovRSPtoRBP (1370 of 2138) PASS: lldb-unit :: Utility/./UtilityTests/ScalarTest.GetValue (1371 of 2138) PASS: lldb-api :: functionalities/thread/thread_exit/TestThreadExit.py (1372 of 2138) UNSUPPORTED: lldb-api :: commands/expression/macros/TestMacros.py (1373 of 2138) PASS: lldb-api :: commands/apropos/basic/TestApropos.py (1374 of 2138) UNSUPPORTED: lldb-api :: functionalities/darwin_log/filter/exact_match/message/TestDarwinLogFilterMatchMessage.py (1375 of 2138) PASS: lldb-api :: commands/process/signal/TestProcessSignal.py (1376 of 2138) PASS: lldb-unit :: Utility/./UtilityTests/ScalarTest.CastOperations (1377 of 2138) PASS: lldb-unit :: SymbolFile/DWARF/./SymbolFileDWARFTests/SymbolFileDWARFTests.TestAbbrevInvalidNULLTag (1378 of 2138) PASS: lldb-api :: lang/c/set_values/TestSetValues.py (1379 of 2138) PASS: lldb-unit :: Utility/./UtilityTests/CompletionRequest.DuplicateFilteringWithComments (1380 of 2138) PASS: lldb-unit :: Expression/./ExpressionTests/DiagnosticManagerTest.PutStringSeverities (1381 of 2138) PASS: lldb-api :: functionalities/thread/concurrent_events/TestConcurrentTwoBreakpointThreads.py (1382 of 2138) PASS: lldb-unit :: Utility/./UtilityTests/StreamTest.AddressSize (1383 of 2138) PASS: lldb-unit :: Process/minidump/./LLDBMinidumpTests/MinidumpParserTest.GetThreadContext_x86_32_wow64 (1384 of 2138) PASS: lldb-unit :: Symbol/./SymbolTests/TestTypeSystemClang.TestOwningModule (1385 of 2138) PASS: lldb-unit :: Utility/./UtilityTests/ArchSpecTest.MergeFromMachOUnknown (1386 of 2138) PASS: lldb-unit :: Utility/./UtilityTests/StringListTest.JoinNonSpace (1387 of 2138) UNSUPPORTED: lldb-shell :: SymbolFile/PDB/function-level-linking.test (1388 of 2138) PASS: lldb-api :: lang/cpp/lambdas/TestLambdas.py (1389 of 2138) UNSUPPORTED: lldb-api :: functionalities/darwin_log/basic/TestDarwinLogBasic.py (1390 of 2138) PASS: lldb-unit :: UnwindAssembly/x86/./UnwindAssemblyx86Tests/Testx86AssemblyInspectionEngine.TestCALLNextInsn (1391 of 2138) PASS: lldb-api :: iohandler/completion/TestIOHandlerCompletion.py (1392 of 2138) PASS: lldb-unit :: Utility/./UtilityTests/StreamTest.AddressPrefix (1393 of 2138) PASS: lldb-api :: functionalities/data-formatter/data-formatter-proper-plurals/TestFormattersOneIsSingular.py (1394 of 2138) UNSUPPORTED: lldb-api :: functionalities/process_save_core/TestProcessSaveCore.py (1395 of 2138) PASS: lldb-api :: lang/objc/objc-struct-argument/TestObjCStructArgument.py (1396 of 2138) PASS: lldb-api :: commands/session/history/TestSessionHistory.py (1397 of 2138) PASS: lldb-api :: lang/cpp/global_variables/TestCPPGlobalVariables.py (1398 of 2138) PASS: lldb-api :: commands/settings/use_source_cache/TestUseSourceCache.py (1399 of 2138) PASS: lldb-api :: functionalities/thread/crash_during_step/TestCrashDuringStep.py (1400 of 2138) PASS: lldb-api :: functionalities/signal/handle-abrt/TestHandleAbort.py (1401 of 2138) PASS: lldb-unit :: ObjectFile/ELF/./ObjectFileELFTests/ObjectFileELFTest.SectionsResolveConsistently (1402 of 2138) PASS: lldb-unit :: Utility/./UtilityTests/StringExtractorTest.GetHexBytesAvail_FullString (1403 of 2138) PASS: lldb-unit :: Host/./HostTests/FileSystemTest.Resolve (1404 of 2138) PASS: lldb-api :: python_api/symbol-context/TestSymbolContext.py (1405 of 2138) PASS: lldb-api :: lang/c/complex/TestComplexC99.py (1406 of 2138) PASS: lldb-unit :: Utility/./UtilityTests/TimerTest.CategoryTimesStats (1407 of 2138) PASS: lldb-unit :: Editline/./EditlineTests/EditlineTestFixture.EditlineReceivesMultiLineText (1408 of 2138) PASS: lldb-api :: functionalities/data-formatter/synthupdate/TestSyntheticFilterRecompute.py (1409 of 2138) PASS: lldb-api :: functionalities/thread/step_out/TestThreadStepOut.py (1410 of 2138) PASS: lldb-unit :: UnwindAssembly/x86/./UnwindAssemblyx86Tests/Testx86AssemblyInspectionEngine.TestSubRSP (1411 of 2138) PASS: lldb-shell :: Minidump/fb-dump.test (1412 of 2138) PASS: lldb-unit :: UnwindAssembly/x86/./UnwindAssemblyx86Tests/Testx86AssemblyInspectionEngine.TestPopEBX (1413 of 2138) PASS: lldb-api :: commands/process/launch/TestProcessLaunch.py (1414 of 2138) PASS: lldb-unit :: ScriptInterpreter/Python/./ScriptInterpreterPythonTests/PythonDataObjectsTest.TestPythonTupleValues (1415 of 2138) UNSUPPORTED: lldb-shell :: SymbolFile/PDB/variables-locations.test (1416 of 2138) PASS: lldb-unit :: Process/minidump/./LLDBMinidumpTests/RegisterContextMinidump.ConvertMinidumpContext_x86_64 (1417 of 2138) PASS: lldb-shell :: SymbolFile/DWARF/anon_class_w_and_wo_export_symbols.ll (1418 of 2138) UNSUPPORTED: lldb-shell :: SymbolFile/NativePDB/function-types-classes.cpp (1419 of 2138) PASS: lldb-api :: lang/c/shared_lib/TestSharedLib.py (1420 of 2138) PASS: lldb-api :: lang/cpp/gmodules-templates/TestGModules.py (1421 of 2138) UNSUPPORTED: lldb-shell :: SymbolFile/Breakpad/stack-cfi-arm.yaml (1422 of 2138) PASS: lldb-unit :: Utility/./UtilityTests/StreamTest.PutHex64ByteOrderBig (1423 of 2138) PASS: lldb-unit :: ScriptInterpreter/Python/./ScriptInterpreterPythonTests/PythonDataObjectsTest.TestObjectAttributes (1424 of 2138) PASS: lldb-unit :: Process/./ProcessEventDataTests/ProcessEventDataTest.DoOnRemoval (1425 of 2138) PASS: lldb-unit :: Utility/./UtilityTests/DataExtractorTest.GetMaxS64 (1426 of 2138) UNSUPPORTED: lldb-shell :: SymbolFile/NativePDB/globals-fundamental.cpp (1427 of 2138) PASS: lldb-api :: functionalities/gdb_remote_client/TestRegDefinitionInParts.py (1428 of 2138) PASS: lldb-api :: functionalities/breakpoint/address_breakpoints/TestAddressBreakpoints.py (1429 of 2138) PASS: lldb-api :: lang/objc/unicode-string/TestUnicodeString.py (1430 of 2138) PASS: lldb-api :: lang/cpp/nested-class-other-compilation-unit/TestNestedClassWithParentInAnotherCU.py (1431 of 2138) PASS: lldb-unit :: Utility/./UtilityTests/LogTest.LLDB_LOG_nullptr (1432 of 2138) PASS: lldb-api :: functionalities/data-formatter/data-formatter-objc/TestDataFormatterObjCNSContainer.py (1433 of 2138) PASS: lldb-shell :: Breakpoint/split-dwarf-5-addrbase.test (1434 of 2138) PASS: lldb-api :: python_api/value/linked_list/TestValueAPILinkedList.py (1435 of 2138) PASS: lldb-shell :: ObjectFile/ELF/netbsd-core-amd64.test (1436 of 2138) PASS: lldb-unit :: Utility/./UtilityTests/FileSpecTest.EqualDotsPosix (1437 of 2138) PASS: lldb-api :: tools/lldb-vscode/step/TestVSCode_step.py (1438 of 2138) PASS: lldb-unit :: Utility/./UtilityTests/ArgsTest.GetQuotedCommandString (1439 of 2138) PASS: lldb-api :: lang/cpp/this/TestCPPThis.py (1440 of 2138) UNSUPPORTED: lldb-api :: functionalities/data-formatter/data-formatter-stl/libstdcpp/vbool/TestDataFormatterStdVBool.py (1441 of 2138) UNSUPPORTED: lldb-shell :: SymbolFile/NativePDB/ast-methods.cpp (1442 of 2138) PASS: lldb-unit :: UnwindAssembly/x86/./UnwindAssemblyx86Tests/Testx86AssemblyInspectionEngine.TestPushEBP (1443 of 2138) UNSUPPORTED: lldb-api :: lang/cpp/printf/TestPrintf.py (1444 of 2138) PASS: lldb-shell :: BuildScript/compiler-full-path.test (1445 of 2138) PASS: lldb-unit :: Expression/./ExpressionTests/DiagnosticManagerTest.GetStringSeverityLabels (1446 of 2138) PASS: lldb-unit :: Utility/./UtilityTests/IndexToObjectTest.ObjectForIndex (1447 of 2138) PASS: lldb-unit :: Utility/./UtilityTests/StringExtractorTest.GetHexBytes_Partial (1448 of 2138) UNSUPPORTED: lldb-api :: tools/lldb-server/TestGdbRemote_vContThreads.py (1449 of 2138) PASS: lldb-api :: functionalities/data-formatter/data-formatter-objc/TestDataFormatterObjCNSError.py (1450 of 2138) PASS: lldb-unit :: Utility/./UtilityTests/StringListTest.RemoveBlankLines (1451 of 2138) PASS: lldb-unit :: Utility/./UtilityTests/LogChannelTest.EnableOptions (1452 of 2138) PASS: lldb-unit :: Language/Highlighting/./HighlighterTests/HighlighterTest.ClangOperators (1453 of 2138) PASS: lldb-unit :: Utility/./UtilityTests/RangeTest.SlideZero (1454 of 2138) PASS: lldb-api :: functionalities/postmortem/elf-core/gcore/TestGCore.py (1455 of 2138) PASS: lldb-shell :: Reproducer/TestRelativePath.test (1456 of 2138) PASS: lldb-api :: lang/objc/objc++/TestObjCXX.py (1457 of 2138) PASS: lldb-api :: functionalities/breakpoint/breakpoint_language/TestBreakpointLanguage.py (1458 of 2138) PASS: lldb-unit :: Utility/./UtilityTests/StringListTest.InsertStringAtIndexStdString (1459 of 2138) PASS: lldb-api :: commands/log/basic/TestLogging.py (1460 of 2138) PASS: lldb-unit :: Utility/./UtilityTests/StatusTest.ErrorCodeConstructor (1461 of 2138) UNSUPPORTED: lldb-shell :: Register/x86-zmm-read.test (1462 of 2138) UNSUPPORTED: lldb-shell :: SymbolFile/PDB/function-nested-block.test (1463 of 2138) PASS: lldb-api :: lang/objc/self/TestObjCSelf.py (1464 of 2138) PASS: lldb-api :: lang/c/conflicting-symbol/TestConflictingSymbol.py (1465 of 2138) UNSUPPORTED: lldb-shell :: SymbolFile/PDB/type-quals.test (1466 of 2138) PASS: lldb-shell :: Process/TestEnvironment.test (1467 of 2138) PASS: lldb-api :: python_api/module_section/TestModuleAndSection.py (1468 of 2138) PASS: lldb-api :: lang/objc/objc-new-syntax/TestObjCNewSyntaxDictionary.py (1469 of 2138) PASS: lldb-unit :: ScriptInterpreter/Python/./ScriptInterpreterPythonTests/PythonDataObjectsTest.TestPythonByteArray (1470 of 2138) UNSUPPORTED: lldb-shell :: Unwind/eh-frame-augment-noop.test (1471 of 2138) PASS: lldb-api :: lang/c/register_variables/TestRegisterVariables.py (1472 of 2138) PASS: lldb-shell :: SymbolFile/DWARF/dwarf5-debug_line.s (1473 of 2138) PASS: lldb-unit :: Utility/./UtilityTests/OptionsWithRawTest.EmptySuffixSingleWhitespace (1474 of 2138) PASS: lldb-api :: lang/cpp/std-function-step-into-callable/TestStdFunctionStepIntoCallable.py (1475 of 2138) PASS: lldb-unit :: Utility/./UtilityTests/StringExtractorTest.InitEmpty (1476 of 2138) UNSUPPORTED: lldb-shell :: SymbolFile/DWARF/DW_TAG_GNU_call_site-DW_AT_low_pc.s (1477 of 2138) PASS: lldb-api :: functionalities/data-formatter/stringprinter/TestStringPrinter.py (1478 of 2138) PASS: lldb-unit :: Utility/./UtilityTests/LogChannelEnabledTest.LogGetLogThread (1479 of 2138) PASS: lldb-api :: commands/command/invalid-args/TestInvalidArgsCommand.py (1480 of 2138) PASS: lldb-api :: tools/lldb-vscode/launch/TestVSCode_launch.py (1481 of 2138) PASS: lldb-api :: python_api/objc_type/TestObjCType.py (1482 of 2138) PASS: lldb-unit :: Utility/./UtilityTests/StringListTest.InsertStringAtIndexStart (1483 of 2138) PASS: lldb-unit :: Host/./HostTests/HostInfoTest.GetHostname (1484 of 2138) PASS: lldb-unit :: Utility/./UtilityTests/ConstStringTest.MangledCounterpart (1485 of 2138) PASS: lldb-shell :: Minidump/memory-region-from-module.yaml (1486 of 2138) PASS: lldb-api :: commands/frame/diagnose/array/TestArray.py (1487 of 2138) PASS: lldb-unit :: ScriptInterpreter/Python/./ScriptInterpreterPythonTests/PythonDataObjectsTest.TestPythonTupleSize (1488 of 2138) UNSUPPORTED: lldb-api :: benchmarks/libcxxlist/TestBenchmarkLibcxxList.py (1489 of 2138) PASS: lldb-api :: functionalities/data-formatter/data-formatter-smart-array/TestDataFormatterSmartArray.py (1490 of 2138) PASS: lldb-api :: functionalities/memory/find/TestMemoryFind.py (1491 of 2138) PASS: lldb-unit :: Utility/./UtilityTests/BinaryStreamTest.PutSLEB128One (1492 of 2138) PASS: lldb-shell :: Settings/TestEchoCommands.test (1493 of 2138) PASS: lldb-unit :: Host/./HostTests/Host.GetEnvironment (1494 of 2138) PASS: lldb-shell :: Driver/TestUseColor.test (1495 of 2138) PASS: lldb-unit :: Utility/./UtilityTests/OptionsWithRawTest.EmptyArgsOnlySuffix (1496 of 2138) PASS: lldb-api :: lang/c/unicode/TestUnicodeSymbols.py (1497 of 2138) PASS: lldb-unit :: UnwindAssembly/x86/./UnwindAssemblyx86Tests/Testx86AssemblyInspectionEngine.TestPopRBP (1498 of 2138) PASS: lldb-unit :: Utility/./UtilityTests/StringExtractorTest.GetHexU8_InvalidHex (1499 of 2138) PASS: lldb-unit :: Host/./HostTests/FileSystemTest.FileAndDirectoryComponents (1500 of 2138) UNSUPPORTED: lldb-api :: macosx/macCatalystAppMacOSFramework/TestMacCatalystAppWithMacOSFramework.py (1501 of 2138) PASS: lldb-shell :: SymbolFile/DWARF/DW_OP_piece-smaller-than-struct.s (1502 of 2138) PASS: lldb-api :: commands/expression/timeout/TestCallWithTimeout.py (1503 of 2138) PASS: lldb-api :: functionalities/thread/concurrent_events/TestConcurrentSignalDelayBreak.py (1504 of 2138) PASS: lldb-unit :: UnwindAssembly/x86/./UnwindAssemblyx86Tests/Testx86AssemblyInspectionEngine.TestSimplex86_64Augmented (1505 of 2138) UNSUPPORTED: lldb-shell :: SymbolFile/NativePDB/function-types-builtins.cpp (1506 of 2138) PASS: lldb-api :: functionalities/data-formatter/data-formatter-stl/libcxx/initializerlist/TestInitializerList.py (1507 of 2138) PASS: lldb-shell :: ScriptInterpreter/None/import_module.test (1508 of 2138) PASS: lldb-api :: macosx/add-dsym/TestAddDsymMidExecutionCommand.py (1509 of 2138) PASS: lldb-api :: functionalities/data-formatter/array_typedef/TestArrayTypedef.py (1510 of 2138) PASS: lldb-unit :: Platform/Android/./AdbClientTests/AdbClientTest.CreateByDeviceId_ByEnvVar (1511 of 2138) PASS: lldb-api :: functionalities/data-formatter/synthcapping/TestSyntheticCapping.py (1512 of 2138) PASS: lldb-shell :: ObjectFile/Breakpad/sections-trailing-func.test (1513 of 2138) UNSUPPORTED: lldb-api :: tools/lldb-vscode/completions/TestVSCode_completions.py (1514 of 2138) PASS: lldb-unit :: SymbolFile/NativePDB/./SymbolFileNativePDBTests/PDBFPOProgramToDWARFExpressionTests.SingleAssignmentRegisterRef (1515 of 2138) PASS: lldb-api :: functionalities/gdb_remote_client/TestqOffsets.py (1516 of 2138) UNSUPPORTED: lldb-api :: commands/target/auto-install-main-executable/TestAutoInstallMainExecutable.py (1517 of 2138) PASS: lldb-api :: lang/objcxx/cxx-bridged-po/TestObjCXXBridgedPO.py (1518 of 2138) UNSUPPORTED: lldb-api :: linux/thread/create_during_instruction_step/TestCreateDuringInstructionStep.py (1519 of 2138) UNSUPPORTED: lldb-shell :: Register/x86-64-gp-write.test (1520 of 2138) PASS: lldb-unit :: Utility/./UtilityTests/FileSpecTest.FormatFileSpec (1521 of 2138) PASS: lldb-unit :: Symbol/./SymbolTests/PostfixExpression.ParseFPOProgram (1522 of 2138) PASS: lldb-unit :: Utility/./UtilityTests/UriParserTest.SchemeHostSeparator (1523 of 2138) PASS: lldb-unit :: Process/minidump/./LLDBMinidumpTests/MinidumpParserTest.GetMemoryRegionInfo (1524 of 2138) PASS: lldb-unit :: Language/Highlighting/./HighlighterTests/HighlighterTest.Keywords (1525 of 2138) UNSUPPORTED: lldb-shell :: SymbolFile/DWARF/debug_ranges_and_rnglists.test (1526 of 2138) UNSUPPORTED: lldb-shell :: SymbolFile/PDB/compilands.test (1527 of 2138) PASS: lldb-api :: lang/cpp/unicode-literals/TestUnicodeLiterals.py (1528 of 2138) PASS: lldb-unit :: Utility/./UtilityTests/StringLexerTest.Peek (1529 of 2138) PASS: lldb-unit :: Process/minidump/./LLDBMinidumpTests/MinidumpParserTest.FindMemoryRangeWithFullMemoryMinidump (1530 of 2138) PASS: lldb-api :: commands/expression/completion/TestExprCompletion.py (1531 of 2138) UNSUPPORTED: lldb-api :: functionalities/unwind/ehframe/TestEhFrameUnwind.py (1532 of 2138) PASS: lldb-api :: functionalities/breakpoint/breakpoint_callback_command_source/TestBreakpointCallbackCommandSource.py (1533 of 2138) UNSUPPORTED: lldb-api :: tools/lldb-server/TestGdbRemoteAuxvSupport.py (1534 of 2138) PASS: lldb-api :: sample_test/TestSampleTest.py (1535 of 2138) PASS: lldb-api :: lang/cpp/virtual-overload/TestVirtualOverload.py (1536 of 2138) PASS: lldb-unit :: Language/Highlighting/./HighlighterTests/HighlighterTest.ClangCursorPosInOtherToken (1537 of 2138) PASS: lldb-api :: macosx/simulator/TestSimulatorPlatform.py (1538 of 2138) PASS: lldb-api :: commands/platform/process/list/TestProcessList.py (1539 of 2138) UNSUPPORTED: lldb-api :: functionalities/data-formatter/data-formatter-stl/libstdcpp/vector/TestDataFormatterStdVector.py (1540 of 2138) PASS: lldb-api :: commands/target/stop-hook/delete/TestTargetStopHookDelete.py (1541 of 2138) UNSUPPORTED: lldb-api :: functionalities/thread/concurrent_events/TestConcurrentWatchpointWithDelayWatchpointThreads.py (1542 of 2138) PASS: lldb-shell :: SymbolFile/DWARF/deterministic-build.cpp (1543 of 2138) PASS: lldb-unit :: Symbol/./SymbolTests/TestTypeSystemClang.TestGetEnumIntegerTypeBasicTypes (1544 of 2138) PASS: lldb-unit :: Utility/./UtilityTests/DeserializerTest.HasData (1545 of 2138) PASS: lldb-api :: functionalities/postmortem/elf-core/TestLinuxCore.py (1546 of 2138) PASS: lldb-api :: functionalities/data-formatter/vector-types/TestVectorTypesFormatting.py (1547 of 2138) PASS: lldb-unit :: Target/./TargetTests/MCBasedABI.MapRegisterName (1548 of 2138) PASS: lldb-api :: functionalities/data-formatter/parray/TestPrintArray.py (1549 of 2138) PASS: lldb-shell :: Commands/command-disassemble-process.yaml (1550 of 2138) PASS: lldb-unit :: Process/minidump/./LLDBMinidumpTests/MinidumpParserTest.GetExceptionStream (1551 of 2138) PASS: lldb-unit :: Utility/./UtilityTests/ScalarTest.LongLongAssigmentOperator (1552 of 2138) UNSUPPORTED: lldb-api :: benchmarks/continue/TestBenchmarkContinue.py (1553 of 2138) PASS: lldb-shell :: Settings/TestModuleCacheSanity.test (1554 of 2138) UNSUPPORTED: lldb-shell :: Register/arm-fp-read.test (1555 of 2138) PASS: lldb-api :: lang/cpp/char1632_t/TestChar1632T.py (1556 of 2138) UNSUPPORTED: lldb-shell :: ScriptInterpreter/Lua/nested_sessions.test (1557 of 2138) UNSUPPORTED: lldb-shell :: SymbolFile/NativePDB/locate-pdb.cpp (1558 of 2138) UNSUPPORTED: lldb-api :: functionalities/thread/break_after_join/TestBreakAfterJoin.py (1559 of 2138) UNSUPPORTED: lldb-shell :: ScriptInterpreter/Lua/command_script_import.test (1560 of 2138) PASS: lldb-unit :: Utility/./UtilityTests/VMRange.CollectionContains (1561 of 2138) PASS: lldb-api :: commands/expression/import-std-module/shared_ptr-dbg-info-content/TestSharedPtrDbgInfoContentFromStdModule.py (1562 of 2138) PASS: lldb-api :: functionalities/data-formatter/data-formatter-caching/TestDataFormatterCaching.py (1563 of 2138) PASS: lldb-api :: tools/lldb-vscode/breakpoint-events/TestVSCode_breakpointEvents.py (1564 of 2138) PASS: lldb-api :: commands/target/select/TestTargetSelect.py (1565 of 2138) PASS: lldb-unit :: Core/./LLDBCoreTests/SourceFileCache.FindSourceFileFound (1566 of 2138) PASS: lldb-unit :: Symbol/./SymbolTests/TestTypeSystemClang.TestRemoveFastQualifiers (1567 of 2138) PASS: lldb-shell :: ObjectFile/PECOFF/sections-names.yaml (1568 of 2138) PASS: lldb-unit :: Utility/./UtilityTests/ScalarTest.Division (1569 of 2138) PASS: lldb-unit :: Language/Highlighting/./HighlighterTests/HighlighterTest.ClangCursorOutOfBounds (1570 of 2138) UNSUPPORTED: lldb-shell :: ScriptInterpreter/Lua/bindings.test (1571 of 2138) PASS: lldb-api :: commands/target/stop-hooks/TestStopHooks.py (1572 of 2138) PASS: lldb-api :: lang/cpp/unique-types/TestUniqueTypes.py (1573 of 2138) PASS: lldb-unit :: DataFormatter/./LLDBFormatterTests/FormatManagerTests.CompatibleLangs (1574 of 2138) UNSUPPORTED: lldb-api :: commands/watchpoints/watchpoint_commands/TestWatchpointCommands.py (1575 of 2138) PASS: lldb-unit :: Utility/./UtilityTests/StringLexerTest.PutBack (1576 of 2138) PASS: lldb-shell :: Settings/TestDisableColor.test (1577 of 2138) PASS: lldb-unit :: debugserver/./debugserverTests/RNBSocket.LoopBackListenIPv6 (1578 of 2138) UNSUPPORTED: lldb-shell :: SymbolFile/DWARF/find-inline-method.s (1579 of 2138) UNSUPPORTED: lldb-api :: tools/intel-features/intel-pt/test/TestIntelPTSimpleBinary.py (1580 of 2138) PASS: lldb-unit :: Utility/./UtilityTests/LogChannelEnabledTest.LogVerboseThread (1581 of 2138) PASS: lldb-api :: functionalities/data-formatter/data-formatter-objc/TestDataFormatterObjNSException.py (1582 of 2138) PASS: lldb-unit :: Utility/./UtilityTests/Predicate.WaitForValueNotEqualTo (1583 of 2138) PASS: lldb-unit :: Utility/./UtilityTests/RegularExpression.Match (1584 of 2138) PASS: lldb-api :: commands/expression/persistent_ptr_update/TestPersistentPtrUpdate.py (1585 of 2138) PASS: lldb-shell :: Driver/TestProcessAttach.test (1586 of 2138) PASS: lldb-api :: lang/cpp/namespace_definitions/TestNamespaceDefinitions.py (1587 of 2138) PASS: lldb-unit :: Utility/./UtilityTests/ConstStringTest.NullAndEmptyStates (1588 of 2138) PASS: lldb-unit :: Interpreter/./InterpreterTests/OptionArgParserTest.toBoolean (1589 of 2138) PASS: lldb-api :: driver/batch_mode/TestBatchMode.py (1590 of 2138) PASS: lldb-unit :: ScriptInterpreter/Python/./ScriptInterpreterPythonTests/PythonDataObjectsTest.TestPythonCallableInvoke (1591 of 2138) PASS: lldb-unit :: Utility/./UtilityTests/StringListTest.SetSize (1592 of 2138) UNSUPPORTED: lldb-api :: lang/objc/objc-dynamic-value/TestObjCDynamicValue.py (1593 of 2138) PASS: lldb-shell :: Breakpoint/debug_rnglist_basic.test (1594 of 2138) PASS: lldb-unit :: Utility/./UtilityTests/RegularExpression.Empty (1595 of 2138) XFAIL: lldb-shell :: Register/x86-mm-xmm-write.test (1596 of 2138) PASS: lldb-unit :: Host/./HostTests/File.GetStreamFromDescriptor (1597 of 2138) PASS: lldb-shell :: BuildScript/toolchain-clang.test (1598 of 2138) PASS: lldb-api :: commands/expression/weak_symbols/TestWeakSymbols.py (1599 of 2138) PASS: lldb-unit :: debugserver/./debugserverTests/RNBSocket.AnyListen (1600 of 2138) UNSUPPORTED: lldb-api :: functionalities/signal/handle-segv/TestHandleSegv.py (1601 of 2138) PASS: lldb-unit :: Core/./LLDBCoreTests/ModuleSpecTest.InvalidInMemoryBuffer (1602 of 2138) PASS: lldb-unit :: ScriptInterpreter/Python/./ScriptInterpreterPythonTests/PythonDataObjectsTest.TestPythonTupleInitializerList (1603 of 2138) PASS: lldb-unit :: Utility/./UtilityTests/StreamTest.PutRawBytesToMixedEndian (1604 of 2138) PASS: lldb-shell :: ObjectFile/ELF/avr-basic-info.yaml (1605 of 2138) PASS: lldb-api :: commands/expression/codegen-crash-import-def-arraytype-element/TestImportDefinitionArrayType.py (1606 of 2138) PASS: lldb-unit :: Language/Highlighting/./HighlighterTests/HighlighterTest.ClangTrailingBackslashWithWhitespace (1607 of 2138) PASS: lldb-api :: lang/cpp/incomplete-types/TestCppIncompleteTypes.py (1608 of 2138) UNSUPPORTED: lldb-api :: lang/cpp/gmodules/TestWithModuleDebugging.py (1609 of 2138) PASS: lldb-unit :: Utility/./UtilityTests/ArgsTest.TestSingleArgWithQuotedSpace (1610 of 2138) PASS: lldb-unit :: Expression/./ExpressionTests/CppModuleConfigurationTest.MissingLibCpp (1611 of 2138) PASS: lldb-api :: lang/objc/modules-compile-error/TestModulesCompileError.py (1612 of 2138) PASS: lldb-unit :: Utility/./UtilityTests/StringExtractorTest.DecodeHexU8_Underflow (1613 of 2138) PASS: lldb-unit :: Target/./TargetTests/MemoryRegionInfoTest.Formatv (1614 of 2138) PASS: lldb-unit :: Utility/./UtilityTests/StreamTeeTest.SetStreamAtIndexOutOfBounds (1615 of 2138) PASS: lldb-unit :: UnwindAssembly/x86/./UnwindAssemblyx86Tests/Testx86AssemblyInspectionEngine.TestPushEDX (1616 of 2138) PASS: lldb-api :: lang/objc/objc-new-syntax/TestObjCNewSyntaxArray.py (1617 of 2138) PASS: lldb-api :: python_api/class_members/TestSBTypeClassMembers.py (1618 of 2138) PASS: lldb-api :: commands/expression/codegen-crash-typedefdecl-not-in_declcontext/TestCodegenCrashTypedefDeclNotInDeclContext.py (1619 of 2138) PASS: lldb-unit :: Utility/./UtilityTests/VASprintfTest.EncodingError (1620 of 2138) PASS: lldb-unit :: Utility/./UtilityTests/StreamTest.Indent (1621 of 2138) PASS: lldb-unit :: Utility/./UtilityTests/StringListTest.ForRangeEmpty (1622 of 2138) PASS: lldb-unit :: Utility/./UtilityTests/BinaryStreamTest.PutULEB128MaxValue (1623 of 2138) PASS: lldb-unit :: Utility/./UtilityTests/UriParserTest.SchemeHostSeparator4 (1624 of 2138) PASS: lldb-api :: python_api/signals/TestSignalsAPI.py (1625 of 2138) PASS: lldb-shell :: ObjectFile/ELF/base-address.yaml (1626 of 2138) PASS: lldb-api :: functionalities/process_group/TestChangeProcessGroup.py (1627 of 2138) PASS: lldb-shell :: ScriptInterpreter/Python/sb_address_exception.test (1628 of 2138) PASS: lldb-shell :: Minidump/memory-region.yaml (1629 of 2138) PASS: lldb-api :: functionalities/data-formatter/ostypeformatting/TestFormattersOsType.py (1630 of 2138) PASS: lldb-unit :: Utility/./UtilityTests/BinaryStreamTest.PutULEB128NineBytes (1631 of 2138) PASS: lldb-api :: tools/lldb-server/inferior-crash/TestGdbRemoteSegFault.py (1632 of 2138) PASS: lldb-shell :: Commands/command-backtrace.test (1633 of 2138) PASS: lldb-api :: lang/cpp/covariant-return-types/TestCovariantReturnTypes.py (1634 of 2138) PASS: lldb-unit :: UnwindAssembly/x86/./UnwindAssemblyx86Tests/Testx86AssemblyInspectionEngine.TestPushEAX (1635 of 2138) PASS: lldb-api :: lang/cpp/bitfields/TestCppBitfields.py (1636 of 2138) PASS: lldb-api :: lang/cpp/typedef/TestCppTypedef.py (1637 of 2138) PASS: lldb-api :: iohandler/autosuggestion/TestAutosuggestion.py (1638 of 2138) PASS: lldb-api :: tools/lldb-server/TestGdbRemoteSingleStep.py (1639 of 2138) UNSUPPORTED: lldb-shell :: Register/aarch64-fp-read.test (1640 of 2138) UNSUPPORTED: lldb-api :: functionalities/darwin_log/source/debug/TestDarwinLogSourceDebug.py (1641 of 2138) PASS: lldb-unit :: Utility/./UtilityTests/UriParserTest.MinimalPort (1642 of 2138) PASS: lldb-unit :: Process/./ProcessEventDataTests/ProcessEventDataTest.ShouldStop (1643 of 2138) PASS: lldb-shell :: Reproducer/TestWorkingDir.test (1644 of 2138) PASS: lldb-unit :: Utility/./UtilityTests/StringExtractorTest.GetHexU8_Underflow_NoEof (1645 of 2138) PASS: lldb-unit :: ScriptInterpreter/Python/./ScriptInterpreterPythonTests/PythonDataObjectsTest.TestModuleNameResolutionNoDot (1646 of 2138) PASS: lldb-unit :: tools/lldb-server/tests/./LLDBServerTests/TestBase.LaunchModePreservesEnvironment (1647 of 2138) PASS: lldb-unit :: Signals/./SignalsTests/UnixSignalsTest.Iteration (1648 of 2138) PASS: lldb-api :: functionalities/thread/concurrent_events/TestConcurrentTwoBreakpointsOneSignal.py (1649 of 2138) UNSUPPORTED: lldb-shell :: BuildScript/toolchain-msvc.test (1650 of 2138) PASS: lldb-api :: tools/lldb-server/TestGdbRemoteExitCode.py (1651 of 2138) PASS: lldb-unit :: Utility/./UtilityTests/RangeTest.Union (1652 of 2138) PASS: lldb-unit :: ObjectFile/Breakpad/./ObjectFileBreakpadTests/ModuleRecord.parse (1653 of 2138) PASS: lldb-shell :: Quit/TestQuitExitCodeNonInt.test (1654 of 2138) PASS: lldb-unit :: Core/./LLDBCoreTests/MangledTest.EmptyForInvalidName (1655 of 2138) PASS: lldb-api :: linux/builtin_trap/TestBuiltinTrap.py (1656 of 2138) PASS: lldb-unit :: Process/gdb-remote/./ProcessGdbRemoteTests/GDBRemoteClientBaseTest.SendContinueDelegateInterface (1657 of 2138) PASS: lldb-shell :: SymbolFile/DWARF/DW_AT_low_pc-addrx.s (1658 of 2138) PASS: lldb-unit :: Host/./HostTests/ConnectionFileDescriptorTest.TCPGetURIv4 (1659 of 2138) PASS: lldb-api :: python_api/sbplatform/TestSBPlatform.py (1660 of 2138) PASS: lldb-unit :: UnwindAssembly/x86/./UnwindAssemblyx86Tests/Testx86AssemblyInspectionEngine.TestPushEDI (1661 of 2138) PASS: lldb-unit :: Editline/./EditlineTests/EditlineTestFixture.EditlineReceivesSingleLineText (1662 of 2138) PASS: lldb-unit :: Symbol/./SymbolTests/TestTypeSystemClang.TestConvertAccessTypeToAccessSpecifier (1663 of 2138) PASS: lldb-api :: types/TestShortType.py (1664 of 2138) PASS: lldb-api :: functionalities/data-formatter/data-formatter-ptr-to-array/TestPtrToArrayFormatting.py (1665 of 2138) PASS: lldb-api :: functionalities/gdb_remote_client/TestStopPCs.py (1666 of 2138) PASS: lldb-unit :: Expression/./ExpressionTests/CppModuleConfigurationTest.MissingUsrInclude (1667 of 2138) PASS: lldb-unit :: Utility/./UtilityTests/ArchSpecTest.OperatorBool (1668 of 2138) PASS: lldb-unit :: DataFormatter/./LLDBFormatterTests/StringPrinterTests.SwiftUTF8 (1669 of 2138) UNSUPPORTED: lldb-api :: functionalities/darwin_log/filter/exact_match/activity/TestDarwinLogFilterMatchActivity.py (1670 of 2138) PASS: lldb-api :: commands/expression/dollar-in-variable/TestDollarInVariable.py (1671 of 2138) PASS: lldb-unit :: Process/gdb-remote/./ProcessGdbRemoteTests/GDBRemoteCommunicationClientTest.GetModulesInfoInvalidResponse (1672 of 2138) PASS: lldb-unit :: Utility/./UtilityTests/VMRange.IsValid (1673 of 2138) PASS: lldb-unit :: Utility/./UtilityTests/NameMatchesTest.Contains (1674 of 2138) UNSUPPORTED: lldb-api :: functionalities/darwin_log/filter/regex/message/TestDarwinLogFilterRegexMessage.py (1675 of 2138) PASS: lldb-api :: types/TestCharType.py (1676 of 2138) PASS: lldb-shell :: Commands/command-thread-select.test (1677 of 2138) PASS: lldb-api :: lang/cpp/constructors/TestCppConstructors.py (1678 of 2138) PASS: lldb-unit :: Utility/./UtilityTests/StreamTest.AddressRange (1679 of 2138) PASS: lldb-api :: functionalities/breakpoint/scripted_bkpt/TestScriptedResolver.py (1680 of 2138) PASS: lldb-unit :: Utility/./UtilityTests/TimerTest.CategoryTimesNested (1681 of 2138) PASS: lldb-api :: lang/objc/foundation/TestObjCMethodsNSError.py (1682 of 2138) PASS: lldb-shell :: Quit/TestQuitExitCode30.test (1683 of 2138) PASS: lldb-unit :: Language/CLanguages/./LanguageCLanguagesTests/CLanguages.LookupCLanguagesByLanguageType (1684 of 2138) PASS: lldb-unit :: Utility/./UtilityTests/FileSpecTest.FileAndDirectoryComponents (1685 of 2138) PASS: lldb-shell :: Driver/TestCommands.test (1686 of 2138) PASS: lldb-api :: python_api/lldbutil/iter/TestLLDBIterator.py (1687 of 2138) PASS: lldb-shell :: Driver/TestRepl.test (1688 of 2138) PASS: lldb-unit :: Utility/./UtilityTests/StreamTest.AddressRangeSize (1689 of 2138) PASS: lldb-api :: functionalities/data-formatter/boolreference/TestFormattersBoolRefPtr.py (1690 of 2138) UNSUPPORTED: lldb-shell :: SymbolFile/PDB/expressions.test (1691 of 2138) PASS: lldb-unit :: Utility/./UtilityTests/BinaryStreamTest.PutULEB128ThreeBytes (1692 of 2138) PASS: lldb-shell :: SymbolFile/DWARF/find-qualified-variable.cpp (1693 of 2138) PASS: lldb-unit :: Breakpoint/./LLDBBreakpointTests/BreakpointIDTest.StringIsBreakpointName (1694 of 2138) PASS: lldb-api :: lang/cpp/class_types/TestClassTypesDisassembly.py (1695 of 2138) PASS: lldb-unit :: Utility/./UtilityTests/StringLexerTest.NextIf (1696 of 2138) UNSUPPORTED: lldb-api :: functionalities/thread/concurrent_events/TestConcurrentTwoWatchpointsOneBreakpoint.py (1697 of 2138) PASS: lldb-unit :: Process/gdb-remote/./ProcessGdbRemoteTests/GDBRemoteCommunicationServerTest.SendErrorResponse_ErrorNumber (1698 of 2138) PASS: lldb-api :: commands/expression/no-deadlock/TestExprDoesntBlock.py (1699 of 2138) PASS: lldb-api :: lang/cpp/multiple-inheritance/TestCppMultipleInheritance.py (1700 of 2138) UNSUPPORTED: lldb-api :: python_api/watchpoint/TestSetWatchpoint.py (1701 of 2138) PASS: lldb-api :: functionalities/inferior-crashing/TestInferiorCrashing.py (1702 of 2138) UNSUPPORTED: lldb-api :: functionalities/tsan/multiple/TestTsanMultiple.py (1703 of 2138) PASS: lldb-api :: lang/cpp/unsigned_types/TestUnsignedTypes.py (1704 of 2138) PASS: lldb-api :: functionalities/gdb_remote_client/TestThreadSelectionBug.py (1705 of 2138) PASS: lldb-unit :: UnwindAssembly/x86/./UnwindAssemblyx86Tests/Testx86AssemblyInspectionEngine.TestSpillRegToStackViaMOVi386 (1706 of 2138) PASS: lldb-api :: functionalities/tail_call_frames/disambiguate_paths_to_common_sink/TestDisambiguatePathsToCommonSink.py (1707 of 2138) PASS: lldb-api :: functionalities/data-formatter/data-formatter-stl/libcxx/multiset/TestDataFormatterLibcxxMultiSet.py (1708 of 2138) PASS: lldb-unit :: Language/Highlighting/./HighlighterTests/HighlighterTest.ClangPPDirectives (1709 of 2138) PASS: lldb-unit :: UnwindAssembly/x86/./UnwindAssemblyx86Tests/Testx86AssemblyInspectionEngine.TestPopRBPWithREX (1710 of 2138) PASS: lldb-unit :: Utility/./UtilityTests/UriParserTest.BracketedHostnameWithPortIPv6 (1711 of 2138) PASS: lldb-unit :: Expression/./ExpressionTests/DiagnosticManagerTest.GetStringBasic (1712 of 2138) PASS: lldb-unit :: Symbol/./SymbolTests/TestTypeSystemClang.TestBuiltinTypeForEncodingAndBitSize (1713 of 2138) PASS: lldb-api :: functionalities/deleted-executable/TestDeletedExecutable.py (1714 of 2138) PASS: lldb-api :: functionalities/abbreviation/TestCommonShortSpellings.py (1715 of 2138) PASS: lldb-api :: lang/cpp/alignas_base_class/TestAlignAsBaseClass.py (1716 of 2138) PASS: lldb-unit :: UnwindAssembly/x86/./UnwindAssemblyx86Tests/Testx86AssemblyInspectionEngine.TestPushR13 (1717 of 2138) PASS: lldb-shell :: ObjectFile/wasm/basic.yaml (1718 of 2138) PASS: lldb-unit :: Process/minidump/./LLDBMinidumpTests/MinidumpParserTest.GetThreadContext_x86_32 (1719 of 2138) UNSUPPORTED: lldb-shell :: ScriptInterpreter/Lua/persistent_state.test (1720 of 2138) PASS: lldb-unit :: Utility/./UtilityTests/XcodeSDKTest.FindXcodeContentsDirectoryInPath (1721 of 2138) PASS: lldb-unit :: Expression/./ExpressionTests/DiagnosticManagerTest.AppendMessageAttachToLastDiag (1722 of 2138) PASS: lldb-api :: functionalities/inline-stepping/TestInlineStepping.py (1723 of 2138) PASS: lldb-unit :: Utility/./UtilityTests/LogChannelTest.Disable (1724 of 2138) UNSUPPORTED: lldb-shell :: SymbolFile/NativePDB/typedefs.cpp (1725 of 2138) UNSUPPORTED: lldb-shell :: ScriptInterpreter/Lua/breakpoint_callback.test (1726 of 2138) PASS: lldb-unit :: Utility/./UtilityTests/TimeoutTest.Construction (1727 of 2138) PASS: lldb-api :: commands/disassemble/basic/TestDisassembleBreakpoint.py (1728 of 2138) PASS: lldb-shell :: Reproducer/TestPythonImport.test (1729 of 2138) PASS: lldb-unit :: UnwindAssembly/x86/./UnwindAssemblyx86Tests/Testx86AssemblyInspectionEngine.TestPushEBX (1730 of 2138) PASS: lldb-unit :: Utility/./UtilityTests/StringListTest.LongestCommonPrefixDuplicateElement (1731 of 2138) PASS: lldb-api :: lang/c/enum_types/TestEnumTypes.py (1732 of 2138) PASS: lldb-api :: commands/expression/radar_9673664/TestExprHelpExamples.py (1733 of 2138) PASS: lldb-shell :: ObjectFile/ELF/section-overlap.yaml (1734 of 2138) PASS: lldb-api :: tools/lldb-server/TestGdbRemoteExpeditedRegisters.py (1735 of 2138) PASS: lldb-unit :: Utility/./UtilityTests/StreamTeeTest.AppendStream (1736 of 2138) PASS: lldb-unit :: UnwindAssembly/x86/./UnwindAssemblyx86Tests/Testx86AssemblyInspectionEngine.Test32bitFramelessBigStackFrame (1737 of 2138) PASS: lldb-unit :: SymbolFile/NativePDB/./SymbolFileNativePDBTests/PDBFPOProgramToDWARFExpressionTests.InvalidOpUnary (1738 of 2138) PASS: lldb-unit :: Symbol/./SymbolTests/PostfixExpression.ToDWARF (1739 of 2138) PASS: lldb-unit :: Utility/./UtilityTests/StringLexerTest.GetUnlexed (1740 of 2138) PASS: lldb-api :: lang/c/offsetof/TestOffsetof.py (1741 of 2138) PASS: lldb-unit :: Core/./LLDBCoreTests/ModuleSpecTest.TestMachOFile (1742 of 2138) PASS: lldb-shell :: ObjectFile/ELF/PT_LOAD-overlap-PT_INTERP.yaml (1743 of 2138) PASS: lldb-unit :: ScriptInterpreter/Python/./ScriptInterpreterPythonTests/PythonDataObjectsTest.TestPythonDictionaryToStructuredDictionary (1744 of 2138) PASS: lldb-shell :: SymbolFile/DWARF/compilercontext.ll (1745 of 2138) PASS: lldb-unit :: Utility/./UtilityTests/ProcessInstanceInfo.Dump (1746 of 2138) PASS: lldb-api :: lang/objc/foundation/TestConstStrings.py (1747 of 2138) PASS: lldb-api :: commands/breakpoint/set/func-regex/TestBreakpointRegexError.py (1748 of 2138) PASS: lldb-api :: functionalities/gdb_remote_client/TestWasm.py (1749 of 2138) PASS: lldb-api :: python_api/sbvalue_persist/TestSBValuePersist.py (1750 of 2138) PASS: lldb-api :: functionalities/source-map/TestTargetSourceMap.py (1751 of 2138) UNSUPPORTED: lldb-shell :: SymbolFile/NativePDB/bitfields.cpp (1752 of 2138) PASS: lldb-shell :: BuildScript/modes.test (1753 of 2138) PASS: lldb-unit :: Utility/./UtilityTests/StringExtractorTest.GetHexU8_Extra_NoEof (1754 of 2138) PASS: lldb-unit :: Utility/./UtilityTests/PassiveReplayTest.InstrumentedBarPtr (1755 of 2138) PASS: lldb-unit :: Utility/./UtilityTests/StreamTest.PutMaxHex64ByteOrderBig (1756 of 2138) PASS: lldb-unit :: Utility/./UtilityTests/StringExtractorTest.GetHexU8_Exact_NoEof (1757 of 2138) UNSUPPORTED: lldb-api :: functionalities/thread/concurrent_events/TestConcurrentSignalWatchBreak.py (1758 of 2138) PASS: lldb-unit :: Utility/./UtilityTests/AnsiTerminal.Twice (1759 of 2138) PASS: lldb-unit :: Utility/./UtilityTests/GeneratorTest.GetOrCreate (1760 of 2138) PASS: lldb-unit :: Utility/./UtilityTests/CompletionRequest.TryCompleteCurrentArgBad (1761 of 2138) PASS: lldb-unit :: Utility/./UtilityTests/LogChannelTest.Enable (1762 of 2138) PASS: lldb-api :: functionalities/recursion/TestValueObjectRecursion.py (1763 of 2138) PASS: lldb-api :: lang/cpp/rvalue-references/TestRvalueReferences.py (1764 of 2138) PASS: lldb-unit :: Utility/./UtilityTests/RangeTest.ContainsRange (1765 of 2138) PASS: lldb-shell :: Process/TestAbortExitCode.test (1766 of 2138) PASS: lldb-shell :: SymbolFile/DWARF/debug_loc-aslr.s (1767 of 2138) PASS: lldb-unit :: Utility/./UtilityTests/ArgsTest.TestQuotedUnknownEscape (1768 of 2138) PASS: lldb-unit :: Utility/./UtilityTests/StringExtractorTest.GetHexBytes_Underflow (1769 of 2138) PASS: lldb-shell :: SymbolFile/DWARF/apple-index-is-used.cpp (1770 of 2138) PASS: lldb-shell :: Reproducer/TestVersionCheck.test (1771 of 2138) PASS: lldb-shell :: Settings/TestFrameFormatColor.test (1772 of 2138) PASS: lldb-shell :: ScriptInterpreter/Python/python.test (1773 of 2138) PASS: lldb-api :: python_api/value/change_values/TestChangeValueAPI.py (1774 of 2138) PASS: lldb-unit :: ObjectFile/ELF/./ObjectFileELFTests/ObjectFileELFTest.GetModuleSpecifications_EarlySectionHeaders (1775 of 2138) PASS: lldb-unit :: Utility/./UtilityTests/XcodeSDKTest.SDKSupportsModules (1776 of 2138) PASS: lldb-unit :: Utility/./UtilityTests/Flags.AllClear (1777 of 2138) PASS: lldb-shell :: Commands/CommandScriptImmediateOutput/CommandScriptImmediateOutputFile.test (1778 of 2138) PASS: lldb-api :: tools/lldb-server/TestAppleSimulatorOSType.py (1779 of 2138) PASS: lldb-shell :: ObjectFile/ELF/PT_LOAD-empty.yaml (1780 of 2138) PASS: lldb-unit :: Utility/./UtilityTests/OptionsWithRawTest.WhitespaceSuffix (1781 of 2138) PASS: lldb-api :: functionalities/data-formatter/data-formatter-named-summaries/TestDataFormatterNamedSummaries.py (1782 of 2138) PASS: lldb-unit :: UnwindAssembly/x86/./UnwindAssemblyx86Tests/Testx86AssemblyInspectionEngine.TestPushECX (1783 of 2138) PASS: lldb-api :: commands/command/script/TestCommandScript.py (1784 of 2138) PASS: lldb-api :: lang/cpp/nsimport/TestCppNsImport.py (1785 of 2138) PASS: lldb-unit :: Utility/./UtilityTests/StringExtractorTest.InitMisc (1786 of 2138) PASS: lldb-unit :: Symbol/./SymbolTests/TestTypeSystemClang.TestRecordHasFields (1787 of 2138) PASS: lldb-shell :: SymbolFile/DWARF/debug_loc.s (1788 of 2138) PASS: lldb-api :: functionalities/gdb_remote_client/TestProcessConnect.py (1789 of 2138) PASS: lldb-unit :: UnwindAssembly/x86/./UnwindAssemblyx86Tests/Testx86AssemblyInspectionEngine.Test32bitFramelessSmallStackFrame (1790 of 2138) PASS: lldb-unit :: Expression/./ExpressionTests/DiagnosticManagerTest.GetStringMultiline (1791 of 2138) UNSUPPORTED: lldb-api :: linux/add-symbols/TestTargetSymbolsAddCommand.py (1792 of 2138) PASS: lldb-api :: macosx/duplicate-archive-members/TestDuplicateMembers.py (1793 of 2138) UNSUPPORTED: lldb-api :: functionalities/darwin_log/filter/regex/activity-chain/TestDarwinLogFilterRegexActivityChain.py (1794 of 2138) UNSUPPORTED: lldb-api :: tools/lldb-server/signal-filtering/TestGdbRemote_QPassSignals.py (1795 of 2138) PASS: lldb-shell :: ObjectFile/Breakpad/discontiguous-sections.test (1796 of 2138) PASS: lldb-unit :: Utility/./UtilityTests/BinaryStreamTest.PutSLEB128MaxValue (1797 of 2138) PASS: lldb-unit :: SymbolFile/NativePDB/./SymbolFileNativePDBTests/PDBFPOProgramToDWARFExpressionTests.UnsupportedRASearch (1798 of 2138) PASS: lldb-api :: lang/cpp/this_class_type_mixing/TestThisClassTypeMixing.py (1799 of 2138) PASS: lldb-api :: lang/objc/objc-checker/TestObjCCheckers.py (1800 of 2138) PASS: lldb-unit :: Utility/./UtilityTests/NameMatchesTest.Ignore (1801 of 2138) PASS: lldb-shell :: Reproducer/Functionalities/TestImageList.test (1802 of 2138) PASS: lldb-unit :: Utility/./UtilityTests/StringLexerTest.HasAtLeast (1803 of 2138) PASS: lldb-api :: functionalities/breakpoint/serialize/TestBreakpointSerialization.py (1804 of 2138) PASS: lldb-api :: functionalities/plugins/command_plugin/TestPluginCommands.py (1805 of 2138) PASS: lldb-unit :: Process/minidump/./LLDBMinidumpTests/MinidumpParserTest.GetMiscInfoWindows (1806 of 2138) PASS: lldb-shell :: Expr/TestMultilineExpr.test (1807 of 2138) PASS: lldb-shell :: SymbolFile/DWARF/DW_AT_const_value-bitfields.s (1808 of 2138) PASS: lldb-api :: lang/cpp/type_lookup/TestCppTypeLookup.py (1809 of 2138) PASS: lldb-unit :: Symbol/./SymbolTests/LineEntryTest.GetSameLineContiguousAddressRangeNoInlines (1810 of 2138) PASS: lldb-api :: lang/objc/modules-auto-import/TestModulesAutoImport.py (1811 of 2138) PASS: lldb-api :: functionalities/signal/TestSendSignal.py (1812 of 2138) PASS: lldb-api :: types/TestCharTypeExpr.py (1813 of 2138) PASS: lldb-api :: commands/target/dump-symtab-demangle/TestDumpSymtabDemangle.py (1814 of 2138) PASS: lldb-unit :: Utility/./UtilityTests/RangeTest.SizeTypes (1815 of 2138) UNSUPPORTED: lldb-api :: commands/watchpoints/watchpoint_on_vectors/TestValueOfVectorVariable.py (1816 of 2138) PASS: lldb-api :: lang/objc/ptr_refs/TestPtrRefsObjC.py (1817 of 2138) UNSUPPORTED: lldb-api :: commands/watchpoints/variable_out_of_scope/TestWatchedVarHitWhenInScope.py (1818 of 2138) UNSUPPORTED: lldb-api :: python_api/watchpoint/TestWatchpointIter.py (1819 of 2138) PASS: lldb-api :: lang/cpp/call-function/TestCallCPPFunction.py (1820 of 2138) PASS: lldb-api :: commands/expression/import-std-module/deque-basic/TestDequeFromStdModule.py (1821 of 2138) PASS: lldb-api :: lang/objc/bitfield_ivars/TestBitfieldIvars.py (1822 of 2138) PASS: lldb-api :: functionalities/breakpoint/inlined_breakpoints/TestInlinedBreakpoints.py (1823 of 2138) PASS: lldb-api :: tools/lldb-vscode/breakpoint/TestVSCode_setFunctionBreakpoints.py (1824 of 2138) PASS: lldb-unit :: Target/./TargetTests/PathMappingListTest.RelativeTests (1825 of 2138) PASS: lldb-api :: functionalities/data-formatter/data-formatter-objc/TestDataFormatterObjCNSBundle.py (1826 of 2138) UNSUPPORTED: lldb-shell :: Register/x86-64-zmm-read.test (1827 of 2138) PASS: lldb-unit :: Utility/./UtilityTests/ScalarTest.Getters (1828 of 2138) PASS: lldb-api :: functionalities/breakpoint/breakpoint_ids/TestBreakpointIDs.py (1829 of 2138) PASS: lldb-api :: python_api/value_var_update/TestValueVarUpdate.py (1830 of 2138) PASS: lldb-api :: functionalities/conditional_break/TestConditionalBreak.py (1831 of 2138) PASS: lldb-api :: commands/frame/diagnose/complicated-expression/TestComplicatedExpression.py (1832 of 2138) PASS: lldb-unit :: Symbol/./SymbolTests/TestClangASTImporter.MetadataPropagation (1833 of 2138) PASS: lldb-api :: commands/process/launch-with-shellexpand/TestLaunchWithShellExpand.py (1834 of 2138) PASS: lldb-unit :: Utility/./UtilityTests/BinaryStreamTest.PutSLEB128SixBytes (1835 of 2138) PASS: lldb-api :: sanity/TestSettingSkipping.py (1836 of 2138) PASS: lldb-shell :: ScriptInterpreter/None/none.test (1837 of 2138) PASS: lldb-unit :: Utility/./UtilityTests/ScalarTest.RightShiftOperator (1838 of 2138) PASS: lldb-shell :: SymbolFile/DWARF/debug_rnglists-dwo.s (1839 of 2138) PASS: lldb-unit :: Language/Highlighting/./HighlighterTests/HighlighterTest.ClangStringLiterals (1840 of 2138) PASS: lldb-unit :: Utility/./UtilityTests/StringExtractorTest.GetNameColonValueNoSemicolon (1841 of 2138) PASS: lldb-api :: lang/objcxx/objcxx-ivar-vector/TestIvarVector.py (1842 of 2138) PASS: lldb-shell :: Expr/TestIRMemoryMap.test (1843 of 2138) PASS: lldb-shell :: Reproducer/TestDSYM.test (1844 of 2138) UNSUPPORTED: lldb-api :: functionalities/unwind/standard/TestStandardUnwind.py (1845 of 2138) PASS: lldb-unit :: Symbol/./SymbolTests/TestClangASTImporter.MetadataPropagationIndirectImport (1846 of 2138) PASS: lldb-api :: commands/expression/top-level/TestTopLevelExprs.py (1847 of 2138) PASS: lldb-api :: functionalities/memory-region/TestMemoryRegion.py (1848 of 2138) PASS: lldb-shell :: ObjectFile/ELF/PT_LOAD.yaml (1849 of 2138) PASS: lldb-unit :: Expression/./ExpressionTests/CppModuleConfigurationTest.IgnoreLibStdCpp (1850 of 2138) PASS: lldb-unit :: Utility/./UtilityTests/RangeTest.DoesIntersect (1851 of 2138) PASS: lldb-unit :: Process/gdb-remote/./ProcessGdbRemoteTests/GDBRemoteCommunicationClientTest.GetModulesInfo (1852 of 2138) UNSUPPORTED: lldb-shell :: SymbolFile/PDB/udt-layout.test (1853 of 2138) UNSUPPORTED: lldb-api :: functionalities/thread/concurrent_events/TestConcurrentTwoBreakpointsOneWatchpoint.py (1854 of 2138) PASS: lldb-unit :: Utility/./UtilityTests/SharedCluster.ClusterManager (1855 of 2138) UNSUPPORTED: lldb-shell :: ScriptInterpreter/Lua/quit.test (1856 of 2138) PASS: lldb-unit :: Host/./HostTests/SocketTest.TCPGetAddress (1857 of 2138) PASS: lldb-unit :: Utility/./UtilityTests/BinaryStreamTest.PutULEB128FourBytes (1858 of 2138) PASS: lldb-unit :: Platform/./LLDBPlatformTests/PlatformAppleSimulatorTest.TestSimHasSimEnvionament (1859 of 2138) PASS: lldb-shell :: ObjectFile/ELF/PT_TLS-overlap-PT_LOAD.yaml (1860 of 2138) UNSUPPORTED: lldb-api :: commands/watchpoints/watchpoint_size/TestWatchpointSizes.py (1861 of 2138) UNSUPPORTED: lldb-shell :: SymbolFile/DWARF/find-type-in-function.cpp (1862 of 2138) PASS: lldb-api :: lang/cpp/modules-import/TestCXXModulesImport.py (1863 of 2138) PASS: lldb-api :: lang/c/function_types/TestFunctionTypes.py (1864 of 2138) PASS: lldb-api :: functionalities/postmortem/minidump/TestMiniDump.py (1865 of 2138) PASS: lldb-unit :: Utility/./UtilityTests/StreamTest.PutNHex8 (1866 of 2138) PASS: lldb-api :: functionalities/postmortem/netbsd-core/TestNetBSDCore.py (1867 of 2138) PASS: lldb-unit :: UnwindAssembly/x86/./UnwindAssemblyx86Tests/Testx86AssemblyInspectionEngine.TestAddRSP (1868 of 2138) PASS: lldb-unit :: Utility/./UtilityTests/ArgsTest.TestUnknownEscape (1869 of 2138) PASS: lldb-unit :: UnwindAssembly/x86/./UnwindAssemblyx86Tests/Testx86AssemblyInspectionEngine.Test64bitFramelessSmallStackFrame (1870 of 2138) PASS: lldb-api :: functionalities/thread/ignore_suspended/TestIgnoreSuspendedThread.py (1871 of 2138) PASS: lldb-api :: lang/objc/variadic_methods/TestVariadicMethods.py (1872 of 2138) PASS: lldb-api :: lang/c/shared_lib_stripped_symbols/TestSharedLibStrippedSymbols.py (1873 of 2138) PASS: lldb-shell :: Quit/TestQuitExitCode0.test (1874 of 2138) PASS: lldb-unit :: Utility/./UtilityTests/VMRange.Reset (1875 of 2138) PASS: lldb-api :: functionalities/data-formatter/data-formatter-stl/libcxx/multimap/TestDataFormatterLibccMultiMap.py (1876 of 2138) PASS: lldb-unit :: Process/minidump/./LLDBMinidumpTests/MinidumpParserTest.GetThreadsAndGetThreadContext (1877 of 2138) PASS: lldb-shell :: Breakpoint/debug_rnglistx_rlex.test (1878 of 2138) UNSUPPORTED: lldb-shell :: SymbolFile/NativePDB/globals-bss.cpp (1879 of 2138) PASS: lldb-shell :: ObjectFile/ELF/many-sections.s (1880 of 2138) UNSUPPORTED: lldb-shell :: SymbolFile/DWARF/debug-types-dwo-cross-reference.cpp (1881 of 2138) PASS: lldb-unit :: Utility/./UtilityTests/VASprintfTest.NoBufferResize (1882 of 2138) PASS: lldb-api :: commands/platform/file/read/TestPlatformFileRead.py (1883 of 2138) PASS: lldb-api :: lang/c/tls_globals/TestTlsGlobals.py (1884 of 2138) UNSUPPORTED: lldb-shell :: ObjectFile/PECOFF/disassemble-thumb.yaml (1885 of 2138) PASS: lldb-shell :: ObjectFile/MachO/lc_version_min.yaml (1886 of 2138) PASS: lldb-api :: macosx/order/TestOrderFile.py (1887 of 2138) PASS: lldb-unit :: Utility/./UtilityTests/FileSpecTest.OperatorBool (1888 of 2138) PASS: lldb-unit :: Utility/./UtilityTests/Flags.Test (1889 of 2138) PASS: lldb-unit :: Utility/./UtilityTests/StringExtractorTest.GetHexU8_Underflow2_NoEof (1890 of 2138) PASS: lldb-api :: lang/cpp/thread_local/TestThreadLocal.py (1891 of 2138) PASS: lldb-unit :: Utility/./UtilityTests/BinaryStreamTest.PutSLEB128SevenBytes (1892 of 2138) PASS: lldb-unit :: Utility/./UtilityTests/StringExtractorTest.GetNameColonValueSuccess (1893 of 2138) PASS: lldb-unit :: Core/./LLDBCoreTests/RichManglingContextTest.Basic (1894 of 2138) PASS: lldb-shell :: Driver/LocalLLDBInit.test (1895 of 2138) PASS: lldb-unit :: Utility/./UtilityTests/UriParserTest.Minimal (1896 of 2138) PASS: lldb-api :: functionalities/breakpoint/auto_continue/TestBreakpointAutoContinue.py (1897 of 2138) PASS: lldb-api :: commands/log/invalid-args/TestInvalidArgsLog.py (1898 of 2138) PASS: lldb-unit :: Target/./TargetTests/PathMappingListTest.AbsoluteTests (1899 of 2138) PASS: lldb-shell :: ObjectFile/wasm/unified-debug-sections.yaml (1900 of 2138) PASS: lldb-shell :: SymbolFile/DWARF/DW_AT_data_bit_offset-DW_OP_stack_value.s (1901 of 2138) PASS: lldb-unit :: Utility/./UtilityTests/BinaryStreamTest.PutULEB128SixBytes (1902 of 2138) PASS: lldb-unit :: Utility/./UtilityTests/ArgsTest.TestOverwriteArgs (1903 of 2138) PASS: lldb-shell :: Reproducer/TestDump.test (1904 of 2138) UNSUPPORTED: lldb-api :: arm/breakpoint-it/TestBreakpointIt.py (1905 of 2138) UNSUPPORTED: lldb-api :: lang/objc/modules-update/TestClangModulesUpdate.py (1906 of 2138) PASS: lldb-api :: functionalities/data-formatter/data-formatter-objc/nsindexpath/TestDataFormatterNSIndexPath.py (1907 of 2138) PASS: lldb-shell :: Minidump/Windows/find-module.test (1908 of 2138) PASS: lldb-unit :: Utility/./UtilityTests/ListenerTest.GetEventWait (1909 of 2138) PASS: lldb-unit :: Utility/./UtilityTests/UriParserTest.BracketedHostname (1910 of 2138) PASS: lldb-unit :: Utility/./UtilityTests/StringListTest.CopyList (1911 of 2138) UNSUPPORTED: lldb-shell :: SymbolFile/PDB/func-symbols.test (1912 of 2138) PASS: lldb-api :: lang/cpp/stl/TestStdCXXDisassembly.py (1913 of 2138) UNSUPPORTED: lldb-api :: python_api/watchpoint/TestWatchpointIgnoreCount.py (1914 of 2138) UNSUPPORTED: lldb-shell :: SymbolFile/PDB/pointers.test (1915 of 2138) PASS: lldb-unit :: Utility/./UtilityTests/RangeTest.NotEqual (1916 of 2138) PASS: lldb-api :: functionalities/tail_call_frames/ambiguous_tail_call_seq2/TestAmbiguousTailCallSeq2.py (1917 of 2138) PASS: lldb-api :: lang/objc/modules/TestObjCModules.py (1918 of 2138) PASS: lldb-unit :: Utility/./UtilityTests/StringExtractorTest.GetU64BigEndian (1919 of 2138) PASS: lldb-api :: commands/expression/import-std-module/pair/TestPairFromStdModule.py (1920 of 2138) PASS: lldb-unit :: debugserver/./debugserverTests/RNBSocket.LoopBackListenIPv4 (1921 of 2138) PASS: lldb-api :: types/TestIntegerType.py (1922 of 2138) PASS: lldb-unit :: Process/gdb-remote/./ProcessGdbRemoteTests/GDBRemoteCommunicationClientTest.SendSignalsToIgnore (1923 of 2138) PASS: lldb-unit :: Utility/./UtilityTests/RangeDataVector.FindEntryThatContains_Overlap (1924 of 2138) PASS: lldb-unit :: Utility/./UtilityTests/OptionsWithRawTest.ArgsButNoDelimiter (1925 of 2138) PASS: lldb-api :: lang/objc/orderedset/TestOrderedSet.py (1926 of 2138) PASS: lldb-unit :: ScriptInterpreter/Python/./ScriptInterpreterPythonTests/PythonDataObjectsTest.TestPythonBoolean (1927 of 2138) PASS: lldb-shell :: SymbolFile/DWARF/split-dwarf-inlining.cpp (1928 of 2138) PASS: lldb-unit :: Utility/./UtilityTests/ConstStringTest.FromMidOfBufferStringRef (1929 of 2138) PASS: lldb-api :: functionalities/type_completion/TestTypeCompletion.py (1930 of 2138) PASS: lldb-api :: lang/cpp/frame-var-anon-unions/TestFrameVariableAnonymousUnions.py (1931 of 2138) PASS: lldb-api :: lang/cpp/overloaded-functions/TestOverloadedFunctions.py (1932 of 2138) PASS: lldb-api :: lang/objc/ivar-IMP/TestObjCiVarIMP.py (1933 of 2138) PASS: lldb-unit :: Host/./HostTests/SocketTest.DomainGetConnectURI (1934 of 2138) PASS: lldb-api :: functionalities/gdb_remote_client/TestPlatformClient.py (1935 of 2138) PASS: lldb-unit :: Utility/./UtilityTests/ArgsTest.DoubleQuotedItem (1936 of 2138) PASS: lldb-api :: functionalities/step_scripted/TestStepScripted.py (1937 of 2138) PASS: lldb-unit :: Host/./HostTests/ConnectionFileDescriptorTest.TCPGetURIv6 (1938 of 2138) PASS: lldb-api :: macosx/load-kext/TestLoadKext.py (1939 of 2138) UNSUPPORTED: lldb-api :: android/platform/TestDefaultCacheLineSize.py (1940 of 2138) PASS: lldb-unit :: Host/./HostTests/MainLoopTest.UnmonitoredSignal (1941 of 2138) PASS: lldb-unit :: ObjectFile/ELF/./ObjectFileELFTests/ObjectFileELFTest.GetSymtab_NoSymEntryPointArmAddressClass (1942 of 2138) PASS: lldb-api :: python_api/lldbutil/process/TestPrintStackTraces.py (1943 of 2138) PASS: lldb-api :: functionalities/data-formatter/data-formatter-stl/libcxx/set/TestDataFormatterLibcxxSet.py (1944 of 2138) PASS: lldb-unit :: Utility/./UtilityTests/RangeTest.Constructor (1945 of 2138) PASS: lldb-api :: functionalities/thread/concurrent_events/TestConcurrentDelaySignalBreak.py (1946 of 2138) PASS: lldb-unit :: Utility/./UtilityTests/NameMatchesTest.RegularExpression (1947 of 2138) PASS: lldb-unit :: Utility/./UtilityTests/ArchSpecTest.YAML (1948 of 2138) PASS: lldb-unit :: Process/gdb-remote/./ProcessGdbRemoteTests/GDBRemoteClientBaseTest.SendContinueDelegateStructuredDataReceipt (1949 of 2138) PASS: lldb-shell :: Reproducer/TestVerify.test (1950 of 2138) PASS: lldb-api :: lang/objc/objc-optimized/TestObjcOptimized.py (1951 of 2138) PASS: lldb-unit :: Utility/./UtilityTests/LogTest.Register (1952 of 2138) PASS: lldb-api :: commands/expression/persistent_types/TestPersistentTypes.py (1953 of 2138) UNSUPPORTED: lldb-api :: python_api/disassemble-raw-data/TestDisassemble_VST1_64.py (1954 of 2138) PASS: lldb-api :: functionalities/data-formatter/data-formatter-stl/libcxx/function/TestLibCxxFunction.py (1955 of 2138) PASS: lldb-api :: functionalities/thread/exit_during_break/TestExitDuringBreak.py (1956 of 2138) PASS: lldb-unit :: Utility/./UtilityTests/StringExtractorTest.GetHexBytes_OddPair (1957 of 2138) PASS: lldb-api :: commands/expression/import_base_class_when_class_has_derived_member/TestImportBaseClassWhenClassHasDerivedMember.py (1958 of 2138) PASS: lldb-unit :: Utility/./UtilityTests/ArchSpecTest.TestSetTriple (1959 of 2138) PASS: lldb-unit :: Language/Highlighting/./HighlighterTests/HighlighterTest.ClangIdentifiers (1960 of 2138) PASS: lldb-shell :: SymbolFile/Breakpad/line-table-edgecases.test (1961 of 2138) PASS: lldb-unit :: Expression/./ExpressionTests/DWARFExpression.DW_OP_piece (1962 of 2138) PASS: lldb-unit :: Utility/./UtilityTests/EventTest.DumpEventDataBytes (1963 of 2138) UNSUPPORTED: lldb-shell :: SymbolFile/DWARF/debug-types-address-ranges.s (1964 of 2138) UNSUPPORTED: lldb-shell :: ScriptInterpreter/Lua/independent_state.test (1965 of 2138) PASS: lldb-api :: commands/quit/TestQuit.py (1966 of 2138) PASS: lldb-unit :: ScriptInterpreter/Python/./ScriptInterpreterPythonTests/PythonDataObjectsTest.TestDictionaryResolutionWithDot (1967 of 2138) UNSUPPORTED: lldb-api :: python_api/watchpoint/watchlocation/TestSetWatchlocation.py (1968 of 2138) PASS: lldb-unit :: Utility/./UtilityTests/ArgsTest.ReplaceArgumentAtIndexFarOutOfRange (1969 of 2138) PASS: lldb-unit :: Utility/./UtilityTests/OptionsWithRawTest.EmptySuffix (1970 of 2138) PASS: lldb-unit :: Process/minidump/./LLDBMinidumpTests/RegisterContextMinidump.ConvertMinidumpContext_x86_32 (1971 of 2138) PASS: lldb-api :: functionalities/thread/concurrent_events/TestConcurrentBreakpointOneDelayBreakpointThreads.py (1972 of 2138) PASS: lldb-unit :: Process/minidump/./LLDBMinidumpTests/MinidumpParserTest.GetMemoryRegionInfoFromMemory64List (1973 of 2138) UNSUPPORTED: lldb-shell :: Register/x86-64-ymm16-write.test (1974 of 2138) PASS: lldb-unit :: Utility/./UtilityTests/DataExtractorTest.GetDouble (1975 of 2138) PASS: lldb-api :: functionalities/data-formatter/data-formatter-objc/TestDataFormatterObjCExpr.py (1976 of 2138) PASS: lldb-unit :: Process/gdb-remote/./ProcessGdbRemoteTests/GDBRemoteClientBaseTest.SendContinueAndWait (1977 of 2138) PASS: lldb-unit :: Utility/./UtilityTests/StreamTest.ChangingByteOrder (1978 of 2138) PASS: lldb-shell :: ObjectFile/ELF/minidebuginfo-corrupt-xz.yaml (1979 of 2138) PASS: lldb-shell :: Reproducer/Functionalities/TestExpressionEvaluation.test (1980 of 2138) PASS: lldb-shell :: Commands/command-disassemble.s (1981 of 2138) PASS: lldb-api :: functionalities/data-formatter/data-formatter-stl/libcxx/unordered/TestDataFormatterUnordered.py (1982 of 2138) PASS: lldb-shell :: Reproducer/TestHomeDir.test (1983 of 2138) PASS: lldb-shell :: Register/x86-64-gp-read.test (1984 of 2138) UNSUPPORTED: lldb-api :: commands/expression/call-restarts/TestCallThatRestarts.py (1985 of 2138) PASS: lldb-api :: macosx/macCatalyst/TestMacCatalyst.py (1986 of 2138) PASS: lldb-unit :: Utility/./UtilityTests/ConstStringTest.CompareConstString (1987 of 2138) PASS: lldb-shell :: VSCode/TestOptions.test (1988 of 2138) PASS: lldb-api :: functionalities/breakpoint/step_over_breakpoint/TestStepOverBreakpoint.py (1989 of 2138) PASS: lldb-shell :: SymbolFile/DWARF/debug_ranges-missing-section.s (1990 of 2138) PASS: lldb-api :: lang/cpp/function_refs/TestFunctionRefs.py (1991 of 2138) PASS: lldb-api :: lang/c/anonymous/TestAnonymous.py (1992 of 2138) PASS: lldb-unit :: Utility/./UtilityTests/DataExtractorTest.GetCStrEmpty (1993 of 2138) PASS: lldb-shell :: ObjectFile/ELF/build-id-case.yaml (1994 of 2138) PASS: lldb-unit :: Utility/./UtilityTests/UriParserTest.SchemeHostSeparator2 (1995 of 2138) PASS: lldb-shell :: Host/TestCustomShell.test (1996 of 2138) PASS: lldb-unit :: Expression/./ExpressionTests/CppModuleConfigurationTest.UnknownLibCppFile (1997 of 2138) PASS: lldb-api :: functionalities/thread/step_until/TestStepUntil.py (1998 of 2138) PASS: lldb-unit :: Utility/./UtilityTests/ProcessInstanceInfo.Yaml (1999 of 2138) UNSUPPORTED: lldb-shell :: SymbolFile/DWARF/debug-line-basic.s (2000 of 2138) PASS: lldb-api :: functionalities/tail_call_frames/cross_object/TestCrossObjectTailCalls.py (2001 of 2138) PASS: lldb-api :: functionalities/data-formatter/data-formatter-stl/libcxx/vbool/TestDataFormatterLibcxxVBool.py (2002 of 2138) PASS: lldb-unit :: Utility/./UtilityTests/TimerTest.CategoryTimes2 (2003 of 2138) PASS: lldb-api :: functionalities/pointer_num_children/TestPointerNumChildren.py (2004 of 2138) PASS: lldb-unit :: Utility/./UtilityTests/BinaryStreamTest.PutULEB128SevenBytes (2005 of 2138) PASS: lldb-api :: commands/expression/xvalue/TestXValuePrinting.py (2006 of 2138) PASS: lldb-unit :: Utility/./UtilityTests/StringExtractorTest.GetU64LittleEndian (2007 of 2138) PASS: lldb-unit :: Utility/./UtilityTests/LogChannelEnabledTest.LogThread (2008 of 2138) PASS: lldb-unit :: Symbol/./SymbolTests/DWARFCallFrameInfoTest.Basic_dwarf3 (2009 of 2138) PASS: lldb-shell :: Register/x86-64-read.test (2010 of 2138) PASS: lldb-unit :: Process/gdb-remote/./ProcessGdbRemoteTests/GDBRemoteCommunicationClientTest.WriteRegisterNoSuffix (2011 of 2138) PASS: lldb-unit :: Utility/./UtilityTests/StreamTest.AddressPrefixAndSuffix (2012 of 2138) UNSUPPORTED: lldb-shell :: SymbolFile/DWARF/dwarf5_locations.s (2013 of 2138) PASS: lldb-api :: python_api/symbol-context/two-files/TestSymbolContextTwoFiles.py (2014 of 2138) PASS: lldb-api :: lang/objc/foundation/TestObjCMethodsString.py (2015 of 2138) PASS: lldb-api :: commands/expression/import-std-module/list-dbg-info-content/TestDbgInfoContentListFromStdModule.py (2016 of 2138) PASS: lldb-api :: functionalities/data-formatter/data-formatter-objc/TestDataFormatterObjCNSDate.py (2017 of 2138) PASS: lldb-unit :: Process/minidump/./LLDBMinidumpTests/MinidumpParserTest.GetFilteredModuleList (2018 of 2138) PASS: lldb-unit :: Utility/./UtilityTests/RegularExpression.Invalid (2019 of 2138) PASS: lldb-unit :: Process/gdb-remote/./ProcessGdbRemoteTests/GDBRemoteCommunicationClientTest.GetMemoryRegionInfo (2020 of 2138) PASS: lldb-unit :: Utility/./UtilityTests/AnsiTerminal.KnownPrefix (2021 of 2138) PASS: lldb-api :: functionalities/optimized_code/TestNoASanExceptionAfterEvalOP_piece.py (2022 of 2138) PASS: lldb-unit :: Utility/./UtilityTests/FileSpecTest.EqualDotsWindows (2023 of 2138) PASS: lldb-api :: lang/cpp/char8_t/TestCxxChar8_t.py (2024 of 2138) PASS: lldb-shell :: ObjectFile/ELF/section-types-edgecases.yaml (2025 of 2138) PASS: lldb-unit :: ScriptInterpreter/Python/./ScriptInterpreterPythonTests/PythonDataObjectsTest.TestPythonListValueEquality (2026 of 2138) PASS: lldb-api :: commands/expression/dont_allow_jit/TestAllowJIT.py (2027 of 2138) PASS: lldb-api :: lang/cpp/chained-calls/TestCppChainedCalls.py (2028 of 2138) PASS: lldb-unit :: SymbolFile/NativePDB/./SymbolFileNativePDBTests/PDBFPOProgramToDWARFExpressionTests.UnknownOp (2029 of 2138) PASS: lldb-api :: lang/objc/foundation/TestRuntimeTypes.py (2030 of 2138) PASS: lldb-api :: lang/c/step_over_no_deadlock/TestStepOverDoesntBlock.py (2031 of 2138) PASS: lldb-unit :: Utility/./UtilityTests/SubsystemRAIITest.SubsystemWithErrorSuccess (2032 of 2138) PASS: lldb-shell :: SymbolFile/DWARF/split-dwarf-multiple-cu.ll (2033 of 2138) PASS: lldb-shell :: Breakpoint/jitbp_elf.test (2034 of 2138) PASS: lldb-api :: functionalities/abbreviation/TestAbbreviations.py (2035 of 2138) PASS: lldb-api :: commands/thread/select/TestThreadSelect.py (2036 of 2138) PASS: lldb-shell :: Minidump/dump-all.test (2037 of 2138) PASS: lldb-unit :: Host/./HostTests/ProcessLaunchInfoTest.Constructor (2038 of 2138) UNSUPPORTED: lldb-api :: benchmarks/stepping/TestSteppingSpeed.py (2039 of 2138) PASS: lldb-unit :: Utility/./UtilityTests/SerializationRountripTest.SerializeDeserializeCStringArrayNullptr (2040 of 2138) PASS: lldb-unit :: Utility/./UtilityTests/RecordReplayTest.InstrumentedBarPtr (2041 of 2138) PASS: lldb-unit :: Utility/./UtilityTests/BinaryStreamTest.PutULEB128EightBytes (2042 of 2138) PASS: lldb-api :: functionalities/non-overlapping-index-variable-i/TestIndexVariable.py (2043 of 2138) UNSUPPORTED: lldb-shell :: SymbolFile/DWARF/split-dwarf-expression-eval-bug.cpp (2044 of 2138) PASS: lldb-unit :: Language/CPlusPlus/./LanguageCPlusPlusTests/CPlusPlusLanguage.CPlusPlusNameParser (2045 of 2138) PASS: lldb-unit :: Utility/./UtilityTests/StreamTest.ShiftOperatorPtr (2046 of 2138) PASS: lldb-unit :: UnwindAssembly/x86/./UnwindAssemblyx86Tests/Testx86AssemblyInspectionEngine.TestPushR14 (2047 of 2138) PASS: lldb-unit :: Signals/./SignalsTests/UnixSignalsTest.GetFilteredSignals (2048 of 2138) PASS: lldb-shell :: Register/x86-64-ymm-read.test (2049 of 2138) PASS: lldb-shell :: ObjectFile/wasm/stripped-debug-sections.yaml (2050 of 2138) PASS: lldb-api :: functionalities/param_entry_vals/basic_entry_values/TestBasicEntryValues.py (2051 of 2138) PASS: lldb-unit :: UnwindAssembly/x86/./UnwindAssemblyx86Tests/Testx86AssemblyInspectionEngine.TestPushRBX (2052 of 2138) PASS: lldb-unit :: Symbol/./SymbolTests/TestTypeSystemClang.TestGetTypeClassDeclType (2053 of 2138) UNSUPPORTED: lldb-shell :: SymbolFile/NativePDB/nested-types.cpp (2054 of 2138) PASS: lldb-unit :: Utility/./UtilityTests/StreamTest.PutBytesAsRawHex8ToBigEndian (2055 of 2138) PASS: lldb-unit :: Utility/./UtilityTests/Flags.AllSet (2056 of 2138) UNSUPPORTED: lldb-shell :: Register/x86-ymm-read.test (2057 of 2138) PASS: lldb-unit :: Host/./HostTests/FileSystemTest.MakeAbsolute (2058 of 2138) PASS: lldb-api :: functionalities/unwind/noreturn/TestNoreturnUnwind.py (2059 of 2138) UNSUPPORTED: lldb-shell :: SymbolFile/DWARF/find-function-regex.cpp (2060 of 2138) UNSUPPORTED: lldb-shell :: ScriptInterpreter/Lua/io.test (2061 of 2138) PASS: lldb-api :: functionalities/data-formatter/builtin-formats/TestBuiltinFormats.py (2062 of 2138) PASS: lldb-api :: lang/cpp/dynamic-value-same-basename/TestDynamicValueSameBase.py (2063 of 2138) PASS: lldb-unit :: Utility/./UtilityTests/UriParserTest.TypicalPortPathIPv4 (2064 of 2138) PASS: lldb-unit :: Expression/./ExpressionTests/DiagnosticManagerTest.GetStringPreserveOrder (2065 of 2138) PASS: lldb-api :: tools/lldb-server/TestGdbRemote_qThreadStopInfo.py (2066 of 2138) PASS: lldb-unit :: Utility/./UtilityTests/StreamTest.PutPtr (2067 of 2138) PASS: lldb-unit :: Utility/./UtilityTests/ProcessInstanceInfoList.Yaml (2068 of 2138) PASS: lldb-api :: lang/cpp/exceptions/TestCPPExceptionBreakpoints.py (2069 of 2138) PASS: lldb-unit :: Utility/./UtilityTests/UserIDResolver.GetGroupName (2070 of 2138) PASS: lldb-unit :: Utility/./UtilityTests/StreamTest.AddressRangeInvalidRange (2071 of 2138) PASS: lldb-unit :: Language/Highlighting/./HighlighterTests/HighlighterTest.ClangCommas (2072 of 2138) PASS: lldb-unit :: Core/./LLDBCoreTests/UniqueCStringMap.NoDefaultConstructor (2073 of 2138) UNSUPPORTED: lldb-shell :: SymbolFile/DWARF/debug-types-basic.test (2074 of 2138) PASS: lldb-shell :: SymbolFile/DWARF/module-ownership.mm (2075 of 2138) PASS: lldb-api :: lang/objc/objc-new-syntax/TestObjCNewSyntaxLiteral.py (2076 of 2138) PASS: lldb-unit :: ScriptInterpreter/Python/./ScriptInterpreterPythonTests/PythonDataObjectsTest.TestPythonFile (2077 of 2138) PASS: lldb-unit :: Utility/./UtilityTests/StringListTest.GetMaxStringLengthIncreasingSize (2078 of 2138) PASS: lldb-unit :: Utility/./UtilityTests/VMRange.ContainsAddr (2079 of 2138) PASS: lldb-shell :: Breakpoint/dummy-target.test (2080 of 2138) UNSUPPORTED: lldb-api :: functionalities/tsan/thread_leak/TestTsanThreadLeak.py (2081 of 2138) PASS: lldb-api :: tools/lldb-vscode/breakpoint/TestVSCode_setExceptionBreakpoints.py (2082 of 2138) PASS: lldb-unit :: Process/gdb-remote/./ProcessGdbRemoteTests/GDBRemoteCommunicationServerTest.SendErrorResponse_StringError (2083 of 2138) PASS: lldb-api :: lang/cpp/bool/TestCPPBool.py (2084 of 2138) PASS: lldb-unit :: ObjectFile/Breakpad/./ObjectFileBreakpadTests/InfoRecord.parse (2085 of 2138) PASS: lldb-unit :: debugserver/./debugserverTests/RNBSocket.LoopBackConnectIPv6 (2086 of 2138) PASS: lldb-unit :: ScriptInterpreter/Python/./ScriptInterpreterPythonTests/PythonDataObjectsTest.TestPythonTupleToStructuredList (2087 of 2138) PASS: lldb-unit :: Symbol/./SymbolTests/Type.CompilerContextPattern (2088 of 2138) PASS: lldb-unit :: Symbol/./SymbolTests/TestTypeSystemClang.AddMethodToObjCObjectType (2089 of 2138) PASS: lldb-api :: lang/cpp/extern_c/TestExternCSymbols.py (2090 of 2138) UNSUPPORTED: lldb-shell :: SymbolFile/DWARF/find-basic-type.cpp (2091 of 2138) PASS: lldb-api :: functionalities/data-formatter/nssetsynth/TestNSSetSynthetic.py (2092 of 2138) PASS: lldb-api :: functionalities/signal/raise/TestRaise.py (2093 of 2138) PASS: lldb-api :: functionalities/data-formatter/dump_dynamic/TestDumpDynamic.py (2094 of 2138) UNSUPPORTED: lldb-api :: functionalities/ubsan/user-expression/TestUbsanUserExpression.py (2095 of 2138) PASS: lldb-api :: lang/objc/radar-9691614/TestObjCMethodReturningBOOL.py (2096 of 2138) PASS: lldb-api :: tools/lldb-server/TestGdbRemoteRegisterState.py (2097 of 2138) PASS: lldb-api :: functionalities/tail_call_frames/unambiguous_sequence/TestUnambiguousTailCalls.py (2098 of 2138) PASS: lldb-unit :: Core/./LLDBCoreTests/RichManglingContextTest.IPDRealloc (2099 of 2138) XFAIL: lldb-shell :: Register/x86-64-write.test (2100 of 2138) PASS: lldb-unit :: SymbolFile/NativePDB/./SymbolFileNativePDBTests/PDBFPOProgramToDWARFExpressionTests.MissingTargetRegister (2101 of 2138) PASS: lldb-unit :: SymbolFile/NativePDB/./SymbolFileNativePDBTests/PDBFPOProgramToDWARFExpressionTests.UnresolvedRegisterAssignmentReference (2102 of 2138) PASS: lldb-unit :: ScriptInterpreter/Python/./ScriptInterpreterPythonTests/PythonDataObjectsTest.TestPythonCallableCheck (2103 of 2138) PASS: lldb-unit :: Utility/./UtilityTests/RecordReplayTest.InstrumentedBarRef (2104 of 2138) PASS: lldb-api :: python_api/name_lookup/TestNameLookup.py (2105 of 2138) PASS: lldb-unit :: Utility/./UtilityTests/SerializationRountripTest.SerializeDeserializeCString (2106 of 2138) PASS: lldb-unit :: Utility/./UtilityTests/Predicate.WaitForValueEqualTo (2107 of 2138) PASS: lldb-unit :: Host/./HostTests/FileSystemTest.GetByteSize (2108 of 2138) PASS: lldb-unit :: Language/Highlighting/./HighlighterTests/HighlighterTest.DefaultHighlighter (2109 of 2138) PASS: lldb-unit :: Utility/./UtilityTests/VMRange.Comparison (2110 of 2138) PASS: lldb-api :: functionalities/data-formatter/data-formatter-stl/libcxx/forward_list/TestDataFormatterLibcxxForwardList.py (2111 of 2138) UNSUPPORTED: lldb-shell :: SymbolFile/NativePDB/ast-functions.cpp (2112 of 2138) PASS: lldb-api :: sanity/TestModuleCacheSanity.py (2113 of 2138) PASS: lldb-api :: python_api/sbvalue_const_addrof/TestSBValueConstAddrOf.py (2114 of 2138) PASS: lldb-unit :: Utility/./UtilityTests/ConstStringTest.format_provider (2115 of 2138) PASS: lldb-unit :: Symbol/./SymbolTests/TestTypeSystemClang.TestFunctionTemplateConstruction (2116 of 2138) PASS: lldb-api :: macosx/find-app-in-bundle/TestFindAppInBundle.py (2117 of 2138) UNSUPPORTED: lldb-shell :: SymbolFile/DWARF/find-method.cpp (2118 of 2138) PASS: lldb-api :: lang/objc/objc-ivar-offsets/TestObjCIvarOffsets.py (2119 of 2138) PASS: lldb-shell :: ObjectFile/PECOFF/basic-info.yaml (2120 of 2138) UNSUPPORTED: lldb-shell :: SymbolFile/DWARF/debug-names-compressed.cpp (2121 of 2138) UNSUPPORTED: lldb-api :: functionalities/thread/concurrent_events/TestConcurrentWatchpointDelayWatchpointOneBreakpoint.py (2122 of 2138) PASS: lldb-api :: lang/c/stepping/TestThreadStepping.py (2123 of 2138) PASS: lldb-api :: functionalities/breakpoint/breakpoint_command/TestBreakpointCommand.py (2124 of 2138) PASS: lldb-api :: functionalities/breakpoint/comp_dir_symlink/TestCompDirSymLink.py (2125 of 2138) PASS: lldb-api :: commands/expression/import-std-module/forward_list/TestForwardListFromStdModule.py (2126 of 2138) PASS: lldb-shell :: ExecControl/StopHook/stop-hook.test (2127 of 2138) UNSUPPORTED: lldb-api :: functionalities/breakpoint/hardware_breakpoints/write_memory_with_hw_breakpoint/TestWriteMemoryWithHWBreakpoint.py (2128 of 2138) PASS: lldb-api :: functionalities/data-formatter/data-formatter-objc/TestDataFormatterObjCNSURL.py (2129 of 2138) PASS: lldb-api :: lang/objc/objc-class-method/TestObjCClassMethod.py (2130 of 2138) PASS: lldb-api :: functionalities/gdb_remote_client/TestNoGPacketSupported.py (2131 of 2138) PASS: lldb-api :: lang/cpp/operators/TestCppOperators.py (2132 of 2138) PASS: lldb-api :: lang/objc/objc-struct-return/TestObjCStructReturn.py (2133 of 2138) PASS: lldb-api :: api/multithreaded/TestMultithreaded.py (2134 of 2138) PASS: lldb-api :: lang/objc/foundation/TestObjCMethodsNSArray.py (2135 of 2138) PASS: lldb-api :: types/TestLongTypes.py (2136 of 2138) PASS: lldb-api :: functionalities/completion/TestCompletion.py (2137 of 2138) PASS: lldb-api :: tools/lldb-server/TestLldbGdbServer.py (2138 of 2138) Slowest Tests: -------------------------------------------------------------------------- 88.21s: lldb-api :: tools/lldb-server/TestLldbGdbServer.py 68.88s: lldb-api :: lang/objc/foundation/TestFoundationDisassembly.py 62.43s: lldb-api :: commands/gui/basicdebug/TestGuiBasicDebug.py 60.04s: lldb-api :: lang/objc/hidden-ivars/TestHiddenIvars.py 56.67s: lldb-api :: api/multithreaded/TestMultithreaded.py 55.76s: lldb-api :: lang/objc/foundation/TestObjCMethods.py 48.01s: lldb-api :: macosx/simulator/TestSimulatorPlatform.py 42.71s: lldb-api :: lang/objc/exceptions/TestObjCExceptions.py 36.40s: lldb-api :: lang/objc/real-definition/TestRealDefinition.py 35.67s: lldb-api :: lang/objc/objc-new-syntax/TestObjCNewSyntaxDictionary.py 34.40s: lldb-api :: lang/objc/objc-new-syntax/TestObjCNewSyntaxLiteral.py 32.88s: lldb-api :: tools/lldb-server/TestGdbRemoteThreadsInStopReply.py 32.84s: lldb-api :: lang/objc/objc-new-syntax/TestObjCNewSyntaxArray.py 31.31s: lldb-api :: lang/objc/foundation/TestObjCMethodsNSError.py 30.55s: lldb-api :: types/TestLongTypesExpr.py 29.93s: lldb-api :: lang/cpp/namespace/TestNamespaceLookup.py 29.78s: lldb-api :: python_api/target/TestTargetAPI.py 28.88s: lldb-api :: functionalities/completion/TestCompletion.py 27.23s: lldb-api :: lang/objc/forward-decl/TestForwardDecl.py 26.90s: lldb-api :: commands/target/basic/TestTargetCommand.py

Hide Details

Tests Times: -------------------------------------------------------------------------- [ Range ] :: [ Percentage ] :: [ Count ] -------------------------------------------------------------------------- [85.0s,90.0s) :: [ ] :: [ 1/2138] [80.0s,85.0s) :: [ ] :: [ 0/2138] [75.0s,80.0s) :: [ ] :: [ 0/2138] [70.0s,75.0s) :: [ ] :: [ 1/2138] [65.0s,70.0s) :: [ ] :: [ 0/2138] [60.0s,65.0s) :: [ ] :: [ 2/2138] [55.0s,60.0s) :: [ ] :: [ 2/2138] [50.0s,55.0s) :: [ ] :: [ 0/2138] [45.0s,50.0s) :: [ ] :: [ 1/2138] [40.0s,45.0s) :: [ ] :: [ 1/2138] [35.0s,40.0s) :: [ ] :: [ 3/2138] [30.0s,35.0s) :: [ ] :: [ 6/2138] [25.0s,30.0s) :: [ ] :: [ 5/2138] [20.0s,25.0s) :: [ ] :: [ 2/2138] [15.0s,20.0s) :: [ ] :: [ 17/2138] [10.0s,15.0s) :: [* ] :: [ 79/2138] [ 5.0s,10.0s) :: [*** ] :: [ 210/2138] [ 0.0s, 5.0s) :: [********************************* ] :: [1808/2138] -------------------------------------------------------------------------- ******************** Failed Tests (2): lldb-api :: commands/gui/basicdebug/TestGuiBasicDebug.py lldb-api :: lang/c/vla/TestVLA.py

Hide Details

Hide Details

Testing Time: 377.92s Unsupported : 272 Passed : 1859 Expectedly Failed: 5 Failed : 2 FAILED: tools/lldb/test/CMakeFiles/check-lldb-lit cd /Users/buildslave/jenkins/workspace/lldb-cmake-matrix/lldb-build/tools/lldb/test && /usr/local/Frameworks/Python.framework/Versions/3.7/bin/python3.7 /Users/buildslave/jenkins/workspace/lldb-cmake-matrix/lldb-build/./bin/llvm-lit -v --time-tests --shuffle --xunit-xml-output=/Users/buildslave/jenkins/workspace/lldb-cmake-matrix/test/results.xml -v /Users/buildslave/jenkins/workspace/lldb-cmake-matrix/lldb-build/tools/lldb/test ninja: build stopped: subcommand failed. Command failed: Command '['/usr/bin/env', 'TERM=vt100', '/usr/local/bin/ninja', '-v', 'check-lldb']' returned non-zero exit status 1. Command: ['/usr/bin/env', 'TERM=vt100', '/usr/local/bin/ninja', '-v', 'check-lldb'] + set -e [Pipeline] } [Pipeline] // timeout [Pipeline] junit Recording test results [Pipeline] } [Pipeline] // stage [Pipeline] } [Pipeline] // withEnv [Pipeline] } [Pipeline] // node [Pipeline] End of Pipeline Finished: UNSTABLE