FailedConsole Output

Started by user Chris Matthews
Running as SYSTEM
Building remotely on labmaster2 (Zorg) in workspace /Users/buildslave/jenkins/workspace/LNT_Tests
The recommended git tool is: NONE
No credentials specified
Cloning the remote Git repository
Cloning repository http://labmaster3.local/git/llvm-test-suite.git
 > git init /Users/buildslave/jenkins/workspace/LNT_Tests/llvm-test-suite # timeout=10
Fetching upstream changes from http://labmaster3.local/git/llvm-test-suite.git
 > git --version # timeout=10
 > git --version # 'git version 1.9.3 (Apple Git-50)'
 > git fetch --tags --progress http://labmaster3.local/git/llvm-test-suite.git +refs/heads/*:refs/remotes/origin/* # timeout=10
 > git config remote.origin.url http://labmaster3.local/git/llvm-test-suite.git # timeout=10
 > git config --add remote.origin.fetch +refs/heads/*:refs/remotes/origin/* # timeout=10
Avoid second fetch
 > git rev-parse refs/remotes/origin/main^{commit} # timeout=10
Checking out Revision f6ee2f66b936e94f03abd687567d2f9c8feb2e71 (refs/remotes/origin/main)
 > git config core.sparsecheckout # timeout=10
 > git checkout -f f6ee2f66b936e94f03abd687567d2f9c8feb2e71 # timeout=10
Commit message: "[test-suite] Support Fortran tests in CMake infrastructure."
First time build. Skipping changelog.
The recommended git tool is: NONE
No credentials specified
Cloning the remote Git repository
Cloning repository http://labmaster3.local/git/llvm-lnt.git
 > git init /Users/buildslave/jenkins/workspace/LNT_Tests/llvm-lnt # timeout=10
Fetching upstream changes from http://labmaster3.local/git/llvm-lnt.git
 > git --version # timeout=10
 > git --version # 'git version 1.9.3 (Apple Git-50)'
 > git fetch --tags --progress http://labmaster3.local/git/llvm-lnt.git +refs/heads/*:refs/remotes/origin/* # timeout=10
 > git config remote.origin.url http://labmaster3.local/git/llvm-lnt.git # timeout=10
 > git config --add remote.origin.fetch +refs/heads/*:refs/remotes/origin/* # timeout=10
Avoid second fetch
 > git rev-parse refs/remotes/origin/main^{commit} # timeout=10
Checking out Revision f98bc1b3018248fbe551b0e7491ac5ba388216d5 (refs/remotes/origin/main)
 > git config core.sparsecheckout # timeout=10
 > git checkout -f f98bc1b3018248fbe551b0e7491ac5ba388216d5 # timeout=10
Commit message: "LNT: Fix Perf profiling support"
First time build. Skipping changelog.
The recommended git tool is: NONE
No credentials specified
Cloning the remote Git repository
Cloning repository https://github.com/llvm/llvm-project.git
 > git init /Users/buildslave/jenkins/workspace/LNT_Tests/llvm-project # timeout=10
Fetching upstream changes from https://github.com/llvm/llvm-project.git
 > git --version # timeout=10
 > git --version # 'git version 1.9.3 (Apple Git-50)'
 > git fetch --tags --progress https://github.com/llvm/llvm-project.git +refs/heads/*:refs/remotes/origin/* # timeout=10
 > git config remote.origin.url https://github.com/llvm/llvm-project.git # timeout=10
 > git config --add remote.origin.fetch +refs/heads/*:refs/remotes/origin/* # timeout=10
Avoid second fetch
 > git rev-parse refs/remotes/origin/main^{commit} # timeout=10
Checking out Revision a4931d4fe38d6feef53f97f3dcc7792bfcb06c84 (refs/remotes/origin/main)
 > git config core.sparsecheckout # timeout=10
 > git checkout -f a4931d4fe38d6feef53f97f3dcc7792bfcb06c84 # timeout=10
Commit message: "[AMDGPU] Regenerate umax crash test"
First time build. Skipping changelog.
No emails were triggered.
[LNT_Tests] $ /bin/sh -xe /var/folders/q0/p3jrdx7n2s74x5bnw_pkhqr80000gn/T/jenkins4693642404042078252.sh
+ set -u
+ rm -rf '*.xunit.xml'
+ echo '@@@ Configure Build @@@'
Configure Build

Hide Details

@@@ Configure Build @@@ + export PATH=/usr/local/bin/:/usr/bin:/bin:/usr/sbin:/sbin + PATH=/usr/local/bin/:/usr/bin:/bin:/usr/sbin:/sbin + export PYTHON_EGG_CACHE=/Users/buildslave/jenkins/workspace/LNT_Tests/python_egg_cache + PYTHON_EGG_CACHE=/Users/buildslave/jenkins/workspace/LNT_Tests/python_egg_cache + export PIP_DOWNLOAD_CACHE=/Users/buildslave/jenkins/workspace/LNT_Tests/pip_download_cache + PIP_DOWNLOAD_CACHE=/Users/buildslave/jenkins/workspace/LNT_Tests/pip_download_cache + export LANG=en_CA.UTF-8 + LANG=en_CA.UTF-8 + rm -rf venv + virtualenv venv New python executable in /Users/buildslave/jenkins/workspace/LNT_Tests/venv/bin/python2.7 Also creating executable in /Users/buildslave/jenkins/workspace/LNT_Tests/venv/bin/python Installing setuptools, pip, wheel...done. + set +u + source venv/bin/activate ++ deactivate nondestructive ++ unset -f pydoc ++ '[' -z '' ']' ++ '[' -z '' ']' ++ '[' -n /bin/sh ']' ++ hash -r ++ '[' -z '' ']' ++ unset VIRTUAL_ENV ++ '[' '!' nondestructive = nondestructive ']' ++ VIRTUAL_ENV=/Users/buildslave/jenkins/workspace/LNT_Tests/venv ++ export VIRTUAL_ENV ++ _OLD_VIRTUAL_PATH=/usr/local/bin/:/usr/bin:/bin:/usr/sbin:/sbin ++ PATH=/Users/buildslave/jenkins/workspace/LNT_Tests/venv/bin:/usr/local/bin/:/usr/bin:/bin:/usr/sbin:/sbin ++ export PATH ++ '[' -z '' ']' ++ '[' -z '' ']' ++ _OLD_VIRTUAL_PS1= ++ '[' x '!=' x ']' +++ basename /Users/buildslave/jenkins/workspace/LNT_Tests/venv ++ PS1='(venv) ' ++ export PS1 ++ alias pydoc ++ '[' -n /bin/sh ']' ++ hash -r + set -u + curl https://bootstrap.pypa.io/get-pip.py + python % Total % Received % Xferd Average Speed Time Time Time Current Dload Upload Total Spent Left Speed 0 0 0 0 0 0 0 0 --:--:-- --:--:-- --:--:-- 0 0 0 0 0 0 0 0 0 --:--:-- --:--:-- --:--:-- 0 100 1842k 100 1842k 0 0 2435k 0 --:--:-- --:--:-- --:--:-- 2434k DEPRECATION: Python 2.7 reached the end of its life on January 1st, 2020. Please upgrade your Python as Python 2.7 is no longer maintained. pip 21.0 will drop support for Python 2.7 in January 2021. More details about Python 2 support in pip can be found at https://pip.pypa.io/en/latest/development/release-process/#python-2-support pip 21.0 will remove support for this functionality. Collecting pip Using cached pip-20.3.3-py2.py3-none-any.whl (1.5 MB) Installing collected packages: pip Attempting uninstall: pip Found existing installation: pip 20.3.3 Uninstalling pip-20.3.3: Successfully uninstalled pip-20.3.3 Successfully installed pip-20.3.3 + echo @@@@@@ @@@@@@
+ echo '@@@ Dependencies @@@'
Dependencies

Hide Details

@@@ Dependencies @@@ + cd /Users/buildslave/jenkins/workspace/LNT_Tests/llvm-lnt + /Users/buildslave/jenkins/workspace/LNT_Tests/venv/bin/pip install -r requirements.txt DEPRECATION: Python 2.7 reached the end of its life on January 1st, 2020. Please upgrade your Python as Python 2.7 is no longer maintained. pip 21.0 will drop support for Python 2.7 in January 2021. More details about Python 2 support in pip can be found at https://pip.pypa.io/en/latest/development/release-process/#python-2-support pip 21.0 will remove support for this functionality. Processing /Users/buildslave/jenkins/workspace/LNT_Tests/llvm-lnt Processing /Users/buildslave/Library/Caches/pip/wheels/96/fc/09/f83664f88e8494365b4cb9296d2262ddf189185fb05cd1699a/psycopg2-2.8-cp27-cp27m-macosx_10_10_x86_64.whl Processing /Users/buildslave/Library/Caches/pip/wheels/61/12/6d/27e0d8c49a317c509c131d818b8fc94d1cbfbc61a479d5a396/gunicorn-18.0-cp27-none-any.whl Collecting progressbar2 Using cached progressbar2-3.53.1-py2.py3-none-any.whl (25 kB) Collecting six Using cached six-1.15.0-py2.py3-none-any.whl (10 kB) Processing /Users/buildslave/Library/Caches/pip/wheels/03/22/40/9b2f558eaa39d530e792583795d55365b67efb4299d0dbd5c7/aniso8601-1.2.0-cp27-none-any.whl Collecting Flask==0.12.2 Using cached Flask-0.12.2-py2.py3-none-any.whl (83 kB) Collecting Flask-RESTful==0.3.4 Using cached Flask_RESTful-0.3.4-py2.py3-none-any.whl (24 kB) Processing /Users/buildslave/Library/Caches/pip/wheels/59/a3/6b/51924066cac6ac011024f40b5575b7a4a0a146836644d8b4cf/Jinja2-2.7.2-cp27-none-any.whl Processing /Users/buildslave/Library/Caches/pip/wheels/28/de/65/f28b426d990edb591113e1549c8a0f09034e5958e440629306/MarkupSafe-0.23-cp27-cp27m-macosx_10_10_x86_64.whl Processing /Users/buildslave/Library/Caches/pip/wheels/c2/05/49/544f56621e6766ebeba43c42f7ea4405bcd37cff04c3e571a6/SQLAlchemy-1.1.11-cp27-cp27m-macosx_10_10_x86_64.whl Collecting Werkzeug==0.12.2 Using cached Werkzeug-0.12.2-py2.py3-none-any.whl (312 kB) Processing /Users/buildslave/Library/Caches/pip/wheels/2c/4a/61/5599631c1554768c6290b08c02c72d7317910374ca602ff1e5/itsdangerous-0.24-cp27-none-any.whl Collecting python-dateutil==2.6.0 Using cached python_dateutil-2.6.0-py2.py3-none-any.whl (194 kB) Processing /Users/buildslave/Library/Caches/pip/wheels/1f/cf/6a/f2821cc41923b0714765ae30fe699d7d7b5d233a208eedd1d6/python_gnupg-0.3.7-cp27-none-any.whl Collecting pytz==2016.10 Using cached pytz-2016.10-py2.py3-none-any.whl (483 kB) Collecting WTForms==2.0.2 Using cached WTForms-2.0.2-py27-none-any.whl (128 kB) Collecting Flask-WTF==0.12 Using cached Flask_WTF-0.12-py2-none-any.whl (12 kB) Collecting typing Using cached typing-3.7.4.3-py2-none-any.whl (26 kB) Collecting click==6.7 Using cached click-6.7-py2.py3-none-any.whl (71 kB) Processing /Users/buildslave/Library/Caches/pip/wheels/ad/da/0c/74eb680767247273e2cf2723482cb9c924fe70af57c334513f/PyYAML-3.13-cp27-cp27m-macosx_10_10_x86_64.whl Collecting requests Using cached requests-2.25.1-py2.py3-none-any.whl (61 kB) Processing /Users/buildslave/Library/Caches/pip/wheels/8b/99/a0/81daf51dcd359a9377b110a8a886b3895921802d2fc1b2397e/future-0.18.2-cp27-none-any.whl Processing /Users/buildslave/Library/Caches/pip/wheels/07/6e/c5/524a886e3bd496e3751755b08906f74422f9a2a75ce0c7a88c/lit-0.11.1-py2-none-any.whl Collecting python-utils>=2.3.0 Using cached python_utils-2.4.0-py2.py3-none-any.whl (12 kB) Collecting certifi>=2017.4.17 Using cached certifi-2020.12.5-py2.py3-none-any.whl (147 kB) Collecting chardet<5,>=3.0.2 Using cached chardet-4.0.0-py2.py3-none-any.whl (178 kB) Collecting urllib3<1.27,>=1.21.1 Using cached urllib3-1.26.2-py2.py3-none-any.whl (136 kB) Collecting idna<3,>=2.5 Using cached idna-2.10-py2.py3-none-any.whl (58 kB) Building wheels for collected packages: LNT Building wheel for LNT (setup.py): started Building wheel for LNT (setup.py): finished with status 'done' Created wheel for LNT: filename=LNT-0.4.2.dev0-cp27-cp27m-macosx_10_10_x86_64.whl size=631673 sha256=def95ce88e860b42a7139f64fa2f79060094e23bc35e6571cdf81f5e8c111038 Stored in directory: /Users/buildslave/Library/Caches/pip/wheels/37/ae/a6/6db4c0524d192c4f9bedd4e6dee3279d2a78c0a23fee4ad695 Successfully built LNT Installing collected packages: psycopg2, gunicorn, six, python-utils, progressbar2, python-dateutil, aniso8601, itsdangerous, click, MarkupSafe, Jinja2, Werkzeug, Flask, pytz, Flask-RESTful, SQLAlchemy, python-gnupg, WTForms, Flask-WTF, typing, pyyaml, certifi, chardet, urllib3, idna, requests, future, lit, LNT Successfully installed Flask-0.12.2 Flask-RESTful-0.3.4 Flask-WTF-0.12 Jinja2-2.7.2 LNT-0.4.2.dev0 MarkupSafe-0.23 SQLAlchemy-1.1.11 WTForms-2.0.2 Werkzeug-0.12.2 aniso8601-1.2.0 certifi-2020.12.5 chardet-4.0.0 click-6.7 future-0.18.2 gunicorn-18.0 idna-2.10 itsdangerous-0.24 lit-0.11.1 progressbar2-3.53.1 psycopg2-2.8 python-dateutil-2.6.0 python-gnupg-0.3.7 python-utils-2.4.0 pytz-2016.10 pyyaml-3.13 requests-2.25.1 six-1.15.0 typing-3.7.4.3 urllib3-1.26.2 + /Users/buildslave/jenkins/workspace/LNT_Tests/venv/bin/pip install pep8 sphinx sphinx-bootstrap-theme DEPRECATION: Python 2.7 reached the end of its life on January 1st, 2020. Please upgrade your Python as Python 2.7 is no longer maintained. pip 21.0 will drop support for Python 2.7 in January 2021. More details about Python 2 support in pip can be found at https://pip.pypa.io/en/latest/development/release-process/#python-2-support pip 21.0 will remove support for this functionality. Collecting pep8 Using cached pep8-1.7.1-py2.py3-none-any.whl (41 kB) Collecting sphinx Using cached Sphinx-1.8.5-py2.py3-none-any.whl (3.1 MB) Processing /Users/buildslave/Library/Caches/pip/wheels/71/28/10/e04d1ab1110dbde7f436dd159ed5ee35113f66536df6d99a79/sphinx_bootstrap_theme-0.7.1-cp27-none-any.whl Requirement already satisfied: requests>=2.0.0 in /Users/buildslave/jenkins/workspace/LNT_Tests/venv/lib/python2.7/site-packages (from sphinx) (2.25.1) Collecting babel!=2.0,>=1.3 Downloading Babel-2.9.0-py2.py3-none-any.whl (8.8 MB) Collecting alabaster<0.8,>=0.7 Using cached alabaster-0.7.12-py2.py3-none-any.whl (14 kB) Requirement already satisfied: Jinja2>=2.3 in /Users/buildslave/jenkins/workspace/LNT_Tests/venv/lib/python2.7/site-packages (from sphinx) (2.7.2) Collecting snowballstemmer>=1.1 Using cached snowballstemmer-2.0.0-py2.py3-none-any.whl (97 kB) Collecting imagesize Using cached imagesize-1.2.0-py2.py3-none-any.whl (4.8 kB) Collecting Pygments>=2.0 Using cached Pygments-2.5.2-py2.py3-none-any.whl (896 kB) Collecting docutils>=0.11 Using cached docutils-0.16-py2.py3-none-any.whl (548 kB) Requirement already satisfied: six>=1.5 in /Users/buildslave/jenkins/workspace/LNT_Tests/venv/lib/python2.7/site-packages (from sphinx) (1.15.0) Collecting packaging Downloading packaging-20.8-py2.py3-none-any.whl (39 kB) Requirement already satisfied: typing; python_version < "3.5" in /Users/buildslave/jenkins/workspace/LNT_Tests/venv/lib/python2.7/site-packages (from sphinx) (3.7.4.3) Collecting sphinxcontrib-websupport Using cached sphinxcontrib_websupport-1.1.2-py2.py3-none-any.whl (39 kB) Requirement already satisfied: setuptools in /Users/buildslave/jenkins/workspace/LNT_Tests/venv/lib/python2.7/site-packages (from sphinx) (44.1.1) Requirement already satisfied: chardet<5,>=3.0.2 in /Users/buildslave/jenkins/workspace/LNT_Tests/venv/lib/python2.7/site-packages (from requests>=2.0.0->sphinx) (4.0.0) Requirement already satisfied: certifi>=2017.4.17 in /Users/buildslave/jenkins/workspace/LNT_Tests/venv/lib/python2.7/site-packages (from requests>=2.0.0->sphinx) (2020.12.5) Requirement already satisfied: urllib3<1.27,>=1.21.1 in /Users/buildslave/jenkins/workspace/LNT_Tests/venv/lib/python2.7/site-packages (from requests>=2.0.0->sphinx) (1.26.2) Requirement already satisfied: idna<3,>=2.5 in /Users/buildslave/jenkins/workspace/LNT_Tests/venv/lib/python2.7/site-packages (from requests>=2.0.0->sphinx) (2.10) Requirement already satisfied: pytz>=2015.7 in /Users/buildslave/jenkins/workspace/LNT_Tests/venv/lib/python2.7/site-packages (from babel!=2.0,>=1.3->sphinx) (2016.10) Requirement already satisfied: markupsafe in /Users/buildslave/jenkins/workspace/LNT_Tests/venv/lib/python2.7/site-packages (from Jinja2>=2.3->sphinx) (0.23) Collecting pyparsing>=2.0.2 Using cached pyparsing-2.4.7-py2.py3-none-any.whl (67 kB) Installing collected packages: pep8, babel, alabaster, snowballstemmer, imagesize, Pygments, docutils, pyparsing, packaging, sphinxcontrib-websupport, sphinx, sphinx-bootstrap-theme Successfully installed Pygments-2.5.2 alabaster-0.7.12 babel-2.9.0 docutils-0.16 imagesize-1.2.0 packaging-20.8 pep8-1.7.1 pyparsing-2.4.7 snowballstemmer-2.0.0 sphinx-1.8.5 sphinx-bootstrap-theme-0.7.1 sphinxcontrib-websupport-1.1.2 + /Users/buildslave/jenkins/workspace/LNT_Tests/venv/bin/pip install mysql-python DEPRECATION: Python 2.7 reached the end of its life on January 1st, 2020. Please upgrade your Python as Python 2.7 is no longer maintained. pip 21.0 will drop support for Python 2.7 in January 2021. More details about Python 2 support in pip can be found at https://pip.pypa.io/en/latest/development/release-process/#python-2-support pip 21.0 will remove support for this functionality. Processing /Users/buildslave/Library/Caches/pip/wheels/07/d2/5f/314860e4cb53a44bf0ee0d051d4b34465e4b4fbe9de6d42f42/MySQL_python-1.2.5-cp27-cp27m-macosx_10_10_x86_64.whl Installing collected packages: mysql-python Successfully installed mysql-python-1.2.5 + killall mysqld No matching processes belonging to you were found + true + /Users/buildslave/jenkins/workspace/LNT_Tests/venv/bin/python setup.py develop running develop running egg_info creating LNT.egg-info writing requirements to LNT.egg-info/requires.txt writing LNT.egg-info/PKG-INFO writing top-level names to LNT.egg-info/top_level.txt writing dependency_links to LNT.egg-info/dependency_links.txt writing entry points to LNT.egg-info/entry_points.txt writing manifest file 'LNT.egg-info/SOURCES.txt' reading manifest file 'LNT.egg-info/SOURCES.txt' reading manifest template 'MANIFEST.in' no previously-included directories found matching 'docs/_build' no previously-included directories found matching 'tests/*/Output' no previously-included directories found matching 'tests/*/*/Output' writing manifest file 'LNT.egg-info/SOURCES.txt' running build_ext building 'lnt.testing.profile.cPerf' extension creating build creating build/temp.macosx-10.10-x86_64-2.7 creating build/temp.macosx-10.10-x86_64-2.7/lnt creating build/temp.macosx-10.10-x86_64-2.7/lnt/testing creating build/temp.macosx-10.10-x86_64-2.7/lnt/testing/profile xcrun --sdk macosx clang -fno-strict-aliasing -fno-common -dynamic -g -O2 -DNDEBUG -g -fwrapv -O3 -Wall -Wstrict-prototypes -I/usr/local/Cellar/python@2/2.7.14_3/Frameworks/Python.framework/Versions/2.7/include/python2.7 -c lnt/testing/profile/cPerf.cpp -o build/temp.macosx-10.10-x86_64-2.7/lnt/testing/profile/cPerf.o -std=c++11 -stdlib=libc++ -mmacosx-version-min=10.7 creating build/lib.macosx-10.10-x86_64-2.7 creating build/lib.macosx-10.10-x86_64-2.7/lnt creating build/lib.macosx-10.10-x86_64-2.7/lnt/testing creating build/lib.macosx-10.10-x86_64-2.7/lnt/testing/profile xcrun --sdk macosx clang -bundle -undefined dynamic_lookup build/temp.macosx-10.10-x86_64-2.7/lnt/testing/profile/cPerf.o -o build/lib.macosx-10.10-x86_64-2.7/lnt/testing/profile/cPerf.so copying build/lib.macosx-10.10-x86_64-2.7/lnt/testing/profile/cPerf.so -> lnt/testing/profile Creating /Users/buildslave/jenkins/workspace/LNT_Tests/venv/lib/python2.7/site-packages/LNT.egg-link (link to .) Adding LNT 0.4.2.dev0 to easy-install.pth file Installing lnt script to /Users/buildslave/jenkins/workspace/LNT_Tests/venv/bin

Hide Details

Installed /Users/buildslave/jenkins/workspace/LNT_Tests/llvm-lnt Processing dependencies for LNT==0.4.2.dev0 Searching for lit==0.11.1 Best match: lit 0.11.1 Adding lit 0.11.1 to easy-install.pth file Installing lit script to /Users/buildslave/jenkins/workspace/LNT_Tests/venv/bin

Hide Details

Using /Users/buildslave/jenkins/workspace/LNT_Tests/venv/lib/python2.7/site-packages Searching for future==0.18.2 Best match: future 0.18.2 Adding future 0.18.2 to easy-install.pth file Installing pasteurize script to /Users/buildslave/jenkins/workspace/LNT_Tests/venv/bin Installing futurize script to /Users/buildslave/jenkins/workspace/LNT_Tests/venv/bin

Hide Details

Using /Users/buildslave/jenkins/workspace/LNT_Tests/venv/lib/python2.7/site-packages Searching for requests==2.25.1 Best match: requests 2.25.1 Adding requests 2.25.1 to easy-install.pth file

Hide Details

Using /Users/buildslave/jenkins/workspace/LNT_Tests/venv/lib/python2.7/site-packages Searching for PyYAML==3.13 Best match: PyYAML 3.13 Adding PyYAML 3.13 to easy-install.pth file

Hide Details

Using /Users/buildslave/jenkins/workspace/LNT_Tests/venv/lib/python2.7/site-packages Searching for click==6.7 Best match: click 6.7 Adding click 6.7 to easy-install.pth file

Hide Details

Using /Users/buildslave/jenkins/workspace/LNT_Tests/venv/lib/python2.7/site-packages Searching for typing==3.7.4.3 Best match: typing 3.7.4.3 Adding typing 3.7.4.3 to easy-install.pth file

Hide Details

Using /Users/buildslave/jenkins/workspace/LNT_Tests/venv/lib/python2.7/site-packages Searching for Flask-WTF==0.12 Best match: Flask-WTF 0.12 Adding Flask-WTF 0.12 to easy-install.pth file

Hide Details

Using /Users/buildslave/jenkins/workspace/LNT_Tests/venv/lib/python2.7/site-packages Searching for WTForms==2.0.2 Best match: WTForms 2.0.2 Adding WTForms 2.0.2 to easy-install.pth file

Hide Details

Using /Users/buildslave/jenkins/workspace/LNT_Tests/venv/lib/python2.7/site-packages Searching for pytz==2016.10 Best match: pytz 2016.10 Adding pytz 2016.10 to easy-install.pth file

Hide Details

Using /Users/buildslave/jenkins/workspace/LNT_Tests/venv/lib/python2.7/site-packages Searching for python-gnupg==0.3.7 Best match: python-gnupg 0.3.7 Adding python-gnupg 0.3.7 to easy-install.pth file

Hide Details

Using /Users/buildslave/jenkins/workspace/LNT_Tests/venv/lib/python2.7/site-packages Searching for python-dateutil==2.6.0 Best match: python-dateutil 2.6.0 Adding python-dateutil 2.6.0 to easy-install.pth file

Hide Details

Using /Users/buildslave/jenkins/workspace/LNT_Tests/venv/lib/python2.7/site-packages Searching for itsdangerous==0.24 Best match: itsdangerous 0.24 Adding itsdangerous 0.24 to easy-install.pth file

Hide Details

Using /Users/buildslave/jenkins/workspace/LNT_Tests/venv/lib/python2.7/site-packages Searching for Werkzeug==0.12.2 Best match: Werkzeug 0.12.2 Adding Werkzeug 0.12.2 to easy-install.pth file

Hide Details

Using /Users/buildslave/jenkins/workspace/LNT_Tests/venv/lib/python2.7/site-packages Searching for SQLAlchemy==1.1.11 Best match: SQLAlchemy 1.1.11 Adding SQLAlchemy 1.1.11 to easy-install.pth file

Hide Details

Using /Users/buildslave/jenkins/workspace/LNT_Tests/venv/lib/python2.7/site-packages Searching for MarkupSafe==0.23 Best match: MarkupSafe 0.23 Adding MarkupSafe 0.23 to easy-install.pth file

Hide Details

Using /Users/buildslave/jenkins/workspace/LNT_Tests/venv/lib/python2.7/site-packages Searching for Jinja2==2.7.2 Best match: Jinja2 2.7.2 Adding Jinja2 2.7.2 to easy-install.pth file

Hide Details

Using /Users/buildslave/jenkins/workspace/LNT_Tests/venv/lib/python2.7/site-packages Searching for Flask-RESTful==0.3.4 Best match: Flask-RESTful 0.3.4 Adding Flask-RESTful 0.3.4 to easy-install.pth file

Hide Details

Using /Users/buildslave/jenkins/workspace/LNT_Tests/venv/lib/python2.7/site-packages Searching for Flask==0.12.2 Best match: Flask 0.12.2 Adding Flask 0.12.2 to easy-install.pth file Installing flask script to /Users/buildslave/jenkins/workspace/LNT_Tests/venv/bin

Hide Details

Using /Users/buildslave/jenkins/workspace/LNT_Tests/venv/lib/python2.7/site-packages Searching for aniso8601==1.2.0 Best match: aniso8601 1.2.0 Adding aniso8601 1.2.0 to easy-install.pth file

Hide Details

Using /Users/buildslave/jenkins/workspace/LNT_Tests/venv/lib/python2.7/site-packages Searching for six==1.15.0 Best match: six 1.15.0 Adding six 1.15.0 to easy-install.pth file

Hide Details

Using /Users/buildslave/jenkins/workspace/LNT_Tests/venv/lib/python2.7/site-packages Searching for idna==2.10 Best match: idna 2.10 Adding idna 2.10 to easy-install.pth file

Hide Details

Using /Users/buildslave/jenkins/workspace/LNT_Tests/venv/lib/python2.7/site-packages Searching for urllib3==1.26.2 Best match: urllib3 1.26.2 Adding urllib3 1.26.2 to easy-install.pth file

Hide Details

Using /Users/buildslave/jenkins/workspace/LNT_Tests/venv/lib/python2.7/site-packages Searching for chardet==4.0.0 Best match: chardet 4.0.0 Adding chardet 4.0.0 to easy-install.pth file Installing chardetect script to /Users/buildslave/jenkins/workspace/LNT_Tests/venv/bin

Hide Details

Using /Users/buildslave/jenkins/workspace/LNT_Tests/venv/lib/python2.7/site-packages Searching for certifi==2020.12.5 Best match: certifi 2020.12.5 Adding certifi 2020.12.5 to easy-install.pth file

Hide Details

Using /Users/buildslave/jenkins/workspace/LNT_Tests/venv/lib/python2.7/site-packages Finished processing dependencies for LNT==0.4.2.dev0 + cd .. + cd /Users/buildslave/jenkins/workspace/LNT_Tests/llvm-project/llvm/utils/lit + /Users/buildslave/jenkins/workspace/LNT_Tests/venv/bin/python setup.py install /Users/buildslave/jenkins/workspace/LNT_Tests/venv/lib/python2.7/site-packages/setuptools/dist.py:476: UserWarning: Normalizing '0.12.0dev' to '0.12.0.dev0' normalized_version, running install running bdist_egg running egg_info creating lit.egg-info writing lit.egg-info/PKG-INFO writing top-level names to lit.egg-info/top_level.txt writing dependency_links to lit.egg-info/dependency_links.txt writing entry points to lit.egg-info/entry_points.txt writing manifest file 'lit.egg-info/SOURCES.txt' reading manifest file 'lit.egg-info/SOURCES.txt' reading manifest template 'MANIFEST.in' warning: no files found matching 'TODO' warning: no previously-included files matching '*pyc' found anywhere in distribution warning: no previously-included files matching '*~' found anywhere in distribution no previously-included directories found matching 'tests/Output' no previously-included directories found matching 'tests/*/Output' no previously-included directories found matching 'tests/*/*/Output' no previously-included directories found matching 'tests/*/*/*/Output' writing manifest file 'lit.egg-info/SOURCES.txt' installing library code to build/bdist.macosx-10.10-x86_64/egg running install_lib running build_py creating build creating build/lib creating build/lib/lit copying lit/__init__.py -> build/lib/lit copying lit/BooleanExpression.py -> build/lib/lit copying lit/cl_arguments.py -> build/lib/lit copying lit/discovery.py -> build/lib/lit copying lit/display.py -> build/lib/lit copying lit/LitConfig.py -> build/lib/lit copying lit/LitTestCase.py -> build/lib/lit copying lit/main.py -> build/lib/lit copying lit/ProgressBar.py -> build/lib/lit copying lit/reports.py -> build/lib/lit copying lit/run.py -> build/lib/lit copying lit/ShCommands.py -> build/lib/lit copying lit/ShUtil.py -> build/lib/lit copying lit/Test.py -> build/lib/lit copying lit/TestingConfig.py -> build/lib/lit copying lit/TestRunner.py -> build/lib/lit copying lit/util.py -> build/lib/lit copying lit/worker.py -> build/lib/lit creating build/lib/lit/builtin_commands copying lit/builtin_commands/__init__.py -> build/lib/lit/builtin_commands copying lit/builtin_commands/cat.py -> build/lib/lit/builtin_commands copying lit/builtin_commands/diff.py -> build/lib/lit/builtin_commands creating build/lib/lit/formats copying lit/formats/__init__.py -> build/lib/lit/formats copying lit/formats/base.py -> build/lib/lit/formats copying lit/formats/googletest.py -> build/lib/lit/formats copying lit/formats/shtest.py -> build/lib/lit/formats creating build/lib/lit/llvm copying lit/llvm/__init__.py -> build/lib/lit/llvm copying lit/llvm/config.py -> build/lib/lit/llvm copying lit/llvm/subst.py -> build/lib/lit/llvm creating build/bdist.macosx-10.10-x86_64 creating build/bdist.macosx-10.10-x86_64/egg creating build/bdist.macosx-10.10-x86_64/egg/lit copying build/lib/lit/__init__.py -> build/bdist.macosx-10.10-x86_64/egg/lit copying build/lib/lit/BooleanExpression.py -> build/bdist.macosx-10.10-x86_64/egg/lit creating build/bdist.macosx-10.10-x86_64/egg/lit/builtin_commands copying build/lib/lit/builtin_commands/__init__.py -> build/bdist.macosx-10.10-x86_64/egg/lit/builtin_commands copying build/lib/lit/builtin_commands/cat.py -> build/bdist.macosx-10.10-x86_64/egg/lit/builtin_commands copying build/lib/lit/builtin_commands/diff.py -> build/bdist.macosx-10.10-x86_64/egg/lit/builtin_commands copying build/lib/lit/cl_arguments.py -> build/bdist.macosx-10.10-x86_64/egg/lit copying build/lib/lit/discovery.py -> build/bdist.macosx-10.10-x86_64/egg/lit copying build/lib/lit/display.py -> build/bdist.macosx-10.10-x86_64/egg/lit creating build/bdist.macosx-10.10-x86_64/egg/lit/formats copying build/lib/lit/formats/__init__.py -> build/bdist.macosx-10.10-x86_64/egg/lit/formats copying build/lib/lit/formats/base.py -> build/bdist.macosx-10.10-x86_64/egg/lit/formats copying build/lib/lit/formats/googletest.py -> build/bdist.macosx-10.10-x86_64/egg/lit/formats copying build/lib/lit/formats/shtest.py -> build/bdist.macosx-10.10-x86_64/egg/lit/formats copying build/lib/lit/LitConfig.py -> build/bdist.macosx-10.10-x86_64/egg/lit copying build/lib/lit/LitTestCase.py -> build/bdist.macosx-10.10-x86_64/egg/lit creating build/bdist.macosx-10.10-x86_64/egg/lit/llvm copying build/lib/lit/llvm/__init__.py -> build/bdist.macosx-10.10-x86_64/egg/lit/llvm copying build/lib/lit/llvm/config.py -> build/bdist.macosx-10.10-x86_64/egg/lit/llvm copying build/lib/lit/llvm/subst.py -> build/bdist.macosx-10.10-x86_64/egg/lit/llvm copying build/lib/lit/main.py -> build/bdist.macosx-10.10-x86_64/egg/lit copying build/lib/lit/ProgressBar.py -> build/bdist.macosx-10.10-x86_64/egg/lit copying build/lib/lit/reports.py -> build/bdist.macosx-10.10-x86_64/egg/lit copying build/lib/lit/run.py -> build/bdist.macosx-10.10-x86_64/egg/lit copying build/lib/lit/ShCommands.py -> build/bdist.macosx-10.10-x86_64/egg/lit copying build/lib/lit/ShUtil.py -> build/bdist.macosx-10.10-x86_64/egg/lit copying build/lib/lit/Test.py -> build/bdist.macosx-10.10-x86_64/egg/lit copying build/lib/lit/TestingConfig.py -> build/bdist.macosx-10.10-x86_64/egg/lit copying build/lib/lit/TestRunner.py -> build/bdist.macosx-10.10-x86_64/egg/lit copying build/lib/lit/util.py -> build/bdist.macosx-10.10-x86_64/egg/lit copying build/lib/lit/worker.py -> build/bdist.macosx-10.10-x86_64/egg/lit byte-compiling build/bdist.macosx-10.10-x86_64/egg/lit/__init__.py to __init__.pyc byte-compiling build/bdist.macosx-10.10-x86_64/egg/lit/BooleanExpression.py to BooleanExpression.pyc byte-compiling build/bdist.macosx-10.10-x86_64/egg/lit/builtin_commands/__init__.py to __init__.pyc byte-compiling build/bdist.macosx-10.10-x86_64/egg/lit/builtin_commands/cat.py to cat.pyc byte-compiling build/bdist.macosx-10.10-x86_64/egg/lit/builtin_commands/diff.py to diff.pyc byte-compiling build/bdist.macosx-10.10-x86_64/egg/lit/cl_arguments.py to cl_arguments.pyc byte-compiling build/bdist.macosx-10.10-x86_64/egg/lit/discovery.py to discovery.pyc byte-compiling build/bdist.macosx-10.10-x86_64/egg/lit/display.py to display.pyc byte-compiling build/bdist.macosx-10.10-x86_64/egg/lit/formats/__init__.py to __init__.pyc byte-compiling build/bdist.macosx-10.10-x86_64/egg/lit/formats/base.py to base.pyc byte-compiling build/bdist.macosx-10.10-x86_64/egg/lit/formats/googletest.py to googletest.pyc byte-compiling build/bdist.macosx-10.10-x86_64/egg/lit/formats/shtest.py to shtest.pyc byte-compiling build/bdist.macosx-10.10-x86_64/egg/lit/LitConfig.py to LitConfig.pyc byte-compiling build/bdist.macosx-10.10-x86_64/egg/lit/LitTestCase.py to LitTestCase.pyc byte-compiling build/bdist.macosx-10.10-x86_64/egg/lit/llvm/__init__.py to __init__.pyc byte-compiling build/bdist.macosx-10.10-x86_64/egg/lit/llvm/config.py to config.pyc byte-compiling build/bdist.macosx-10.10-x86_64/egg/lit/llvm/subst.py to subst.pyc byte-compiling build/bdist.macosx-10.10-x86_64/egg/lit/main.py to main.pyc byte-compiling build/bdist.macosx-10.10-x86_64/egg/lit/ProgressBar.py to ProgressBar.pyc byte-compiling build/bdist.macosx-10.10-x86_64/egg/lit/reports.py to reports.pyc byte-compiling build/bdist.macosx-10.10-x86_64/egg/lit/run.py to run.pyc byte-compiling build/bdist.macosx-10.10-x86_64/egg/lit/ShCommands.py to ShCommands.pyc byte-compiling build/bdist.macosx-10.10-x86_64/egg/lit/ShUtil.py to ShUtil.pyc byte-compiling build/bdist.macosx-10.10-x86_64/egg/lit/Test.py to Test.pyc byte-compiling build/bdist.macosx-10.10-x86_64/egg/lit/TestingConfig.py to TestingConfig.pyc byte-compiling build/bdist.macosx-10.10-x86_64/egg/lit/TestRunner.py to TestRunner.pyc byte-compiling build/bdist.macosx-10.10-x86_64/egg/lit/util.py to util.pyc byte-compiling build/bdist.macosx-10.10-x86_64/egg/lit/worker.py to worker.pyc creating build/bdist.macosx-10.10-x86_64/egg/EGG-INFO copying lit.egg-info/PKG-INFO -> build/bdist.macosx-10.10-x86_64/egg/EGG-INFO copying lit.egg-info/SOURCES.txt -> build/bdist.macosx-10.10-x86_64/egg/EGG-INFO copying lit.egg-info/dependency_links.txt -> build/bdist.macosx-10.10-x86_64/egg/EGG-INFO copying lit.egg-info/entry_points.txt -> build/bdist.macosx-10.10-x86_64/egg/EGG-INFO copying lit.egg-info/not-zip-safe -> build/bdist.macosx-10.10-x86_64/egg/EGG-INFO copying lit.egg-info/top_level.txt -> build/bdist.macosx-10.10-x86_64/egg/EGG-INFO creating dist creating 'dist/lit-0.12.0.dev0-py2.7.egg' and adding 'build/bdist.macosx-10.10-x86_64/egg' to it removing 'build/bdist.macosx-10.10-x86_64/egg' (and everything under it) Processing lit-0.12.0.dev0-py2.7.egg creating /Users/buildslave/jenkins/workspace/LNT_Tests/venv/lib/python2.7/site-packages/lit-0.12.0.dev0-py2.7.egg Extracting lit-0.12.0.dev0-py2.7.egg to /Users/buildslave/jenkins/workspace/LNT_Tests/venv/lib/python2.7/site-packages Adding lit 0.12.0.dev0 to easy-install.pth file Installing lit script to /Users/buildslave/jenkins/workspace/LNT_Tests/venv/bin

Hide Details

Installed /Users/buildslave/jenkins/workspace/LNT_Tests/venv/lib/python2.7/site-packages/lit-0.12.0.dev0-py2.7.egg Processing dependencies for lit==0.12.0.dev0 Finished processing dependencies for lit==0.12.0.dev0 + cd .. + cd /Users/buildslave/jenkins/workspace/LNT_Tests/llvm-lnt/tests/ + echo @@@@@@ @@@@@@ + echo '@@@ Test LNT @@@'
Test LNT

Hide Details

@@@ Test LNT @@@ + rm -rf test_run_tmp + /Users/buildslave/jenkins/workspace/LNT_Tests/venv/bin/lit -j1 --xunit-xml-output=/Users/buildslave/jenkins/workspace/LNT_Tests/lnt.xunit.xml -v --param postgres=True --param mysql=True . -- Testing: 72 tests, 1 workers -- PASS: LNT :: Formats/json.py (1 of 72) PASS: LNT :: Formats/plist.py (2 of 72) PASS: LNT :: lnttool/MySQLDB.shtest (3 of 72) PASS: LNT :: lnttool/PostgresDB.shtest (4 of 72) PASS: LNT :: lnttool/Profile.py (5 of 72) PASS: LNT :: lnttool/UpdateDB.py (6 of 72) PASS: LNT :: lnttool/admin.shtest (7 of 72) PASS: LNT :: lnttool/check_no_errors.shtest (8 of 72) PASS: LNT :: lnttool/checkformat.shtest (9 of 72) PASS: LNT :: lnttool/email_tools.py (10 of 72) PASS: LNT :: lnttool/showtests.shtest (11 of 72) PASS: LNT :: lnttool/submit.shtest (12 of 72) PASS: LNT :: lnttool/submit_badurl.shtest (13 of 72) PASS: LNT :: lnttool/test_importreport.py (14 of 72) PASS: LNT :: lnttool/view-comparison.shtest (15 of 72) PASS: LNT :: runtest/exclude_stat.py (16 of 72) PASS: LNT :: runtest/multisample.py (17 of 72) PASS: LNT :: runtest/nt-darwin.py (18 of 72) PASS: LNT :: runtest/nt.py (19 of 72) PASS: LNT :: runtest/only_test.py (20 of 72) PASS: LNT :: runtest/rerun.py (21 of 72) PASS: LNT :: runtest/test_suite-benchmarking-only.shtest (22 of 72) PASS: LNT :: runtest/test_suite-c-compiler.shtest (23 of 72) PASS: LNT :: runtest/test_suite-cache.shtest (24 of 72) PASS: LNT :: runtest/test_suite-cc.shtest (25 of 72) PASS: LNT :: runtest/test_suite-cflags0.shtest (26 of 72) PASS: LNT :: runtest/test_suite-cflags1.shtest (27 of 72) PASS: LNT :: runtest/test_suite-cflags2.shtest (28 of 72) PASS: LNT :: runtest/test_suite-cflags3.shtest (29 of 72) PASS: LNT :: runtest/test_suite-cflags4.shtest (30 of 72) PASS: LNT :: runtest/test_suite-compile-only.shtest (31 of 72) PASS: LNT :: runtest/test_suite-cross.shtest (32 of 72) PASS: LNT :: runtest/test_suite-fail-compile.shtest (33 of 72) PASS: LNT :: runtest/test_suite-fail-exec.shtest (34 of 72) PASS: LNT :: runtest/test_suite-machine-name.shtest (35 of 72) PASS: LNT :: runtest/test_suite-metrics.shtest (36 of 72) PASS: LNT :: runtest/test_suite-only-test.shtest (37 of 72) PASS: LNT :: runtest/test_suite-perf-events.shtest (38 of 72) PASS: LNT :: runtest/test_suite-pgo.shtest (39 of 72) PASS: LNT :: runtest/test_suite-profile.shtest (40 of 72) PASS: LNT :: runtest/test_suite-run-order.shtest (41 of 72) PASS: LNT :: runtest/test_suite-run-under.shtest (42 of 72) PASS: LNT :: runtest/test_suite-use-perf.shtest (43 of 72) PASS: LNT :: runtest/test_suite.shtest (44 of 72) PASS: LNT :: runtest/test_suite_diagnose.shtest (45 of 72) PASS: LNT :: server/db/CreateV4TestSuite.py (46 of 72) PASS: LNT :: server/db/CreateV4TestSuiteInstance.py (47 of 72) PASS: LNT :: server/db/ImportProfile.py (48 of 72) PASS: LNT :: server/db/ImportV4TestSuiteInstance.py (49 of 72) PASS: LNT :: server/db/Migrations.py (50 of 72) PASS: LNT :: server/db/rules.py (51 of 72) PASS: LNT :: server/db/search.py (52 of 72) PASS: LNT :: server/db/yamlschema.shtest (53 of 72) PASS: LNT :: server/reporting/analysis.py (54 of 72) FAIL: LNT :: server/ui/V4Pages.py (55 of 72) ******************** TEST 'LNT :: server/ui/V4Pages.py' FAILED ******************** Script: -- : 'RUN: at line 7'; rm -rf /Users/buildslave/jenkins/workspace/LNT_Tests/llvm-lnt/tests/test_run_tmp/server/ui/Output/V4Pages.py.tmp.instance : 'RUN: at line 8'; python /Users/buildslave/jenkins/workspace/LNT_Tests/llvm-lnt/tests/../tests/SharedInputs/create_temp_instance.py /Users/buildslave/jenkins/workspace/LNT_Tests/llvm-lnt/tests/server/ui/V4Pages.py /Users/buildslave/jenkins/workspace/LNT_Tests/llvm-lnt/tests/../tests/SharedInputs/SmallInstance /Users/buildslave/jenkins/workspace/LNT_Tests/llvm-lnt/tests/test_run_tmp/server/ui/Output/V4Pages.py.tmp.instance /Users/buildslave/jenkins/workspace/LNT_Tests/llvm-lnt/tests/server/ui/Inputs/V4Pages_extra_records.sql : 'RUN: at line 13'; lnt import /Users/buildslave/jenkins/workspace/LNT_Tests/llvm-lnt/tests/test_run_tmp/server/ui/Output/V4Pages.py.tmp.instance /Users/buildslave/jenkins/workspace/LNT_Tests/llvm-lnt/tests/../tests/SharedInputs/profile-report.json : 'RUN: at line 18'; lnt import /Users/buildslave/jenkins/workspace/LNT_Tests/llvm-lnt/tests/test_run_tmp/server/ui/Output/V4Pages.py.tmp.instance /Users/buildslave/jenkins/workspace/LNT_Tests/llvm-lnt/tests/server/ui/Inputs/last-run-report.json : 'RUN: at line 20'; lnt import /Users/buildslave/jenkins/workspace/LNT_Tests/llvm-lnt/tests/test_run_tmp/server/ui/Output/V4Pages.py.tmp.instance /Users/buildslave/jenkins/workspace/LNT_Tests/llvm-lnt/tests/server/ui/Inputs/sample-failed-report1.json : 'RUN: at line 21'; lnt import /Users/buildslave/jenkins/workspace/LNT_Tests/llvm-lnt/tests/test_run_tmp/server/ui/Output/V4Pages.py.tmp.instance /Users/buildslave/jenkins/workspace/LNT_Tests/llvm-lnt/tests/server/ui/Inputs/sample-failed-report2.json : 'RUN: at line 23'; python /Users/buildslave/jenkins/workspace/LNT_Tests/llvm-lnt/tests/server/ui/V4Pages.py /Users/buildslave/jenkins/workspace/LNT_Tests/llvm-lnt/tests/test_run_tmp/server/ui/Output/V4Pages.py.tmp.instance -- Exit Code: 1

Hide Details

Command Output (stdout): -- $ ":" "RUN: at line 7" $ "rm" "-rf" "/Users/buildslave/jenkins/workspace/LNT_Tests/llvm-lnt/tests/test_run_tmp/server/ui/Output/V4Pages.py.tmp.instance" $ ":" "RUN: at line 8" $ "python" "/Users/buildslave/jenkins/workspace/LNT_Tests/llvm-lnt/tests/../tests/SharedInputs/create_temp_instance.py" "/Users/buildslave/jenkins/workspace/LNT_Tests/llvm-lnt/tests/server/ui/V4Pages.py" "/Users/buildslave/jenkins/workspace/LNT_Tests/llvm-lnt/tests/../tests/SharedInputs/SmallInstance" "/Users/buildslave/jenkins/workspace/LNT_Tests/llvm-lnt/tests/test_run_tmp/server/ui/Output/V4Pages.py.tmp.instance" "/Users/buildslave/jenkins/workspace/LNT_Tests/llvm-lnt/tests/server/ui/Inputs/V4Pages_extra_records.sql" # command output: sqlite3 -batch /Users/buildslave/jenkins/workspace/LNT_Tests/llvm-lnt/tests/test_run_tmp/server/ui/Output/V4Pages.py.tmp.instance/data/lnt.db < /Users/buildslave/jenkins/workspace/LNT_Tests/llvm-lnt/tests/../tests/SharedInputs/SmallInstance/data/lnt_db_create.sql sqlite3 -batch /Users/buildslave/jenkins/workspace/LNT_Tests/llvm-lnt/tests/test_run_tmp/server/ui/Output/V4Pages.py.tmp.instance/data/lnt.db < /Users/buildslave/jenkins/workspace/LNT_Tests/llvm-lnt/tests/server/ui/Inputs/V4Pages_extra_records.sql

Hide Details

$ ":" "RUN: at line 13" $ "lnt" "import" "/Users/buildslave/jenkins/workspace/LNT_Tests/llvm-lnt/tests/test_run_tmp/server/ui/Output/V4Pages.py.tmp.instance" "/Users/buildslave/jenkins/workspace/LNT_Tests/llvm-lnt/tests/../tests/SharedInputs/profile-report.json" # command output: Importing 'profile-report.json' Import succeeded.

Hide Details

--- Tested: 5 tests -- Processing Times ---------------- Load : 0.00s Import : 0.07s Report : 0.27s Total : 0.27s

Hide Details

Imported Data ------------- Added Machines: 1 Added Runs : 1 Added Tests : 1

Hide Details

Results ---------------- PASS : 5

Hide Details

# command stderr: 2021-01-12 10:24:50 WARNING: Found unknown metric 'profile'

Hide Details

$ ":" "RUN: at line 18" $ "lnt" "import" "/Users/buildslave/jenkins/workspace/LNT_Tests/llvm-lnt/tests/test_run_tmp/server/ui/Output/V4Pages.py.tmp.instance" "/Users/buildslave/jenkins/workspace/LNT_Tests/llvm-lnt/tests/server/ui/Inputs/last-run-report.json" # command output: Importing 'last-run-report.json' Import succeeded.

Hide Details

--- Tested: 15 tests -- Processing Times ---------------- Load : 0.00s Import : 0.02s Report : 0.20s Total : 0.20s

Hide Details

Imported Data ------------- Added Runs : 1 Added Tests : 2

Hide Details

Results ---------------- PASS : 15

Hide Details

$ ":" "RUN: at line 20" $ "lnt" "import" "/Users/buildslave/jenkins/workspace/LNT_Tests/llvm-lnt/tests/test_run_tmp/server/ui/Output/V4Pages.py.tmp.instance" "/Users/buildslave/jenkins/workspace/LNT_Tests/llvm-lnt/tests/server/ui/Inputs/sample-failed-report1.json" # command output: Importing 'sample-failed-report1.json' Import succeeded.

Hide Details

--- Tested: 5 tests -- FAIL: FailingTest.execution_time (2 of 5) Processing Times ---------------- Load : 0.00s Import : 0.02s Report : 0.21s Total : 0.21s

Hide Details

Imported Data ------------- Added Machines: 1 Added Runs : 1 Added Tests : 1

Hide Details

Results ---------------- FAIL : 1 PASS : 4

Hide Details

$ ":" "RUN: at line 21" $ "lnt" "import" "/Users/buildslave/jenkins/workspace/LNT_Tests/llvm-lnt/tests/test_run_tmp/server/ui/Output/V4Pages.py.tmp.instance" "/Users/buildslave/jenkins/workspace/LNT_Tests/llvm-lnt/tests/server/ui/Inputs/sample-failed-report2.json" # command output: Importing 'sample-failed-report2.json' Import succeeded.

Hide Details

--- Tested: 5 tests -- IMPROVED: FailingTest.execution_time (2 of 5) ******************** TEST 'FailingTest.execution_time' ******************** Test started passing. ******************** Processing Times ---------------- Load : 0.01s Import : 0.04s Report : 0.26s Total : 0.27s

Hide Details

Imported Data ------------- Added Runs : 1

Hide Details

Results ---------------- IMPROVED : 1 PASS : 4

Hide Details

$ ":" "RUN: at line 23" $ "python" "/Users/buildslave/jenkins/workspace/LNT_Tests/llvm-lnt/tests/server/ui/V4Pages.py" "/Users/buildslave/jenkins/workspace/LNT_Tests/llvm-lnt/tests/test_run_tmp/server/ui/Output/V4Pages.py.tmp.instance" # command output: Logging to : lnt.log

Hide Details

# command stderr: INFO: Started file logging. [in app.py:272 2021-01-12 10:24:55,547] WARNING: Found different hashes for multiple samples in the same run [NT_Run(7, NT_Machine(2, u'machine2'), NT_Order(None, 5, **{u'llvm_project_revision': u'152293'}), datetime.datetime(2012, 5, 10, 16, 28, 23), datetime.datetime(2012, 5, 10, 16, 28, 58))]: [u'hash1', u'hash2'] TestID:9 [in analysis.py:345 2021-01-12 10:24:56,262] WARNING: Found different hashes for multiple samples in the same run [NT_Run(7, NT_Machine(2, u'machine2'), NT_Order(None, 5, **{u'llvm_project_revision': u'152293'}), datetime.datetime(2012, 5, 10, 16, 28, 23), datetime.datetime(2012, 5, 10, 16, 28, 58))]: [u'hash1', u'hash2'] TestID:9 [in analysis.py:345 2021-01-12 10:24:56,262] WARNING: Found different hashes for multiple samples in the same run [NT_Run(7, NT_Machine(2, u'machine2'), NT_Order(None, 5, **{u'llvm_project_revision': u'152293'}), datetime.datetime(2012, 5, 10, 16, 28, 23), datetime.datetime(2012, 5, 10, 16, 28, 58))]: [u'hash1', u'hash2'] TestID:9 [in analysis.py:345 2021-01-12 10:24:56,263] WARNING: Found different hashes for multiple samples in the same run [NT_Run(7, NT_Machine(2, u'machine2'), NT_Order(None, 5, **{u'llvm_project_revision': u'152293'}), datetime.datetime(2012, 5, 10, 16, 28, 23), datetime.datetime(2012, 5, 10, 16, 28, 58))]: [u'hash1', u'hash2'] TestID:9 [in analysis.py:345 2021-01-12 10:24:56,263] WARNING: Found different hashes for multiple samples in the same run [NT_Run(7, NT_Machine(2, u'machine2'), NT_Order(None, 5, **{u'llvm_project_revision': u'152293'}), datetime.datetime(2012, 5, 10, 16, 28, 23), datetime.datetime(2012, 5, 10, 16, 28, 58))]: [u'hash1', u'hash2'] TestID:9 [in analysis.py:345 2021-01-12 10:24:56,263] WARNING: Found different hashes for multiple samples in the same run [NT_Run(7, NT_Machine(2, u'machine2'), NT_Order(None, 5, **{u'llvm_project_revision': u'152293'}), datetime.datetime(2012, 5, 10, 16, 28, 23), datetime.datetime(2012, 5, 10, 16, 28, 58))]: [u'hash1', u'hash2'] TestID:9 [in analysis.py:345 2021-01-12 10:24:56,264] WARNING: Found different hashes for multiple samples in the same run [NT_Run(7, NT_Machine(2, u'machine2'), NT_Order(None, 5, **{u'llvm_project_revision': u'152293'}), datetime.datetime(2012, 5, 10, 16, 28, 23), datetime.datetime(2012, 5, 10, 16, 28, 58))]: [u'hash1', u'hash2'] TestID:9 [in analysis.py:345 2021-01-12 10:24:56,264] WARNING: Found different hashes for multiple samples in the same run [NT_Run(7, NT_Machine(2, u'machine2'), NT_Order(None, 5, **{u'llvm_project_revision': u'152293'}), datetime.datetime(2012, 5, 10, 16, 28, 23), datetime.datetime(2012, 5, 10, 16, 28, 58))]: [u'hash1', u'hash2'] TestID:9 [in analysis.py:345 2021-01-12 10:24:56,265] WARNING: Found different hashes for multiple samples in the same run [NT_Run(7, NT_Machine(2, u'machine2'), NT_Order(None, 5, **{u'llvm_project_revision': u'152293'}), datetime.datetime(2012, 5, 10, 16, 28, 23), datetime.datetime(2012, 5, 10, 16, 28, 58))]: [u'hash1', u'hash2'] TestID:9 [in analysis.py:345 2021-01-12 10:24:56,265] WARNING: Found different hashes for multiple samples in the same run [NT_Run(7, NT_Machine(2, u'machine2'), NT_Order(None, 5, **{u'llvm_project_revision': u'152293'}), datetime.datetime(2012, 5, 10, 16, 28, 23), datetime.datetime(2012, 5, 10, 16, 28, 58))]: [u'hash1', u'hash2'] TestID:9 [in analysis.py:345 2021-01-12 10:24:56,265] WARNING: Found different hashes for multiple samples in the same run [NT_Run(7, NT_Machine(2, u'machine2'), NT_Order(None, 5, **{u'llvm_project_revision': u'152293'}), datetime.datetime(2012, 5, 10, 16, 28, 23), datetime.datetime(2012, 5, 10, 16, 28, 58))]: [u'hash1', u'hash2'] TestID:9 [in analysis.py:345 2021-01-12 10:24:56,279] WARNING: Found different hashes for multiple samples in the same run [NT_Run(7, NT_Machine(2, u'machine2'), NT_Order(None, 5, **{u'llvm_project_revision': u'152293'}), datetime.datetime(2012, 5, 10, 16, 28, 23), datetime.datetime(2012, 5, 10, 16, 28, 58))]: [u'hash1', u'hash2'] TestID:9 [in analysis.py:345 2021-01-12 10:24:56,282] WARNING: Found different hashes for multiple samples in the same run [NT_Run(7, NT_Machine(2, u'machine2'), NT_Order(None, 5, **{u'llvm_project_revision': u'152293'}), datetime.datetime(2012, 5, 10, 16, 28, 23), datetime.datetime(2012, 5, 10, 16, 28, 58))]: [u'hash1', u'hash2'] TestID:9 [in analysis.py:345 2021-01-12 10:24:56,283] WARNING: Found different hashes for multiple samples in the same run [NT_Run(7, NT_Machine(2, u'machine2'), NT_Order(None, 5, **{u'llvm_project_revision': u'152293'}), datetime.datetime(2012, 5, 10, 16, 28, 23), datetime.datetime(2012, 5, 10, 16, 28, 58))]: [u'hash1', u'hash2'] TestID:9 [in analysis.py:345 2021-01-12 10:24:56,284] WARNING: Found different hashes for multiple samples in the same run [NT_Run(7, NT_Machine(2, u'machine2'), NT_Order(None, 5, **{u'llvm_project_revision': u'152293'}), datetime.datetime(2012, 5, 10, 16, 28, 23), datetime.datetime(2012, 5, 10, 16, 28, 58))]: [u'hash1', u'hash2'] TestID:9 [in analysis.py:345 2021-01-12 10:24:56,285] WARNING: Found different hashes for multiple samples in the same run [NT_Run(7, NT_Machine(2, u'machine2'), NT_Order(None, 5, **{u'llvm_project_revision': u'152293'}), datetime.datetime(2012, 5, 10, 16, 28, 23), datetime.datetime(2012, 5, 10, 16, 28, 58))]: [u'hash1', u'hash2'] TestID:9 [in analysis.py:345 2021-01-12 10:24:56,364] WARNING: Found different hashes for multiple samples in the same run [NT_Run(7, NT_Machine(2, u'machine2'), NT_Order(None, 5, **{u'llvm_project_revision': u'152293'}), datetime.datetime(2012, 5, 10, 16, 28, 23), datetime.datetime(2012, 5, 10, 16, 28, 58))]: [u'hash1', u'hash2'] TestID:9 [in analysis.py:345 2021-01-12 10:24:56,364] WARNING: Found different hashes for multiple samples in the same run [NT_Run(7, NT_Machine(2, u'machine2'), NT_Order(None, 5, **{u'llvm_project_revision': u'152293'}), datetime.datetime(2012, 5, 10, 16, 28, 23), datetime.datetime(2012, 5, 10, 16, 28, 58))]: [u'hash1', u'hash2'] TestID:9 [in analysis.py:345 2021-01-12 10:24:56,364] WARNING: Found different hashes for multiple samples in the same run [NT_Run(7, NT_Machine(2, u'machine2'), NT_Order(None, 5, **{u'llvm_project_revision': u'152293'}), datetime.datetime(2012, 5, 10, 16, 28, 23), datetime.datetime(2012, 5, 10, 16, 28, 58))]: [u'hash1', u'hash2'] TestID:9 [in analysis.py:345 2021-01-12 10:24:56,365] WARNING: Found different hashes for multiple samples in the same run [NT_Run(7, NT_Machine(2, u'machine2'), NT_Order(None, 5, **{u'llvm_project_revision': u'152293'}), datetime.datetime(2012, 5, 10, 16, 28, 23), datetime.datetime(2012, 5, 10, 16, 28, 58))]: [u'hash1', u'hash2'] TestID:9 [in analysis.py:345 2021-01-12 10:24:56,365] WARNING: Found different hashes for multiple samples in the same run [NT_Run(7, NT_Machine(2, u'machine2'), NT_Order(None, 5, **{u'llvm_project_revision': u'152293'}), datetime.datetime(2012, 5, 10, 16, 28, 23), datetime.datetime(2012, 5, 10, 16, 28, 58))]: [u'hash1', u'hash2'] TestID:9 [in analysis.py:345 2021-01-12 10:24:56,365] WARNING: Found different hashes for multiple samples in the same run [NT_Run(7, NT_Machine(2, u'machine2'), NT_Order(None, 5, **{u'llvm_project_revision': u'152293'}), datetime.datetime(2012, 5, 10, 16, 28, 23), datetime.datetime(2012, 5, 10, 16, 28, 58))]: [u'hash1', u'hash2'] TestID:9 [in analysis.py:345 2021-01-12 10:24:56,366] WARNING: Found different hashes for multiple samples in the same run [NT_Run(7, NT_Machine(2, u'machine2'), NT_Order(None, 5, **{u'llvm_project_revision': u'152293'}), datetime.datetime(2012, 5, 10, 16, 28, 23), datetime.datetime(2012, 5, 10, 16, 28, 58))]: [u'hash1', u'hash2'] TestID:9 [in analysis.py:345 2021-01-12 10:24:56,366] WARNING: Found different hashes for multiple samples in the same run [NT_Run(7, NT_Machine(2, u'machine2'), NT_Order(None, 5, **{u'llvm_project_revision': u'152293'}), datetime.datetime(2012, 5, 10, 16, 28, 23), datetime.datetime(2012, 5, 10, 16, 28, 58))]: [u'hash1', u'hash2'] TestID:9 [in analysis.py:345 2021-01-12 10:24:56,366] WARNING: Found different hashes for multiple samples in the same run [NT_Run(7, NT_Machine(2, u'machine2'), NT_Order(None, 5, **{u'llvm_project_revision': u'152293'}), datetime.datetime(2012, 5, 10, 16, 28, 23), datetime.datetime(2012, 5, 10, 16, 28, 58))]: [u'hash1', u'hash2'] TestID:9 [in analysis.py:345 2021-01-12 10:24:56,367] WARNING: Found different hashes for multiple samples in the same run [NT_Run(7, NT_Machine(2, u'machine2'), NT_Order(None, 5, **{u'llvm_project_revision': u'152293'}), datetime.datetime(2012, 5, 10, 16, 28, 23), datetime.datetime(2012, 5, 10, 16, 28, 58))]: [u'hash1', u'hash2'] TestID:9 [in analysis.py:345 2021-01-12 10:24:56,380] WARNING: Found different hashes for multiple samples in the same run [NT_Run(7, NT_Machine(2, u'machine2'), NT_Order(None, 5, **{u'llvm_project_revision': u'152293'}), datetime.datetime(2012, 5, 10, 16, 28, 23), datetime.datetime(2012, 5, 10, 16, 28, 58))]: [u'hash1', u'hash2'] TestID:9 [in analysis.py:345 2021-01-12 10:24:56,382] WARNING: Found different hashes for multiple samples in the same run [NT_Run(7, NT_Machine(2, u'machine2'), NT_Order(None, 5, **{u'llvm_project_revision': u'152293'}), datetime.datetime(2012, 5, 10, 16, 28, 23), datetime.datetime(2012, 5, 10, 16, 28, 58))]: [u'hash1', u'hash2'] TestID:9 [in analysis.py:345 2021-01-12 10:24:56,383] WARNING: Found different hashes for multiple samples in the same run [NT_Run(7, NT_Machine(2, u'machine2'), NT_Order(None, 5, **{u'llvm_project_revision': u'152293'}), datetime.datetime(2012, 5, 10, 16, 28, 23), datetime.datetime(2012, 5, 10, 16, 28, 58))]: [u'hash1', u'hash2'] TestID:9 [in analysis.py:345 2021-01-12 10:24:56,383] WARNING: Found different hashes for multiple samples in the same run [NT_Run(7, NT_Machine(2, u'machine2'), NT_Order(None, 5, **{u'llvm_project_revision': u'152293'}), datetime.datetime(2012, 5, 10, 16, 28, 23), datetime.datetime(2012, 5, 10, 16, 28, 58))]: [u'hash1', u'hash2'] TestID:9 [in analysis.py:345 2021-01-12 10:24:56,384] WARNING: Found different hashes for multiple samples in the same run [NT_Run(7, NT_Machine(2, u'machine2'), NT_Order(None, 5, **{u'llvm_project_revision': u'152293'}), datetime.datetime(2012, 5, 10, 16, 28, 23), datetime.datetime(2012, 5, 10, 16, 28, 58))]: [u'hash1', u'hash2'] TestID:9 [in analysis.py:345 2021-01-12 10:24:58,747] Traceback (most recent call last): File "/Users/buildslave/jenkins/workspace/LNT_Tests/llvm-lnt/tests/server/ui/V4Pages.py", line 684, in <module> main() File "/Users/buildslave/jenkins/workspace/LNT_Tests/llvm-lnt/tests/server/ui/V4Pages.py", line 580, in main assert resp.headers['Location'] == "http://localhost/db_default/v4/nts/9?compare_to=4" AssertionError

Hide Details

error: command failed with exit status: 1

Hide Details

--

Hide Details

******************** PASS: LNT :: server/ui/change_processing.py (56 of 72) PASS: LNT :: server/ui/statsTester.py (57 of 72) PASS: LNT :: server/ui/test_api.py (58 of 72) PASS: LNT :: server/ui/test_api_modify.py (59 of 72) PASS: LNT :: server/ui/test_api_roundtrip.py (60 of 72) PASS: LNT :: server/ui/test_matrix_page.py (61 of 72) PASS: LNT :: server/ui/test_roundtrip.py (62 of 72) PASS: LNT :: server/ui/test_system_info.py (63 of 72) PASS: LNT :: testing/CalltreeDataLoading.py (64 of 72) PASS: LNT :: testing/Compilers.py (65 of 72) PASS: LNT :: testing/TestingTest.py (66 of 72) PASS: LNT :: testing/cPerf.py (67 of 72) PASS: LNT :: testing/profilev1impl.py (68 of 72) PASS: LNT :: testing/profilev2impl.py (69 of 72) UNSUPPORTED: LNT :: utils/Installation.py (70 of 72) UNSUPPORTED: LNT :: utils/SourceDistribution.py (71 of 72) PASS: LNT :: utils/blast.py (72 of 72) ******************** Failed Tests (1): LNT :: server/ui/V4Pages.py

Hide Details

Hide Details

Testing Time: 571.27s Unsupported: 2 Passed : 69 Failed : 1 Build step 'Execute shell' marked build as failure [WARNINGS] Parsing warnings in console log with parser Pep8 Skipping warnings blame since Git is the only supported SCM up to now.%n [WARNINGS] Computing warning deltas based on reference build #19217 [WARNINGS] Ignore new warnings since this is the first valid build [WARNINGS] Plug-in Result: Success - no threshold has been exceeded Recording test results [Checks API] No suitable checks publisher found. Email was triggered for: Failure - Any Sending email for trigger: Failure - Any

Hide Details

Begin Pre-Send Script... Sending email to: drew_maxwell@apple.com Erik Pilkington <epilkington@apple.com> Azhar Mohammed <azhar@apple.com> Finished: FAILURE