FailedConsole Output

Skipping 14,855 KB.. Full Log
PASS: lldb-shell :: ObjectFile/ELF/netbsd-core-amd64.test (996 of 2260)
PASS: lldb-shell :: ObjectFile/ELF/minidebuginfo-find-symbols.yaml (997 of 2260)
PASS: lldb-shell :: ObjectFile/ELF/minidebuginfo-corrupt-xz.yaml (998 of 2260)
PASS: lldb-shell :: ObjectFile/ELF/netbsd-exec-8.99.30-amd64.yaml (999 of 2260)
PASS: lldb-shell :: ObjectFile/ELF/null-jmprel.yaml (1000 of 2260)
PASS: lldb-shell :: ObjectFile/ELF/section-addresses.yaml (1001 of 2260)
PASS: lldb-shell :: ObjectFile/ELF/riscv-arch.yaml (1002 of 2260)
PASS: lldb-shell :: ObjectFile/ELF/section-overlap.yaml (1003 of 2260)
PASS: lldb-shell :: ObjectFile/ELF/section-permissions.yaml (1004 of 2260)
PASS: lldb-shell :: ObjectFile/ELF/section-types-edgecases.yaml (1005 of 2260)
PASS: lldb-shell :: ObjectFile/ELF/section-types.yaml (1006 of 2260)
PASS: lldb-shell :: ObjectFile/ELF/many-sections.s (1007 of 2260)
PASS: lldb-shell :: ObjectFile/ELF/short-build-id.yaml (1008 of 2260)
PASS: lldb-shell :: ObjectFile/MachO/lc_build_version.yaml (1009 of 2260)
PASS: lldb-shell :: ObjectFile/MachO/lc_build_version_notools.yaml (1010 of 2260)
PASS: lldb-shell :: ObjectFile/MachO/subsections.yaml (1011 of 2260)
PASS: lldb-shell :: ObjectFile/MachO/lc_version_min.yaml (1012 of 2260)
PASS: lldb-shell :: ObjectFile/PECOFF/basic-info-arm64.yaml (1013 of 2260)
PASS: lldb-shell :: ObjectFile/PECOFF/basic-info-arm.yaml (1014 of 2260)
UNSUPPORTED: lldb-shell :: ObjectFile/PECOFF/dep-modules.yaml (1015 of 2260)
UNSUPPORTED: lldb-shell :: ObjectFile/PECOFF/disassemble-thumb.yaml (1016 of 2260)
UNSUPPORTED: lldb-shell :: ObjectFile/PECOFF/export-dllfunc.yaml (1017 of 2260)
PASS: lldb-shell :: ObjectFile/PECOFF/basic-info.yaml (1018 of 2260)
PASS: lldb-shell :: ObjectFile/PECOFF/invalid-export-table.yaml (1019 of 2260)
PASS: lldb-shell :: ObjectFile/PECOFF/section-types.yaml (1020 of 2260)
PASS: lldb-shell :: ObjectFile/PECOFF/sections-names.yaml (1021 of 2260)
PASS: lldb-shell :: ObjectFile/PECOFF/sections.yaml (1022 of 2260)
UNSUPPORTED: lldb-shell :: ObjectFile/PECOFF/uuid.yaml (1023 of 2260)
PASS: lldb-shell :: ObjectFile/PECOFF/symbol.yaml (1024 of 2260)
PASS: lldb-shell :: ObjectFile/PDB/object.test (1025 of 2260)
PASS: lldb-shell :: ObjectFile/wasm/basic.yaml (1026 of 2260)
PASS: lldb-shell :: ObjectFile/wasm/embedded-debug-sections.yaml (1027 of 2260)
PASS: lldb-shell :: ObjectFile/wasm/stripped-debug-sections.yaml (1028 of 2260)
PASS: lldb-shell :: ObjectFile/wasm/unified-debug-sections.yaml (1029 of 2260)
PASS: lldb-shell :: ObjectFile/MachO/symtab.yaml (1030 of 2260)
UNSUPPORTED: lldb-shell :: Process/Windows/exception_access_violation.cpp (1031 of 2260)
PASS: lldb-shell :: Quit/TestQuitExitCode-30.test (1032 of 2260)
PASS: lldb-shell :: Quit/TestQuitExitCode0.test (1033 of 2260)
PASS: lldb-shell :: Quit/TestQuitExitCode30.test (1034 of 2260)
PASS: lldb-shell :: Quit/TestQuitExitCodeHex0.test (1035 of 2260)
PASS: lldb-shell :: Quit/TestQuitExitCodeHexA.test (1036 of 2260)
PASS: lldb-api :: types/TestCharType.py (1037 of 2260)
PASS: lldb-shell :: Quit/TestQuitExitCodeImplicit0.test (1038 of 2260)
PASS: lldb-shell :: Quit/TestQuitExitCodeNonInt.test (1039 of 2260)
PASS: lldb-shell :: Quit/TestQuitExitCodeTooManyArgs.test (1040 of 2260)
UNSUPPORTED: lldb-shell :: Register/aarch64-fp-read.test (1041 of 2260)
UNSUPPORTED: lldb-shell :: Register/aarch64-gp-read.test (1042 of 2260)
UNSUPPORTED: lldb-shell :: Register/arm-fp-read.test (1043 of 2260)
UNSUPPORTED: lldb-shell :: Register/arm-gp-read.test (1044 of 2260)
PASS: lldb-shell :: Process/Optimization.test (1045 of 2260)
PASS: lldb-shell :: Process/UnsupportedLanguage.test (1046 of 2260)
PASS: lldb-shell :: Minidump/Windows/Sigsegv/sigsegv.test (1047 of 2260)
UNSUPPORTED: lldb-shell :: Register/x86-64-gp-write.test (1048 of 2260)
PASS: lldb-shell :: Recognizer/assert.test (1049 of 2260)
PASS: lldb-shell :: Minidump/Windows/broken-unwind.test (1050 of 2260)
UNSUPPORTED: lldb-shell :: Register/x86-64-xmm16-read.test (1051 of 2260)
UNSUPPORTED: lldb-shell :: Register/x86-64-xmm16-write.test (1052 of 2260)
PASS: lldb-shell :: Expr/TestIRMemoryMap.test (1053 of 2260)
XFAIL: lldb-shell :: Register/x86-64-fp-write.test (1054 of 2260)
UNSUPPORTED: lldb-shell :: Register/x86-64-ymm16-read.test (1055 of 2260)
UNSUPPORTED: lldb-shell :: Register/x86-64-ymm16-write.test (1056 of 2260)
UNSUPPORTED: lldb-shell :: Register/x86-64-zmm-read.test (1057 of 2260)
UNSUPPORTED: lldb-shell :: Register/x86-64-zmm-write.test (1058 of 2260)
UNSUPPORTED: lldb-shell :: Register/x86-db-read.test (1059 of 2260)
UNSUPPORTED: lldb-shell :: Register/x86-fp-read.test (1060 of 2260)
PASS: lldb-shell :: Register/x86-64-gp-read.test (1061 of 2260)
UNSUPPORTED: lldb-shell :: Register/x86-gp-read.test (1062 of 2260)
UNSUPPORTED: lldb-shell :: Register/x86-gp-write.test (1063 of 2260)
XFAIL: lldb-shell :: Register/x86-64-fp-read.test (1064 of 2260)
PASS: lldb-shell :: Register/x86-64-read.test (1065 of 2260)
PASS: lldb-shell :: Minidump/Windows/find-module.test (1066 of 2260)
XFAIL: lldb-shell :: Register/x86-64-write.test (1067 of 2260)
UNSUPPORTED: lldb-shell :: Register/x86-ymm-read.test (1068 of 2260)
UNSUPPORTED: lldb-shell :: Register/x86-ymm-write.test (1069 of 2260)
UNSUPPORTED: lldb-shell :: Register/x86-zmm-read.test (1070 of 2260)
UNSUPPORTED: lldb-shell :: Register/x86-zmm-write.test (1071 of 2260)
PASS: lldb-shell :: Register/x86-64-ymm-read.test (1072 of 2260)
PASS: lldb-shell :: Process/TestEnvironment.test (1073 of 2260)
XFAIL: lldb-shell :: Register/x86-fp-write.test (1074 of 2260)
XFAIL: lldb-shell :: Register/x86-64-ymm-write.test (1075 of 2260)
XFAIL: lldb-shell :: Register/x86-mm-xmm-read.test (1076 of 2260)
PASS: lldb-shell :: Reproducer/TestCaptureEnvOverride.test (1077 of 2260)
PASS: lldb-shell :: Reproducer/TestCrash.test (1078 of 2260)
XFAIL: lldb-shell :: Register/x86-mm-xmm-write.test (1079 of 2260)
PASS: lldb-api :: types/TestCharTypeExpr.py (1080 of 2260)
PASS: lldb-shell :: Register/x86-multithread-read.test (1081 of 2260)
PASS: lldb-shell :: Reproducer/TestDriverOptions.test (1082 of 2260)
PASS: lldb-shell :: Register/x86-multithread-write.test (1083 of 2260)
PASS: lldb-shell :: Reproducer/TestDebugSymbols.test (1084 of 2260)
PASS: lldb-shell :: Reproducer/TestFinalize.test (1085 of 2260)
PASS: lldb-shell :: Reproducer/TestDSYM.test (1086 of 2260)
PASS: lldb-shell :: Reproducer/TestHomeDir.test (1087 of 2260)
UNSUPPORTED: lldb-shell :: Reproducer/TestLuaImport.test (1088 of 2260)
PASS: lldb-shell :: Reproducer/TestDiscard.test (1089 of 2260)
PASS: lldb-shell :: Reproducer/TestProcessList.test (1090 of 2260)
PASS: lldb-shell :: Reproducer/TestPythonImport.test (1091 of 2260)
PASS: lldb-api :: types/TestShortType.py (1092 of 2260)
PASS: lldb-shell :: Reproducer/Functionalities/TestDataFormatter.test (1093 of 2260)
PASS: lldb-shell :: Reproducer/TestSynchronous.test (1094 of 2260)
PASS: lldb-shell :: Reproducer/Functionalities/TestImageList.test (1095 of 2260)
PASS: lldb-shell :: Reproducer/Functionalities/TestStepping.test (1096 of 2260)
PASS: lldb-shell :: Reproducer/Functionalities/TestExpressionEvaluation.test (1097 of 2260)
UNSUPPORTED: lldb-shell :: ScriptInterpreter/Lua/bindings.test (1098 of 2260)
UNSUPPORTED: lldb-shell :: ScriptInterpreter/Lua/breakpoint_callback.test (1099 of 2260)
UNSUPPORTED: lldb-shell :: ScriptInterpreter/Lua/breakpoint_function_callback.test (1100 of 2260)
UNSUPPORTED: lldb-shell :: ScriptInterpreter/Lua/breakpoint_oneline_callback.test (1101 of 2260)
UNSUPPORTED: lldb-shell :: ScriptInterpreter/Lua/command_script_import.test (1102 of 2260)
UNSUPPORTED: lldb-shell :: ScriptInterpreter/Lua/convenience_variables.test (1103 of 2260)
UNSUPPORTED: lldb-shell :: ScriptInterpreter/Lua/fail_breakpoint_oneline.test (1104 of 2260)
UNSUPPORTED: lldb-shell :: ScriptInterpreter/Lua/independent_state.test (1105 of 2260)
UNSUPPORTED: lldb-shell :: ScriptInterpreter/Lua/io.test (1106 of 2260)
UNSUPPORTED: lldb-shell :: ScriptInterpreter/Lua/lua-python.test (1107 of 2260)
UNSUPPORTED: lldb-shell :: ScriptInterpreter/Lua/lua.test (1108 of 2260)
UNSUPPORTED: lldb-shell :: ScriptInterpreter/Lua/nested_sessions.test (1109 of 2260)
UNSUPPORTED: lldb-shell :: ScriptInterpreter/Lua/partial_statements.test (1110 of 2260)
UNSUPPORTED: lldb-shell :: ScriptInterpreter/Lua/persistent_state.test (1111 of 2260)
UNSUPPORTED: lldb-shell :: ScriptInterpreter/Lua/print.test (1112 of 2260)
UNSUPPORTED: lldb-shell :: ScriptInterpreter/Lua/quit.test (1113 of 2260)
UNSUPPORTED: lldb-shell :: ScriptInterpreter/Lua/watchpoint_callback.test (1114 of 2260)
PASS: lldb-shell :: ScriptInterpreter/None/import_module.test (1115 of 2260)
PASS: lldb-shell :: ScriptInterpreter/None/none.test (1116 of 2260)
PASS: lldb-shell :: Reproducer/Modules/TestModuleCXX.test (1117 of 2260)
PASS: lldb-api :: types/TestIntegerTypeExpr.py (1118 of 2260)
PASS: lldb-shell :: ScriptInterpreter/Python/Crashlog/parser_json.test (1119 of 2260)
PASS: lldb-shell :: ScriptInterpreter/Python/Crashlog/parser_text.test (1120 of 2260)
PASS: lldb-shell :: ScriptInterpreter/Python/Crashlog/json.test (1121 of 2260)
PASS: lldb-shell :: ScriptInterpreter/Python/Crashlog/text.test (1122 of 2260)
PASS: lldb-shell :: ScriptInterpreter/Python/eof.test (1123 of 2260)
PASS: lldb-shell :: ScriptInterpreter/Python/command_import.test (1124 of 2260)
PASS: lldb-shell :: ScriptInterpreter/Python/fail_breakpoint_oneline.test (1125 of 2260)
PASS: lldb-shell :: ScriptInterpreter/Python/command_relative_import.test (1126 of 2260)
PASS: lldb-shell :: ScriptInterpreter/Python/sb_address_exception.test (1127 of 2260)
PASS: lldb-shell :: ScriptInterpreter/Python/scripted_breakpoint.test (1128 of 2260)
PASS: lldb-shell :: Settings/TestDefaultModuleCachePath.test (1129 of 2260)
PASS: lldb-shell :: ScriptInterpreter/Python/scripted_breakpoint_lua.test (1130 of 2260)
PASS: lldb-shell :: Settings/TestDisableColor.test (1131 of 2260)
PASS: lldb-shell :: Reproducer/TestDump.test (1132 of 2260)
PASS: lldb-shell :: Settings/TestDisassemblyFormat.test (1133 of 2260)
PASS: lldb-shell :: Reproducer/TestFileRepro.test (1134 of 2260)
PASS: lldb-shell :: Settings/TestEchoCommands.test (1135 of 2260)
PASS: lldb-shell :: Settings/TestFrameFormatColor.test (1136 of 2260)
PASS: lldb-shell :: Settings/TestModuleCacheSanity.test (1137 of 2260)
PASS: lldb-shell :: Settings/TestSettingsSet.test (1138 of 2260)
PASS: lldb-shell :: Settings/TestFrameFormatMangling.test (1139 of 2260)
PASS: lldb-shell :: ScriptInterpreter/Python/python.test (1140 of 2260)
PASS: lldb-shell :: SymbolFile/Breakpad/line-table-discontinuous-file-ids.test (1141 of 2260)
PASS: lldb-shell :: SymbolFile/Breakpad/line-table-edgecases.test (1142 of 2260)
PASS: lldb-shell :: SymbolFile/Breakpad/line-table-missing-file.test (1143 of 2260)
PASS: lldb-shell :: Settings/TestSettingsWrite.test (1144 of 2260)
PASS: lldb-shell :: Settings/TestStopCommandSourceOnError.test (1145 of 2260)
PASS: lldb-shell :: SymbolFile/Breakpad/line-table-mixed-path-styles.test (1146 of 2260)
UNSUPPORTED: lldb-shell :: SymbolFile/Breakpad/stack-cfi-arm.yaml (1147 of 2260)
PASS: lldb-shell :: SymbolFile/Breakpad/line-table.test (1148 of 2260)
PASS: lldb-shell :: SymbolFile/Breakpad/symtab-macho.test (1149 of 2260)
PASS: lldb-shell :: SymbolFile/Breakpad/stack-cfi-parsing.test (1150 of 2260)
PASS: lldb-shell :: SymbolFile/Breakpad/symtab.test (1151 of 2260)
PASS: lldb-shell :: SymbolFile/Breakpad/unwind-via-stack-cfi.test (1152 of 2260)
PASS: lldb-shell :: Settings/TestFrameFormatNoColor.test (1153 of 2260)
PASS: lldb-shell :: Reproducer/TestRelativePath.test (1154 of 2260)
PASS: lldb-shell :: SymbolFile/DWARF/DW_AT_const_value-bitfields.s (1155 of 2260)
PASS: lldb-shell :: SymbolFile/DWARF/DW_AT_const_value.s (1156 of 2260)
PASS: lldb-shell :: SymbolFile/DWARF/DW_AT_data_bit_offset-DW_OP_stack_value.s (1157 of 2260)
PASS: lldb-shell :: SymbolFile/DWARF/DW_AT_decl_file-DW_AT_specification-crosscu.s (1158 of 2260)
PASS: lldb-shell :: SymbolFile/DWARF/DW_AT_location-DW_AT_const_value.s (1159 of 2260)
PASS: lldb-shell :: SymbolFile/DWARF/DW_AT_declaration-with-children.s (1160 of 2260)
PASS: lldb-api :: types/TestShortTypeExpr.py (1161 of 2260)
PASS: lldb-shell :: SymbolFile/DWARF/DW_AT_loclists_base.s (1162 of 2260)
PASS: lldb-shell :: SymbolFile/DWARF/DW_AT_low_pc-addrx.s (1163 of 2260)
UNSUPPORTED: lldb-shell :: SymbolFile/DWARF/DW_TAG_GNU_call_site-DW_AT_low_pc.s (1164 of 2260)
PASS: lldb-shell :: SymbolFile/DWARF/DW_OP_piece-struct.s (1165 of 2260)
PASS: lldb-shell :: SymbolFile/DWARF/DW_OP_piece-smaller-than-struct.s (1166 of 2260)
PASS: lldb-shell :: SymbolFile/DWARF/DW_TAG_basic_type_DW_ATE_UTF_nonC.ll (1167 of 2260)
PASS: lldb-shell :: SymbolFile/DWARF/DW_TAG_variable-invalid_location.s (1168 of 2260)
PASS: lldb-shell :: SymbolFile/DWARF/DW_TAG_variable-DW_AT_const_value.s (1169 of 2260)
UNSUPPORTED: lldb-shell :: SymbolFile/DWARF/array-sizes.s (1170 of 2260)
PASS: lldb-shell :: SymbolFile/DWARF/childless-compile-unit.s (1171 of 2260)
PASS: lldb-shell :: SymbolFile/DWARF/apple-index-is-used.cpp (1172 of 2260)
PASS: lldb-shell :: SymbolFile/DWARF/clang-ast-from-dwarf-unamed-and-anon-structs.cpp (1173 of 2260)
PASS: lldb-shell :: SymbolFile/DWARF/clang-ast-from-dwarf-objc-property.m (1174 of 2260)
UNSUPPORTED: lldb-shell :: SymbolFile/DWARF/debug-line-basic.s (1175 of 2260)
UNSUPPORTED: lldb-shell :: SymbolFile/DWARF/debug-names-compressed.cpp (1176 of 2260)
UNSUPPORTED: lldb-shell :: SymbolFile/DWARF/debug-types-address-ranges.s (1177 of 2260)
UNSUPPORTED: lldb-shell :: SymbolFile/DWARF/debug-types-basic.test (1178 of 2260)
PASS: lldb-shell :: Settings/TestLineMarkerColor.test (1179 of 2260)
UNSUPPORTED: lldb-shell :: SymbolFile/DWARF/debug-types-dwo-cross-reference.cpp (1180 of 2260)
UNSUPPORTED: lldb-shell :: SymbolFile/DWARF/debug-types-expressions.test (1181 of 2260)
PASS: lldb-shell :: SymbolFile/DWARF/debug-types-dwarf5.s (1182 of 2260)
PASS: lldb-shell :: SymbolFile/DWARF/debug-types-line-tables.s (1183 of 2260)
UNSUPPORTED: lldb-shell :: SymbolFile/DWARF/debug-types-signature-loop.s (1184 of 2260)
PASS: lldb-shell :: SymbolFile/DWARF/debug_aranges-empty-section.s (1185 of 2260)
PASS: lldb-shell :: SymbolFile/DWARF/debug_line-relative_path.s (1186 of 2260)
PASS: lldb-shell :: SymbolFile/DWARF/debug_line-tombstone.s (1187 of 2260)
PASS: lldb-shell :: SymbolFile/DWARF/debug_loc-aslr.s (1188 of 2260)
PASS: lldb-shell :: SymbolFile/DWARF/anon_class_w_and_wo_export_symbols.ll (1189 of 2260)
PASS: lldb-shell :: SymbolFile/DWARF/debug_loc.s (1190 of 2260)
PASS: lldb-shell :: SymbolFile/DWARF/debug_loc_and_loclists.s (1191 of 2260)
PASS: lldb-shell :: SymbolFile/DWARF/debug-types-missing-signature.test (1192 of 2260)
PASS: lldb-shell :: SymbolFile/DWARF/debug_ranges-missing-section.s (1193 of 2260)
PASS: lldb-shell :: SymbolFile/DWARF/debug_loclists-dwo.s (1194 of 2260)
UNSUPPORTED: lldb-shell :: SymbolFile/DWARF/debug_ranges_and_rnglists.test (1195 of 2260)
PASS: lldb-shell :: SymbolFile/DWARF/debug_ranges.s (1196 of 2260)
PASS: lldb-shell :: SymbolFile/DWARF/debug_rnglists.s (1197 of 2260)
PASS: lldb-shell :: SymbolFile/DWARF/debug_rnglists-dwo.s (1198 of 2260)
UNSUPPORTED: lldb-shell :: SymbolFile/DWARF/dir-separator-no-comp-dir-relative-name.s (1199 of 2260)
UNSUPPORTED: lldb-shell :: SymbolFile/DWARF/dir-separator-no-comp-dir.s (1200 of 2260)
UNSUPPORTED: lldb-shell :: SymbolFile/DWARF/dir-separator-windows.s (1201 of 2260)
UNSUPPORTED: lldb-shell :: SymbolFile/DWARF/dir-separator-posix.s (1202 of 2260)
PASS: lldb-shell :: SymbolFile/DWARF/dwarf5-debug_line.s (1203 of 2260)
UNSUPPORTED: lldb-shell :: SymbolFile/DWARF/dwarf5-index-is-used.cpp (1204 of 2260)
UNSUPPORTED: lldb-shell :: SymbolFile/DWARF/dwarf5-partial-index.cpp (1205 of 2260)
PASS: lldb-shell :: SymbolFile/DWARF/dwarf5-atomic.s (1206 of 2260)
UNSUPPORTED: lldb-shell :: SymbolFile/DWARF/dwarf5_locations.s (1207 of 2260)
PASS: lldb-shell :: SymbolFile/DWARF/dwarf5-split.s (1208 of 2260)
PASS: lldb-shell :: SymbolFile/DWARF/dwo-type-in-main-file.s (1209 of 2260)
UNSUPPORTED: lldb-shell :: SymbolFile/DWARF/dwp-separate-debug-file.cpp (1210 of 2260)
PASS: lldb-shell :: SymbolFile/DWARF/dwp-debug-types.s (1211 of 2260)
UNSUPPORTED: lldb-shell :: SymbolFile/DWARF/find-basic-function.cpp (1212 of 2260)
UNSUPPORTED: lldb-shell :: SymbolFile/DWARF/find-basic-namespace.cpp (1213 of 2260)
UNSUPPORTED: lldb-shell :: SymbolFile/DWARF/find-basic-type.cpp (1214 of 2260)
UNSUPPORTED: lldb-shell :: SymbolFile/DWARF/find-basic-variable.cpp (1215 of 2260)
UNSUPPORTED: lldb-shell :: SymbolFile/DWARF/find-function-regex.cpp (1216 of 2260)
UNSUPPORTED: lldb-shell :: SymbolFile/DWARF/find-inline-method.s (1217 of 2260)
PASS: lldb-shell :: SymbolFile/DWARF/dwp.s (1218 of 2260)
UNSUPPORTED: lldb-shell :: SymbolFile/DWARF/find-method.cpp (1219 of 2260)
PASS: lldb-shell :: SymbolFile/DWARF/find-method-local-struct.cpp (1220 of 2260)
UNSUPPORTED: lldb-shell :: SymbolFile/DWARF/find-type-in-function.cpp (1221 of 2260)
UNSUPPORTED: lldb-shell :: SymbolFile/DWARF/find-variable-dwo.cpp (1222 of 2260)
UNSUPPORTED: lldb-shell :: SymbolFile/DWARF/find-variable-file.cpp (1223 of 2260)
PASS: lldb-shell :: SymbolFile/DWARF/find-qualified-variable.cpp (1224 of 2260)
UNSUPPORTED: lldb-shell :: SymbolFile/DWARF/inline-function-address-shared.test (1225 of 2260)
UNSUPPORTED: lldb-shell :: SymbolFile/DWARF/inline-function-address.ll (1226 of 2260)
UNSUPPORTED: lldb-shell :: SymbolFile/DWARF/limit-debug-info.s (1227 of 2260)
PASS: lldb-shell :: SymbolFile/DWARF/gnu-style-compression.cpp (1228 of 2260)
PASS: lldb-shell :: SymbolFile/DWARF/compilercontext.ll (1229 of 2260)
UNSUPPORTED: lldb-shell :: SymbolFile/DWARF/split-dwarf-expression-eval-bug.cpp (1230 of 2260)
PASS: lldb-shell :: SymbolFile/DWARF/parallel-indexing-stress.s (1231 of 2260)
PASS: lldb-shell :: SymbolFile/DWARF/split-dwarf-inlining.cpp (1232 of 2260)
PASS: lldb-shell :: SymbolFile/DWARF/static_scope.s (1233 of 2260)
PASS: lldb-shell :: SymbolFile/DWARF/split-dwarf-multiple-cu.ll (1234 of 2260)
UNSUPPORTED: lldb-shell :: SymbolFile/DWARF/subprogram_ranges.test (1235 of 2260)
UNSUPPORTED: lldb-shell :: SymbolFile/DWARF/win-i386-line-table.s (1236 of 2260)
UNSUPPORTED: lldb-shell :: SymbolFile/NativePDB/ast-functions-msvc.cpp (1237 of 2260)
UNSUPPORTED: lldb-shell :: SymbolFile/NativePDB/ast-functions.cpp (1238 of 2260)
UNSUPPORTED: lldb-shell :: SymbolFile/NativePDB/ast-methods.cpp (1239 of 2260)
UNSUPPORTED: lldb-shell :: SymbolFile/NativePDB/ast-types.cpp (1240 of 2260)
UNSUPPORTED: lldb-shell :: SymbolFile/NativePDB/bitfields.cpp (1241 of 2260)
UNSUPPORTED: lldb-shell :: SymbolFile/NativePDB/break-by-line.cpp (1242 of 2260)
UNSUPPORTED: lldb-shell :: SymbolFile/NativePDB/break-by-function.cpp (1243 of 2260)
UNSUPPORTED: lldb-shell :: SymbolFile/NativePDB/disassembly.cpp (1244 of 2260)
UNSUPPORTED: lldb-shell :: SymbolFile/NativePDB/function-types-builtins.cpp (1245 of 2260)
UNSUPPORTED: lldb-shell :: SymbolFile/NativePDB/function-types-calling-conv.cpp (1246 of 2260)
UNSUPPORTED: lldb-shell :: SymbolFile/NativePDB/function-types-classes.cpp (1247 of 2260)
UNSUPPORTED: lldb-shell :: SymbolFile/NativePDB/global-classes.cpp (1248 of 2260)
UNSUPPORTED: lldb-shell :: SymbolFile/NativePDB/globals-bss.cpp (1249 of 2260)
UNSUPPORTED: lldb-shell :: SymbolFile/NativePDB/load-pdb.cpp (1250 of 2260)
UNSUPPORTED: lldb-shell :: SymbolFile/NativePDB/globals-fundamental.cpp (1251 of 2260)
UNSUPPORTED: lldb-shell :: SymbolFile/NativePDB/local-variables.cpp (1252 of 2260)
UNSUPPORTED: lldb-shell :: SymbolFile/NativePDB/locate-pdb.cpp (1253 of 2260)
UNSUPPORTED: lldb-shell :: SymbolFile/NativePDB/nested-types.cpp (1254 of 2260)
UNSUPPORTED: lldb-shell :: SymbolFile/NativePDB/source-list.cpp (1255 of 2260)
UNSUPPORTED: lldb-shell :: SymbolFile/NativePDB/s_constant.cpp (1256 of 2260)
UNSUPPORTED: lldb-shell :: SymbolFile/NativePDB/stack_unwinding01.cpp (1257 of 2260)
UNSUPPORTED: lldb-shell :: SymbolFile/NativePDB/typedefs.cpp (1258 of 2260)
UNSUPPORTED: lldb-shell :: SymbolFile/NativePDB/tag-types.cpp (1259 of 2260)
UNSUPPORTED: lldb-shell :: SymbolFile/PDB/calling-conventions.test (1260 of 2260)
UNSUPPORTED: lldb-shell :: SymbolFile/PDB/ast-restore.test (1261 of 2260)
UNSUPPORTED: lldb-shell :: SymbolFile/PDB/compilands.test (1262 of 2260)
UNSUPPORTED: lldb-shell :: SymbolFile/PDB/class-layout.test (1263 of 2260)
UNSUPPORTED: lldb-shell :: SymbolFile/PDB/enums-layout.test (1264 of 2260)
UNSUPPORTED: lldb-shell :: SymbolFile/PDB/expressions.test (1265 of 2260)
UNSUPPORTED: lldb-shell :: SymbolFile/PDB/func-symbols.test (1266 of 2260)
UNSUPPORTED: lldb-shell :: SymbolFile/PDB/function-nested-block.test (1267 of 2260)
UNSUPPORTED: lldb-shell :: SymbolFile/PDB/function-level-linking.test (1268 of 2260)
UNSUPPORTED: lldb-shell :: SymbolFile/PDB/type-quals.test (1269 of 2260)
UNSUPPORTED: lldb-shell :: SymbolFile/PDB/pointers.test (1270 of 2260)
UNSUPPORTED: lldb-shell :: SymbolFile/PDB/udt-layout.test (1271 of 2260)
UNSUPPORTED: lldb-shell :: SymbolFile/PDB/typedefs.test (1272 of 2260)
UNSUPPORTED: lldb-shell :: SymbolFile/PDB/variables-locations.test (1273 of 2260)
UNSUPPORTED: lldb-shell :: SymbolFile/PDB/vbases.test (1274 of 2260)
UNSUPPORTED: lldb-shell :: SymbolFile/PDB/variables.test (1275 of 2260)
UNSUPPORTED: lldb-shell :: SymbolFile/dissassemble-entry-point.s (1276 of 2260)
UNSUPPORTED: lldb-shell :: SymbolFile/target-symbols-add-unwind.test (1277 of 2260)
UNSUPPORTED: lldb-shell :: Unwind/basic-block-sections.test (1278 of 2260)
UNSUPPORTED: lldb-shell :: Unwind/eh-frame-augment-noop.test (1279 of 2260)
PASS: lldb-shell :: SymbolFile/DWARF/module-ownership.mm (1280 of 2260)
UNSUPPORTED: lldb-shell :: Unwind/eh-frame-small-fde.test (1281 of 2260)
PASS: lldb-shell :: SymbolFile/symbol-binding.test (1282 of 2260)
UNSUPPORTED: lldb-shell :: Unwind/split-machine-functions.test (1283 of 2260)
PASS: lldb-shell :: SymbolFile/DWARF/deterministic-build.cpp (1284 of 2260)
PASS: lldb-shell :: Unwind/eh-frame-dwarf-unwind.test (1285 of 2260)
UNSUPPORTED: lldb-shell :: Unwind/unwind-plan-dwarf-dump.test (1286 of 2260)
PASS: lldb-shell :: VSCode/TestOptions.test (1287 of 2260)
PASS: lldb-shell :: Unwind/thread-step-out-ret-addr-check.test (1288 of 2260)
UNSUPPORTED: lldb-shell :: Watchpoint/netbsd-nouserdbregs.test (1289 of 2260)
PASS: lldb-shell :: Unwind/trap_frame_sym_ctx.test (1290 of 2260)
XFAIL: lldb-shell :: Unwind/prefer-debug-over-eh-frame.test (1291 of 2260)
PASS: lldb-unit :: API/Release/APITests/SBCommandInterpreterTest.MultiWordCommand (1292 of 2260)
PASS: lldb-unit :: API/Release/APITests/SBCommandInterpreterTest.SingleWordCommand (1293 of 2260)
PASS: lldb-unit :: Breakpoint/Release/LLDBBreakpointTests/BreakpointIDTest.StringIsBreakpointName (1294 of 2260)
PASS: lldb-unit :: Core/Release/LLDBCoreTests/CommunicationTest.SynchronizeWhileClosing (1295 of 2260)
PASS: lldb-unit :: Core/Release/LLDBCoreTests/MangledTest.EmptyForInvalidName (1296 of 2260)
PASS: lldb-unit :: Core/Release/LLDBCoreTests/MangledTest.NameIndexes_FindFunctionSymbols (1297 of 2260)
PASS: lldb-unit :: Core/Release/LLDBCoreTests/MangledTest.ResultForBlockInvocation (1298 of 2260)
PASS: lldb-unit :: Core/Release/LLDBCoreTests/MangledTest.ResultForValidName (1299 of 2260)
PASS: lldb-unit :: Core/Release/LLDBCoreTests/ModuleSpecTest.InvalidInMemoryBuffer (1300 of 2260)
PASS: lldb-unit :: Core/Release/LLDBCoreTests/ModuleSpecTest.InvalidInMemoryBufferValidFile (1301 of 2260)
PASS: lldb-unit :: Core/Release/LLDBCoreTests/ModuleSpecTest.TestCOFFFile (1302 of 2260)
PASS: lldb-unit :: Core/Release/LLDBCoreTests/ModuleSpecTest.TestELFFile (1303 of 2260)
PASS: lldb-unit :: Core/Release/LLDBCoreTests/ModuleSpecTest.TestMachOFile (1304 of 2260)
PASS: lldb-unit :: Core/Release/LLDBCoreTests/RichManglingContextTest.Basic (1305 of 2260)
PASS: lldb-unit :: Core/Release/LLDBCoreTests/RichManglingContextTest.FromCxxMethodName (1306 of 2260)
PASS: lldb-unit :: Core/Release/LLDBCoreTests/RichManglingContextTest.IPDRealloc (1307 of 2260)
PASS: lldb-unit :: Core/Release/LLDBCoreTests/RichManglingContextTest.SwitchProvider (1308 of 2260)
PASS: lldb-unit :: Core/Release/LLDBCoreTests/SourceFileCache.FindSourceFileFound (1309 of 2260)
PASS: lldb-unit :: Core/Release/LLDBCoreTests/SourceFileCache.FindSourceFileNotFound (1310 of 2260)
PASS: lldb-unit :: Core/Release/LLDBCoreTests/StreamCallbackTest.Callback (1311 of 2260)
PASS: lldb-unit :: Core/Release/LLDBCoreTests/UniqueCStringMap.NoDefaultConstructor (1312 of 2260)
PASS: lldb-unit :: DataFormatter/Release/LLDBFormatterTests/FormatManagerTests.CompatibleLangs (1313 of 2260)
PASS: lldb-unit :: DataFormatter/Release/LLDBFormatterTests/StringPrinterTests.CxxASCII (1314 of 2260)
PASS: lldb-unit :: DataFormatter/Release/LLDBFormatterTests/StringPrinterTests.CxxUTF8 (1315 of 2260)
PASS: lldb-unit :: DataFormatter/Release/LLDBFormatterTests/StringPrinterTests.SwiftUTF8 (1316 of 2260)
PASS: lldb-unit :: DataFormatter/Release/LLDBFormatterTests/TypeMatcherTests.CreatedBySameMatchString (1317 of 2260)
PASS: lldb-unit :: DataFormatter/Release/LLDBFormatterTests/TypeMatcherTests.CreatedBySameMatchStringExactNamePrefixes (1318 of 2260)
PASS: lldb-unit :: DataFormatter/Release/LLDBFormatterTests/TypeMatcherTests.ExactName (1319 of 2260)
PASS: lldb-unit :: DataFormatter/Release/LLDBFormatterTests/TypeMatcherTests.GetMatchStringExactName (1320 of 2260)
PASS: lldb-unit :: DataFormatter/Release/LLDBFormatterTests/TypeMatcherTests.GetMatchStringRegex (1321 of 2260)
PASS: lldb-unit :: DataFormatter/Release/LLDBFormatterTests/TypeMatcherTests.RegexMatchPart (1322 of 2260)
PASS: lldb-unit :: DataFormatter/Release/LLDBFormatterTests/TypeMatcherTests.RegexName (1323 of 2260)
PASS: lldb-unit :: Editline/Release/EditlineTests/EditlineTestFixture.EditlineReceivesMultiLineText (1324 of 2260)
PASS: lldb-unit :: Editline/Release/EditlineTests/EditlineTestFixture.EditlineReceivesSingleLineText (1325 of 2260)
PASS: lldb-unit :: Expression/Release/ExpressionTests/ClangExpressionDeclMapTest.TestPersistentDeclLookup (1326 of 2260)
PASS: lldb-unit :: Expression/Release/ExpressionTests/ClangExpressionDeclMapTest.TestUnknownIdentifierLookup (1327 of 2260)
PASS: lldb-unit :: Expression/Release/ExpressionTests/ClangHostTest.ComputeClangResourceDirectory (1328 of 2260)
PASS: lldb-unit :: Expression/Release/ExpressionTests/ClangHostTest.MacOSX (1329 of 2260)
PASS: lldb-unit :: Expression/Release/ExpressionTests/CppModuleConfigurationTest.AmbiguousCLib (1330 of 2260)
PASS: lldb-unit :: Expression/Release/ExpressionTests/CppModuleConfigurationTest.AmbiguousLibCpp (1331 of 2260)
PASS: lldb-unit :: Expression/Release/ExpressionTests/CppModuleConfigurationTest.IgnoreLibStdCpp (1332 of 2260)
PASS: lldb-unit :: Expression/Release/ExpressionTests/CppModuleConfigurationTest.LibCppV2 (1333 of 2260)
PASS: lldb-unit :: Expression/Release/ExpressionTests/CppModuleConfigurationTest.Linux (1334 of 2260)
PASS: lldb-unit :: Expression/Release/ExpressionTests/CppModuleConfigurationTest.LinuxLocalLibCpp (1335 of 2260)
PASS: lldb-unit :: Expression/Release/ExpressionTests/CppModuleConfigurationTest.MissingLibCpp (1336 of 2260)
PASS: lldb-unit :: Expression/Release/ExpressionTests/CppModuleConfigurationTest.MissingUsrInclude (1337 of 2260)
PASS: lldb-unit :: Expression/Release/ExpressionTests/CppModuleConfigurationTest.Sysroot (1338 of 2260)
PASS: lldb-unit :: Expression/Release/ExpressionTests/CppModuleConfigurationTest.UnknownLibCppFile (1339 of 2260)
PASS: lldb-unit :: Expression/Release/ExpressionTests/CppModuleConfigurationTest.UnrelatedLibrary (1340 of 2260)
PASS: lldb-unit :: Expression/Release/ExpressionTests/CppModuleConfigurationTest.Xcode (1341 of 2260)
PASS: lldb-unit :: Expression/Release/ExpressionTests/DWARFExpression.DW_OP_const (1342 of 2260)
PASS: lldb-unit :: Expression/Release/ExpressionTests/DWARFExpression.DW_OP_convert (1343 of 2260)
PASS: lldb-unit :: Expression/Release/ExpressionTests/DWARFExpression.DW_OP_implicit_value (1344 of 2260)
PASS: lldb-unit :: Expression/Release/ExpressionTests/DWARFExpression.DW_OP_pick (1345 of 2260)
PASS: lldb-unit :: Expression/Release/ExpressionTests/DWARFExpression.DW_OP_piece (1346 of 2260)
PASS: lldb-unit :: Expression/Release/ExpressionTests/DWARFExpression.DW_OP_stack_value (1347 of 2260)
PASS: lldb-unit :: Expression/Release/ExpressionTests/DWARFExpression.DW_OP_unknown (1348 of 2260)
PASS: lldb-shell :: lldb-server/TestGdbserverPort.test (1349 of 2260)
PASS: lldb-unit :: Expression/Release/ExpressionTests/DWARFExpressionMockProcessTest.DW_OP_deref (1350 of 2260)
PASS: lldb-unit :: Expression/Release/ExpressionTests/DiagnosticManagerTest.AddDiagnostic (1351 of 2260)
PASS: lldb-unit :: Expression/Release/ExpressionTests/DiagnosticManagerTest.AppendMessageAttachToLastDiag (1352 of 2260)
PASS: lldb-unit :: Expression/Release/ExpressionTests/DiagnosticManagerTest.AppendMessageSubsequentDiags (1353 of 2260)
PASS: lldb-unit :: Expression/Release/ExpressionTests/DiagnosticManagerTest.AppendMessageNoDiag (1354 of 2260)
PASS: lldb-shell :: lldb-server/TestErrorMessages.test (1355 of 2260)
PASS: lldb-unit :: Expression/Release/ExpressionTests/DiagnosticManagerTest.FixedExpression (1356 of 2260)
PASS: lldb-unit :: Expression/Release/ExpressionTests/DiagnosticManagerTest.GetStringBasic (1357 of 2260)
PASS: lldb-unit :: Expression/Release/ExpressionTests/DiagnosticManagerTest.GetStringMultipleDiags (1358 of 2260)
PASS: lldb-unit :: Expression/Release/ExpressionTests/DiagnosticManagerTest.GetStringNoDiags (1359 of 2260)
PASS: lldb-unit :: Expression/Release/ExpressionTests/DiagnosticManagerTest.GetStringMultiline (1360 of 2260)
PASS: lldb-unit :: Expression/Release/ExpressionTests/DiagnosticManagerTest.HasFixits (1361 of 2260)
PASS: lldb-unit :: Expression/Release/ExpressionTests/DiagnosticManagerTest.GetStringPreserveOrder (1362 of 2260)
PASS: lldb-unit :: Expression/Release/ExpressionTests/DiagnosticManagerTest.GetStringSeverityLabels (1363 of 2260)
PASS: lldb-unit :: Expression/Release/ExpressionTests/DiagnosticManagerTest.PutStringSeverities (1364 of 2260)
PASS: lldb-unit :: Expression/Release/ExpressionTests/DiagnosticManagerTest.PutString (1365 of 2260)
PASS: lldb-unit :: Expression/Release/ExpressionTests/DiagnosticManagerTest.PutStringMultiple (1366 of 2260)
PASS: lldb-unit :: Host/Release/HostTests/File.GetStreamFromDescriptor (1367 of 2260)
PASS: lldb-unit :: Host/Release/HostTests/ConnectionFileDescriptorTest.TCPGetURIv4 (1368 of 2260)
PASS: lldb-unit :: Host/Release/HostTests/ConnectionFileDescriptorTest.TCPGetURIv6 (1369 of 2260)
PASS: lldb-unit :: Host/Release/HostTests/File.GetWaitableHandleFileno (1370 of 2260)
PASS: lldb-unit :: Host/Release/HostTests/FileSystemTest.EmptyTest (1371 of 2260)
PASS: lldb-unit :: Host/Release/HostTests/FileActionTest.Open (1372 of 2260)
PASS: lldb-unit :: Host/Release/HostTests/FileSystemTest.EnumerateDirectory (1373 of 2260)
PASS: lldb-unit :: Host/Release/HostTests/FileSystemTest.Exists (1374 of 2260)
PASS: lldb-unit :: Host/Release/HostTests/FileSystemTest.FileAndDirectoryComponents (1375 of 2260)
PASS: lldb-unit :: Host/Release/HostTests/FileSystemTest.GetPermissions (1376 of 2260)
PASS: lldb-unit :: Host/Release/HostTests/FileSystemTest.GetByteSize (1377 of 2260)
PASS: lldb-unit :: Host/Release/HostTests/FileSystemTest.MakeAbsolute (1378 of 2260)
PASS: lldb-unit :: Host/Release/HostTests/FileSystemTest.Resolve (1379 of 2260)
PASS: lldb-unit :: Host/Release/HostTests/FileSystemTest.Readable (1380 of 2260)
PASS: lldb-unit :: Host/Release/HostTests/FileSystemTest.OpenErrno (1381 of 2260)
PASS: lldb-unit :: Host/Release/HostTests/Host.WaitStatusFormat (1382 of 2260)
PASS: lldb-unit :: Host/Release/HostTests/Host.GetEnvironment (1383 of 2260)
PASS: lldb-unit :: Host/Release/HostTests/HostInfoTest.GetAugmentedArchSpec (1384 of 2260)
PASS: lldb-unit :: Host/Release/HostTests/HostInfoTest.GetHostname (1385 of 2260)
PASS: lldb-unit :: Host/Release/HostTests/MainLoopTest.DetectsEOF (1386 of 2260)
PASS: lldb-unit :: Host/Release/HostTests/MainLoopTest.ReadObject (1387 of 2260)
PASS: lldb-unit :: Host/Release/HostTests/MainLoopTest.Signal (1388 of 2260)
PASS: lldb-unit :: Host/Release/HostTests/MainLoopTest.TerminatesImmediately (1389 of 2260)
PASS: lldb-unit :: Host/Release/HostTests/HostInfoTest.GetXcodeSDK (1390 of 2260)
PASS: lldb-unit :: Host/Release/HostTests/NativeProcessProtocolTest.ReadCStringFromMemory (1391 of 2260)
PASS: lldb-unit :: Host/Release/HostTests/NativeProcessProtocolTest.ReadCStringFromMemory_CrossPageBoundary (1392 of 2260)
PASS: lldb-unit :: Host/Release/HostTests/NativeProcessProtocolTest.ReadCStringFromMemory_MaxSize (1393 of 2260)
PASS: lldb-unit :: Host/Release/HostTests/NativeProcessProtocolTest.ReadMemoryWithoutTrap (1394 of 2260)
PASS: lldb-unit :: Host/Release/HostTests/NativeProcessProtocolTest.SetBreakpoint (1395 of 2260)
PASS: lldb-unit :: Host/Release/HostTests/NativeProcessProtocolTest.SetBreakpointFailRead (1396 of 2260)
PASS: lldb-unit :: Host/Release/HostTests/NativeProcessProtocolTest.SetBreakpointFailVerify (1397 of 2260)
PASS: lldb-unit :: Host/Release/HostTests/NativeProcessProtocolTest.SetBreakpointFailWrite (1398 of 2260)
PASS: lldb-unit :: Host/Release/HostTests/PipeTest.CreateWithUniqueName (1399 of 2260)
PASS: lldb-unit :: Host/Release/HostTests/PipeTest.OpenAsReader (1400 of 2260)
PASS: lldb-unit :: Host/Release/HostTests/ProcessLaunchInfoTest.Constructor (1401 of 2260)
PASS: lldb-unit :: Host/Release/HostTests/SocketAddressTest.GetAddressInfo (1402 of 2260)
PASS: lldb-unit :: Host/Release/HostTests/SocketAddressTest.Set (1403 of 2260)
PASS: lldb-unit :: Host/Release/HostTests/SocketTests/SocketTest.DecodeHostAndPort/ipv4 (1404 of 2260)
PASS: lldb-unit :: Host/Release/HostTests/SocketTests/SocketTest.DecodeHostAndPort/ipv6 (1405 of 2260)
PASS: lldb-unit :: Host/Release/HostTests/SocketTests/SocketTest.DomainGetConnectURI/ipv4 (1406 of 2260)
PASS: lldb-unit :: Host/Release/HostTests/SocketTests/SocketTest.DomainGetConnectURI/ipv6 (1407 of 2260)
PASS: lldb-unit :: Host/Release/HostTests/SocketTests/SocketTest.DomainListenConnectAccept/ipv4 (1408 of 2260)
PASS: lldb-unit :: Host/Release/HostTests/SocketTests/SocketTest.DomainListenConnectAccept/ipv6 (1409 of 2260)
PASS: lldb-unit :: Host/Release/HostTests/SocketTests/SocketTest.TCPGetAddress/ipv4 (1410 of 2260)
PASS: lldb-unit :: Host/Release/HostTests/SocketTests/SocketTest.TCPGetAddress/ipv6 (1411 of 2260)
PASS: lldb-unit :: Host/Release/HostTests/SocketTests/SocketTest.TCPGetConnectURI/ipv4 (1412 of 2260)
PASS: lldb-unit :: Host/Release/HostTests/SocketTests/SocketTest.TCPGetConnectURI/ipv6 (1413 of 2260)
PASS: lldb-unit :: Host/Release/HostTests/SocketTests/SocketTest.TCPListen0ConnectAccept/ipv4 (1414 of 2260)
PASS: lldb-unit :: Host/Release/HostTests/SocketTests/SocketTest.TCPListen0ConnectAccept/ipv6 (1415 of 2260)
PASS: lldb-unit :: Host/Release/HostTests/SocketTests/SocketTest.TCPListen0GetPort/ipv4 (1416 of 2260)
PASS: lldb-unit :: Host/Release/HostTests/SocketTests/SocketTest.TCPListen0GetPort/ipv6 (1417 of 2260)
PASS: lldb-unit :: Host/Release/HostTests/SocketTests/SocketTest.UDPConnect/ipv4 (1418 of 2260)
PASS: lldb-unit :: Host/Release/HostTests/SocketTests/SocketTest.UDPConnect/ipv6 (1419 of 2260)
PASS: lldb-unit :: Host/Release/HostTests/SocketTests/SocketTest.UDPGetConnectURI/ipv4 (1420 of 2260)
PASS: lldb-unit :: Host/Release/HostTests/SocketTests/SocketTest.UDPGetConnectURI/ipv6 (1421 of 2260)
PASS: lldb-unit :: Interpreter/Release/InterpreterTests/CompletionTest.DirCompletionAbsolute (1422 of 2260)
PASS: lldb-unit :: Interpreter/Release/InterpreterTests/CompletionTest.DirCompletionUsername (1423 of 2260)
PASS: lldb-unit :: Interpreter/Release/InterpreterTests/OptionArgParserTest.toBoolean (1424 of 2260)
PASS: lldb-unit :: Interpreter/Release/InterpreterTests/CompletionTest.FileCompletionAbsolute (1425 of 2260)
PASS: lldb-unit :: Interpreter/Release/InterpreterTests/OptionArgParserTest.toChar (1426 of 2260)
PASS: lldb-unit :: Interpreter/Release/InterpreterTests/OptionArgParserTest.toScriptLanguage (1427 of 2260)
PASS: lldb-shell :: Reproducer/TestWorkingDir.test (1428 of 2260)
PASS: lldb-unit :: Interpreter/Release/InterpreterTests/OptionValueFileColonLine.setFromString (1429 of 2260)
PASS: lldb-unit :: Language/CPlusPlus/Release/LanguageCPlusPlusTests/CPlusPlusLanguage.CPlusPlusNameParser (1430 of 2260)
PASS: lldb-unit :: Language/CLanguages/Release/LanguageCLanguagesTests/CLanguages.LookupCLanguagesByLanguageType (1431 of 2260)
PASS: lldb-unit :: Language/CPlusPlus/Release/LanguageCPlusPlusTests/CPlusPlusLanguage.ExtractContextAndIdentifier (1432 of 2260)
PASS: lldb-unit :: Language/CPlusPlus/Release/LanguageCPlusPlusTests/CPlusPlusLanguage.FindAlternateFunctionManglings (1433 of 2260)
PASS: lldb-unit :: Language/CPlusPlus/Release/LanguageCPlusPlusTests/CPlusPlusLanguage.MethodNameParsing (1434 of 2260)
PASS: lldb-unit :: Language/Highlighting/Release/HighlighterTests/HighlighterTest.ClangBraces (1435 of 2260)
PASS: lldb-unit :: Language/Highlighting/Release/HighlighterTests/HighlighterTest.ClangComments (1436 of 2260)
PASS: lldb-unit :: Language/Highlighting/Release/HighlighterTests/HighlighterTest.ClangCommas (1437 of 2260)
PASS: lldb-unit :: Language/Highlighting/Release/HighlighterTests/HighlighterTest.ClangCursorPosAfterOtherToken (1438 of 2260)
PASS: lldb-unit :: Language/Highlighting/Release/HighlighterTests/HighlighterTest.ClangCursorOutOfBounds (1439 of 2260)
PASS: lldb-unit :: Language/Highlighting/Release/HighlighterTests/HighlighterTest.ClangCursorPos (1440 of 2260)
PASS: lldb-unit :: Language/Highlighting/Release/HighlighterTests/HighlighterTest.ClangCursorPosInOtherToken (1441 of 2260)
PASS: lldb-unit :: Language/Highlighting/Release/HighlighterTests/HighlighterTest.ClangCursorPosEndOfLine (1442 of 2260)
PASS: lldb-unit :: Language/Highlighting/Release/HighlighterTests/HighlighterTest.ClangCursorPosBeforeOtherToken (1443 of 2260)
PASS: lldb-unit :: Language/Highlighting/Release/HighlighterTests/HighlighterTest.ClangOperators (1444 of 2260)
PASS: lldb-unit :: Language/Highlighting/Release/HighlighterTests/HighlighterTest.ClangIdentifiers (1445 of 2260)
PASS: lldb-unit :: Language/Highlighting/Release/HighlighterTests/HighlighterTest.ClangEmptyInput (1446 of 2260)
PASS: lldb-unit :: Language/Highlighting/Release/HighlighterTests/HighlighterTest.ClangPPDirectives (1447 of 2260)
PASS: lldb-unit :: Language/Highlighting/Release/HighlighterTests/HighlighterTest.ClangPreserveNewLine (1448 of 2260)
PASS: lldb-unit :: Language/Highlighting/Release/HighlighterTests/HighlighterTest.ClangScalarLiterals (1449 of 2260)
PASS: lldb-unit :: Language/Highlighting/Release/HighlighterTests/HighlighterTest.ClangStringLiterals (1450 of 2260)
PASS: lldb-unit :: Language/Highlighting/Release/HighlighterTests/HighlighterTest.ClangSquareBrackets (1451 of 2260)
PASS: lldb-unit :: Language/Highlighting/Release/HighlighterTests/HighlighterTest.ClangTrailingBackslashBeforeNewline (1452 of 2260)
PASS: lldb-unit :: Language/Highlighting/Release/HighlighterTests/HighlighterTest.ClangTrailingBackslashWithWhitespace (1453 of 2260)
PASS: lldb-unit :: Language/Highlighting/Release/HighlighterTests/HighlighterTest.ClangUnterminatedString (1454 of 2260)
PASS: lldb-unit :: Language/Highlighting/Release/HighlighterTests/HighlighterTest.ClangTrailingBackslashMissingNewLine (1455 of 2260)
PASS: lldb-unit :: Language/Highlighting/Release/HighlighterTests/HighlighterTest.DefaultHighlighterWithCursor (1456 of 2260)
PASS: lldb-unit :: Language/Highlighting/Release/HighlighterTests/HighlighterTest.DefaultHighlighter (1457 of 2260)
PASS: lldb-unit :: Language/Highlighting/Release/HighlighterTests/HighlighterTest.Colons (1458 of 2260)
PASS: lldb-unit :: Language/Highlighting/Release/HighlighterTests/HighlighterTest.DefaultHighlighterWithCursorOutOfBounds (1459 of 2260)
PASS: lldb-unit :: Language/Highlighting/Release/HighlighterTests/HighlighterTest.FallbackHighlighter (1460 of 2260)
PASS: lldb-unit :: Language/Highlighting/Release/HighlighterTests/HighlighterTest.HighlighterSelectionPath (1461 of 2260)
PASS: lldb-unit :: ObjectFile/Breakpad/Release/ObjectFileBreakpadTests/FileRecord.parse (1462 of 2260)
PASS: lldb-unit :: Language/Highlighting/Release/HighlighterTests/HighlighterTest.HighlighterSelectionType (1463 of 2260)
PASS: lldb-unit :: Language/Highlighting/Release/HighlighterTests/HighlighterTest.Keywords (1464 of 2260)
PASS: lldb-shell :: Watchpoint/SetErrorCases.test (1465 of 2260)
PASS: lldb-unit :: ObjectFile/Breakpad/Release/ObjectFileBreakpadTests/FuncRecord.parse (1466 of 2260)
PASS: lldb-unit :: ObjectFile/Breakpad/Release/ObjectFileBreakpadTests/InfoRecord.parse (1467 of 2260)
PASS: lldb-unit :: ObjectFile/Breakpad/Release/ObjectFileBreakpadTests/LineRecord.parse (1468 of 2260)
PASS: lldb-unit :: ObjectFile/Breakpad/Release/ObjectFileBreakpadTests/PublicRecord.parse (1469 of 2260)
PASS: lldb-unit :: ObjectFile/Breakpad/Release/ObjectFileBreakpadTests/ModuleRecord.parse (1470 of 2260)
PASS: lldb-unit :: ObjectFile/Breakpad/Release/ObjectFileBreakpadTests/Record.classify (1471 of 2260)
PASS: lldb-unit :: ObjectFile/Breakpad/Release/ObjectFileBreakpadTests/StackCFIRecord.parse (1472 of 2260)
PASS: lldb-unit :: ObjectFile/Breakpad/Release/ObjectFileBreakpadTests/StackWinRecord.parse (1473 of 2260)
PASS: lldb-unit :: ObjectFile/ELF/Release/ObjectFileELFTests/ObjectFileELFTest.GetModuleSpecifications_EarlySectionHeaders (1474 of 2260)
PASS: lldb-unit :: ObjectFile/ELF/Release/ObjectFileELFTests/ObjectFileELFTest.GetSymtab_NoSymEntryPointArmThumbAddressClass (1475 of 2260)
PASS: lldb-unit :: ObjectFile/ELF/Release/ObjectFileELFTests/ObjectFileELFTest.GetSymtab_NoSymEntryPointArmAddressClass (1476 of 2260)
PASS: lldb-unit :: ObjectFile/ELF/Release/ObjectFileELFTests/ObjectFileELFTest.SectionsResolveConsistently (1477 of 2260)
PASS: lldb-unit :: ObjectFile/PECOFF/Release/ObjectFilePECOFFTests/PECallFrameInfoTest.Basic_eh (1478 of 2260)
PASS: lldb-unit :: ObjectFile/MachO/Release/ObjectFileMachOTests/ObjectFileMachOTest.ModuleFromSharedCacheInfo (1479 of 2260)
PASS: lldb-unit :: ObjectFile/PECOFF/Release/ObjectFilePECOFFTests/PECallFrameInfoTest.Chained_eh (1480 of 2260)
PASS: lldb-unit :: ObjectFile/PECOFF/Release/ObjectFilePECOFFTests/PECallFrameInfoTest.Frame_reg_eh (1481 of 2260)
PASS: lldb-unit :: Platform/Android/Release/AdbClientTests/AdbClientTest.CreateByDeviceId_ByEnvVar (1482 of 2260)
PASS: lldb-unit :: Platform/Android/Release/AdbClientTests/AdbClientTest.CreateByDeviceId (1483 of 2260)
PASS: lldb-unit :: Platform/Release/LLDBPlatformTests/PlatformDarwinTest.FindComponentInPath (1484 of 2260)
PASS: lldb-unit :: Platform/Release/LLDBPlatformTests/PlatformDarwinTest.TestParseVersionBuildDir (1485 of 2260)
PASS: lldb-unit :: Process/Release/ProcessEventDataTests/ProcessEventDataTest.ShouldStop (1486 of 2260)
PASS: lldb-unit :: Process/Release/ProcessEventDataTests/ProcessEventDataTest.DoOnRemoval (1487 of 2260)
PASS: lldb-unit :: Process/Utility/Release/ProcessUtilityTests/ProcMapTests/LinuxProcMapsTestFixture.ParseMapRegions/1 (1488 of 2260)
PASS: lldb-unit :: Process/Utility/Release/ProcessUtilityTests/ProcMapTests/LinuxProcMapsTestFixture.ParseMapRegions/0 (1489 of 2260)
PASS: lldb-unit :: Process/Utility/Release/ProcessUtilityTests/ProcMapTests/LinuxProcMapsTestFixture.ParseMapRegions/3 (1490 of 2260)
PASS: lldb-unit :: Process/Utility/Release/ProcessUtilityTests/ProcMapTests/LinuxProcMapsTestFixture.ParseMapRegions/2 (1491 of 2260)
PASS: lldb-unit :: Process/Utility/Release/ProcessUtilityTests/ProcMapTests/LinuxProcMapsTestFixture.ParseMapRegions/5 (1492 of 2260)
PASS: lldb-unit :: Process/Utility/Release/ProcessUtilityTests/ProcMapTests/LinuxProcMapsTestFixture.ParseMapRegions/4 (1493 of 2260)
PASS: lldb-unit :: Process/Utility/Release/ProcessUtilityTests/ProcMapTests/LinuxProcMapsTestFixture.ParseMapRegions/7 (1494 of 2260)
PASS: lldb-unit :: Process/Utility/Release/ProcessUtilityTests/ProcMapTests/LinuxProcMapsTestFixture.ParseMapRegions/6 (1495 of 2260)
PASS: lldb-unit :: Process/Utility/Release/ProcessUtilityTests/ProcMapTests/LinuxProcMapsTestFixture.ParseMapRegions/8 (1496 of 2260)
PASS: lldb-unit :: Process/Utility/Release/ProcessUtilityTests/ProcSMapTests/LinuxProcSMapsTestFixture.ParseSMapRegions/0 (1497 of 2260)
PASS: lldb-unit :: Process/Utility/Release/ProcessUtilityTests/ProcSMapTests/LinuxProcSMapsTestFixture.ParseSMapRegions/2 (1498 of 2260)
PASS: lldb-unit :: Process/Utility/Release/ProcessUtilityTests/ProcSMapTests/LinuxProcSMapsTestFixture.ParseSMapRegions/1 (1499 of 2260)
PASS: lldb-unit :: Process/Utility/Release/ProcessUtilityTests/ProcSMapTests/LinuxProcSMapsTestFixture.ParseSMapRegions/4 (1500 of 2260)
PASS: lldb-unit :: Process/Utility/Release/ProcessUtilityTests/ProcSMapTests/LinuxProcSMapsTestFixture.ParseSMapRegions/3 (1501 of 2260)
PASS: lldb-unit :: Process/Utility/Release/ProcessUtilityTests/ProcSMapTests/LinuxProcSMapsTestFixture.ParseSMapRegions/6 (1502 of 2260)
PASS: lldb-unit :: Process/Utility/Release/ProcessUtilityTests/ProcSMapTests/LinuxProcSMapsTestFixture.ParseSMapRegions/5 (1503 of 2260)
PASS: lldb-unit :: Process/Utility/Release/ProcessUtilityTests/ProcSMapTests/LinuxProcSMapsTestFixture.ParseSMapRegions/7 (1504 of 2260)
PASS: lldb-unit :: Process/Utility/Release/ProcessUtilityTests/ProcSMapTests/LinuxProcSMapsTestFixture.ParseSMapRegions/8 (1505 of 2260)
PASS: lldb-unit :: Process/Utility/Release/ProcessUtilityTests/RegisterContext_x86Test.AbridgedToFullTagWord (1506 of 2260)
PASS: lldb-unit :: Process/Utility/Release/ProcessUtilityTests/ProcSMapTests/LinuxProcSMapsTestFixture.ParseSMapRegions/9 (1507 of 2260)
PASS: lldb-unit :: Process/Utility/Release/ProcessUtilityTests/RegisterContext_x86Test.FullToAbridgedTagWord (1508 of 2260)
PASS: lldb-unit :: Process/gdb-remote/Release/ProcessGdbRemoteTests/GDBRemoteClientBaseTest.SendContinueAndAsyncPacket (1509 of 2260)
PASS: lldb-unit :: Process/gdb-remote/Release/ProcessGdbRemoteTests/GDBRemoteClientBaseTest.SendContinueAndAsyncSignal (1510 of 2260)
PASS: lldb-shell :: SymbolFile/Breakpad/unwind-via-stack-win-no-memory-info.yaml (1511 of 2260)
PASS: lldb-shell :: SymbolFile/Breakpad/unwind-via-raSearch.test (1512 of 2260)
PASS: lldb-shell :: SymbolFile/Breakpad/unwind-via-stack-win.test (1513 of 2260)
PASS: lldb-unit :: Process/gdb-remote/Release/ProcessGdbRemoteTests/GDBRemoteClientBaseTest.SendContinueAndWait (1514 of 2260)
PASS: lldb-unit :: Process/gdb-remote/Release/ProcessGdbRemoteTests/GDBRemoteClientBaseTest.SendContinueAndInterrupt2PacketBug (1515 of 2260)
PASS: lldb-unit :: Process/gdb-remote/Release/ProcessGdbRemoteTests/GDBRemoteClientBaseTest.SendContinueDelegateStructuredDataReceipt (1516 of 2260)
PASS: lldb-unit :: Process/gdb-remote/Release/ProcessGdbRemoteTests/GDBRemoteClientBaseTest.SendContinueDelegateInterface (1517 of 2260)
PASS: lldb-unit :: Process/gdb-remote/Release/ProcessGdbRemoteTests/GDBRemoteClientBaseTest.SendContinueAndInterrupt (1518 of 2260)
PASS: lldb-unit :: Process/gdb-remote/Release/ProcessGdbRemoteTests/GDBRemoteClientBaseTest.SendPacketAndReceiveResponseWithOutputSupport (1519 of 2260)
PASS: lldb-unit :: Process/gdb-remote/Release/ProcessGdbRemoteTests/GDBRemoteCommunicationClientTest.GetMemoryRegionInfoInvalidResponse (1520 of 2260)
PASS: lldb-unit :: Process/gdb-remote/Release/ProcessGdbRemoteTests/GDBRemoteCommunicationClientTest.GetMemoryRegionInfo (1521 of 2260)
PASS: lldb-unit :: Process/gdb-remote/Release/ProcessGdbRemoteTests/GDBRemoteCommunicationClientTest.GetModulesInfo (1522 of 2260)
PASS: lldb-unit :: Process/gdb-remote/Release/ProcessGdbRemoteTests/GDBRemoteCommunicationClientTest.GetModulesInfo_UUID20 (1523 of 2260)
PASS: lldb-unit :: Process/gdb-remote/Release/ProcessGdbRemoteTests/GDBRemoteCommunicationClientTest.GetModulesInfoInvalidResponse (1524 of 2260)
PASS: lldb-unit :: Process/gdb-remote/Release/ProcessGdbRemoteTests/GDBRemoteCommunicationClientTest.SaveRestoreRegistersNoSuffix (1525 of 2260)
PASS: lldb-unit :: Process/gdb-remote/Release/ProcessGdbRemoteTests/GDBRemoteCommunicationClientTest.ReadRegister (1526 of 2260)
PASS: lldb-unit :: Process/gdb-remote/Release/ProcessGdbRemoteTests/GDBRemoteCommunicationClientTest.GetQOffsets (1527 of 2260)
PASS: lldb-unit :: Process/gdb-remote/Release/ProcessGdbRemoteTests/GDBRemoteCommunicationClientTest.SendGetDataPacket (1528 of 2260)
PASS: lldb-unit :: Process/gdb-remote/Release/ProcessGdbRemoteTests/GDBRemoteCommunicationClientTest.SendGetMetaDataPacket (1529 of 2260)
PASS: lldb-unit :: Process/gdb-remote/Release/ProcessGdbRemoteTests/GDBRemoteCommunicationClientTest.SendGetTraceConfigPacket (1530 of 2260)
PASS: lldb-unit :: Process/gdb-remote/Release/ProcessGdbRemoteTests/GDBRemoteCommunicationClientTest.SendSignalsToIgnore (1531 of 2260)
PASS: lldb-unit :: Process/gdb-remote/Release/ProcessGdbRemoteTests/GDBRemoteCommunicationClientTest.SendStopTracePacket (1532 of 2260)
PASS: lldb-unit :: Process/gdb-remote/Release/ProcessGdbRemoteTests/GDBRemoteCommunicationClientTest.SendStartTracePacket (1533 of 2260)
PASS: lldb-unit :: Process/gdb-remote/Release/ProcessGdbRemoteTests/GDBRemoteCommunicationClientTest.SyncThreadState (1534 of 2260)
PASS: lldb-unit :: Process/gdb-remote/Release/ProcessGdbRemoteTests/GDBRemoteCommunicationClientTest.SendTraceSupportedTypePacket (1535 of 2260)
PASS: lldb-unit :: Process/gdb-remote/Release/ProcessGdbRemoteTests/GDBRemoteClientBaseTest.SendContinueAndLateInterrupt (1536 of 2260)
PASS: lldb-unit :: Process/gdb-remote/Release/ProcessGdbRemoteTests/GDBRemoteCommunicationClientTest.WriteRegister (1537 of 2260)
PASS: lldb-unit :: Process/gdb-remote/Release/ProcessGdbRemoteTests/GDBRemoteCommunicationClientTest.WriteRegisterNoSuffix (1538 of 2260)
PASS: lldb-unit :: Process/gdb-remote/Release/ProcessGdbRemoteTests/GDBRemoteCommunicationServerTest.SendErrorResponse_ErrorList (1539 of 2260)
PASS: lldb-unit :: Process/gdb-remote/Release/ProcessGdbRemoteTests/GDBRemoteCommunicationServerTest.SendErrorResponse_Status (1540 of 2260)
PASS: lldb-unit :: Process/gdb-remote/Release/ProcessGdbRemoteTests/GDBRemoteCommunicationServerTest.SendErrorResponse_ErrorNumber (1541 of 2260)
PASS: lldb-unit :: Process/gdb-remote/Release/ProcessGdbRemoteTests/GDBRemoteCommunicationClientTest.TestPacketSpeedJSON (1542 of 2260)
PASS: lldb-unit :: Process/gdb-remote/Release/ProcessGdbRemoteTests/GDBRemoteCommunicationServerTest.SendErrorResponse_StringError (1543 of 2260)
PASS: lldb-unit :: Process/gdb-remote/Release/ProcessGdbRemoteTests/GDBRemoteCommunicationServerTest.SendErrorResponse_UnimplementedError (1544 of 2260)
PASS: lldb-unit :: Process/gdb-remote/Release/ProcessGdbRemoteTests/GDBRemoteCommunicationTest.ReadPacket_checksum (1545 of 2260)
PASS: lldb-unit :: Process/gdb-remote/Release/ProcessGdbRemoteTests/PortMapTest.AllowPort (1546 of 2260)
PASS: lldb-unit :: Process/gdb-remote/Release/ProcessGdbRemoteTests/PortMapTest.Constructors (1547 of 2260)
PASS: lldb-unit :: Process/gdb-remote/Release/ProcessGdbRemoteTests/PortMapTest.FreePort (1548 of 2260)
PASS: lldb-unit :: Process/gdb-remote/Release/ProcessGdbRemoteTests/PortMapTest.FreePortForProcess (1549 of 2260)
PASS: lldb-unit :: Process/minidump/Release/LLDBMinidumpTests/MinidumpParserTest.FindMemoryRange (1550 of 2260)
PASS: lldb-unit :: Process/minidump/Release/LLDBMinidumpTests/MinidumpParserTest.GetArchitecture (1551 of 2260)
PASS: lldb-unit :: Process/minidump/Release/LLDBMinidumpTests/MinidumpParserTest.FindMemoryRangeWithFullMemoryMinidump (1552 of 2260)
PASS: lldb-unit :: Process/minidump/Release/LLDBMinidumpTests/MinidumpParserTest.GetArchitectureWindows (1553 of 2260)
PASS: lldb-unit :: Process/minidump/Release/LLDBMinidumpTests/MinidumpParserTest.GetExceptionStream (1554 of 2260)
PASS: lldb-unit :: Process/minidump/Release/LLDBMinidumpTests/MinidumpParserTest.GetLinuxProcStatus (1555 of 2260)
PASS: lldb-unit :: Process/minidump/Release/LLDBMinidumpTests/MinidumpParserTest.GetFilteredModuleList (1556 of 2260)
PASS: lldb-unit :: Process/minidump/Release/LLDBMinidumpTests/MinidumpParserTest.GetLinuxProcStatus_no_stream (1557 of 2260)
PASS: lldb-unit :: Process/minidump/Release/LLDBMinidumpTests/MinidumpParserTest.GetMemoryRegionInfoFromMemory64List (1558 of 2260)
PASS: lldb-unit :: Process/minidump/Release/LLDBMinidumpTests/MinidumpParserTest.GetMemory (1559 of 2260)
PASS: lldb-unit :: Process/minidump/Release/LLDBMinidumpTests/MinidumpParserTest.GetMemoryRegionInfo (1560 of 2260)
PASS: lldb-unit :: Process/minidump/Release/LLDBMinidumpTests/MinidumpParserTest.GetMemoryRegionInfoFromMemoryList (1561 of 2260)
PASS: lldb-unit :: Process/minidump/Release/LLDBMinidumpTests/MinidumpParserTest.GetMemoryRegionInfoLinuxMapsError (1562 of 2260)
PASS: lldb-unit :: Process/minidump/Release/LLDBMinidumpTests/MinidumpParserTest.GetMiscInfoWindows (1563 of 2260)
PASS: lldb-unit :: Process/minidump/Release/LLDBMinidumpTests/MinidumpParserTest.GetMemoryRegionInfoLinuxMaps (1564 of 2260)
PASS: lldb-unit :: Process/minidump/Release/LLDBMinidumpTests/MinidumpParserTest.GetMiscInfo_no_stream (1565 of 2260)
PASS: lldb-unit :: Process/minidump/Release/LLDBMinidumpTests/MinidumpParserTest.GetPid (1566 of 2260)
PASS: lldb-unit :: Process/minidump/Release/LLDBMinidumpTests/MinidumpParserTest.GetPidWindows (1567 of 2260)
PASS: lldb-unit :: Process/minidump/Release/LLDBMinidumpTests/MinidumpParserTest.GetPidWow64 (1568 of 2260)
PASS: lldb-unit :: Process/minidump/Release/LLDBMinidumpTests/MinidumpParserTest.GetThreadContext_x86_32 (1569 of 2260)
PASS: lldb-unit :: Process/minidump/Release/LLDBMinidumpTests/MinidumpParserTest.GetThreadContext_x86_64 (1570 of 2260)
PASS: lldb-unit :: Process/minidump/Release/LLDBMinidumpTests/MinidumpParserTest.GetThreadsAndGetThreadContext (1571 of 2260)
PASS: lldb-unit :: Process/minidump/Release/LLDBMinidumpTests/MinidumpParserTest.GetThreadContext_x86_32_wow64 (1572 of 2260)
PASS: lldb-unit :: Process/minidump/Release/LLDBMinidumpTests/MinidumpParserTest.InvalidMinidump (1573 of 2260)
PASS: lldb-unit :: Process/minidump/Release/LLDBMinidumpTests/MinidumpParserTest.MinidumpDuplicateModuleMappedSecond (1574 of 2260)
PASS: lldb-unit :: Process/minidump/Release/LLDBMinidumpTests/MinidumpParserTest.MinidumpDuplicateModuleMappedFirst (1575 of 2260)
PASS: lldb-unit :: Process/minidump/Release/LLDBMinidumpTests/MinidumpParserTest.MinidumpDuplicateModuleMinAddress (1576 of 2260)
PASS: lldb-unit :: Process/minidump/Release/LLDBMinidumpTests/MinidumpParserTest.MinidumpDuplicateModuleMappedSecondHigh (1577 of 2260)
PASS: lldb-unit :: Process/minidump/Release/LLDBMinidumpTests/RegisterContextMinidump.ConvertMinidumpContext_x86_32 (1578 of 2260)
PASS: lldb-unit :: Process/minidump/Release/LLDBMinidumpTests/MinidumpParserTest.MinidumpDuplicateModuleSeparateCode (1579 of 2260)
PASS: lldb-unit :: Process/minidump/Release/LLDBMinidumpTests/RegisterContextMinidump.CheckRegisterContextMinidump_ARM (1580 of 2260)
PASS: lldb-unit :: Process/minidump/Release/LLDBMinidumpTests/MinidumpParserTest.MinidumpModuleOrder (1581 of 2260)
PASS: lldb-unit :: Process/minidump/Release/LLDBMinidumpTests/RegisterContextMinidump.ConvertMinidumpContext_x86_64 (1582 of 2260)
PASS: lldb-unit :: ScriptInterpreter/Python/Release/ScriptInterpreterPythonTests/PythonDataObjectsTest.TestBorrowedReferences (1583 of 2260)
PASS: lldb-unit :: ScriptInterpreter/Python/Release/ScriptInterpreterPythonTests/PythonDataObjectsTest.TestDictionaryResolutionWithDot (1584 of 2260)
PASS: lldb-unit :: ScriptInterpreter/Python/Release/ScriptInterpreterPythonTests/PythonDataObjectsTest.TestExceptions (1585 of 2260)
PASS: lldb-unit :: ScriptInterpreter/Python/Release/ScriptInterpreterPythonTests/PythonDataObjectsTest.TestCallable (1586 of 2260)
PASS: lldb-unit :: ScriptInterpreter/Python/Release/ScriptInterpreterPythonTests/PythonDataObjectsTest.TestExtractingUInt64ThroughStructuredData (1587 of 2260)
PASS: lldb-unit :: ScriptInterpreter/Python/Release/ScriptInterpreterPythonTests/PythonDataObjectsTest.TestGlobalNameResolutionNoDot (1588 of 2260)
PASS: lldb-unit :: ScriptInterpreter/Python/Release/ScriptInterpreterPythonTests/PythonDataObjectsTest.TestGlobalNameResolutionWithDot (1589 of 2260)
PASS: lldb-unit :: ScriptInterpreter/Python/Release/ScriptInterpreterPythonTests/PythonDataObjectsTest.TestInstanceNameResolutionNoDot (1590 of 2260)
PASS: lldb-unit :: ScriptInterpreter/Python/Release/ScriptInterpreterPythonTests/PythonDataObjectsTest.TestModuleNameResolutionNoDot (1591 of 2260)
PASS: lldb-unit :: ScriptInterpreter/Python/Release/ScriptInterpreterPythonTests/PythonDataObjectsTest.TestObjectAttributes (1592 of 2260)
PASS: lldb-shell :: Reproducer/TestMultipleTargets.test (1593 of 2260)
PASS: lldb-unit :: ScriptInterpreter/Python/Release/ScriptInterpreterPythonTests/PythonDataObjectsTest.TestOwnedReferences (1594 of 2260)
PASS: lldb-unit :: ScriptInterpreter/Python/Release/ScriptInterpreterPythonTests/PythonDataObjectsTest.TestPythonBoolean (1595 of 2260)
PASS: lldb-unit :: ScriptInterpreter/Python/Release/ScriptInterpreterPythonTests/PythonDataObjectsTest.TestPythonByteArray (1596 of 2260)
PASS: lldb-unit :: ScriptInterpreter/Python/Release/ScriptInterpreterPythonTests/PythonDataObjectsTest.TestPythonBytes (1597 of 2260)
PASS: lldb-unit :: ScriptInterpreter/Python/Release/ScriptInterpreterPythonTests/PythonDataObjectsTest.TestPythonCallableCheck (1598 of 2260)
PASS: lldb-unit :: ScriptInterpreter/Python/Release/ScriptInterpreterPythonTests/PythonDataObjectsTest.TestPythonCallableInvoke (1599 of 2260)
PASS: lldb-unit :: ScriptInterpreter/Python/Release/ScriptInterpreterPythonTests/PythonDataObjectsTest.TestPythonDictionaryManipulation (1600 of 2260)
PASS: lldb-unit :: ScriptInterpreter/Python/Release/ScriptInterpreterPythonTests/PythonDataObjectsTest.TestPythonDictionaryToStructuredDictionary (1601 of 2260)
PASS: lldb-unit :: ScriptInterpreter/Python/Release/ScriptInterpreterPythonTests/PythonDataObjectsTest.TestPythonDictionaryValueEquality (1602 of 2260)
PASS: lldb-unit :: ScriptInterpreter/Python/Release/ScriptInterpreterPythonTests/PythonDataObjectsTest.TestPythonFile (1603 of 2260)
PASS: lldb-unit :: ScriptInterpreter/Python/Release/ScriptInterpreterPythonTests/PythonDataObjectsTest.TestPythonInteger (1604 of 2260)
PASS: lldb-unit :: ScriptInterpreter/Python/Release/ScriptInterpreterPythonTests/PythonDataObjectsTest.TestPythonIntegerToStr (1605 of 2260)
PASS: lldb-unit :: ScriptInterpreter/Python/Release/ScriptInterpreterPythonTests/PythonDataObjectsTest.TestPythonListManipulation (1606 of 2260)
PASS: lldb-unit :: ScriptInterpreter/Python/Release/ScriptInterpreterPythonTests/PythonDataObjectsTest.TestPythonIntegerToStructuredInteger (1607 of 2260)
PASS: lldb-unit :: ScriptInterpreter/Python/Release/ScriptInterpreterPythonTests/PythonDataObjectsTest.TestPythonListToStructuredList (1608 of 2260)
PASS: lldb-unit :: ScriptInterpreter/Python/Release/ScriptInterpreterPythonTests/PythonDataObjectsTest.TestPythonListValueEquality (1609 of 2260)
PASS: lldb-unit :: ScriptInterpreter/Python/Release/ScriptInterpreterPythonTests/PythonDataObjectsTest.TestPythonString (1610 of 2260)
PASS: lldb-unit :: ScriptInterpreter/Python/Release/ScriptInterpreterPythonTests/PythonDataObjectsTest.TestPythonStringToStr (1611 of 2260)
PASS: lldb-unit :: ScriptInterpreter/Python/Release/ScriptInterpreterPythonTests/PythonDataObjectsTest.TestPythonStringToStructuredString (1612 of 2260)
PASS: lldb-unit :: ScriptInterpreter/Python/Release/ScriptInterpreterPythonTests/PythonDataObjectsTest.TestPythonTupleInitializerList (1613 of 2260)
PASS: lldb-unit :: ScriptInterpreter/Python/Release/ScriptInterpreterPythonTests/PythonDataObjectsTest.TestPythonTupleInitializerList2 (1614 of 2260)
PASS: lldb-unit :: ScriptInterpreter/Python/Release/ScriptInterpreterPythonTests/PythonDataObjectsTest.TestPythonTupleSize (1615 of 2260)
PASS: lldb-unit :: ScriptInterpreter/Python/Release/ScriptInterpreterPythonTests/PythonDataObjectsTest.TestPythonTupleToStructuredList (1616 of 2260)
PASS: lldb-unit :: ScriptInterpreter/Python/Release/ScriptInterpreterPythonTests/PythonDataObjectsTest.TestPythonTupleValues (1617 of 2260)
PASS: lldb-unit :: ScriptInterpreter/Python/Release/ScriptInterpreterPythonTests/PythonDataObjectsTest.TestResetting (1618 of 2260)
PASS: lldb-unit :: ScriptInterpreter/Python/Release/ScriptInterpreterPythonTests/PythonDataObjectsTest.TestRun (1619 of 2260)
PASS: lldb-unit :: Signals/Release/SignalsTests/UnixSignalsTest.GetFilteredSignals (1620 of 2260)
PASS: lldb-unit :: Signals/Release/SignalsTests/UnixSignalsTest.GetInfo (1621 of 2260)
PASS: lldb-unit :: Signals/Release/SignalsTests/UnixSignalsTest.Iteration (1622 of 2260)
PASS: lldb-unit :: Signals/Release/SignalsTests/UnixSignalsTest.VersionChange (1623 of 2260)
PASS: lldb-unit :: ScriptInterpreter/Python/Release/ScriptInterpreterPythonTests/PythonDataObjectsTest.TestScript (1624 of 2260)
PASS: lldb-unit :: Symbol/Release/SymbolTests/DWARFCallFrameInfoTest.Basic_dwarf3 (1625 of 2260)
PASS: lldb-unit :: Symbol/Release/SymbolTests/DWARFCallFrameInfoTest.Basic_eh (1626 of 2260)
PASS: lldb-unit :: Symbol/Release/SymbolTests/DWARFCallFrameInfoTest.Basic_dwarf4 (1627 of 2260)
PASS: lldb-unit :: ScriptInterpreter/Python/Release/ScriptInterpreterPythonTests/PythonDataObjectsTest.TestTypeNameResolutionNoDot (1628 of 2260)
PASS: lldb-unit :: Symbol/Release/SymbolTests/LineEntryTest.GetSameLineContiguousAddressRangeNestedInline (1629 of 2260)
PASS: lldb-unit :: Symbol/Release/SymbolTests/LineEntryTest.GetSameLineContiguousAddressRangeNoInlines (1630 of 2260)
PASS: lldb-unit :: Symbol/Release/SymbolTests/PostfixExpression.ParseFPOProgram (1631 of 2260)
PASS: lldb-unit :: Symbol/Release/SymbolTests/PostfixExpression.ParseOneExpression (1632 of 2260)
PASS: lldb-unit :: Symbol/Release/SymbolTests/LineEntryTest.GetSameLineContiguousAddressRangeOneInline (1633 of 2260)
PASS: lldb-unit :: Symbol/Release/SymbolTests/PostfixExpression.ToDWARF (1634 of 2260)
PASS: lldb-unit :: Symbol/Release/SymbolTests/SymbolsTest.LocateExecutableSymbolFileForUnknownExecutableAndMissingSymbolFile (1635 of 2260)
PASS: lldb-unit :: Symbol/Release/SymbolTests/TestClangASTImporter.CanImportInvalidType (1636 of 2260)
PASS: lldb-unit :: Symbol/Release/SymbolTests/SymbolsTest.TerminateLocateExecutableSymbolFileForUnknownExecutableAndUnknownSymbolFile (1637 of 2260)
PASS: lldb-unit :: Symbol/Release/SymbolTests/TestClangASTImporter.CompleteFwdDeclWithOtherOrigin (1638 of 2260)
PASS: lldb-unit :: Symbol/Release/SymbolTests/TestClangASTImporter.CopyDeclTagDecl (1639 of 2260)
PASS: lldb-api :: types/TestLongTypes.py (1640 of 2260)
PASS: lldb-unit :: Symbol/Release/SymbolTests/TestClangASTImporter.CopyTypeTagDecl (1641 of 2260)
PASS: lldb-unit :: Symbol/Release/SymbolTests/TestClangASTImporter.DeportDeclTagDecl (1642 of 2260)
PASS: lldb-unit :: Symbol/Release/SymbolTests/TestClangASTImporter.DeportTypeTagDecl (1643 of 2260)
PASS: lldb-unit :: Symbol/Release/SymbolTests/TestClangASTImporter.ImportInvalidType (1644 of 2260)
PASS: lldb-unit :: Symbol/Release/SymbolTests/TestClangASTImporter.MetadataPropagation (1645 of 2260)
PASS: lldb-unit :: Symbol/Release/SymbolTests/TestScratchTypeSystemClang.InferSubASTFromLangOpts (1646 of 2260)
PASS: lldb-unit :: Symbol/Release/SymbolTests/TestClangASTImporter.RecordLayout (1647 of 2260)
PASS: lldb-unit :: Symbol/Release/SymbolTests/TestClangASTImporter.MetadataPropagationAfterCopying (1648 of 2260)
PASS: lldb-unit :: Symbol/Release/SymbolTests/TestClangASTImporter.MetadataPropagationIndirectImport (1649 of 2260)
PASS: lldb-unit :: Symbol/Release/SymbolTests/TestTypeSystemClang.AddMethodToObjCObjectType (1650 of 2260)
PASS: lldb-unit :: Symbol/Release/SymbolTests/TestTypeSystemClang.OnlyPackName (1651 of 2260)
PASS: lldb-unit :: Symbol/Release/SymbolTests/TestTypeSystemClang.TemplateArguments (1652 of 2260)
PASS: lldb-unit :: Symbol/Release/SymbolTests/TestTypeSystemClang.TestConvertAccessTypeToAccessSpecifier (1653 of 2260)
PASS: lldb-unit :: Symbol/Release/SymbolTests/TestTypeSystemClang.TestDeletingImplicitCopyCstrDueToMoveCStr (1654 of 2260)
PASS: lldb-unit :: Symbol/Release/SymbolTests/TestTypeSystemClang.TestBuiltinTypeForEncodingAndBitSize (1655 of 2260)
PASS: lldb-unit :: Symbol/Release/SymbolTests/TestTypeSystemClang.TestDisplayName (1656 of 2260)
PASS: lldb-unit :: Symbol/Release/SymbolTests/TestTypeSystemClang.TestDisplayNameEmpty (1657 of 2260)
PASS: lldb-unit :: Symbol/Release/SymbolTests/TestTypeSystemClang.TestFunctionTemplateConstruction (1658 of 2260)
PASS: lldb-unit :: Symbol/Release/SymbolTests/TestTypeSystemClang.TestGetBasicTypeFromName (1659 of 2260)
PASS: lldb-unit :: Symbol/Release/SymbolTests/TestTypeSystemClang.TestFunctionTemplateInRecordConstruction (1660 of 2260)
PASS: lldb-unit :: Symbol/Release/SymbolTests/TestTypeSystemClang.TestGetBasicTypeFromEnum (1661 of 2260)
PASS: lldb-unit :: Symbol/Release/SymbolTests/TestTypeSystemClang.TestGetEnumIntegerTypeInvalid (1662 of 2260)
PASS: lldb-unit :: Symbol/Release/SymbolTests/TestTypeSystemClang.TestGetEnumIntegerTypeBasicTypes (1663 of 2260)
PASS: lldb-unit :: Symbol/Release/SymbolTests/TestTypeSystemClang.TestGetTypeClassDeclType (1664 of 2260)
PASS: lldb-unit :: Symbol/Release/SymbolTests/TestTypeSystemClang.TestGetEnumIntegerTypeUnexpectedType (1665 of 2260)
PASS: lldb-unit :: Symbol/Release/SymbolTests/TestTypeSystemClang.TestGetTypeClassTypeOf (1666 of 2260)
PASS: lldb-unit :: Symbol/Release/SymbolTests/TestTypeSystemClang.TestGetTypeClassNested (1667 of 2260)
PASS: lldb-unit :: Symbol/Release/SymbolTests/TestTypeSystemClang.TestGetTypeClassTypeOfExpr (1668 of 2260)
PASS: lldb-unit :: Symbol/Release/SymbolTests/TestTypeSystemClang.TestIsClangType (1669 of 2260)
PASS: lldb-unit :: Symbol/Release/SymbolTests/TestTypeSystemClang.TestOwningModule (1670 of 2260)
PASS: lldb-unit :: Symbol/Release/SymbolTests/TestTypeSystemClang.TestRecordHasFields (1671 of 2260)
PASS: lldb-unit :: Symbol/Release/SymbolTests/TestTypeSystemClang.TestRemoveFastQualifiers (1672 of 2260)
PASS: lldb-unit :: Symbol/Release/SymbolTests/TestTypeSystemClang.TestNotDeletingUserCopyCstrDueToMoveCStr (1673 of 2260)
PASS: lldb-unit :: Symbol/Release/SymbolTests/TestTypeSystemClang.TestUnifyAccessSpecifiers (1674 of 2260)
PASS: lldb-unit :: Symbol/Release/SymbolTests/Type.CompilerContextPattern (1675 of 2260)
PASS: lldb-unit :: Symbol/Release/SymbolTests/Type.GetTypeScopeAndBasename (1676 of 2260)
PASS: lldb-unit :: SymbolFile/DWARF/Release/SymbolFileDWARFTests/SymbolFileDWARFTests.ParseArangesNonzeroSegmentSize (1677 of 2260)
PASS: lldb-unit :: SymbolFile/DWARF/Release/SymbolFileDWARFTests/SymbolFileDWARFTests.ParseAranges (1678 of 2260)
PASS: lldb-unit :: SymbolFile/DWARF/Release/SymbolFileDWARFTests/SymbolFileDWARFTests.TestAbbrevMissingTerminator (1679 of 2260)
PASS: lldb-unit :: SymbolFile/DWARF/Release/SymbolFileDWARFTests/SymbolFileDWARFTests.TestAbbrevInvalidNULLTag (1680 of 2260)
PASS: lldb-unit :: SymbolFile/DWARF/Release/SymbolFileDWARFTests/DWARFASTParserClangTests.EnsureAllDIEsInDeclContextHaveBeenParsedParsesOnlyMatchingEntries (1681 of 2260)
PASS: lldb-unit :: SymbolFile/DWARF/Release/SymbolFileDWARFTests/SymbolFileDWARFTests.TestAbbrevNullAttrValidForm (1682 of 2260)
PASS: lldb-unit :: SymbolFile/DWARF/Release/SymbolFileDWARFTests/SymbolFileDWARFTests.TestAbbrevOrder1Start1 (1683 of 2260)
PASS: lldb-unit :: SymbolFile/DWARF/Release/SymbolFileDWARFTests/SymbolFileDWARFTests.TestAbbrevOrder1Start5 (1684 of 2260)
PASS: lldb-unit :: SymbolFile/DWARF/Release/SymbolFileDWARFTests/SymbolFileDWARFTests.TestAbbrevValidAttrNullForm (1685 of 2260)
PASS: lldb-unit :: SymbolFile/DWARF/Release/SymbolFileDWARFTests/SymbolFileDWARFTests.TestAbbrevOutOfOrder (1686 of 2260)
PASS: lldb-unit :: SymbolFile/DWARF/Release/SymbolFileDWARFTests/SymbolFileDWARFTests.TestAbilitiesForDWARF (1687 of 2260)
PASS: lldb-unit :: SymbolFile/NativePDB/Release/SymbolFileNativePDBTests/PDBFPOProgramToDWARFExpressionTests.InvalidAssignmentMultiple (1688 of 2260)
PASS: lldb-unit :: SymbolFile/NativePDB/Release/SymbolFileNativePDBTests/PDBFPOProgramToDWARFExpressionTests.DependencyChain (1689 of 2260)
PASS: lldb-unit :: SymbolFile/NativePDB/Release/SymbolFileNativePDBTests/PDBFPOProgramToDWARFExpressionTests.InvalidOpBinary (1690 of 2260)
PASS: lldb-unit :: SymbolFile/NativePDB/Release/SymbolFileNativePDBTests/PDBFPOProgramToDWARFExpressionTests.InvalidAssignmentSingle (1691 of 2260)
PASS: lldb-shell :: Reproducer/TestGDBRemoteRepro.test (1692 of 2260)
PASS: lldb-unit :: SymbolFile/NativePDB/Release/SymbolFileNativePDBTests/PDBFPOProgramToDWARFExpressionTests.InvalidOpUnary (1693 of 2260)
PASS: lldb-unit :: SymbolFile/NativePDB/Release/SymbolFileNativePDBTests/PDBFPOProgramToDWARFExpressionTests.MissingTargetRegister (1694 of 2260)
PASS: lldb-unit :: SymbolFile/NativePDB/Release/SymbolFileNativePDBTests/PDBFPOProgramToDWARFExpressionTests.MultipleIndependentAssignments (1695 of 2260)
PASS: lldb-unit :: SymbolFile/NativePDB/Release/SymbolFileNativePDBTests/PDBFPOProgramToDWARFExpressionTests.SingleAssignmentRegisterRef (1696 of 2260)
PASS: lldb-unit :: SymbolFile/NativePDB/Release/SymbolFileNativePDBTests/PDBFPOProgramToDWARFExpressionTests.MultipleDependentAssignments (1697 of 2260)
PASS: lldb-unit :: SymbolFile/NativePDB/Release/SymbolFileNativePDBTests/PDBFPOProgramToDWARFExpressionTests.UnknownOp (1698 of 2260)
PASS: lldb-unit :: SymbolFile/NativePDB/Release/SymbolFileNativePDBTests/PDBFPOProgramToDWARFExpressionTests.UnresolvedCyclicRegisterAssignmentReference (1699 of 2260)
PASS: lldb-unit :: SymbolFile/NativePDB/Release/SymbolFileNativePDBTests/PDBFPOProgramToDWARFExpressionTests.UnresolvedRegisterAssignmentReference (1700 of 2260)
PASS: lldb-unit :: SymbolFile/NativePDB/Release/SymbolFileNativePDBTests/PDBFPOProgramToDWARFExpressionTests.UnresolvedRegisterReference (1701 of 2260)
PASS: lldb-unit :: SymbolFile/NativePDB/Release/SymbolFileNativePDBTests/PDBFPOProgramToDWARFExpressionTests.UnresolvedDependentCyclicRegisterAssignmentReference (1702 of 2260)
PASS: lldb-unit :: SymbolFile/NativePDB/Release/SymbolFileNativePDBTests/PDBFPOProgramToDWARFExpressionTests.UnsupportedRASearch (1703 of 2260)
PASS: lldb-unit :: Target/Release/TargetTests/ExecutionContextTest.GetByteOrder (1704 of 2260)
PASS: lldb-unit :: Target/Release/TargetTests/MemoryRegionInfoTest.Formatv (1705 of 2260)
PASS: lldb-unit :: Target/Release/TargetTests/MCBasedABI.MapRegisterName (1706 of 2260)
PASS: lldb-unit :: Target/Release/TargetTests/ExecutionContextTest.GetByteOrderProcess (1707 of 2260)
PASS: lldb-unit :: Target/Release/TargetTests/ExecutionContextTest.GetByteOrderTarget (1708 of 2260)
PASS: lldb-unit :: Target/Release/TargetTests/ModuleCacheTest.GetAndPut (1709 of 2260)
PASS: lldb-unit :: Target/Release/TargetTests/ModuleCacheTest.GetAndPutStrangeHostname (1710 of 2260)
PASS: lldb-unit :: Target/Release/TargetTests/PathMappingListTest.AbsoluteTests (1711 of 2260)
PASS: lldb-unit :: Target/Release/TargetTests/ModuleCacheTest.GetAndPutUuidExists (1712 of 2260)
PASS: lldb-unit :: Target/Release/TargetTests/PathMappingListTest.RelativeTests (1713 of 2260)
PASS: lldb-unit :: Target/Release/TargetTests/PathMappingListTest.RemapRoot (1714 of 2260)
PASS: lldb-unit :: Target/Release/TargetTests/RemoteAwarePlatformTest.TestResolveExecutabelOnClientByPlatform (1715 of 2260)
PASS: lldb-unit :: Target/Release/TargetTests/StackFrameRecognizerTest.NullModuleRegex (1716 of 2260)
PASS: lldb-unit :: UnwindAssembly/x86/Release/UnwindAssemblyx86Tests/Testx86AssemblyInspectionEngine.Test32BitOnlyInstruction (1717 of 2260)
PASS: lldb-unit :: UnwindAssembly/x86/Release/UnwindAssemblyx86Tests/Testx86AssemblyInspectionEngine.Test32bitFramelessSmallStackFrame (1718 of 2260)
PASS: lldb-unit :: UnwindAssembly/x86/Release/UnwindAssemblyx86Tests/Testx86AssemblyInspectionEngine.Test32bitFramelessBigStackFrame (1719 of 2260)
PASS: lldb-unit :: UnwindAssembly/x86/Release/UnwindAssemblyx86Tests/Testx86AssemblyInspectionEngine.Test64bitFramelessBigStackFrame (1720 of 2260)
PASS: lldb-unit :: Thread/Release/ThreadTests/ThreadTest.SetStopInfo (1721 of 2260)
PASS: lldb-unit :: Thread/Release/ThreadTests/ThreadTest.GetPrivateStopInfo (1722 of 2260)
PASS: lldb-unit :: UnwindAssembly/x86/Release/UnwindAssemblyx86Tests/Testx86AssemblyInspectionEngine.Test64bitFramelessSmallStackFrame (1723 of 2260)
PASS: lldb-unit :: UnwindAssembly/x86/Release/UnwindAssemblyx86Tests/Testx86AssemblyInspectionEngine.TestAddRSP (1724 of 2260)
PASS: lldb-unit :: UnwindAssembly/x86/Release/UnwindAssemblyx86Tests/Testx86AssemblyInspectionEngine.TestAddESP (1725 of 2260)
PASS: lldb-unit :: UnwindAssembly/x86/Release/UnwindAssemblyx86Tests/Testx86AssemblyInspectionEngine.TestCALLNextInsn (1726 of 2260)
PASS: lldb-unit :: UnwindAssembly/x86/Release/UnwindAssemblyx86Tests/Testx86AssemblyInspectionEngine.TestDisassemblyMidFunctionEpilogues (1727 of 2260)
PASS: lldb-unit :: UnwindAssembly/x86/Release/UnwindAssemblyx86Tests/Testx86AssemblyInspectionEngine.TestDisassemblyJunkBytes (1728 of 2260)
PASS: lldb-unit :: UnwindAssembly/x86/Release/UnwindAssemblyx86Tests/Testx86AssemblyInspectionEngine.TestLEAVE (1729 of 2260)
PASS: lldb-unit :: UnwindAssembly/x86/Release/UnwindAssemblyx86Tests/Testx86AssemblyInspectionEngine.TestPopEBP (1730 of 2260)
PASS: lldb-unit :: UnwindAssembly/x86/Release/UnwindAssemblyx86Tests/Testx86AssemblyInspectionEngine.TestMovRSPtoRBP (1731 of 2260)
PASS: lldb-unit :: UnwindAssembly/x86/Release/UnwindAssemblyx86Tests/Testx86AssemblyInspectionEngine.TestPopEBX (1732 of 2260)
PASS: lldb-unit :: UnwindAssembly/x86/Release/UnwindAssemblyx86Tests/Testx86AssemblyInspectionEngine.TestPopEDI (1733 of 2260)
PASS: lldb-unit :: UnwindAssembly/x86/Release/UnwindAssemblyx86Tests/Testx86AssemblyInspectionEngine.TestPopESI (1734 of 2260)
PASS: lldb-unit :: UnwindAssembly/x86/Release/UnwindAssemblyx86Tests/Testx86AssemblyInspectionEngine.TestPopR12 (1735 of 2260)
PASS: lldb-unit :: UnwindAssembly/x86/Release/UnwindAssemblyx86Tests/Testx86AssemblyInspectionEngine.TestPopR14 (1736 of 2260)
PASS: lldb-unit :: UnwindAssembly/x86/Release/UnwindAssemblyx86Tests/Testx86AssemblyInspectionEngine.TestPopR13 (1737 of 2260)
PASS: lldb-unit :: UnwindAssembly/x86/Release/UnwindAssemblyx86Tests/Testx86AssemblyInspectionEngine.TestPopR15 (1738 of 2260)
PASS: lldb-unit :: UnwindAssembly/x86/Release/UnwindAssemblyx86Tests/Testx86AssemblyInspectionEngine.TestPopRBP (1739 of 2260)
PASS: lldb-unit :: UnwindAssembly/x86/Release/UnwindAssemblyx86Tests/Testx86AssemblyInspectionEngine.TestPopRBPWithREX (1740 of 2260)
PASS: lldb-unit :: UnwindAssembly/x86/Release/UnwindAssemblyx86Tests/Testx86AssemblyInspectionEngine.TestPopRBX (1741 of 2260)
PASS: lldb-unit :: UnwindAssembly/x86/Release/UnwindAssemblyx86Tests/Testx86AssemblyInspectionEngine.TestPush0 (1742 of 2260)
PASS: lldb-unit :: UnwindAssembly/x86/Release/UnwindAssemblyx86Tests/Testx86AssemblyInspectionEngine.TestPushEAX (1743 of 2260)
PASS: lldb-unit :: UnwindAssembly/x86/Release/UnwindAssemblyx86Tests/Testx86AssemblyInspectionEngine.TestPushEBP (1744 of 2260)
PASS: lldb-unit :: UnwindAssembly/x86/Release/UnwindAssemblyx86Tests/Testx86AssemblyInspectionEngine.TestPushEBX (1745 of 2260)
PASS: lldb-unit :: UnwindAssembly/x86/Release/UnwindAssemblyx86Tests/Testx86AssemblyInspectionEngine.TestPushECX (1746 of 2260)
PASS: lldb-unit :: UnwindAssembly/x86/Release/UnwindAssemblyx86Tests/Testx86AssemblyInspectionEngine.TestPushEDI (1747 of 2260)
PASS: lldb-unit :: UnwindAssembly/x86/Release/UnwindAssemblyx86Tests/Testx86AssemblyInspectionEngine.TestPushEDX (1748 of 2260)
PASS: lldb-unit :: UnwindAssembly/x86/Release/UnwindAssemblyx86Tests/Testx86AssemblyInspectionEngine.TestPushESI (1749 of 2260)
PASS: lldb-unit :: UnwindAssembly/x86/Release/UnwindAssemblyx86Tests/Testx86AssemblyInspectionEngine.TestPushImm (1750 of 2260)
PASS: lldb-unit :: UnwindAssembly/x86/Release/UnwindAssemblyx86Tests/Testx86AssemblyInspectionEngine.TestPushR12 (1751 of 2260)
PASS: lldb-unit :: UnwindAssembly/x86/Release/UnwindAssemblyx86Tests/Testx86AssemblyInspectionEngine.TestPushExtended (1752 of 2260)
PASS: lldb-unit :: UnwindAssembly/x86/Release/UnwindAssemblyx86Tests/Testx86AssemblyInspectionEngine.TestPushR13 (1753 of 2260)
PASS: lldb-unit :: UnwindAssembly/x86/Release/UnwindAssemblyx86Tests/Testx86AssemblyInspectionEngine.TestPushR14 (1754 of 2260)
PASS: lldb-unit :: UnwindAssembly/x86/Release/UnwindAssemblyx86Tests/Testx86AssemblyInspectionEngine.TestPushR15 (1755 of 2260)
PASS: lldb-unit :: Host/Release/HostTests/MainLoopTest.UnmonitoredSignal (1756 of 2260)
PASS: lldb-unit :: UnwindAssembly/x86/Release/UnwindAssemblyx86Tests/Testx86AssemblyInspectionEngine.TestPushRBP (1757 of 2260)
PASS: lldb-unit :: UnwindAssembly/x86/Release/UnwindAssemblyx86Tests/Testx86AssemblyInspectionEngine.TestPushRBPWithREX (1758 of 2260)
PASS: lldb-unit :: UnwindAssembly/x86/Release/UnwindAssemblyx86Tests/Testx86AssemblyInspectionEngine.TestReturnDetect (1759 of 2260)
PASS: lldb-unit :: UnwindAssembly/x86/Release/UnwindAssemblyx86Tests/Testx86AssemblyInspectionEngine.TestSimple64bitFrameFunction (1760 of 2260)
PASS: lldb-unit :: UnwindAssembly/x86/Release/UnwindAssemblyx86Tests/Testx86AssemblyInspectionEngine.TestPushRBX (1761 of 2260)
PASS: lldb-unit :: UnwindAssembly/x86/Release/UnwindAssemblyx86Tests/Testx86AssemblyInspectionEngine.TestSimple32bitFrameFunction (1762 of 2260)
PASS: lldb-unit :: UnwindAssembly/x86/Release/UnwindAssemblyx86Tests/Testx86AssemblyInspectionEngine.TestSimplei386ugmented (1763 of 2260)
PASS: lldb-unit :: UnwindAssembly/x86/Release/UnwindAssemblyx86Tests/Testx86AssemblyInspectionEngine.TestSpillRegToStackViaMOVx86_64 (1764 of 2260)
PASS: lldb-unit :: UnwindAssembly/x86/Release/UnwindAssemblyx86Tests/Testx86AssemblyInspectionEngine.TestSpArithx86_64Augmented (1765 of 2260)
PASS: lldb-unit :: UnwindAssembly/x86/Release/UnwindAssemblyx86Tests/Testx86AssemblyInspectionEngine.TestSimplex86_64Augmented (1766 of 2260)
PASS: lldb-unit :: UnwindAssembly/x86/Release/UnwindAssemblyx86Tests/Testx86AssemblyInspectionEngine.TestStackRealign32BitDisp_x86_64 (1767 of 2260)
PASS: lldb-unit :: UnwindAssembly/x86/Release/UnwindAssemblyx86Tests/Testx86AssemblyInspectionEngine.TestSpillRegToStackViaMOVi386 (1768 of 2260)
PASS: lldb-unit :: UnwindAssembly/x86/Release/UnwindAssemblyx86Tests/Testx86AssemblyInspectionEngine.TestStackRealign8BitDisp_i386 (1769 of 2260)
PASS: lldb-unit :: UnwindAssembly/x86/Release/UnwindAssemblyx86Tests/Testx86AssemblyInspectionEngine.TestStackRealignMSVC_i386 (1770 of 2260)
PASS: lldb-unit :: UnwindAssembly/x86/Release/UnwindAssemblyx86Tests/Testx86AssemblyInspectionEngine.TestSubESP (1771 of 2260)
PASS: lldb-unit :: Utility/Release/UtilityTests/AnsiTerminal.Empty (1772 of 2260)
PASS: lldb-unit :: Utility/Release/UtilityTests/AnsiTerminal.Basic (1773 of 2260)
PASS: lldb-unit :: Utility/Release/UtilityTests/AnsiTerminal.AtEnd (1774 of 2260)
PASS: lldb-unit :: Utility/Release/UtilityTests/AnsiTerminal.AtStart (1775 of 2260)
PASS: lldb-unit :: UnwindAssembly/x86/Release/UnwindAssemblyx86Tests/Testx86AssemblyInspectionEngine.Testi386IgnoredRegisters (1776 of 2260)
PASS: lldb-unit :: UnwindAssembly/x86/Release/UnwindAssemblyx86Tests/Testx86AssemblyInspectionEngine.TestSubRSP (1777 of 2260)
PASS: lldb-unit :: Utility/Release/UtilityTests/AnsiTerminal.Twice (1778 of 2260)
PASS: lldb-unit :: Utility/Release/UtilityTests/ArchSpecTest.Compatibility (1779 of 2260)
PASS: lldb-unit :: Utility/Release/UtilityTests/AnsiTerminal.Incomplete (1780 of 2260)
PASS: lldb-unit :: Utility/Release/UtilityTests/AnsiTerminal.WhiteSpace (1781 of 2260)
PASS: lldb-unit :: Utility/Release/UtilityTests/AnsiTerminal.Unknown (1782 of 2260)
PASS: lldb-unit :: Utility/Release/UtilityTests/AnsiTerminal.KnownPrefix (1783 of 2260)
PASS: lldb-unit :: Utility/Release/UtilityTests/ArchSpecTest.MergeFrom (1784 of 2260)
PASS: lldb-unit :: Utility/Release/UtilityTests/ArchSpecTest.TestParseMachCPUDashSubtypeTripleSimple (1785 of 2260)
PASS: lldb-unit :: Utility/Release/UtilityTests/ArchSpecTest.OperatorBool (1786 of 2260)
PASS: lldb-unit :: Utility/Release/UtilityTests/ArchSpecTest.MergeFromMachOUnknown (1787 of 2260)
PASS: lldb-unit :: Utility/Release/UtilityTests/ArchSpecTest.TestSetTriple (1788 of 2260)
PASS: lldb-unit :: Utility/Release/UtilityTests/ArchSpecTest.TestParseMachCPUDashSubtypeTripleExtra (1789 of 2260)
PASS: lldb-unit :: Utility/Release/UtilityTests/ArchSpecTest.TripleComponentsWereSpecified (1790 of 2260)
PASS: lldb-unit :: Utility/Release/UtilityTests/ArchSpecTest.YAML (1791 of 2260)
PASS: lldb-unit :: Utility/Release/UtilityTests/ArgsTest.EscapeLLDBCommandArgument (1792 of 2260)
PASS: lldb-unit :: Utility/Release/UtilityTests/ArgsTest.DoubleQuotedItem (1793 of 2260)
PASS: lldb-unit :: Utility/Release/UtilityTests/ArgsTest.BareSingleQuote (1794 of 2260)
PASS: lldb-unit :: Utility/Release/UtilityTests/ArgsTest.AppendArguments (1795 of 2260)
PASS: lldb-unit :: Utility/Release/UtilityTests/ArgsTest.GetArgumentArrayRef (1796 of 2260)
PASS: lldb-unit :: Utility/Release/UtilityTests/ArgsTest.GetQuotedCommandString (1797 of 2260)
PASS: lldb-unit :: Utility/Release/UtilityTests/ArgsTest.GetShellSafeArgument (1798 of 2260)
PASS: lldb-unit :: Utility/Release/UtilityTests/ArgsTest.ReplaceArgumentAtIndexLonger (1799 of 2260)
PASS: lldb-unit :: Utility/Release/UtilityTests/ArgsTest.ReplaceArgumentAtIndexEqual (1800 of 2260)
PASS: lldb-unit :: Utility/Release/UtilityTests/ArgsTest.ReplaceArgumentAtIndexOutOfRange (1801 of 2260)
PASS: lldb-unit :: Utility/Release/UtilityTests/ArgsTest.ReplaceArgumentAtIndexFarOutOfRange (1802 of 2260)
PASS: lldb-unit :: Utility/Release/UtilityTests/ArgsTest.ReplaceArgumentAtIndexShort (1803 of 2260)
PASS: lldb-unit :: Utility/Release/UtilityTests/ArgsTest.StringListConstructor (1804 of 2260)
PASS: lldb-unit :: Utility/Release/UtilityTests/ArgsTest.TestAppendArg (1805 of 2260)
PASS: lldb-unit :: Utility/Release/UtilityTests/ArgsTest.TestOverwriteArgs (1806 of 2260)
PASS: lldb-unit :: Utility/Release/UtilityTests/ArgsTest.TestArgv (1807 of 2260)
PASS: lldb-unit :: Utility/Release/UtilityTests/ArgsTest.TestQuotedTrailingBackslash (1808 of 2260)
PASS: lldb-unit :: Utility/Release/UtilityTests/ArgsTest.TestInsertArg (1809 of 2260)
PASS: lldb-unit :: Utility/Release/UtilityTests/ArgsTest.TestSingleArg (1810 of 2260)
PASS: lldb-unit :: Utility/Release/UtilityTests/ArgsTest.TestMultipleArgs (1811 of 2260)
PASS: lldb-unit :: Utility/Release/UtilityTests/ArgsTest.TestQuotedUnknownEscape (1812 of 2260)
PASS: lldb-unit :: Utility/Release/UtilityTests/ArgsTest.TestTrailingBackslash (1813 of 2260)
PASS: lldb-unit :: Utility/Release/UtilityTests/ArgsTest.TestSingleArgWithQuotedSpace (1814 of 2260)
PASS: lldb-unit :: Utility/Release/UtilityTests/ArgsTest.Yaml (1815 of 2260)
PASS: lldb-unit :: Utility/Release/UtilityTests/ArgsTest.TestSingleQuotedArgWithSpace (1816 of 2260)
PASS: lldb-unit :: Utility/Release/UtilityTests/ArgsTest.TestUnknownEscape (1817 of 2260)
PASS: lldb-unit :: Utility/Release/UtilityTests/BinaryStreamTest.PutSLEB128FiveBytes (1818 of 2260)
PASS: lldb-unit :: Utility/Release/UtilityTests/BinaryStreamTest.PutSLEB128EightBytes (1819 of 2260)
PASS: lldb-unit :: Utility/Release/UtilityTests/BinaryStreamTest.PutSLEB128FourBytes (1820 of 2260)
PASS: lldb-unit :: Utility/Release/UtilityTests/BinaryStreamTest.PutSLEB128OneByte (1821 of 2260)
PASS: lldb-unit :: Utility/Release/UtilityTests/BinaryStreamTest.PutSLEB128MaxValue (1822 of 2260)
PASS: lldb-unit :: Utility/Release/UtilityTests/BinaryStreamTest.PutSLEB128One (1823 of 2260)
PASS: lldb-unit :: Utility/Release/UtilityTests/BinaryStreamTest.PutSLEB128NineBytes (1824 of 2260)
PASS: lldb-unit :: Utility/Release/UtilityTests/BinaryStreamTest.PutSLEB128SevenBytes (1825 of 2260)
PASS: lldb-unit :: Utility/Release/UtilityTests/BinaryStreamTest.PutSLEB128SixBytes (1826 of 2260)
PASS: lldb-unit :: Utility/Release/UtilityTests/BinaryStreamTest.PutSLEB128ThreeBytes (1827 of 2260)
PASS: lldb-unit :: Utility/Release/UtilityTests/BinaryStreamTest.PutSLEB128TwoBytes (1828 of 2260)
PASS: lldb-unit :: Utility/Release/UtilityTests/BinaryStreamTest.PutULEB128EightBytes (1829 of 2260)
PASS: lldb-unit :: Utility/Release/UtilityTests/BinaryStreamTest.PutULEB128FourBytes (1830 of 2260)
PASS: lldb-unit :: Utility/Release/UtilityTests/BinaryStreamTest.PutULEB128FiveBytes (1831 of 2260)
PASS: lldb-unit :: Utility/Release/UtilityTests/BinaryStreamTest.PutSLEB128Zero (1832 of 2260)
PASS: lldb-unit :: Utility/Release/UtilityTests/BinaryStreamTest.PutULEB128MaxValue (1833 of 2260)
PASS: lldb-unit :: Utility/Release/UtilityTests/BinaryStreamTest.PutULEB128One (1834 of 2260)
PASS: lldb-unit :: Utility/Release/UtilityTests/BinaryStreamTest.PutULEB128NineBytes (1835 of 2260)
PASS: lldb-unit :: Utility/Release/UtilityTests/BinaryStreamTest.PutULEB128SixBytes (1836 of 2260)
PASS: lldb-unit :: Utility/Release/UtilityTests/BinaryStreamTest.PutULEB128ThreeBytes (1837 of 2260)
PASS: lldb-unit :: Utility/Release/UtilityTests/BinaryStreamTest.PutULEB128OneByte (1838 of 2260)
PASS: lldb-unit :: Utility/Release/UtilityTests/BinaryStreamTest.PutULEB128TwoBytes (1839 of 2260)
PASS: lldb-unit :: Utility/Release/UtilityTests/BinaryStreamTest.PutULEB128SevenBytes (1840 of 2260)
PASS: lldb-unit :: Utility/Release/UtilityTests/CompletionRequest.DuplicateFiltering (1841 of 2260)
PASS: lldb-unit :: Utility/Release/UtilityTests/BinaryStreamTest.PutULEB128Zero (1842 of 2260)
PASS: lldb-unit :: Utility/Release/UtilityTests/BroadcasterTest.EventTypeHasListeners (1843 of 2260)
PASS: lldb-unit :: Utility/Release/UtilityTests/BroadcasterTest.BroadcastEvent (1844 of 2260)
PASS: lldb-unit :: Utility/Release/UtilityTests/CompletionRequest.Constructor (1845 of 2260)
PASS: lldb-unit :: Utility/Release/UtilityTests/CompletionRequest.DuplicateFilteringWithComments (1846 of 2260)
PASS: lldb-unit :: Utility/Release/UtilityTests/CompletionRequest.FakeLastArg (1847 of 2260)
PASS: lldb-unit :: Utility/Release/UtilityTests/CompletionRequest.TryCompleteCurrentArgBad (1848 of 2260)
PASS: lldb-unit :: Utility/Release/UtilityTests/CompletionRequest.TryCompleteCurrentArgGood (1849 of 2260)
PASS: lldb-unit :: Utility/Release/UtilityTests/CompletionRequest.ShiftArguments (1850 of 2260)
PASS: lldb-unit :: Utility/Release/UtilityTests/CompletionRequest.TestCompletionOwnership (1851 of 2260)
PASS: lldb-unit :: Utility/Release/UtilityTests/CompletionRequest.TryCompleteCurrentArgMode (1852 of 2260)
PASS: lldb-unit :: Utility/Release/UtilityTests/ConstStringTest.CompareConstString (1853 of 2260)
PASS: lldb-unit :: Utility/Release/UtilityTests/ConstStringTest.CompareStringRef (1854 of 2260)
PASS: lldb-unit :: Utility/Release/UtilityTests/ConstStringTest.NullAndEmptyStates (1855 of 2260)
PASS: lldb-unit :: Utility/Release/UtilityTests/ConstStringTest.FromMidOfBufferStringRef (1856 of 2260)
PASS: lldb-unit :: Utility/Release/UtilityTests/ConstStringTest.UpdateMangledCounterpart (1857 of 2260)
PASS: lldb-unit :: Utility/Release/UtilityTests/ConstStringTest.format_provider (1858 of 2260)
PASS: lldb-unit :: Utility/Release/UtilityTests/ConstStringTest.MangledCounterpart (1859 of 2260)
PASS: lldb-unit :: Utility/Release/UtilityTests/ConstStringTest.YAML (1860 of 2260)
PASS: lldb-unit :: Utility/Release/UtilityTests/DataExtractorTest.GetBitfield (1861 of 2260)
PASS: lldb-unit :: Utility/Release/UtilityTests/DataExtractorTest.GetCStrAtEnd (1862 of 2260)
PASS: lldb-unit :: Utility/Release/UtilityTests/DataExtractorTest.GetCStrEmpty (1863 of 2260)
PASS: lldb-unit :: Utility/Release/UtilityTests/DataExtractorTest.GetCStr (1864 of 2260)
PASS: lldb-unit :: Utility/Release/UtilityTests/DataExtractorTest.GetDouble (1865 of 2260)
PASS: lldb-unit :: Utility/Release/UtilityTests/DataExtractorTest.GetCStrAtNullOffset (1866 of 2260)
PASS: lldb-unit :: Utility/Release/UtilityTests/DataExtractorTest.GetCStrUnterminated (1867 of 2260)
PASS: lldb-unit :: Utility/Release/UtilityTests/DataExtractorTest.GetDoubleUnaligned (1868 of 2260)
PASS: lldb-unit :: Utility/Release/UtilityTests/DataExtractorTest.GetFloat (1869 of 2260)
PASS: lldb-unit :: Utility/Release/UtilityTests/DataExtractorTest.GetMaxU64 (1870 of 2260)
PASS: lldb-unit :: Utility/Release/UtilityTests/DataExtractorTest.GetFloatUnaligned (1871 of 2260)
PASS: lldb-unit :: Utility/Release/UtilityTests/DataExtractorTest.GetSLEB128_bit63 (1872 of 2260)
PASS: lldb-unit :: Utility/Release/UtilityTests/DataExtractorTest.GetMaxU64_unchecked (1873 of 2260)
PASS: lldb-unit :: Utility/Release/UtilityTests/DataExtractorTest.GetMaxS64 (1874 of 2260)
PASS: lldb-unit :: Utility/Release/UtilityTests/DataExtractorTest.GetULEB128_bit63 (1875 of 2260)
PASS: lldb-unit :: Utility/Release/UtilityTests/DataExtractorTest.UncommonAddressSize (1876 of 2260)
PASS: lldb-unit :: Utility/Release/UtilityTests/EnvironmentTest.EnvpConstruction (1877 of 2260)
PASS: lldb-unit :: Utility/Release/UtilityTests/DataExtractorTest.PeekData (1878 of 2260)
PASS: lldb-unit :: Utility/Release/UtilityTests/EventTest.DumpEventDataBytes (1879 of 2260)
PASS: lldb-unit :: Utility/Release/UtilityTests/DeserializerTest.HasData (1880 of 2260)
PASS: lldb-unit :: Utility/Release/UtilityTests/FileSpecTest.AppendPathComponent (1881 of 2260)
PASS: lldb-unit :: Utility/Release/UtilityTests/EnvironmentTest.EnvpConversion (1882 of 2260)
PASS: lldb-unit :: Utility/Release/UtilityTests/FileSpecTest.Equal (1883 of 2260)
PASS: lldb-unit :: Utility/Release/UtilityTests/FileSpecTest.EqualDotsPosixRoot (1884 of 2260)
PASS: lldb-unit :: Utility/Release/UtilityTests/FileSpecTest.EqualSeparator (1885 of 2260)
PASS: lldb-unit :: Utility/Release/UtilityTests/FileSpecTest.CopyByAppendingPathComponent (1886 of 2260)
PASS: lldb-unit :: Utility/Release/UtilityTests/FileSpecTest.FileAndDirectoryComponents (1887 of 2260)
PASS: lldb-unit :: Utility/Release/UtilityTests/FileSpecTest.EqualDotsPosix (1888 of 2260)
PASS: lldb-unit :: Utility/Release/UtilityTests/FileSpecTest.EqualDotsWindows (1889 of 2260)
PASS: lldb-unit :: Utility/Release/UtilityTests/FileSpecTest.GuessPathStyle (1890 of 2260)
PASS: lldb-unit :: Utility/Release/UtilityTests/FileSpecTest.IsRelative (1891 of 2260)
PASS: lldb-unit :: Utility/Release/UtilityTests/FileSpecTest.FormatFileSpec (1892 of 2260)
PASS: lldb-unit :: Utility/Release/UtilityTests/FileSpecTest.Match (1893 of 2260)
PASS: lldb-unit :: Utility/Release/UtilityTests/FileSpecTest.PrependPathComponent (1894 of 2260)
PASS: lldb-unit :: Utility/Release/UtilityTests/FileSpecTest.GetPath (1895 of 2260)
PASS: lldb-unit :: Utility/Release/UtilityTests/FileSpecTest.OperatorBool (1896 of 2260)
PASS: lldb-unit :: Utility/Release/UtilityTests/Flags.AllClear (1897 of 2260)
PASS: lldb-unit :: Utility/Release/UtilityTests/FileSpecTest.Yaml (1898 of 2260)
PASS: lldb-unit :: Utility/Release/UtilityTests/Flags.AllSet (1899 of 2260)
PASS: lldb-unit :: Utility/Release/UtilityTests/FileSpecTest.RemoveLastPathComponent (1900 of 2260)
PASS: lldb-unit :: Utility/Release/UtilityTests/Flags.AnyClear (1901 of 2260)
PASS: lldb-unit :: Utility/Release/UtilityTests/Flags.AnySet (1902 of 2260)
PASS: lldb-unit :: Utility/Release/UtilityTests/Flags.Clear (1903 of 2260)
PASS: lldb-unit :: Utility/Release/UtilityTests/Flags.IsClear (1904 of 2260)
PASS: lldb-unit :: Utility/Release/UtilityTests/Flags.GetBitSize (1905 of 2260)
PASS: lldb-unit :: Utility/Release/UtilityTests/Flags.Reset (1906 of 2260)
PASS: lldb-unit :: Utility/Release/UtilityTests/Flags.Test (1907 of 2260)
PASS: lldb-unit :: Utility/Release/UtilityTests/GeneratorTest.Get (1908 of 2260)
PASS: lldb-unit :: Utility/Release/UtilityTests/GeneratorTest.Create (1909 of 2260)
PASS: lldb-unit :: Utility/Release/UtilityTests/GeneratorTest.GetOrCreate (1910 of 2260)
PASS: lldb-unit :: Utility/Release/UtilityTests/IndexToObjectTest.ObjectForIndex (1911 of 2260)
PASS: lldb-unit :: Utility/Release/UtilityTests/ListenerTest.GetEventImmediate (1912 of 2260)
PASS: lldb-unit :: Utility/Release/UtilityTests/LogChannelEnabledTest.LLDB_LOG_ERROR (1913 of 2260)
PASS: lldb-unit :: Utility/Release/UtilityTests/LogChannelEnabledTest.LogGetLogThread (1914 of 2260)
PASS: lldb-unit :: Utility/Release/UtilityTests/LogChannelEnabledTest.LogThread (1915 of 2260)
PASS: lldb-unit :: Utility/Release/UtilityTests/GeneratorTest.YamlMultiProvider (1916 of 2260)
PASS: lldb-unit :: Utility/Release/UtilityTests/LogChannelTest.Enable (1917 of 2260)
PASS: lldb-unit :: Utility/Release/UtilityTests/LogChannelEnabledTest.log_options (1918 of 2260)
PASS: lldb-unit :: Utility/Release/UtilityTests/LogChannelEnabledTest.LogVerboseThread (1919 of 2260)
PASS: lldb-unit :: Utility/Release/UtilityTests/LogChannelTest.Disable (1920 of 2260)
PASS: lldb-unit :: Utility/Release/UtilityTests/LogChannelTest.List (1921 of 2260)
PASS: lldb-unit :: Utility/Release/UtilityTests/LogChannelTest.EnableOptions (1922 of 2260)
PASS: lldb-unit :: Utility/Release/UtilityTests/LogTest.Register (1923 of 2260)
PASS: lldb-unit :: Utility/Release/UtilityTests/LogTest.LLDB_LOG_nullptr (1924 of 2260)
PASS: lldb-unit :: Utility/Release/UtilityTests/LogTest.Unregister (1925 of 2260)
PASS: lldb-unit :: Utility/Release/UtilityTests/NameMatchesTest.Contains (1926 of 2260)
PASS: lldb-unit :: Utility/Release/UtilityTests/ListenerTest.GetEventWait (1927 of 2260)
PASS: lldb-unit :: Utility/Release/UtilityTests/NameMatchesTest.Equals (1928 of 2260)
PASS: lldb-unit :: Utility/Release/UtilityTests/NameMatchesTest.EndsWith (1929 of 2260)
PASS: lldb-unit :: Utility/Release/UtilityTests/NameMatchesTest.Ignore (1930 of 2260)
PASS: lldb-unit :: Utility/Release/UtilityTests/NameMatchesTest.RegularExpression (1931 of 2260)
PASS: lldb-unit :: Utility/Release/UtilityTests/NameMatchesTest.StartsWith (1932 of 2260)
PASS: lldb-unit :: Utility/Release/UtilityTests/OptionsWithRawTest.ArgsButNoDelimiter (1933 of 2260)
PASS: lldb-unit :: Utility/Release/UtilityTests/OptionsWithRawTest.EmptyArgsOnlySuffix (1934 of 2260)
PASS: lldb-unit :: Utility/Release/UtilityTests/OptionsWithRawTest.ArgsButNoLeadingDash (1935 of 2260)
PASS: lldb-unit :: Utility/Release/UtilityTests/OptionsWithRawTest.EmptyInput (1936 of 2260)
PASS: lldb-unit :: Utility/Release/UtilityTests/OptionsWithRawTest.QuotedSuffix (1937 of 2260)
PASS: lldb-unit :: Utility/Release/UtilityTests/OptionsWithRawTest.EmptySuffix (1938 of 2260)
PASS: lldb-unit :: Utility/Release/UtilityTests/OptionsWithRawTest.LeadingSpaceArgs (1939 of 2260)
PASS: lldb-unit :: Utility/Release/UtilityTests/OptionsWithRawTest.EmptySuffixSingleWhitespace (1940 of 2260)
PASS: lldb-unit :: Utility/Release/UtilityTests/OptionsWithRawTest.SingleWhitespaceInput (1941 of 2260)
PASS: lldb-unit :: Utility/Release/UtilityTests/OptionsWithRawTest.SingleWordSuffix (1942 of 2260)
PASS: lldb-unit :: Utility/Release/UtilityTests/OptionsWithRawTest.MultiWordSuffix (1943 of 2260)
PASS: lldb-unit :: Utility/Release/UtilityTests/PassiveReplayTest.InstrumentedBarRef (1944 of 2260)
PASS: lldb-unit :: Utility/Release/UtilityTests/OptionsWithRawTest.UnterminatedQuote (1945 of 2260)
PASS: lldb-unit :: Utility/Release/UtilityTests/OptionsWithRawTest.TerminatedQuote (1946 of 2260)
PASS: lldb-unit :: Utility/Release/UtilityTests/OptionsWithRawTest.WhitespaceSuffix (1947 of 2260)
PASS: lldb-unit :: Utility/Release/UtilityTests/OptionsWithRawTest.WhitespaceInput (1948 of 2260)
PASS: lldb-unit :: Utility/Release/UtilityTests/PassiveReplayTest.InstrumentedBarPtr (1949 of 2260)
PASS: lldb-unit :: Utility/Release/UtilityTests/PassiveReplayTest.InstrumentedBar (1950 of 2260)
PASS: lldb-unit :: Utility/Release/UtilityTests/ProcessInstanceInfo.Dump (1951 of 2260)
PASS: lldb-unit :: Utility/Release/UtilityTests/PassiveReplayTest.InstrumentedFoo (1952 of 2260)
PASS: lldb-unit :: Utility/Release/UtilityTests/ProcessInfoTest.Constructor (1953 of 2260)
PASS: lldb-unit :: Utility/Release/UtilityTests/ProcessInstanceInfo.DumpTable (1954 of 2260)
PASS: lldb-unit :: Utility/Release/UtilityTests/Predicate.WaitForValueNotEqualTo (1955 of 2260)
PASS: lldb-unit :: Utility/Release/UtilityTests/ProcessInstanceInfoMatch.Name (1956 of 2260)
PASS: lldb-unit :: Utility/Release/UtilityTests/ProcessInstanceInfo.Yaml (1957 of 2260)
PASS: lldb-unit :: Utility/Release/UtilityTests/ProcessInstanceInfo.DumpTable_invalidUID (1958 of 2260)
PASS: lldb-unit :: Utility/Release/UtilityTests/PassiveReplayTest.InstrumentedFooInvalid (1959 of 2260)
PASS: lldb-unit :: Utility/Release/UtilityTests/ProcessInstanceInfoList.Yaml (1960 of 2260)
PASS: lldb-unit :: Utility/Release/UtilityTests/RangeDataVector.CustomSort (1961 of 2260)
PASS: lldb-unit :: Utility/Release/UtilityTests/RangeDataVector.FindEntryIndexesThatContain (1962 of 2260)
PASS: lldb-unit :: Utility/Release/UtilityTests/RangeDataVector.FindEntryThatContains (1963 of 2260)
PASS: lldb-unit :: Utility/Release/UtilityTests/RangeDataVector.FindEntryIndexesThatContain_Overlap (1964 of 2260)
PASS: lldb-unit :: Utility/Release/UtilityTests/RangeDataVector.FindEntryThatContains_Overlap (1965 of 2260)
PASS: lldb-unit :: Utility/Release/UtilityTests/RangeTest.Clear (1966 of 2260)
PASS: lldb-unit :: Utility/Release/UtilityTests/RangeTest.ClearWithStarAddress (1967 of 2260)
PASS: lldb-unit :: Utility/Release/UtilityTests/RangeTest.Constructor (1968 of 2260)
PASS: lldb-unit :: Utility/Release/UtilityTests/RangeTest.ContainsEndInclusive (1969 of 2260)
PASS: lldb-unit :: Utility/Release/UtilityTests/RangeTest.ContainsEndInclusiveInvalid (1970 of 2260)
PASS: lldb-unit :: Utility/Release/UtilityTests/RangeTest.ContainsAddr (1971 of 2260)
PASS: lldb-unit :: Utility/Release/UtilityTests/RangeTest.ContainsAddrInvalid (1972 of 2260)
PASS: lldb-unit :: Utility/Release/UtilityTests/RangeTest.ContainsRangeStartingFromZero (1973 of 2260)
PASS: lldb-unit :: Utility/Release/UtilityTests/RangeTest.ContainsRange (1974 of 2260)
PASS: lldb-unit :: Utility/Release/UtilityTests/RangeTest.Copy (1975 of 2260)
PASS: lldb-unit :: Utility/Release/UtilityTests/RangeTest.DoesAdjoinOrIntersect (1976 of 2260)
PASS: lldb-unit :: Utility/Release/UtilityTests/RangeTest.DoesIntersect (1977 of 2260)
PASS: lldb-unit :: Utility/Release/UtilityTests/RangeTest.DefaultConstructor (1978 of 2260)
PASS: lldb-unit :: Utility/Release/UtilityTests/RangeTest.LessThan (1979 of 2260)
PASS: lldb-unit :: Utility/Release/UtilityTests/RangeTest.Equal (1980 of 2260)
PASS: lldb-unit :: Utility/Release/UtilityTests/RangeTest.EqualInvalid (1981 of 2260)
PASS: lldb-unit :: Utility/Release/UtilityTests/RangeTest.NotEqual (1982 of 2260)
PASS: lldb-unit :: Utility/Release/UtilityTests/RangeTest.LessThanInvalid (1983 of 2260)
PASS: lldb-unit :: Utility/Release/UtilityTests/RangeTest.NotEqualInvalid (1984 of 2260)
PASS: lldb-unit :: Utility/Release/UtilityTests/RangeTest.SetRangeBase (1985 of 2260)
PASS: lldb-unit :: Utility/Release/UtilityTests/RangeTest.Slide (1986 of 2260)
PASS: lldb-unit :: Utility/Release/UtilityTests/RangeTest.SizeTypes (1987 of 2260)
PASS: lldb-unit :: Utility/Release/UtilityTests/RangeTest.Union (1988 of 2260)
PASS: lldb-unit :: Utility/Release/UtilityTests/RangeVector.CombineConsecutiveRanges (1989 of 2260)
PASS: lldb-unit :: Utility/Release/UtilityTests/RangeTest.SlideZero (1990 of 2260)
PASS: lldb-unit :: Utility/Release/UtilityTests/Predicate.WaitForValueEqualTo (1991 of 2260)
PASS: lldb-unit :: Utility/Release/UtilityTests/RecordReplayTest.InvalidSequence (1992 of 2260)
PASS: lldb-unit :: Utility/Release/UtilityTests/RegisterValueTest.GetScalarValue (1993 of 2260)
PASS: lldb-unit :: Utility/Release/UtilityTests/RegisterValueTest.GetSet8 (1994 of 2260)
PASS: lldb-unit :: Utility/Release/UtilityTests/RegularExpression.CopyAssignment (1995 of 2260)
PASS: lldb-unit :: Utility/Release/UtilityTests/RegularExpression.Empty (1996 of 2260)
PASS: lldb-unit :: Utility/Release/UtilityTests/RegularExpression.Invalid (1997 of 2260)
PASS: lldb-unit :: Utility/Release/UtilityTests/RegularExpression.Match (1998 of 2260)
PASS: lldb-unit :: Utility/Release/UtilityTests/RegularExpression.Valid (1999 of 2260)
PASS: lldb-unit :: Utility/Release/UtilityTests/RecordReplayTest.InstrumentedBarRef (2000 of 2260)
PASS: lldb-unit :: Utility/Release/UtilityTests/RecordReplayTest.InstrumentedBar (2001 of 2260)
PASS: lldb-unit :: Utility/Release/UtilityTests/RecordReplayTest.InstrumentedBarPtr (2002 of 2260)
PASS: lldb-unit :: Utility/Release/UtilityTests/RecordReplayTest.InstrumentedFoo (2003 of 2260)
PASS: lldb-unit :: Utility/Release/UtilityTests/RecordReplayTest.InstrumentedFooSameThis (2004 of 2260)
PASS: lldb-unit :: Utility/Release/UtilityTests/ReproducerTest.SetCapture (2005 of 2260)
PASS: lldb-unit :: Utility/Release/UtilityTests/ScalarTest.Comparison (2006 of 2260)
PASS: lldb-unit :: Utility/Release/UtilityTests/ScalarTest.APIntConstructor (2007 of 2260)
PASS: lldb-unit :: Utility/Release/UtilityTests/ScalarTest.ComparisonFloat (2008 of 2260)
PASS: lldb-unit :: Utility/Release/UtilityTests/ScalarTest.CastOperations (2009 of 2260)
PASS: lldb-unit :: Utility/Release/UtilityTests/ReproducerTest.SetReplay (2010 of 2260)
PASS: lldb-unit :: Utility/Release/UtilityTests/ScalarTest.Division (2011 of 2260)
PASS: lldb-unit :: Utility/Release/UtilityTests/RecordReplayTest.ValidSequence (2012 of 2260)
PASS: lldb-unit :: Utility/Release/UtilityTests/ScalarTest.GetBytes (2013 of 2260)
PASS: lldb-unit :: Utility/Release/UtilityTests/ScalarTest.ExtractBitfield (2014 of 2260)
PASS: lldb-unit :: Utility/Release/UtilityTests/ScalarTest.GetValue (2015 of 2260)
PASS: lldb-unit :: Utility/Release/UtilityTests/ScalarTest.Equality (2016 of 2260)
PASS: lldb-unit :: Utility/Release/UtilityTests/ScalarTest.Getters (2017 of 2260)
PASS: lldb-unit :: Utility/Release/UtilityTests/ScalarTest.LongLongAssigmentOperator (2018 of 2260)
PASS: lldb-unit :: Utility/Release/UtilityTests/ScalarTest.Promotion (2019 of 2260)
PASS: lldb-unit :: Utility/Release/UtilityTests/ScalarTest.TruncOrExtendTo (2020 of 2260)
PASS: lldb-unit :: Utility/Release/UtilityTests/ScalarTest.Scalar_512 (2021 of 2260)
PASS: lldb-unit :: Utility/Release/UtilityTests/ScalarTest.RightShiftOperator (2022 of 2260)
PASS: lldb-unit :: Utility/Release/UtilityTests/ScalarTest.SetValueFromCString (2023 of 2260)
PASS: lldb-unit :: Utility/Release/UtilityTests/ScalarTest.SetValueFromData (2024 of 2260)
PASS: lldb-unit :: Utility/Release/UtilityTests/SerializationRountripTest.SerializeDeserializeCString (2025 of 2260)
PASS: lldb-unit :: Utility/Release/UtilityTests/SerializationRountripTest.SerializeDeserializeCStringArray (2026 of 2260)
PASS: lldb-unit :: Utility/Release/UtilityTests/SerializationRountripTest.SerializeDeserializeCStringArrayNullptr (2027 of 2260)
PASS: lldb-unit :: Utility/Release/UtilityTests/SerializationRountripTest.SerializeDeserializeCStringNull (2028 of 2260)
PASS: lldb-unit :: Utility/Release/UtilityTests/SerializationRountripTest.SerializeDeserializeCStringArrayNullptrElem (2029 of 2260)
PASS: lldb-unit :: Utility/Release/UtilityTests/SerializationRountripTest.SerializeDeserializeObjectReference (2030 of 2260)
PASS: lldb-unit :: Utility/Release/UtilityTests/SerializationRountripTest.SerializeDeserializeObjectPointer (2031 of 2260)
PASS: lldb-unit :: Utility/Release/UtilityTests/SerializationRountripTest.SerializeDeserializePod (2032 of 2260)
PASS: lldb-unit :: Utility/Release/UtilityTests/SerializationRountripTest.SerializeDeserializePodPointers (2033 of 2260)
PASS: lldb-unit :: Utility/Release/UtilityTests/SerializationRountripTest.SerializeDeserializePodReferences (2034 of 2260)
PASS: lldb-unit :: Utility/Release/UtilityTests/StatusTest.ErrorCodeConstructor (2035 of 2260)
PASS: lldb-unit :: Utility/Release/UtilityTests/StateTest.Formatv (2036 of 2260)
PASS: lldb-unit :: Utility/Release/UtilityTests/SharedCluster.ClusterManager (2037 of 2260)
PASS: lldb-unit :: Utility/Release/UtilityTests/StatusTest.ErrorConstructor (2038 of 2260)
PASS: lldb-unit :: Utility/Release/UtilityTests/StatusTest.ErrorConversion (2039 of 2260)
PASS: lldb-unit :: Utility/Release/UtilityTests/StatusTest.Formatv (2040 of 2260)
PASS: lldb-unit :: Utility/Release/UtilityTests/StreamTeeTest.CopyConstructor (2041 of 2260)
PASS: lldb-unit :: Utility/Release/UtilityTests/StreamTeeTest.Constructor1Stream (2042 of 2260)
PASS: lldb-unit :: Utility/Release/UtilityTests/StreamTeeTest.AppendStream (2043 of 2260)
PASS: lldb-unit :: Utility/Release/UtilityTests/StreamTeeTest.Assignment (2044 of 2260)
PASS: lldb-unit :: Utility/Release/UtilityTests/StreamTeeTest.DefaultConstructor (2045 of 2260)
PASS: lldb-unit :: Utility/Release/UtilityTests/StreamTeeTest.Constructor2Streams (2046 of 2260)
PASS: lldb-unit :: Utility/Release/UtilityTests/StreamTeeTest.Flush (2047 of 2260)
PASS: lldb-unit :: Utility/Release/UtilityTests/StreamTeeTest.GetStreamAtIndexOutOfBoundsEmpty (2048 of 2260)
PASS: lldb-unit :: Utility/Release/UtilityTests/StreamTeeTest.SetStreamAtIndexOverwrite (2049 of 2260)
PASS: lldb-unit :: Utility/Release/UtilityTests/StreamTest.AddressEmptyPrefix (2050 of 2260)
PASS: lldb-unit :: Utility/Release/UtilityTests/StreamTeeTest.SetStreamAtIndexOutOfBounds (2051 of 2260)
PASS: lldb-unit :: Utility/Release/UtilityTests/StreamTeeTest.GetStreamAtIndexOutOfBounds (2052 of 2260)
PASS: lldb-unit :: Utility/Release/UtilityTests/StreamTeeTest.Write (2053 of 2260)
PASS: lldb-unit :: Utility/Release/UtilityTests/StreamTest.AddressNoSuffix (2054 of 2260)
PASS: lldb-unit :: Utility/Release/UtilityTests/StreamTest.AddressRange (2055 of 2260)
PASS: lldb-unit :: Utility/Release/UtilityTests/StreamTest.AddressPrefixAndSuffix (2056 of 2260)
PASS: lldb-unit :: Utility/Release/UtilityTests/StreamTest.AddressRangeSize (2057 of 2260)
PASS: lldb-unit :: Utility/Release/UtilityTests/StreamTest.AddressPrefix (2058 of 2260)
PASS: lldb-unit :: Utility/Release/UtilityTests/StreamTest.AddressRangeInvalidRange (2059 of 2260)
PASS: lldb-unit :: Utility/Release/UtilityTests/StreamTest.AddressRangeEmptyRange (2060 of 2260)
PASS: lldb-unit :: Utility/Release/UtilityTests/StreamTest.AddressSize (2061 of 2260)
PASS: lldb-unit :: Utility/Release/UtilityTests/StreamTest.AddressSuffix (2062 of 2260)
PASS: lldb-unit :: Utility/Release/UtilityTests/StreamTest.PutBytesAsRawHex8ToLittleEndian (2063 of 2260)
PASS: lldb-unit :: Utility/Release/UtilityTests/StreamTest.PutBytesAsRawHex8ToBigEndian (2064 of 2260)
PASS: lldb-unit :: Utility/Release/UtilityTests/StreamTest.PutBytesAsRawHex8ToMixedEndian (2065 of 2260)
PASS: lldb-unit :: Utility/Release/UtilityTests/StreamTest.ChangingByteOrder (2066 of 2260)
PASS: lldb-unit :: Utility/Release/UtilityTests/StreamTest.Indent (2067 of 2260)
PASS: lldb-unit :: Utility/Release/UtilityTests/StreamTest.PutCString (2068 of 2260)
PASS: lldb-unit :: Utility/Release/UtilityTests/StreamTest.PutCStringWithStringRef (2069 of 2260)
PASS: lldb-unit :: Utility/Release/UtilityTests/StreamTest.PutCharWhitespace (2070 of 2260)
PASS: lldb-unit :: Utility/Release/UtilityTests/StreamTest.PutHex16ByteOrderLittle (2071 of 2260)
PASS: lldb-unit :: Utility/Release/UtilityTests/StreamTest.PutHex16ByteOrderBig (2072 of 2260)
PASS: lldb-unit :: Utility/Release/UtilityTests/StreamTest.PutCharNull (2073 of 2260)
PASS: lldb-unit :: Utility/Release/UtilityTests/StreamTest.PutChar (2074 of 2260)
PASS: lldb-unit :: Utility/Release/UtilityTests/StreamTest.PutHex32ByteOrderBig (2075 of 2260)
PASS: lldb-unit :: Utility/Release/UtilityTests/StreamTest.PutHex32ByteOrderLittle (2076 of 2260)
PASS: lldb-unit :: Utility/Release/UtilityTests/StreamTest.PutHex64ByteOrderBig (2077 of 2260)
PASS: lldb-unit :: Utility/Release/UtilityTests/StreamTest.PutHex8 (2078 of 2260)
PASS: lldb-unit :: Utility/Release/UtilityTests/StreamTest.PutMaxHex64ByteOrderBig (2079 of 2260)
PASS: lldb-unit :: Utility/Release/UtilityTests/StreamTest.PutMaxHex64ByteOrderLittle (2080 of 2260)
PASS: lldb-unit :: Utility/Release/UtilityTests/StreamTest.PutHex64ByteOrderLittle (2081 of 2260)
PASS: lldb-unit :: Utility/Release/UtilityTests/StreamTest.PutNHex8 (2082 of 2260)
PASS: lldb-unit :: Utility/Release/UtilityTests/StreamTest.PutPtr (2083 of 2260)
PASS: lldb-unit :: Utility/Release/UtilityTests/StreamTest.PutRawBytesToLittleEndian (2084 of 2260)
PASS: lldb-unit :: Utility/Release/UtilityTests/StreamTest.PutRawBytesToBigEndian (2085 of 2260)
PASS: lldb-unit :: Utility/Release/UtilityTests/StreamTest.PutRawBytesToMixedEndian (2086 of 2260)
PASS: lldb-unit :: Utility/Release/UtilityTests/StreamTest.PutStringAsRawHex8 (2087 of 2260)
PASS: lldb-unit :: Utility/Release/UtilityTests/StreamTest.PutSLEB128 (2088 of 2260)
PASS: lldb-unit :: Utility/Release/UtilityTests/StreamTest.PutULEB128 (2089 of 2260)
PASS: lldb-unit :: Utility/Release/UtilityTests/StreamTest.QuotedCString (2090 of 2260)
PASS: lldb-unit :: Utility/Release/UtilityTests/StreamTest.ShiftOperatorPtr (2091 of 2260)
PASS: lldb-unit :: Utility/Release/UtilityTests/StreamTest.SetIndentLevel (2092 of 2260)
PASS: lldb-unit :: Utility/Release/UtilityTests/StreamTest.ShiftOperatorChars (2093 of 2260)
PASS: lldb-unit :: Utility/Release/UtilityTests/StreamTest.ShiftOperatorStrings (2094 of 2260)
PASS: lldb-unit :: Utility/Release/UtilityTests/StringExtractorTest.DecodeHexU8_Exact (2095 of 2260)
PASS: lldb-unit :: Utility/Release/UtilityTests/StringExtractorTest.DecodeHexU8_InvalidHex (2096 of 2260)
PASS: lldb-unit :: Utility/Release/UtilityTests/StringExtractorTest.DecodeHexU8_Extra (2097 of 2260)
PASS: lldb-unit :: Utility/Release/UtilityTests/StringExtractorTest.DecodeHexU8_Underflow (2098 of 2260)
PASS: lldb-unit :: Utility/Release/UtilityTests/StringExtractorTest.DecodeHexU8_Underflow2 (2099 of 2260)
PASS: lldb-unit :: Utility/Release/UtilityTests/StringExtractorTest.GetHexBytes (2100 of 2260)
PASS: lldb-unit :: Utility/Release/UtilityTests/StringExtractorTest.DecodeHexU8_InvalidHex2 (2101 of 2260)
PASS: lldb-unit :: Utility/Release/UtilityTests/StringExtractorTest.GetHexBytesAvail (2102 of 2260)
PASS: lldb-unit :: Utility/Release/UtilityTests/StringExtractorTest.GetHexBytesAvail_FullString (2103 of 2260)
PASS: lldb-unit :: Utility/Release/UtilityTests/StringExtractorTest.GetHexBytesAvail_Partial (2104 of 2260)
PASS: lldb-unit :: Utility/Release/UtilityTests/StringExtractorTest.GetHexBytesAvail_OddPair (2105 of 2260)
PASS: lldb-unit :: Utility/Release/UtilityTests/StringExtractorTest.GetHexBytesAvail_Underflow (2106 of 2260)
PASS: lldb-unit :: Utility/Release/UtilityTests/StringExtractorTest.GetHexBytes_OddPair (2107 of 2260)
PASS: lldb-unit :: Utility/Release/UtilityTests/StringExtractorTest.GetHexBytesAvail_OddPair2 (2108 of 2260)
PASS: lldb-unit :: Utility/Release/UtilityTests/StringExtractorTest.GetHexBytes_FullString (2109 of 2260)
PASS: lldb-unit :: Utility/Release/UtilityTests/StringExtractorTest.GetHexBytes_OddPair2 (2110 of 2260)
PASS: lldb-unit :: Utility/Release/UtilityTests/StringExtractorTest.GetHexBytes_Underflow (2111 of 2260)
PASS: lldb-unit :: Utility/Release/UtilityTests/StringExtractorTest.GetHexBytes_Partial (2112 of 2260)
PASS: lldb-unit :: Utility/Release/UtilityTests/StringExtractorTest.GetHexU8_Exact (2113 of 2260)
PASS: lldb-unit :: Utility/Release/UtilityTests/StringExtractorTest.GetHexU8_Exact_NoEof (2114 of 2260)
PASS: lldb-unit :: Utility/Release/UtilityTests/StringExtractorTest.GetHexU8_Extra_NoEof (2115 of 2260)
PASS: lldb-unit :: Utility/Release/UtilityTests/StringExtractorTest.GetHexU8_Extra (2116 of 2260)
PASS: lldb-unit :: Utility/Release/UtilityTests/StringExtractorTest.GetHexU8_InvalidHex (2117 of 2260)
PASS: lldb-unit :: Utility/Release/UtilityTests/StringExtractorTest.GetHexU8_InvalidHex_NoEof (2118 of 2260)
PASS: lldb-unit :: Utility/Release/UtilityTests/StringExtractorTest.GetHexU8_Underflow (2119 of 2260)
PASS: lldb-unit :: Utility/Release/UtilityTests/StringExtractorTest.GetHexU8_Underflow2_NoEof (2120 of 2260)
PASS: lldb-unit :: Utility/Release/UtilityTests/StringExtractorTest.GetHexU8_Underflow2 (2121 of 2260)
PASS: lldb-unit :: Utility/Release/UtilityTests/StringExtractorTest.GetHexU8_Underflow_NoEof (2122 of 2260)
PASS: lldb-unit :: Utility/Release/UtilityTests/StringExtractorTest.GetNameColonValueContainsColon (2123 of 2260)
PASS: lldb-unit :: Utility/Release/UtilityTests/StringExtractorTest.GetU32BigEndian (2124 of 2260)
PASS: lldb-unit :: Utility/Release/UtilityTests/StringExtractorTest.GetNameColonValueNoColon (2125 of 2260)
PASS: lldb-unit :: Utility/Release/UtilityTests/StringExtractorTest.GetNameColonValueNoSemicolon (2126 of 2260)
PASS: lldb-unit :: Utility/Release/UtilityTests/StringExtractorTest.GetNameColonValueSuccess (2127 of 2260)
PASS: lldb-unit :: Utility/Release/UtilityTests/StringExtractorTest.GetU32LittleEndian (2128 of 2260)
PASS: lldb-unit :: Utility/Release/UtilityTests/StringExtractorTest.GetU64BigEndian (2129 of 2260)
PASS: lldb-unit :: Utility/Release/UtilityTests/StringExtractorTest.GetU64LittleEndian (2130 of 2260)
PASS: lldb-unit :: Utility/Release/UtilityTests/StringExtractorTest.InitEmpty (2131 of 2260)
PASS: lldb-unit :: Utility/Release/UtilityTests/StringLexerTest.AdvanceIf (2132 of 2260)
PASS: lldb-unit :: Utility/Release/UtilityTests/StringExtractorTest.InitMisc (2133 of 2260)
PASS: lldb-unit :: Utility/Release/UtilityTests/StringLexerTest.Next (2134 of 2260)
PASS: lldb-unit :: Utility/Release/UtilityTests/StringLexerTest.GetUnlexed (2135 of 2260)
PASS: lldb-unit :: Utility/Release/UtilityTests/StringLexerTest.HasAtLeast (2136 of 2260)
PASS: lldb-unit :: Utility/Release/UtilityTests/StringLexerTest.NextIf (2137 of 2260)
PASS: lldb-unit :: Utility/Release/UtilityTests/StringLexerTest.PutBack (2138 of 2260)
PASS: lldb-unit :: Utility/Release/UtilityTests/StringLexerTest.NextIfList (2139 of 2260)
PASS: lldb-unit :: Utility/Release/UtilityTests/StringLexerTest.Peek (2140 of 2260)
PASS: lldb-unit :: Utility/Release/UtilityTests/StringListTest.AppendListCStringArray (2141 of 2260)
PASS: lldb-unit :: Utility/Release/UtilityTests/StringListTest.AppendList (2142 of 2260)
PASS: lldb-unit :: Utility/Release/UtilityTests/StringListTest.AppendStringCString (2143 of 2260)
PASS: lldb-unit :: Utility/Release/UtilityTests/StringListTest.AppendListCStringArrayEmpty (2144 of 2260)
PASS: lldb-unit :: Utility/Release/UtilityTests/StringListTest.AppendStringMove (2145 of 2260)
PASS: lldb-unit :: Utility/Release/UtilityTests/StringListTest.Assignment (2146 of 2260)
PASS: lldb-unit :: Utility/Release/UtilityTests/StringListTest.AppendStringStdString (2147 of 2260)
PASS: lldb-unit :: Utility/Release/UtilityTests/StringListTest.CopyList (2148 of 2260)
PASS: lldb-unit :: Utility/Release/UtilityTests/StringListTest.Clear (2149 of 2260)
PASS: lldb-unit :: Utility/Release/UtilityTests/StringListTest.CopyListEmpty (2150 of 2260)
PASS: lldb-unit :: Utility/Release/UtilityTests/StringListTest.CopyListSingle (2151 of 2260)
PASS: lldb-unit :: Utility/Release/UtilityTests/StringListTest.ForRangeEmpty (2152 of 2260)
PASS: lldb-unit :: Utility/Release/UtilityTests/StringListTest.DefaultConstructor (2153 of 2260)
PASS: lldb-unit :: Utility/Release/UtilityTests/StringListTest.ForRange (2154 of 2260)
PASS: lldb-unit :: Utility/Release/UtilityTests/StringListTest.GetMaxStringLengthDecreasingSize (2155 of 2260)
PASS: lldb-unit :: Utility/Release/UtilityTests/StringListTest.GetMaxStringLengthEmpty (2156 of 2260)
PASS: lldb-unit :: Utility/Release/UtilityTests/StringListTest.GetMaxStringLengthEqualSize (2157 of 2260)
PASS: lldb-unit :: Utility/Release/UtilityTests/StringListTest.GetMaxStringLengthIncreasingSize (2158 of 2260)
PASS: lldb-unit :: Utility/Release/UtilityTests/StringListTest.InsertStringAtIndexStart (2159 of 2260)
PASS: lldb-unit :: Utility/Release/UtilityTests/StringListTest.GetMaxStringLengthMixed (2160 of 2260)
PASS: lldb-unit :: Utility/Release/UtilityTests/StringListTest.InsertStringAtIndexEnd (2161 of 2260)
PASS: lldb-unit :: Utility/Release/UtilityTests/StringListTest.InsertStringAtIndexMove (2162 of 2260)
PASS: lldb-unit :: Utility/Release/UtilityTests/StringListTest.GetSize (2163 of 2260)
PASS: lldb-unit :: Utility/Release/UtilityTests/StringListTest.InsertStringAtIndexOutOfBounds (2164 of 2260)
PASS: lldb-unit :: Utility/Release/UtilityTests/StringListTest.InsertStringAtIndexStdString (2165 of 2260)
PASS: lldb-unit :: Utility/Release/UtilityTests/StringListTest.Join (2166 of 2260)
PASS: lldb-unit :: Utility/Release/UtilityTests/StringListTest.JoinEmpty (2167 of 2260)
PASS: lldb-unit :: Utility/Release/UtilityTests/StringListTest.JoinNonSpace (2168 of 2260)
PASS: lldb-unit :: Utility/Release/UtilityTests/StringListTest.JoinThree (2169 of 2260)
PASS: lldb-unit :: Utility/Release/UtilityTests/StringListTest.JoinMultiCharSeparator (2170 of 2260)
PASS: lldb-unit :: Utility/Release/UtilityTests/StringListTest.JoinSingle (2171 of 2260)
PASS: lldb-unit :: Utility/Release/UtilityTests/StringListTest.LongestCommonPrefix (2172 of 2260)
PASS: lldb-unit :: Utility/Release/UtilityTests/StringListTest.LongestCommonPrefixDuplicateElement (2173 of 2260)
PASS: lldb-unit :: Utility/Release/UtilityTests/StringListTest.LongestCommonPrefixEmpty (2174 of 2260)
PASS: lldb-unit :: Utility/Release/UtilityTests/StringListTest.LongestCommonPrefixNoPrefix (2175 of 2260)
PASS: lldb-unit :: Utility/Release/UtilityTests/StringListTest.RemoveBlankLines (2176 of 2260)
PASS: lldb-unit :: Utility/Release/UtilityTests/StringListTest.PopBack (2177 of 2260)
PASS: lldb-unit :: Utility/Release/UtilityTests/StringListTest.LongestCommonPrefixSingleElement (2178 of 2260)
PASS: lldb-unit :: Utility/Release/UtilityTests/StringListTest.SetSize (2179 of 2260)
PASS: lldb-unit :: Utility/Release/UtilityTests/StringListTest.SplitIntoLinesSingleTrailingCR (2180 of 2260)
PASS: lldb-unit :: Utility/Release/UtilityTests/StringListTest.ShiftCString (2181 of 2260)
PASS: lldb-unit :: Utility/Release/UtilityTests/StringListTest.ShiftMove (2182 of 2260)
PASS: lldb-unit :: Utility/Release/UtilityTests/StringListTest.ShiftStdString (2183 of 2260)
PASS: lldb-unit :: Utility/Release/UtilityTests/StringListTest.SplitIntoLinesEmpty (2184 of 2260)
PASS: lldb-unit :: Utility/Release/UtilityTests/StringListTest.SplitIntoLines (2185 of 2260)
PASS: lldb-unit :: Utility/Release/UtilityTests/StructuredDataTest.ParseJSONFromFile (2186 of 2260)
PASS: lldb-unit :: Utility/Release/UtilityTests/StructuredDataTest.StringDump (2187 of 2260)
PASS: lldb-unit :: Utility/Release/UtilityTests/SubsystemRAIITest.SubsystemWithErrorSuccess (2188 of 2260)
PASS: lldb-unit :: Utility/Release/UtilityTests/SubsystemRAIITest.SubsystemWithErrorFailure (2189 of 2260)
PASS: lldb-unit :: Utility/Release/UtilityTests/SubsystemRAIITest.NormalSubsystem (2190 of 2260)
PASS: lldb-unit :: Utility/Release/UtilityTests/TildeExpressionResolver.ResolveFullPath (2191 of 2260)
PASS: lldb-unit :: Utility/Release/UtilityTests/TimeoutTest.Construction (2192 of 2260)
PASS: lldb-unit :: Utility/Release/UtilityTests/TimeoutTest.Format (2193 of 2260)
PASS: lldb-unit :: Utility/Release/UtilityTests/UUIDTest.SetFromStringRef (2194 of 2260)
PASS: lldb-unit :: Utility/Release/UtilityTests/UUIDTest.RelationalOperators (2195 of 2260)
PASS: lldb-unit :: Utility/Release/UtilityTests/UUIDTest.StringConverion (2196 of 2260)
PASS: lldb-unit :: Utility/Release/UtilityTests/UriParserTest.BadPort (2197 of 2260)
PASS: lldb-unit :: Utility/Release/UtilityTests/UUIDTest.Validity (2198 of 2260)
PASS: lldb-unit :: Utility/Release/UtilityTests/UriParserTest.BadPort2 (2199 of 2260)
PASS: lldb-unit :: Utility/Release/UtilityTests/TimerTest.CategoryTimes (2200 of 2260)
PASS: lldb-unit :: Utility/Release/UtilityTests/TimerTest.CategoryTimesNested (2201 of 2260)
PASS: lldb-unit :: Utility/Release/UtilityTests/UriParserTest.BracketedHostname (2202 of 2260)
PASS: lldb-unit :: Utility/Release/UtilityTests/UriParserTest.BracketedHostnamePort (2203 of 2260)
PASS: lldb-unit :: Utility/Release/UtilityTests/UriParserTest.BracketedHostnameWithColon (2204 of 2260)
PASS: lldb-unit :: Utility/Release/UtilityTests/UriParserTest.BracketedHostnameWithPortIPv4 (2205 of 2260)
PASS: lldb-unit :: Utility/Release/UtilityTests/UriParserTest.BracketedHostnameWithPortIPv6 (2206 of 2260)
PASS: lldb-unit :: Utility/Release/UtilityTests/UriParserTest.Minimal (2207 of 2260)
PASS: lldb-unit :: Utility/Release/UtilityTests/UriParserTest.Empty (2208 of 2260)
PASS: lldb-unit :: Utility/Release/UtilityTests/UriParserTest.LongPath (2209 of 2260)
PASS: lldb-unit :: Utility/Release/UtilityTests/UriParserTest.MinimalPath (2210 of 2260)
PASS: lldb-unit :: Utility/Release/UtilityTests/UriParserTest.MinimalPort (2211 of 2260)
PASS: lldb-unit :: Utility/Release/UtilityTests/UriParserTest.PortOverflow (2212 of 2260)
PASS: lldb-unit :: Utility/Release/UtilityTests/UriParserTest.SchemeHostSeparator (2213 of 2260)
PASS: lldb-unit :: Utility/Release/UtilityTests/UriParserTest.SchemeHostSeparator2 (2214 of 2260)
PASS: lldb-unit :: Utility/Release/UtilityTests/UriParserTest.MinimalPortPath (2215 of 2260)
PASS: lldb-unit :: Utility/Release/UtilityTests/UriParserTest.SchemeHostSeparator3 (2216 of 2260)
PASS: lldb-unit :: Utility/Release/UtilityTests/UriParserTest.TypicalPortPathIPv4 (2217 of 2260)
PASS: lldb-unit :: Utility/Release/UtilityTests/UserIDResolver.GetGroupName (2218 of 2260)
PASS: lldb-unit :: Utility/Release/UtilityTests/UriParserTest.SchemeHostSeparator4 (2219 of 2260)
PASS: lldb-unit :: Utility/Release/UtilityTests/UriParserTest.TypicalPortPathIPv6 (2220 of 2260)
PASS: lldb-unit :: Utility/Release/UtilityTests/UserIDResolver.GetUserName (2221 of 2260)
PASS: lldb-unit :: Utility/Release/UtilityTests/VASprintfTest.BufferResize (2222 of 2260)
PASS: lldb-unit :: Utility/Release/UtilityTests/VASprintfTest.NoBufferResize (2223 of 2260)
PASS: lldb-unit :: Utility/Release/UtilityTests/VASprintfTest.EncodingError (2224 of 2260)
PASS: lldb-unit :: Utility/Release/UtilityTests/VMRange.Clear (2225 of 2260)
PASS: lldb-unit :: Utility/Release/UtilityTests/VMRange.Comparison (2226 of 2260)
PASS: lldb-unit :: Utility/Release/UtilityTests/VMRange.CollectionContains (2227 of 2260)
PASS: lldb-unit :: Utility/Release/UtilityTests/VMRange.ContainsRange (2228 of 2260)
PASS: lldb-unit :: Utility/Release/UtilityTests/VMRange.ContainsAddr (2229 of 2260)
PASS: lldb-unit :: Utility/Release/UtilityTests/VMRange.IsValid (2230 of 2260)
PASS: lldb-unit :: Utility/Release/UtilityTests/VMRange.Ordering (2231 of 2260)
PASS: lldb-unit :: Utility/Release/UtilityTests/VMRange.Reset (2232 of 2260)
PASS: lldb-unit :: Utility/Release/UtilityTests/VMRange.SetEndAddress (2233 of 2260)
PASS: lldb-unit :: Utility/Release/UtilityTests/XcodeSDKTest.FindXcodeContentsDirectoryInPath (2234 of 2260)
PASS: lldb-unit :: Utility/Release/UtilityTests/XcodeSDKTest.GetCanonicalNameAndConstruct (2235 of 2260)
PASS: lldb-unit :: Utility/Release/UtilityTests/TimerTest.CategoryTimes2 (2236 of 2260)
PASS: lldb-unit :: Utility/Release/UtilityTests/XcodeSDKTest.MergeTest (2237 of 2260)
PASS: lldb-unit :: Utility/Release/UtilityTests/XcodeSDKTest.ParseTest (2238 of 2260)
PASS: lldb-unit :: Utility/Release/UtilityTests/XcodeSDKTest.GetSDKTypeForTriple (2239 of 2260)
PASS: lldb-unit :: Utility/Release/UtilityTests/XcodeSDKTest.SDKSupportsModules (2240 of 2260)
PASS: lldb-unit :: Utility/Release/UtilityTests/XcodeSDKTest.SDKSupportsSwift (2241 of 2260)
PASS: lldb-unit :: debugserver/Release/debugserverTests/JSON.Parse (2242 of 2260)
PASS: lldb-unit :: Utility/Release/UtilityTests/TimerTest.CategoryTimesStats (2243 of 2260)
PASS: lldb-unit :: debugserver/Release/debugserverTests/RNBSocket.AnyListen (2244 of 2260)
PASS: lldb-unit :: debugserver/Release/debugserverTests/RNBSocket.LoopBackConnectIPv6 (2245 of 2260)
PASS: lldb-unit :: debugserver/Release/debugserverTests/RNBSocket.LoopBackConnectIPv4 (2246 of 2260)
PASS: lldb-unit :: debugserver/Release/debugserverTests/RNBSocket.LoopBackListenIPv4 (2247 of 2260)
PASS: lldb-unit :: debugserver/Release/debugserverTests/RNBSocket.LoopBackListenIPv6 (2248 of 2260)
PASS: lldb-unit :: SymbolFile/DWARF/Release/SymbolFileDWARFTests/XcodeSDKModuleTests.TestModuleGetXcodeSDK (2249 of 2260)
PASS: lldb-unit :: tools/lldb-server/tests/Release/LLDBServerTests/TestBase.DebugserverEnv (2250 of 2260)
PASS: lldb-unit :: tools/lldb-server/tests/Release/LLDBServerTests/TestBase.LaunchModePreservesEnvironment (2251 of 2260)
PASS: lldb-unit :: tools/lldb-server/tests/Release/LLDBServerTests/StandardStartupTest.TestStopReplyContainsThreadPcs (2252 of 2260)
PASS: lldb-shell :: Reproducer/TestReuseDirectory.test (2253 of 2260)
PASS: lldb-shell :: Reproducer/TestVersionCheck.test (2254 of 2260)
PASS: lldb-unit :: Platform/Release/LLDBPlatformTests/PlatformAppleSimulatorTest.TestSimHasSimEnvionament (2255 of 2260)
PASS: lldb-unit :: Platform/Release/LLDBPlatformTests/PlatformAppleSimulatorTest.TestHostPlatformToSim (2256 of 2260)
PASS: lldb-unit :: Process/gdb-remote/Release/ProcessGdbRemoteTests/GDBRemoteClientBaseTest.InterruptNoResponse (2257 of 2260)
PASS: lldb-shell :: Reproducer/TestVerify.test (2258 of 2260)
PASS: lldb-api :: types/TestLongTypesExpr.py (2259 of 2260)
FAIL: lldb-api :: tools/lldb-server/TestLldbGdbServer.py (2260 of 2260)
******************** TEST 'lldb-api :: tools/lldb-server/TestLldbGdbServer.py' FAILED ********************
Script:
--
/usr/local/Frameworks/Python.framework/Versions/3.7/bin/python3.7 /Users/buildslave/jenkins/workspace/lldb-cmake-standalone/llvm-project/lldb/test/API/dotest.py -u CXXFLAGS -u CFLAGS --codesign-identity lldb_codesign --env LLVM_LIBS_DIR=/Users/buildslave/jenkins/workspace/lldb-cmake-standalone/clang-build/./lib --arch x86_64 --build-dir /Users/buildslave/jenkins/workspace/lldb-cmake-standalone/lldb-xcode-build/lldb-test-build.noindex --lldb-module-cache-dir /Users/buildslave/jenkins/workspace/lldb-cmake-standalone/lldb-xcode-build/lldb-test-build.noindex/module-cache-lldb/lldb-api --clang-module-cache-dir /Users/buildslave/jenkins/workspace/lldb-cmake-standalone/lldb-xcode-build/lldb-test-build.noindex/module-cache-clang/lldb-api --executable /Users/buildslave/jenkins/workspace/lldb-cmake-standalone/lldb-xcode-build/Release/bin/lldb --compiler /Users/buildslave/jenkins/workspace/lldb-cmake-standalone/clang-build/./bin/clang --dsymutil /Users/buildslave/jenkins/workspace/lldb-cmake-standalone/clang-build/./bin/dsymutil --llvm-tools-dir /Users/buildslave/jenkins/workspace/lldb-cmake-standalone/clang-build/./bin --lldb-libs-dir /Users/buildslave/jenkins/workspace/lldb-cmake-standalone/lldb-xcode-build/Release/lib --framework /Users/buildslave/jenkins/workspace/lldb-cmake-standalone/lldb-xcode-build/Release/bin/LLDB.framework /Users/buildslave/jenkins/workspace/lldb-cmake-standalone/llvm-project/lldb/test/API/tools/lldb-server -p TestLldbGdbServer.py
--
Exit Code: 1

Hide Details

Command Output (stdout): -- lldb version 13.0.0 (http://labmaster3.local/git/llvm-project.git revision ef1f7f1d7db1e9bf7e256e208c295b605b014059) clang revision ef1f7f1d7db1e9bf7e256e208c295b605b014059 llvm revision ef1f7f1d7db1e9bf7e256e208c295b605b014059 libstdcxx tests will not be run because: Don't know how to build with libstdcxx on macosx Skipping following debug info categories: ['dwo']

Hide Details

-- Command Output (stderr): -- XFAIL: LLDB (/Users/buildslave/jenkins/workspace/lldb-cmake-standalone/clang-build/bin/clang-x86_64) :: test_Hc_then_Csignal_signals_correct_thread_launch_debugserver (TestLldbGdbServer.LldbGdbServerTestCase) UNSUPPORTED: LLDB (/Users/buildslave/jenkins/workspace/lldb-cmake-standalone/clang-build/bin/clang-x86_64) :: test_Hc_then_Csignal_signals_correct_thread_launch_llgs (TestLldbGdbServer.LldbGdbServerTestCase) (test case does not fall in any category of interest for this run) PASS: LLDB (/Users/buildslave/jenkins/workspace/lldb-cmake-standalone/clang-build/bin/clang-x86_64) :: test_Hg_switches_to_3_threads_attach_debugserver (TestLldbGdbServer.LldbGdbServerTestCase) UNSUPPORTED: LLDB (/Users/buildslave/jenkins/workspace/lldb-cmake-standalone/clang-build/bin/clang-x86_64) :: test_Hg_switches_to_3_threads_attach_llgs (TestLldbGdbServer.LldbGdbServerTestCase) (test case does not fall in any category of interest for this run) FAIL: LLDB (/Users/buildslave/jenkins/workspace/lldb-cmake-standalone/clang-build/bin/clang-x86_64) :: test_Hg_switches_to_3_threads_launch_debugserver (TestLldbGdbServer.LldbGdbServerTestCase) UNSUPPORTED: LLDB (/Users/buildslave/jenkins/workspace/lldb-cmake-standalone/clang-build/bin/clang-x86_64) :: test_Hg_switches_to_3_threads_launch_llgs (TestLldbGdbServer.LldbGdbServerTestCase) (test case does not fall in any category of interest for this run) PASS: LLDB (/Users/buildslave/jenkins/workspace/lldb-cmake-standalone/clang-build/bin/clang-x86_64) :: test_P_and_p_thread_suffix_work_debugserver (TestLldbGdbServer.LldbGdbServerTestCase) UNSUPPORTED: LLDB (/Users/buildslave/jenkins/workspace/lldb-cmake-standalone/clang-build/bin/clang-x86_64) :: test_P_and_p_thread_suffix_work_llgs (TestLldbGdbServer.LldbGdbServerTestCase) (test case does not fall in any category of interest for this run) PASS: LLDB (/Users/buildslave/jenkins/workspace/lldb-cmake-standalone/clang-build/bin/clang-x86_64) :: test_P_writes_all_gpr_registers_debugserver (TestLldbGdbServer.LldbGdbServerTestCase) UNSUPPORTED: LLDB (/Users/buildslave/jenkins/workspace/lldb-cmake-standalone/clang-build/bin/clang-x86_64) :: test_P_writes_all_gpr_registers_llgs (TestLldbGdbServer.LldbGdbServerTestCase) (test case does not fall in any category of interest for this run) PASS: LLDB (/Users/buildslave/jenkins/workspace/lldb-cmake-standalone/clang-build/bin/clang-x86_64) :: test_attach_commandline_continue_app_exits_debugserver (TestLldbGdbServer.LldbGdbServerTestCase) UNSUPPORTED: LLDB (/Users/buildslave/jenkins/workspace/lldb-cmake-standalone/clang-build/bin/clang-x86_64) :: test_attach_commandline_continue_app_exits_llgs (TestLldbGdbServer.LldbGdbServerTestCase) (test case does not fall in any category of interest for this run) PASS: LLDB (/Users/buildslave/jenkins/workspace/lldb-cmake-standalone/clang-build/bin/clang-x86_64) :: test_c_packet_works_debugserver (TestLldbGdbServer.LldbGdbServerTestCase) UNSUPPORTED: LLDB (/Users/buildslave/jenkins/workspace/lldb-cmake-standalone/clang-build/bin/clang-x86_64) :: test_c_packet_works_llgs (TestLldbGdbServer.LldbGdbServerTestCase) (test case does not fall in any category of interest for this run) PASS: LLDB (/Users/buildslave/jenkins/workspace/lldb-cmake-standalone/clang-build/bin/clang-x86_64) :: test_first_launch_stop_reply_thread_matches_first_qC_debugserver (TestLldbGdbServer.LldbGdbServerTestCase) UNSUPPORTED: LLDB (/Users/buildslave/jenkins/workspace/lldb-cmake-standalone/clang-build/bin/clang-x86_64) :: test_first_launch_stop_reply_thread_matches_first_qC_llgs (TestLldbGdbServer.LldbGdbServerTestCase) (test case does not fall in any category of interest for this run) UNSUPPORTED: LLDB (/Users/buildslave/jenkins/workspace/lldb-cmake-standalone/clang-build/bin/clang-x86_64) :: test_hardware_breakpoint_set_and_remove_work_debugserver (TestLldbGdbServer.LldbGdbServerTestCase) (requires one of linux) UNSUPPORTED: LLDB (/Users/buildslave/jenkins/workspace/lldb-cmake-standalone/clang-build/bin/clang-x86_64) :: test_hardware_breakpoint_set_and_remove_work_llgs (TestLldbGdbServer.LldbGdbServerTestCase) (test case does not fall in any category of interest for this run) PASS: LLDB (/Users/buildslave/jenkins/workspace/lldb-cmake-standalone/clang-build/bin/clang-x86_64) :: test_inferior_print_exit_debugserver (TestLldbGdbServer.LldbGdbServerTestCase) UNSUPPORTED: LLDB (/Users/buildslave/jenkins/workspace/lldb-cmake-standalone/clang-build/bin/clang-x86_64) :: test_inferior_print_exit_llgs (TestLldbGdbServer.LldbGdbServerTestCase) (test case does not fall in any category of interest for this run) PASS: LLDB (/Users/buildslave/jenkins/workspace/lldb-cmake-standalone/clang-build/bin/clang-x86_64) :: test_list_threads_in_stop_reply_supported_debugserver (TestLldbGdbServer.LldbGdbServerTestCase) UNSUPPORTED: LLDB (/Users/buildslave/jenkins/workspace/lldb-cmake-standalone/clang-build/bin/clang-x86_64) :: test_list_threads_in_stop_reply_supported_llgs (TestLldbGdbServer.LldbGdbServerTestCase) (test case does not fall in any category of interest for this run) PASS: LLDB (/Users/buildslave/jenkins/workspace/lldb-cmake-standalone/clang-build/bin/clang-x86_64) :: test_m_packet_reads_memory_debugserver (TestLldbGdbServer.LldbGdbServerTestCase) UNSUPPORTED: LLDB (/Users/buildslave/jenkins/workspace/lldb-cmake-standalone/clang-build/bin/clang-x86_64) :: test_m_packet_reads_memory_llgs (TestLldbGdbServer.LldbGdbServerTestCase) (test case does not fall in any category of interest for this run) PASS: LLDB (/Users/buildslave/jenkins/workspace/lldb-cmake-standalone/clang-build/bin/clang-x86_64) :: test_p_returns_correct_data_size_for_each_qRegisterInfo_launch_debugserver (TestLldbGdbServer.LldbGdbServerTestCase) UNSUPPORTED: LLDB (/Users/buildslave/jenkins/workspace/lldb-cmake-standalone/clang-build/bin/clang-x86_64) :: test_p_returns_correct_data_size_for_each_qRegisterInfo_launch_llgs (TestLldbGdbServer.LldbGdbServerTestCase) (test case does not fall in any category of interest for this run) PASS: LLDB (/Users/buildslave/jenkins/workspace/lldb-cmake-standalone/clang-build/bin/clang-x86_64) :: test_qMemoryRegionInfo_is_supported_debugserver (TestLldbGdbServer.LldbGdbServerTestCase) UNSUPPORTED: LLDB (/Users/buildslave/jenkins/workspace/lldb-cmake-standalone/clang-build/bin/clang-x86_64) :: test_qMemoryRegionInfo_is_supported_llgs (TestLldbGdbServer.LldbGdbServerTestCase) (test case does not fall in any category of interest for this run) PASS: LLDB (/Users/buildslave/jenkins/workspace/lldb-cmake-standalone/clang-build/bin/clang-x86_64) :: test_qMemoryRegionInfo_reports_code_address_as_executable_debugserver (TestLldbGdbServer.LldbGdbServerTestCase) UNSUPPORTED: LLDB (/Users/buildslave/jenkins/workspace/lldb-cmake-standalone/clang-build/bin/clang-x86_64) :: test_qMemoryRegionInfo_reports_code_address_as_executable_llgs (TestLldbGdbServer.LldbGdbServerTestCase) (test case does not fall in any category of interest for this run) PASS: LLDB (/Users/buildslave/jenkins/workspace/lldb-cmake-standalone/clang-build/bin/clang-x86_64) :: test_qMemoryRegionInfo_reports_heap_address_as_rw_debugserver (TestLldbGdbServer.LldbGdbServerTestCase) UNSUPPORTED: LLDB (/Users/buildslave/jenkins/workspace/lldb-cmake-standalone/clang-build/bin/clang-x86_64) :: test_qMemoryRegionInfo_reports_heap_address_as_rw_llgs (TestLldbGdbServer.LldbGdbServerTestCase) (test case does not fall in any category of interest for this run) PASS: LLDB (/Users/buildslave/jenkins/workspace/lldb-cmake-standalone/clang-build/bin/clang-x86_64) :: test_qMemoryRegionInfo_reports_stack_address_as_rw_debugserver (TestLldbGdbServer.LldbGdbServerTestCase) UNSUPPORTED: LLDB (/Users/buildslave/jenkins/workspace/lldb-cmake-standalone/clang-build/bin/clang-x86_64) :: test_qMemoryRegionInfo_reports_stack_address_as_rw_llgs (TestLldbGdbServer.LldbGdbServerTestCase) (test case does not fall in any category of interest for this run) PASS: LLDB (/Users/buildslave/jenkins/workspace/lldb-cmake-standalone/clang-build/bin/clang-x86_64) :: test_qRegisterInfo_contains_at_least_one_register_set_debugserver (TestLldbGdbServer.LldbGdbServerTestCase) UNSUPPORTED: LLDB (/Users/buildslave/jenkins/workspace/lldb-cmake-standalone/clang-build/bin/clang-x86_64) :: test_qRegisterInfo_contains_at_least_one_register_set_llgs (TestLldbGdbServer.LldbGdbServerTestCase) (test case does not fall in any category of interest for this run) UNSUPPORTED: LLDB (/Users/buildslave/jenkins/workspace/lldb-cmake-standalone/clang-build/bin/clang-x86_64) :: test_qRegisterInfo_contains_avx_registers_llgs (TestLldbGdbServer.LldbGdbServerTestCase) (test case does not fall in any category of interest for this run) PASS: LLDB (/Users/buildslave/jenkins/workspace/lldb-cmake-standalone/clang-build/bin/clang-x86_64) :: test_qRegisterInfo_contains_required_generics_debugserver_debugserver (TestLldbGdbServer.LldbGdbServerTestCase) UNSUPPORTED: LLDB (/Users/buildslave/jenkins/workspace/lldb-cmake-standalone/clang-build/bin/clang-x86_64) :: test_qRegisterInfo_contains_required_generics_debugserver_llgs (TestLldbGdbServer.LldbGdbServerTestCase) (test case does not fall in any category of interest for this run) PASS: LLDB (/Users/buildslave/jenkins/workspace/lldb-cmake-standalone/clang-build/bin/clang-x86_64) :: test_qRegisterInfo_returns_all_valid_results_debugserver (TestLldbGdbServer.LldbGdbServerTestCase) UNSUPPORTED: LLDB (/Users/buildslave/jenkins/workspace/lldb-cmake-standalone/clang-build/bin/clang-x86_64) :: test_qRegisterInfo_returns_all_valid_results_llgs (TestLldbGdbServer.LldbGdbServerTestCase) (test case does not fall in any category of interest for this run) PASS: LLDB (/Users/buildslave/jenkins/workspace/lldb-cmake-standalone/clang-build/bin/clang-x86_64) :: test_qRegisterInfo_returns_one_valid_result_debugserver (TestLldbGdbServer.LldbGdbServerTestCase) UNSUPPORTED: LLDB (/Users/buildslave/jenkins/workspace/lldb-cmake-standalone/clang-build/bin/clang-x86_64) :: test_qRegisterInfo_returns_one_valid_result_llgs (TestLldbGdbServer.LldbGdbServerTestCase) (test case does not fall in any category of interest for this run) PASS: LLDB (/Users/buildslave/jenkins/workspace/lldb-cmake-standalone/clang-build/bin/clang-x86_64) :: test_qSupported_returns_known_stub_features_debugserver (TestLldbGdbServer.LldbGdbServerTestCase) UNSUPPORTED: LLDB (/Users/buildslave/jenkins/workspace/lldb-cmake-standalone/clang-build/bin/clang-x86_64) :: test_qSupported_returns_known_stub_features_llgs (TestLldbGdbServer.LldbGdbServerTestCase) (test case does not fall in any category of interest for this run) PASS: LLDB (/Users/buildslave/jenkins/workspace/lldb-cmake-standalone/clang-build/bin/clang-x86_64) :: test_qThreadInfo_contains_thread_attach_debugserver (TestLldbGdbServer.LldbGdbServerTestCase) UNSUPPORTED: LLDB (/Users/buildslave/jenkins/workspace/lldb-cmake-standalone/clang-build/bin/clang-x86_64) :: test_qThreadInfo_contains_thread_attach_llgs (TestLldbGdbServer.LldbGdbServerTestCase) (test case does not fall in any category of interest for this run) PASS: LLDB (/Users/buildslave/jenkins/workspace/lldb-cmake-standalone/clang-build/bin/clang-x86_64) :: test_qThreadInfo_contains_thread_launch_debugserver (TestLldbGdbServer.LldbGdbServerTestCase) UNSUPPORTED: LLDB (/Users/buildslave/jenkins/workspace/lldb-cmake-standalone/clang-build/bin/clang-x86_64) :: test_qThreadInfo_contains_thread_launch_llgs (TestLldbGdbServer.LldbGdbServerTestCase) (test case does not fall in any category of interest for this run) PASS: LLDB (/Users/buildslave/jenkins/workspace/lldb-cmake-standalone/clang-build/bin/clang-x86_64) :: test_qThreadInfo_matches_qC_attach_debugserver (TestLldbGdbServer.LldbGdbServerTestCase) UNSUPPORTED: LLDB (/Users/buildslave/jenkins/workspace/lldb-cmake-standalone/clang-build/bin/clang-x86_64) :: test_qThreadInfo_matches_qC_attach_llgs (TestLldbGdbServer.LldbGdbServerTestCase) (test case does not fall in any category of interest for this run) PASS: LLDB (/Users/buildslave/jenkins/workspace/lldb-cmake-standalone/clang-build/bin/clang-x86_64) :: test_qThreadInfo_matches_qC_launch_debugserver (TestLldbGdbServer.LldbGdbServerTestCase) UNSUPPORTED: LLDB (/Users/buildslave/jenkins/workspace/lldb-cmake-standalone/clang-build/bin/clang-x86_64) :: test_qThreadInfo_matches_qC_launch_llgs (TestLldbGdbServer.LldbGdbServerTestCase) (test case does not fall in any category of interest for this run) PASS: LLDB (/Users/buildslave/jenkins/workspace/lldb-cmake-standalone/clang-build/bin/clang-x86_64) :: test_software_breakpoint_set_and_remove_work_debugserver (TestLldbGdbServer.LldbGdbServerTestCase) UNSUPPORTED: LLDB (/Users/buildslave/jenkins/workspace/lldb-cmake-standalone/clang-build/bin/clang-x86_64) :: test_software_breakpoint_set_and_remove_work_llgs (TestLldbGdbServer.LldbGdbServerTestCase) (test case does not fall in any category of interest for this run) PASS: LLDB (/Users/buildslave/jenkins/workspace/lldb-cmake-standalone/clang-build/bin/clang-x86_64) :: test_thread_suffix_supported_debugserver (TestLldbGdbServer.LldbGdbServerTestCase) UNSUPPORTED: LLDB (/Users/buildslave/jenkins/workspace/lldb-cmake-standalone/clang-build/bin/clang-x86_64) :: test_thread_suffix_supported_llgs (TestLldbGdbServer.LldbGdbServerTestCase) (test case does not fall in any category of interest for this run) PASS: LLDB (/Users/buildslave/jenkins/workspace/lldb-cmake-standalone/clang-build/bin/clang-x86_64) :: test_written_M_content_reads_back_correctly_debugserver (TestLldbGdbServer.LldbGdbServerTestCase) UNSUPPORTED: LLDB (/Users/buildslave/jenkins/workspace/lldb-cmake-standalone/clang-build/bin/clang-x86_64) :: test_written_M_content_reads_back_correctly_llgs (TestLldbGdbServer.LldbGdbServerTestCase) (test case does not fall in any category of interest for this run) ====================================================================== ERROR: test_Hg_switches_to_3_threads_launch_debugserver (TestLldbGdbServer.LldbGdbServerTestCase) ---------------------------------------------------------------------- Traceback (most recent call last): File "/Users/buildslave/jenkins/workspace/lldb-cmake-standalone/llvm-project/lldb/packages/Python/lldbsuite/test/tools/lldb-server/gdbremote_testcase.py", line 52, in test_method return attrvalue(self) File "/Users/buildslave/jenkins/workspace/lldb-cmake-standalone/llvm-project/lldb/packages/Python/lldbsuite/test/decorators.py", line 119, in wrapper func(*args, **kwargs) File "/Users/buildslave/jenkins/workspace/lldb-cmake-standalone/llvm-project/lldb/test/API/tools/lldb-server/TestLldbGdbServer.py", line 387, in test_Hg_switches_to_3_threads_launch self.Hg_switches_to_3_threads() File "/Users/buildslave/jenkins/workspace/lldb-cmake-standalone/llvm-project/lldb/test/API/tools/lldb-server/TestLldbGdbServer.py", line 362, in Hg_switches_to_3_threads threads = self.wait_for_thread_count(3) File "/Users/buildslave/jenkins/workspace/lldb-cmake-standalone/llvm-project/lldb/packages/Python/lldbsuite/test/tools/lldb-server/gdbremote_testcase.py", line 846, in wait_for_thread_count self.DEFAULT_TIMEOUT, thread_count, actual_thread_count)) Exception: timed out after 20 seconds while waiting for theads: waiting for at least 3 threads, found 1 Config=x86_64-/Users/buildslave/jenkins/workspace/lldb-cmake-standalone/clang-build/bin/clang ---------------------------------------------------------------------- Ran 59 tests in 94.478s

Hide Details

RESULT: FAILED (26 passes, 0 failures, 1 errors, 31 skipped, 1 expected failures, 0 unexpected successes)

Hide Details

--

Hide Details

******************** ******************** Failed Tests (1): lldb-api :: tools/lldb-server/TestLldbGdbServer.py

Hide Details

Hide Details

Testing Time: 446.20s Unsupported : 237 Passed : 2013 Expectedly Failed: 9 Failed : 1 make: *** [/Users/buildslave/jenkins/workspace/lldb-cmake-standalone/lldb-xcode-build/test/CMakeFiles/check-lldb-lit] Error 1

Hide Details

** BUILD FAILED **

Hide Details

Hide Details

The following build commands failed: PhaseScriptExecution CMake\ Rules /Users/buildslave/jenkins/workspace/lldb-cmake-standalone/lldb-xcode-build/test/lldb.build/Release/check-lldb-lit.build/Script-2ACFA1C91D904400944D4C7B.sh (1 failure) Command failed: Command '['/usr/bin/env', 'TERM=vt100', '/usr/local/bin/cmake', '--build', '.', '--config', 'Release', '--target', 'check-lldb']' returned non-zero exit status 65. Command: ['/usr/bin/env', 'TERM=vt100', '/usr/local/bin/cmake', '--build', '.', '--config', 'Release', '--target', 'check-lldb'] [Pipeline] } [Pipeline] // timeout [Pipeline] } [Pipeline] // stage [Pipeline] stage [Pipeline] { (Declarative: Post Actions) [Pipeline] emailext Warning: fraser@codeplay.com is not a recognized user, but sending mail anyway Warning: n.james93@hotmail.co.uk is not a recognized user, but sending mail anyway Warning: tbaeder@redhat.com is not a recognized user, but sending mail anyway Warning: ndesaulniers@google.com is not a recognized user, but sending mail anyway Warning: david.green@arm.com is not a recognized user, but sending mail anyway Warning: joe.ellis@arm.com is not a recognized user, but sending mail anyway Warning: jrtc27@jrtc27.com is not a recognized user, but sending mail anyway Warning: martin@martin.st is not a recognized user, but sending mail anyway Warning: andrzej.warzynski@arm.com is not a recognized user, but sending mail anyway Warning: nicolas.vasilache@gmail.com is not a recognized user, but sending mail anyway Warning: tianshilei1992@gmail.com is not a recognized user, but sending mail anyway Warning: mgorny@gentoo.org is not a recognized user, but sending mail anyway Warning: aqjune@gmail.com is not a recognized user, but sending mail anyway Warning: luismarques@lowrisc.org is not a recognized user, but sending mail anyway Warning: kuhnel@google.com is not a recognized user, but sending mail anyway Warning: craig.topper@intel.com is not a recognized user, but sending mail anyway Warning: andrei.elovikov@intel.com is not a recognized user, but sending mail anyway Warning: jeremy.bruestle@intel.com is not a recognized user, but sending mail anyway Warning: jay.foad@gmail.com is not a recognized user, but sending mail anyway Warning: sjoerd.meijer@arm.com is not a recognized user, but sending mail anyway Warning: wingo@igalia.com is not a recognized user, but sending mail anyway Warning: 1.int32@gmail.com is not a recognized user, but sending mail anyway Warning: kai.wang@sifive.com is not a recognized user, but sending mail anyway Warning: mliska@suse.cz is not a recognized user, but sending mail anyway Warning: frgossen@google.com is not a recognized user, but sending mail anyway Warning: anastasia.stulova@arm.com is not a recognized user, but sending mail anyway Warning: a.v.lapshin@mail.ru is not a recognized user, but sending mail anyway Warning: llvm-dev@redking.me.uk is not a recognized user, but sending mail anyway Warning: Stanislav.Mekhanoshin@amd.com is not a recognized user, but sending mail anyway Warning: sven.vanhaastregt@arm.com is not a recognized user, but sending mail anyway Warning: aschwaighofer@apple.com is not a recognized user, but sending mail anyway Warning: davelee.com@gmail.com is not a recognized user, but sending mail anyway Warning: flo@fhahn.com is not a recognized user, but sending mail anyway Warning: fraser@codeplay.com is not a recognized user, but sending mail anyway Warning: n.james93@hotmail.co.uk is not a recognized user, but sending mail anyway Warning: tbaeder@redhat.com is not a recognized user, but sending mail anyway Warning: ndesaulniers@google.com is not a recognized user, but sending mail anyway Warning: david.green@arm.com is not a recognized user, but sending mail anyway Warning: joe.ellis@arm.com is not a recognized user, but sending mail anyway Warning: jrtc27@jrtc27.com is not a recognized user, but sending mail anyway Warning: martin@martin.st is not a recognized user, but sending mail anyway Warning: andrzej.warzynski@arm.com is not a recognized user, but sending mail anyway Warning: nicolas.vasilache@gmail.com is not a recognized user, but sending mail anyway Warning: tianshilei1992@gmail.com is not a recognized user, but sending mail anyway Warning: mgorny@gentoo.org is not a recognized user, but sending mail anyway Warning: aqjune@gmail.com is not a recognized user, but sending mail anyway Warning: luismarques@lowrisc.org is not a recognized user, but sending mail anyway Warning: kuhnel@google.com is not a recognized user, but sending mail anyway Warning: craig.topper@intel.com is not a recognized user, but sending mail anyway Warning: andrei.elovikov@intel.com is not a recognized user, but sending mail anyway Warning: jeremy.bruestle@intel.com is not a recognized user, but sending mail anyway Warning: jay.foad@gmail.com is not a recognized user, but sending mail anyway Warning: sjoerd.meijer@arm.com is not a recognized user, but sending mail anyway Warning: wingo@igalia.com is not a recognized user, but sending mail anyway Warning: 1.int32@gmail.com is not a recognized user, but sending mail anyway Warning: kai.wang@sifive.com is not a recognized user, but sending mail anyway Warning: mliska@suse.cz is not a recognized user, but sending mail anyway Warning: frgossen@google.com is not a recognized user, but sending mail anyway Warning: anastasia.stulova@arm.com is not a recognized user, but sending mail anyway Warning: a.v.lapshin@mail.ru is not a recognized user, but sending mail anyway Warning: llvm-dev@redking.me.uk is not a recognized user, but sending mail anyway Warning: Stanislav.Mekhanoshin@amd.com is not a recognized user, but sending mail anyway Warning: sven.vanhaastregt@arm.com is not a recognized user, but sending mail anyway Warning: aschwaighofer@apple.com is not a recognized user, but sending mail anyway Warning: davelee.com@gmail.com is not a recognized user, but sending mail anyway Warning: flo@fhahn.com is not a recognized user, but sending mail anyway

Hide Details

Begin Pre-Send Script... Sending email to: Florian Hahn <florian_hahn@apple.com> Florian Hahn <florian_hahn@apple.com> Azhar Mohammed <azhar@apple.com>
[Pipeline] } [Pipeline] // stage [Pipeline] } [Pipeline] // withEnv [Pipeline] } [Pipeline] // node [Pipeline] End of Pipeline ERROR: script returned exit code 1 Finished: FAILURE