UnstableConsole Output

Skipping 79,048 KB.. Full Log
n.framework/Versions/3.7/bin/python3.7 /Users/buildslave/jenkins/workspace/lldb-cmake-matrix/llvm-project/lldb/test/API/dotest.py -S nm -u CXXFLAGS -u CFLAGS --codesign-identity lldb_codesign --arch x86_64 --build-dir /Users/buildslave/jenkins/workspace/lldb-cmake-matrix/lldb-build/lldb-test-build.noindex -s=/Users/buildslave/jenkins/workspace/lldb-cmake-matrix/test/logs -t --env TERM=vt100 --skip-category gmodules --skip-category watchpoint --arch=x86_64 --env LLVM_LIBS_DIR=/Users/buildslave/jenkins/workspace/lldb-cmake-matrix/lldb-build/./lib --arch x86_64 --build-dir /Users/buildslave/jenkins/workspace/lldb-cmake-matrix/lldb-build/lldb-test-build.noindex -s /Users/buildslave/jenkins/workspace/lldb-cmake-matrix/lldb-build/lldb-test-traces --lldb-module-cache-dir /Users/buildslave/jenkins/workspace/lldb-cmake-matrix/lldb-build/lldb-test-build.noindex/module-cache-lldb/lldb-api --clang-module-cache-dir /Users/buildslave/jenkins/workspace/lldb-cmake-matrix/lldb-build/lldb-test-build.noindex/module-cache-clang/lldb-api --executable /Users/buildslave/jenkins/workspace/lldb-cmake-matrix/lldb-build/./bin/lldb --compiler /Users/buildslave/jenkins/workspace/lldb-cmake-matrix/lldb-build/./bin/clang --dsymutil /Users/buildslave/jenkins/workspace/lldb-cmake-matrix/lldb-build/./bin/dsymutil --filecheck /Users/buildslave/jenkins/workspace/lldb-cmake-matrix/lldb-build/./bin/FileCheck --yaml2obj /Users/buildslave/jenkins/workspace/lldb-cmake-matrix/lldb-build/./bin/yaml2obj --server /Users/buildslave/jenkins/workspace/lldb-cmake-matrix/lldb-build/./bin/debugserver --lldb-libs-dir /Users/buildslave/jenkins/workspace/lldb-cmake-matrix/lldb-build/./lib /Users/buildslave/jenkins/workspace/lldb-cmake-matrix/llvm-project/lldb/test/API/python_api/exprpath_synthetic -p TestExprPathSynthetic.py
--
Exit Code: 1

Hide Details

Command Output (stdout): -- lldb version 12.0.99 (http://labmaster3.local/git/llvm-project.git revision d5adadb3a564236a894cbb5f189496a65d9e9742) clang revision d5adadb3a564236a894cbb5f189496a65d9e9742 llvm revision d5adadb3a564236a894cbb5f189496a65d9e9742 libstdcxx tests will not be run because: Don't know how to build with libstdcxx on macosx Skipping following debug info categories: ['dwo']

Hide Details

-- Command Output (stderr): --

Hide Details

Session logs for test failures/errors/unexpected successes will go into directory '/Users/buildslave/jenkins/workspace/lldb-cmake-matrix/lldb-build/lldb-test-traces' Change dir to: /Users/buildslave/jenkins/workspace/lldb-cmake-matrix/llvm-project/lldb/test/API/python_api/exprpath_synthetic runCmd: settings clear -all output:

Hide Details

runCmd: settings set symbols.enable-external-lookup false output:

Hide Details

runCmd: settings set target.inherit-tcc true output:

Hide Details

runCmd: settings set target.auto-apply-fixits false output:

Hide Details

runCmd: settings set plugin.process.gdb-remote.packet-timeout 60 output:

Hide Details

runCmd: settings set symbols.clang-modules-cache-path "/Users/buildslave/jenkins/workspace/lldb-cmake-matrix/lldb-build/lldb-test-build.noindex/module-cache-lldb/lldb-api" output:

Hide Details

runCmd: settings set use-color false output:

Hide Details

runCmd: setting set target.prefer-dynamic-value no-dynamic-values output:

Hide Details

runCmd: expr (*( (int *)0x100207bf0)) = 12 output: (int) $0 = 12

Hide Details

Hide Details

runCmd: po ((id)0x100002058) output: World

Hide Details

Hide Details

Hide Details

Ran command: "po ((id)0x100002058)"

Hide Details

Got output: World

Hide Details

Hide Details

Expecting sub string: "World" (was found)

Hide Details

<bound method SBProcess.Kill of <lldb.SBProcess; proxy of <Swig Object of type 'lldb::SBProcess *' at 0x10b4473c0> >>: success

Hide Details

PASS: LLDB (/Users/buildslave/jenkins/workspace/lldb-cmake-matrix/lldb-build/bin/clang-x86_64) :: test_dsym (lldbsuite.test.lldbtest.TestExprPathSynthetic) runCmd: settings clear -all output:

Hide Details

runCmd: settings set symbols.enable-external-lookup false output:

Hide Details

runCmd: settings set target.inherit-tcc true output:

Hide Details

runCmd: settings set target.auto-apply-fixits false output:

Hide Details

runCmd: settings set plugin.process.gdb-remote.packet-timeout 60 output:

Hide Details

runCmd: settings set symbols.clang-modules-cache-path "/Users/buildslave/jenkins/workspace/lldb-cmake-matrix/lldb-build/lldb-test-build.noindex/module-cache-lldb/lldb-api" output:

Hide Details

runCmd: settings set use-color false output:

Hide Details

runCmd: setting set target.prefer-dynamic-value no-dynamic-values output:

Hide Details

FAIL: LLDB (/Users/buildslave/jenkins/workspace/lldb-cmake-matrix/lldb-build/bin/clang-x86_64) :: test_dwarf (lldbsuite.test.lldbtest.TestExprPathSynthetic) <bound method SBProcess.Kill of <lldb.SBProcess; proxy of <Swig Object of type 'lldb::SBProcess *' at 0x10acf49c0> >>: success

Hide Details

UNSUPPORTED: LLDB (/Users/buildslave/jenkins/workspace/lldb-cmake-matrix/lldb-build/bin/clang-x86_64) :: test_dwo (lldbsuite.test.lldbtest.TestExprPathSynthetic) (test case does not fall in any category of interest for this run) UNSUPPORTED: LLDB (/Users/buildslave/jenkins/workspace/lldb-cmake-matrix/lldb-build/bin/clang-x86_64) :: test_gmodules (lldbsuite.test.lldbtest.TestExprPathSynthetic) (test case does not fall in any category of interest for this run) Restore dir to: /Users/buildslave/jenkins/workspace/lldb-cmake-matrix/lldb-build/tools/lldb/test ====================================================================== FAIL: test_dwarf (lldbsuite.test.lldbtest.TestExprPathSynthetic) ---------------------------------------------------------------------- Traceback (most recent call last): File "/Users/buildslave/jenkins/workspace/lldb-cmake-matrix/llvm-project/lldb/packages/Python/lldbsuite/test/lldbtest.py", line 1823, in test_method return attrvalue(self) File "/Users/buildslave/jenkins/workspace/lldb-cmake-matrix/llvm-project/lldb/packages/Python/lldbsuite/test/lldbinline.py", line 121, in _test self.do_test() File "/Users/buildslave/jenkins/workspace/lldb-cmake-matrix/llvm-project/lldb/packages/Python/lldbsuite/test/lldbinline.py", line 157, in do_test "inline test did not hit a single breakpoint") AssertionError: False is not True : inline test did not hit a single breakpoint Config=x86_64-/Users/buildslave/jenkins/workspace/lldb-cmake-matrix/lldb-build/bin/clang ---------------------------------------------------------------------- Ran 4 tests in 41.225s

Hide Details

RESULT: FAILED (1 passes, 1 failures, 0 errors, 2 skipped, 0 expected failures, 0 unexpected successes)

Hide Details

--

Hide Details

******************** FAIL: lldb-api :: commands/target/stop-hooks/TestStopHooks.py (1351 of 2167) ******************** TEST 'lldb-api :: commands/target/stop-hooks/TestStopHooks.py' FAILED ******************** Script: -- /usr/local/Frameworks/Python.framework/Versions/3.7/bin/python3.7 /Users/buildslave/jenkins/workspace/lldb-cmake-matrix/llvm-project/lldb/test/API/dotest.py -S nm -u CXXFLAGS -u CFLAGS --codesign-identity lldb_codesign --arch x86_64 --build-dir /Users/buildslave/jenkins/workspace/lldb-cmake-matrix/lldb-build/lldb-test-build.noindex -s=/Users/buildslave/jenkins/workspace/lldb-cmake-matrix/test/logs -t --env TERM=vt100 --skip-category gmodules --skip-category watchpoint --arch=x86_64 --env LLVM_LIBS_DIR=/Users/buildslave/jenkins/workspace/lldb-cmake-matrix/lldb-build/./lib --arch x86_64 --build-dir /Users/buildslave/jenkins/workspace/lldb-cmake-matrix/lldb-build/lldb-test-build.noindex -s /Users/buildslave/jenkins/workspace/lldb-cmake-matrix/lldb-build/lldb-test-traces --lldb-module-cache-dir /Users/buildslave/jenkins/workspace/lldb-cmake-matrix/lldb-build/lldb-test-build.noindex/module-cache-lldb/lldb-api --clang-module-cache-dir /Users/buildslave/jenkins/workspace/lldb-cmake-matrix/lldb-build/lldb-test-build.noindex/module-cache-clang/lldb-api --executable /Users/buildslave/jenkins/workspace/lldb-cmake-matrix/lldb-build/./bin/lldb --compiler /Users/buildslave/jenkins/workspace/lldb-cmake-matrix/lldb-build/./bin/clang --dsymutil /Users/buildslave/jenkins/workspace/lldb-cmake-matrix/lldb-build/./bin/dsymutil --filecheck /Users/buildslave/jenkins/workspace/lldb-cmake-matrix/lldb-build/./bin/FileCheck --yaml2obj /Users/buildslave/jenkins/workspace/lldb-cmake-matrix/lldb-build/./bin/yaml2obj --server /Users/buildslave/jenkins/workspace/lldb-cmake-matrix/lldb-build/./bin/debugserver --lldb-libs-dir /Users/buildslave/jenkins/workspace/lldb-cmake-matrix/lldb-build/./lib /Users/buildslave/jenkins/workspace/lldb-cmake-matrix/llvm-project/lldb/test/API/commands/target/stop-hooks -p TestStopHooks.py -- Exit Code: 1

Hide Details

Command Output (stdout): -- lldb version 12.0.99 (http://labmaster3.local/git/llvm-project.git revision d5adadb3a564236a894cbb5f189496a65d9e9742) clang revision d5adadb3a564236a894cbb5f189496a65d9e9742 llvm revision d5adadb3a564236a894cbb5f189496a65d9e9742 libstdcxx tests will not be run because: Don't know how to build with libstdcxx on macosx Skipping following debug info categories: ['dwo']

Hide Details

-- Command Output (stderr): --

Hide Details

Session logs for test failures/errors/unexpected successes will go into directory '/Users/buildslave/jenkins/workspace/lldb-cmake-matrix/lldb-build/lldb-test-traces' Change dir to: /Users/buildslave/jenkins/workspace/lldb-cmake-matrix/llvm-project/lldb/test/API/commands/target/stop-hooks runCmd: settings clear -all output:

Hide Details

runCmd: settings set symbols.enable-external-lookup false output:

Hide Details

runCmd: settings set target.inherit-tcc true output:

Hide Details

runCmd: settings set target.auto-apply-fixits false output:

Hide Details

runCmd: settings set plugin.process.gdb-remote.packet-timeout 60 output:

Hide Details

runCmd: settings set symbols.clang-modules-cache-path "/Users/buildslave/jenkins/workspace/lldb-cmake-matrix/lldb-build/lldb-test-build.noindex/module-cache-lldb/lldb-api" output:

Hide Details

runCmd: settings set use-color false output:

Hide Details

runCmd: setting set target.prefer-dynamic-value no-dynamic-values output:

Hide Details

FAIL: LLDB (/Users/buildslave/jenkins/workspace/lldb-cmake-matrix/lldb-build/bin/clang-x86_64) :: test_stop_hooks_step_out (TestStopHooks.TestStopHooks) <bound method SBProcess.Kill of <lldb.SBProcess; proxy of <Swig Object of type 'lldb::SBProcess *' at 0x107a88780> >>: success

Hide Details

Restore dir to: /Users/buildslave/jenkins/workspace/lldb-cmake-matrix/lldb-build/tools/lldb/test ====================================================================== FAIL: test_stop_hooks_step_out (TestStopHooks.TestStopHooks) Test that stop hooks fire on step-out. ---------------------------------------------------------------------- Traceback (most recent call last): File "/Users/buildslave/jenkins/workspace/lldb-cmake-matrix/llvm-project/lldb/test/API/commands/target/stop-hooks/TestStopHooks.py", line 30, in test_stop_hooks_step_out self.step_out_test() File "/Users/buildslave/jenkins/workspace/lldb-cmake-matrix/llvm-project/lldb/test/API/commands/target/stop-hooks/TestStopHooks.py", line 34, in step_out_test "Set a breakpoint here", self.main_source_file) File "/Users/buildslave/jenkins/workspace/lldb-cmake-matrix/llvm-project/lldb/packages/Python/lldbsuite/test/lldbutil.py", line 954, in run_to_source_breakpoint only_one_thread, extra_images) File "/Users/buildslave/jenkins/workspace/lldb-cmake-matrix/llvm-project/lldb/packages/Python/lldbsuite/test/lldbutil.py", line 873, in run_to_breakpoint_do_run "Process launch failed: %s" % (error.GetCString())) AssertionError: True is not False : Process launch failed: process exited with status -1 (tried to attach to process already being debugged) Config=x86_64-/Users/buildslave/jenkins/workspace/lldb-cmake-matrix/lldb-build/bin/clang ---------------------------------------------------------------------- Ran 1 test in 30.639s

Hide Details

RESULT: FAILED (0 passes, 1 failures, 0 errors, 0 skipped, 0 expected failures, 0 unexpected successes)

Hide Details

--

Hide Details

******************** FAIL: lldb-api :: macosx/thread_suspend/TestInternalThreadSuspension.py (1352 of 2167) ******************** TEST 'lldb-api :: macosx/thread_suspend/TestInternalThreadSuspension.py' FAILED ******************** Script: -- /usr/local/Frameworks/Python.framework/Versions/3.7/bin/python3.7 /Users/buildslave/jenkins/workspace/lldb-cmake-matrix/llvm-project/lldb/test/API/dotest.py -S nm -u CXXFLAGS -u CFLAGS --codesign-identity lldb_codesign --arch x86_64 --build-dir /Users/buildslave/jenkins/workspace/lldb-cmake-matrix/lldb-build/lldb-test-build.noindex -s=/Users/buildslave/jenkins/workspace/lldb-cmake-matrix/test/logs -t --env TERM=vt100 --skip-category gmodules --skip-category watchpoint --arch=x86_64 --env LLVM_LIBS_DIR=/Users/buildslave/jenkins/workspace/lldb-cmake-matrix/lldb-build/./lib --arch x86_64 --build-dir /Users/buildslave/jenkins/workspace/lldb-cmake-matrix/lldb-build/lldb-test-build.noindex -s /Users/buildslave/jenkins/workspace/lldb-cmake-matrix/lldb-build/lldb-test-traces --lldb-module-cache-dir /Users/buildslave/jenkins/workspace/lldb-cmake-matrix/lldb-build/lldb-test-build.noindex/module-cache-lldb/lldb-api --clang-module-cache-dir /Users/buildslave/jenkins/workspace/lldb-cmake-matrix/lldb-build/lldb-test-build.noindex/module-cache-clang/lldb-api --executable /Users/buildslave/jenkins/workspace/lldb-cmake-matrix/lldb-build/./bin/lldb --compiler /Users/buildslave/jenkins/workspace/lldb-cmake-matrix/lldb-build/./bin/clang --dsymutil /Users/buildslave/jenkins/workspace/lldb-cmake-matrix/lldb-build/./bin/dsymutil --filecheck /Users/buildslave/jenkins/workspace/lldb-cmake-matrix/lldb-build/./bin/FileCheck --yaml2obj /Users/buildslave/jenkins/workspace/lldb-cmake-matrix/lldb-build/./bin/yaml2obj --server /Users/buildslave/jenkins/workspace/lldb-cmake-matrix/lldb-build/./bin/debugserver --lldb-libs-dir /Users/buildslave/jenkins/workspace/lldb-cmake-matrix/lldb-build/./lib /Users/buildslave/jenkins/workspace/lldb-cmake-matrix/llvm-project/lldb/test/API/macosx/thread_suspend -p TestInternalThreadSuspension.py -- Exit Code: 1

Hide Details

Command Output (stdout): -- lldb version 12.0.99 (http://labmaster3.local/git/llvm-project.git revision d5adadb3a564236a894cbb5f189496a65d9e9742) clang revision d5adadb3a564236a894cbb5f189496a65d9e9742 llvm revision d5adadb3a564236a894cbb5f189496a65d9e9742 libstdcxx tests will not be run because: Don't know how to build with libstdcxx on macosx Skipping following debug info categories: ['dwo']

Hide Details

-- Command Output (stderr): --

Hide Details

Session logs for test failures/errors/unexpected successes will go into directory '/Users/buildslave/jenkins/workspace/lldb-cmake-matrix/lldb-build/lldb-test-traces' Change dir to: /Users/buildslave/jenkins/workspace/lldb-cmake-matrix/llvm-project/lldb/test/API/macosx/thread_suspend runCmd: settings clear -all output:

Hide Details

runCmd: settings set symbols.enable-external-lookup false output:

Hide Details

runCmd: settings set target.inherit-tcc true output:

Hide Details

runCmd: settings set target.auto-apply-fixits false output:

Hide Details

runCmd: settings set plugin.process.gdb-remote.packet-timeout 60 output:

Hide Details

runCmd: settings set symbols.clang-modules-cache-path "/Users/buildslave/jenkins/workspace/lldb-cmake-matrix/lldb-build/lldb-test-build.noindex/module-cache-lldb/lldb-api" output:

Hide Details

runCmd: settings set use-color false output:

Hide Details

runCmd: setting set target.prefer-dynamic-value no-dynamic-values output:

Hide Details

FAIL: LLDB (/Users/buildslave/jenkins/workspace/lldb-cmake-matrix/lldb-build/bin/clang-x86_64) :: test_suspended_threads (TestInternalThreadSuspension.TestSuspendedThreadHandling) <bound method SBProcess.Kill of <lldb.SBProcess; proxy of <Swig Object of type 'lldb::SBProcess *' at 0x10982a780> >>: success

Hide Details

Restore dir to: /Users/buildslave/jenkins/workspace/lldb-cmake-matrix/lldb-build/tools/lldb/test ====================================================================== FAIL: test_suspended_threads (TestInternalThreadSuspension.TestSuspendedThreadHandling) Test that debugserver doesn't disturb the suspend count of a thread ---------------------------------------------------------------------- Traceback (most recent call last): File "/Users/buildslave/jenkins/workspace/lldb-cmake-matrix/llvm-project/lldb/test/API/macosx/thread_suspend/TestInternalThreadSuspension.py", line 25, in test_suspended_threads self.suspended_thread_test() File "/Users/buildslave/jenkins/workspace/lldb-cmake-matrix/llvm-project/lldb/test/API/macosx/thread_suspend/TestInternalThreadSuspension.py", line 51, in suspended_thread_test "Stop here to get things going", self.main_source_file) File "/Users/buildslave/jenkins/workspace/lldb-cmake-matrix/llvm-project/lldb/packages/Python/lldbsuite/test/lldbutil.py", line 954, in run_to_source_breakpoint only_one_thread, extra_images) File "/Users/buildslave/jenkins/workspace/lldb-cmake-matrix/llvm-project/lldb/packages/Python/lldbsuite/test/lldbutil.py", line 873, in run_to_breakpoint_do_run "Process launch failed: %s" % (error.GetCString())) AssertionError: True is not False : Process launch failed: process exited with status -1 (tried to attach to process already being debugged) Config=x86_64-/Users/buildslave/jenkins/workspace/lldb-cmake-matrix/lldb-build/bin/clang ---------------------------------------------------------------------- Ran 1 test in 30.729s

Hide Details

RESULT: FAILED (0 passes, 1 failures, 0 errors, 0 skipped, 0 expected failures, 0 unexpected successes)

Hide Details

--

Hide Details

******************** PASS: lldb-unit :: Utility/./UtilityTests/AnsiTerminal.KnownPrefix (1353 of 2167) FAIL: lldb-api :: functionalities/data-formatter/user-format-vs-summary/TestUserFormatVsSummary.py (1354 of 2167) ******************** TEST 'lldb-api :: functionalities/data-formatter/user-format-vs-summary/TestUserFormatVsSummary.py' FAILED ******************** Script: -- /usr/local/Frameworks/Python.framework/Versions/3.7/bin/python3.7 /Users/buildslave/jenkins/workspace/lldb-cmake-matrix/llvm-project/lldb/test/API/dotest.py -S nm -u CXXFLAGS -u CFLAGS --codesign-identity lldb_codesign --arch x86_64 --build-dir /Users/buildslave/jenkins/workspace/lldb-cmake-matrix/lldb-build/lldb-test-build.noindex -s=/Users/buildslave/jenkins/workspace/lldb-cmake-matrix/test/logs -t --env TERM=vt100 --skip-category gmodules --skip-category watchpoint --arch=x86_64 --env LLVM_LIBS_DIR=/Users/buildslave/jenkins/workspace/lldb-cmake-matrix/lldb-build/./lib --arch x86_64 --build-dir /Users/buildslave/jenkins/workspace/lldb-cmake-matrix/lldb-build/lldb-test-build.noindex -s /Users/buildslave/jenkins/workspace/lldb-cmake-matrix/lldb-build/lldb-test-traces --lldb-module-cache-dir /Users/buildslave/jenkins/workspace/lldb-cmake-matrix/lldb-build/lldb-test-build.noindex/module-cache-lldb/lldb-api --clang-module-cache-dir /Users/buildslave/jenkins/workspace/lldb-cmake-matrix/lldb-build/lldb-test-build.noindex/module-cache-clang/lldb-api --executable /Users/buildslave/jenkins/workspace/lldb-cmake-matrix/lldb-build/./bin/lldb --compiler /Users/buildslave/jenkins/workspace/lldb-cmake-matrix/lldb-build/./bin/clang --dsymutil /Users/buildslave/jenkins/workspace/lldb-cmake-matrix/lldb-build/./bin/dsymutil --filecheck /Users/buildslave/jenkins/workspace/lldb-cmake-matrix/lldb-build/./bin/FileCheck --yaml2obj /Users/buildslave/jenkins/workspace/lldb-cmake-matrix/lldb-build/./bin/yaml2obj --server /Users/buildslave/jenkins/workspace/lldb-cmake-matrix/lldb-build/./bin/debugserver --lldb-libs-dir /Users/buildslave/jenkins/workspace/lldb-cmake-matrix/lldb-build/./lib /Users/buildslave/jenkins/workspace/lldb-cmake-matrix/llvm-project/lldb/test/API/functionalities/data-formatter/user-format-vs-summary -p TestUserFormatVsSummary.py -- Exit Code: 1

Hide Details

Command Output (stdout): -- lldb version 12.0.99 (http://labmaster3.local/git/llvm-project.git revision d5adadb3a564236a894cbb5f189496a65d9e9742) clang revision d5adadb3a564236a894cbb5f189496a65d9e9742 llvm revision d5adadb3a564236a894cbb5f189496a65d9e9742 libstdcxx tests will not be run because: Don't know how to build with libstdcxx on macosx Skipping following debug info categories: ['dwo']

Hide Details

-- Command Output (stderr): --

Hide Details

Session logs for test failures/errors/unexpected successes will go into directory '/Users/buildslave/jenkins/workspace/lldb-cmake-matrix/lldb-build/lldb-test-traces' Change dir to: /Users/buildslave/jenkins/workspace/lldb-cmake-matrix/llvm-project/lldb/test/API/functionalities/data-formatter/user-format-vs-summary runCmd: settings clear -all output:

Hide Details

runCmd: settings set symbols.enable-external-lookup false output:

Hide Details

runCmd: settings set target.inherit-tcc true output:

Hide Details

runCmd: settings set target.auto-apply-fixits false output:

Hide Details

runCmd: settings set plugin.process.gdb-remote.packet-timeout 60 output:

Hide Details

runCmd: settings set symbols.clang-modules-cache-path "/Users/buildslave/jenkins/workspace/lldb-cmake-matrix/lldb-build/lldb-test-build.noindex/module-cache-lldb/lldb-api" output:

Hide Details

runCmd: settings set use-color false output:

Hide Details

runCmd: setting set target.prefer-dynamic-value no-dynamic-values output:

Hide Details

runCmd: file /Users/buildslave/jenkins/workspace/lldb-cmake-matrix/lldb-build/lldb-test-build.noindex/functionalities/data-formatter/user-format-vs-summary/TestUserFormatVsSummary.test_with_run_command_dsym/a.out output: Current executable set to '/Users/buildslave/jenkins/workspace/lldb-cmake-matrix/lldb-build/lldb-test-build.noindex/functionalities/data-formatter/user-format-vs-summary/TestUserFormatVsSummary.test_with_run_command_dsym/a.out' (x86_64).

Hide Details

Hide Details

runCmd: breakpoint set -f "main.cpp" -l 10 output: Breakpoint 1: where = a.out`main + 34 at main.cpp:10:12, address = 0x0000000100000f52

Hide Details

Hide Details

Expecting pattern: ^Breakpoint (?P<bpno>[0-9]+): (?P<num_locations>[0-9]+) locations\.$ Not matched

Hide Details

Expecting pattern: ^Breakpoint (?P<bpno>[0-9]+): (?P<num_locations>no) locations \(pending\)\. Not matched

Hide Details

Expecting pattern: ^Breakpoint (?P<bpno>[0-9]+): where = (?P<module>.*)`(?P<symbol>[+\-]{0,1}[^+]+)( \+ (?P<offset>[0-9]+)){0,1}( \[inlined\] (?P<inline_symbol>.*)){0,1} at (?P<file>[^:]+):(?P<line_no>[0-9]+)(?P<column>(:[0-9]+)?), address = (?P<address>0x[0-9a-fA-F]+)$ Matched

Hide Details

runCmd: run output: Process 74111 stopped * thread #1, queue = 'com.apple.main-thread', stop reason = breakpoint 1.1 frame #0: 0x0000000100000f52 a.out`main at main.cpp:10:12 7 8 int main() { 9 Pair p1(3,-3); -> 10 return p1.x + p1.y; // Set break point at this line. ^ 11 }

Hide Details

Process 74111 launched: '/Users/buildslave/jenkins/workspace/lldb-cmake-matrix/lldb-build/lldb-test-build.noindex/functionalities/data-formatter/user-format-vs-summary/TestUserFormatVsSummary.test_with_run_command_dsym/a.out' (x86_64)

Hide Details

Hide Details

runCmd: thread list output: Process 74111 stopped * thread #1: tid = 0x65d0aa, 0x0000000100000f52 a.out`main at main.cpp:10:12, queue = 'com.apple.main-thread', stop reason = breakpoint 1.1

Hide Details

Hide Details

Ran command: "thread list"

Hide Details

Got output: Process 74111 stopped * thread #1: tid = 0x65d0aa, 0x0000000100000f52 a.out`main at main.cpp:10:12, queue = 'com.apple.main-thread', stop reason = breakpoint 1.1

Hide Details

Expecting sub string: "stopped" (was found) Expecting sub string: "stop reason = breakpoint" (was found)

Hide Details

runCmd: frame variable p1 output: (Pair) p1 = (x = 3, y = -3)

Hide Details

Hide Details

Ran command: "frame variable p1"

Hide Details

Got output: (Pair) p1 = (x = 3, y = -3)

Hide Details

Expecting sub string: "(Pair) p1 = (x = 3, y = -3)" (was found)

Hide Details

Adding tearDown hook: def cleanup(): self.runCmd('type format clear', check=False) self.runCmd('type summary clear', check=False)

Hide Details

Hide Details

runCmd: type summary add Pair -s "x=${var.x%d},y=${var.y%u}" output:

Hide Details

runCmd: frame variable p1 output: (Pair) p1 = x=3,y=4294967293

Hide Details

Hide Details

Ran command: "frame variable p1"

Hide Details

Got output: (Pair) p1 = x=3,y=4294967293

Hide Details

Expecting sub string: "(Pair) p1 = x=3,y=4294967293" (was found)

Hide Details

runCmd: frame variable -f x p1 output: (Pair) p1 = x=3,y=4294967293

Hide Details

Hide Details

Ran command: "frame variable -f x p1"

Hide Details

Got output: (Pair) p1 = x=3,y=4294967293

Hide Details

Not expecting sub string: "(Pair) p1 = x=0x00000003,y=0xfffffffd" (was not found)

Hide Details

runCmd: frame variable -f d p1 output: (Pair) p1 = x=3,y=4294967293

Hide Details

Hide Details

Ran command: "frame variable -f d p1"

Hide Details

Got output: (Pair) p1 = x=3,y=4294967293

Hide Details

Not expecting sub string: "(Pair) p1 = x=3,y=-3" (was not found)

Hide Details

runCmd: frame variable p1 output: (Pair) p1 = x=3,y=4294967293

Hide Details

Hide Details

Ran command: "frame variable p1"

Hide Details

Got output: (Pair) p1 = x=3,y=4294967293

Hide Details

Expecting sub string: "(Pair) p1 = x=3,y=4294967293" (was found)

Hide Details

runCmd: type summary add Pair -s "x=${var.x%x},y=${var.y%u}" output:

Hide Details

runCmd: frame variable p1 output: (Pair) p1 = x=0x00000003,y=4294967293

Hide Details

Hide Details

Ran command: "frame variable p1"

Hide Details

Got output: (Pair) p1 = x=0x00000003,y=4294967293

Hide Details

Expecting sub string: "(Pair) p1 = x=0x00000003,y=4294967293" (was found)

Hide Details

runCmd: frame variable -f d p1 output: (Pair) p1 = x=0x00000003,y=4294967293

Hide Details

Hide Details

Ran command: "frame variable -f d p1"

Hide Details

Got output: (Pair) p1 = x=0x00000003,y=4294967293

Hide Details

Not expecting sub string: "(Pair) p1 = x=3,y=-3" (was not found)

Hide Details

<bound method SBProcess.Kill of <lldb.SBProcess; proxy of <Swig Object of type 'lldb::SBProcess *' at 0x10708c810> >>: success

Hide Details

Executing tearDown hook: def cleanup(): self.runCmd('type format clear', check=False) self.runCmd('type summary clear', check=False)

Hide Details

Hide Details

runCmd: type format clear check of return status not required output:

Hide Details

runCmd: type summary clear check of return status not required output:

Hide Details

PASS: LLDB (/Users/buildslave/jenkins/workspace/lldb-cmake-matrix/lldb-build/bin/clang-x86_64) :: test_with_run_command_dsym (TestUserFormatVsSummary.UserFormatVSSummaryTestCase) runCmd: settings clear -all output:

Hide Details

runCmd: settings set symbols.enable-external-lookup false output:

Hide Details

runCmd: settings set target.inherit-tcc true output:

Hide Details

runCmd: settings set target.auto-apply-fixits false output:

Hide Details

runCmd: settings set plugin.process.gdb-remote.packet-timeout 60 output:

Hide Details

runCmd: settings set symbols.clang-modules-cache-path "/Users/buildslave/jenkins/workspace/lldb-cmake-matrix/lldb-build/lldb-test-build.noindex/module-cache-lldb/lldb-api" output:

Hide Details

runCmd: settings set use-color false output:

Hide Details

runCmd: setting set target.prefer-dynamic-value no-dynamic-values output:

Hide Details

runCmd: file /Users/buildslave/jenkins/workspace/lldb-cmake-matrix/lldb-build/lldb-test-build.noindex/functionalities/data-formatter/user-format-vs-summary/TestUserFormatVsSummary.test_with_run_command_dwarf/a.out output: Current executable set to '/Users/buildslave/jenkins/workspace/lldb-cmake-matrix/lldb-build/lldb-test-build.noindex/functionalities/data-formatter/user-format-vs-summary/TestUserFormatVsSummary.test_with_run_command_dwarf/a.out' (x86_64).

Hide Details

Hide Details

runCmd: breakpoint set -f "main.cpp" -l 10 output: Breakpoint 1: where = a.out`main + 34 at main.cpp:10:12, address = 0x0000000100000f52

Hide Details

Hide Details

Expecting pattern: ^Breakpoint (?P<bpno>[0-9]+): (?P<num_locations>[0-9]+) locations\.$ Not matched

Hide Details

Expecting pattern: ^Breakpoint (?P<bpno>[0-9]+): (?P<num_locations>no) locations \(pending\)\. Not matched

Hide Details

Expecting pattern: ^Breakpoint (?P<bpno>[0-9]+): where = (?P<module>.*)`(?P<symbol>[+\-]{0,1}[^+]+)( \+ (?P<offset>[0-9]+)){0,1}( \[inlined\] (?P<inline_symbol>.*)){0,1} at (?P<file>[^:]+):(?P<line_no>[0-9]+)(?P<column>(:[0-9]+)?), address = (?P<address>0x[0-9a-fA-F]+)$ Matched

Hide Details

runCmd: run runCmd failed! error: process exited with status -1 (tried to attach to process already being debugged)

Hide Details

Hide Details

Command 'run' failed!

Hide Details

FAIL: LLDB (/Users/buildslave/jenkins/workspace/lldb-cmake-matrix/lldb-build/bin/clang-x86_64) :: test_with_run_command_dwarf (TestUserFormatVsSummary.UserFormatVSSummaryTestCase) <bound method SBProcess.Kill of <lldb.SBProcess; proxy of <Swig Object of type 'lldb::SBProcess *' at 0x101f2b9c0> >>: success

Hide Details

UNSUPPORTED: LLDB (/Users/buildslave/jenkins/workspace/lldb-cmake-matrix/lldb-build/bin/clang-x86_64) :: test_with_run_command_dwo (TestUserFormatVsSummary.UserFormatVSSummaryTestCase) (test case does not fall in any category of interest for this run) UNSUPPORTED: LLDB (/Users/buildslave/jenkins/workspace/lldb-cmake-matrix/lldb-build/bin/clang-x86_64) :: test_with_run_command_gmodules (TestUserFormatVsSummary.UserFormatVSSummaryTestCase) (test case does not fall in any category of interest for this run) Restore dir to: /Users/buildslave/jenkins/workspace/lldb-cmake-matrix/lldb-build/tools/lldb/test ====================================================================== FAIL: test_with_run_command_dwarf (TestUserFormatVsSummary.UserFormatVSSummaryTestCase) Test that the user can input a format but it will not prevail over summary format's choices. ---------------------------------------------------------------------- Traceback (most recent call last): File "/Users/buildslave/jenkins/workspace/lldb-cmake-matrix/llvm-project/lldb/packages/Python/lldbsuite/test/lldbtest.py", line 1823, in test_method return attrvalue(self) File "/Users/buildslave/jenkins/workspace/lldb-cmake-matrix/llvm-project/lldb/test/API/functionalities/data-formatter/user-format-vs-summary/TestUserFormatVsSummary.py", line 30, in test_with_run_command self.runCmd("run", RUN_SUCCEEDED) File "/Users/buildslave/jenkins/workspace/lldb-cmake-matrix/llvm-project/lldb/packages/Python/lldbsuite/test/lldbtest.py", line 2153, in runCmd msg if (msg) else CMD_MSG(cmd)) AssertionError: False is not True : Process is launched successfully Error output: error: process exited with status -1 (tried to attach to process already being debugged)

Hide Details

Config=x86_64-/Users/buildslave/jenkins/workspace/lldb-cmake-matrix/lldb-build/bin/clang ---------------------------------------------------------------------- Ran 4 tests in 32.500s

Hide Details

RESULT: FAILED (1 passes, 1 failures, 0 errors, 2 skipped, 0 expected failures, 0 unexpected successes)

Hide Details

--

Hide Details

******************** PASS: lldb-unit :: Utility/./UtilityTests/FileSpecTest.GuessPathStyle (1355 of 2167) PASS: lldb-unit :: Process/minidump/./LLDBMinidumpTests/MinidumpParserTest.GetPidWow64 (1356 of 2167) PASS: lldb-unit :: Utility/./UtilityTests/CompletionRequest.TryCompleteCurrentArgBad (1357 of 2167) PASS: lldb-unit :: Process/gdb-remote/./ProcessGdbRemoteTests/GDBRemoteCommunicationServerTest.SendErrorResponse_StringError (1358 of 2167) UNSUPPORTED: lldb-shell :: Register/x86-64-zmm-read.test (1359 of 2167) FAIL: lldb-api :: functionalities/thread/concurrent_events/TestConcurrentCrashWithSignal.py (1360 of 2167) ******************** TEST 'lldb-api :: functionalities/thread/concurrent_events/TestConcurrentCrashWithSignal.py' FAILED ******************** Script: -- /usr/local/Frameworks/Python.framework/Versions/3.7/bin/python3.7 /Users/buildslave/jenkins/workspace/lldb-cmake-matrix/llvm-project/lldb/test/API/dotest.py -S nm -u CXXFLAGS -u CFLAGS --codesign-identity lldb_codesign --arch x86_64 --build-dir /Users/buildslave/jenkins/workspace/lldb-cmake-matrix/lldb-build/lldb-test-build.noindex -s=/Users/buildslave/jenkins/workspace/lldb-cmake-matrix/test/logs -t --env TERM=vt100 --skip-category gmodules --skip-category watchpoint --arch=x86_64 --env LLVM_LIBS_DIR=/Users/buildslave/jenkins/workspace/lldb-cmake-matrix/lldb-build/./lib --arch x86_64 --build-dir /Users/buildslave/jenkins/workspace/lldb-cmake-matrix/lldb-build/lldb-test-build.noindex -s /Users/buildslave/jenkins/workspace/lldb-cmake-matrix/lldb-build/lldb-test-traces --lldb-module-cache-dir /Users/buildslave/jenkins/workspace/lldb-cmake-matrix/lldb-build/lldb-test-build.noindex/module-cache-lldb/lldb-api --clang-module-cache-dir /Users/buildslave/jenkins/workspace/lldb-cmake-matrix/lldb-build/lldb-test-build.noindex/module-cache-clang/lldb-api --executable /Users/buildslave/jenkins/workspace/lldb-cmake-matrix/lldb-build/./bin/lldb --compiler /Users/buildslave/jenkins/workspace/lldb-cmake-matrix/lldb-build/./bin/clang --dsymutil /Users/buildslave/jenkins/workspace/lldb-cmake-matrix/lldb-build/./bin/dsymutil --filecheck /Users/buildslave/jenkins/workspace/lldb-cmake-matrix/lldb-build/./bin/FileCheck --yaml2obj /Users/buildslave/jenkins/workspace/lldb-cmake-matrix/lldb-build/./bin/yaml2obj --server /Users/buildslave/jenkins/workspace/lldb-cmake-matrix/lldb-build/./bin/debugserver --lldb-libs-dir /Users/buildslave/jenkins/workspace/lldb-cmake-matrix/lldb-build/./lib /Users/buildslave/jenkins/workspace/lldb-cmake-matrix/llvm-project/lldb/test/API/functionalities/thread/concurrent_events -p TestConcurrentCrashWithSignal.py -- Exit Code: 1

Hide Details

Command Output (stdout): -- lldb version 12.0.99 (http://labmaster3.local/git/llvm-project.git revision d5adadb3a564236a894cbb5f189496a65d9e9742) clang revision d5adadb3a564236a894cbb5f189496a65d9e9742 llvm revision d5adadb3a564236a894cbb5f189496a65d9e9742 libstdcxx tests will not be run because: Don't know how to build with libstdcxx on macosx Skipping following debug info categories: ['dwo']

Hide Details

-- Command Output (stderr): --

Hide Details

Session logs for test failures/errors/unexpected successes will go into directory '/Users/buildslave/jenkins/workspace/lldb-cmake-matrix/lldb-build/lldb-test-traces' Change dir to: /Users/buildslave/jenkins/workspace/lldb-cmake-matrix/llvm-project/lldb/test/API/functionalities/thread/concurrent_events runCmd: settings clear -all output:

Hide Details

runCmd: settings set symbols.enable-external-lookup false output:

Hide Details

runCmd: settings set target.inherit-tcc true output:

Hide Details

runCmd: settings set target.auto-apply-fixits false output:

Hide Details

runCmd: settings set plugin.process.gdb-remote.packet-timeout 60 output:

Hide Details

runCmd: settings set symbols.clang-modules-cache-path "/Users/buildslave/jenkins/workspace/lldb-cmake-matrix/lldb-build/lldb-test-build.noindex/module-cache-lldb/lldb-api" output:

Hide Details

runCmd: settings set use-color false output:

Hide Details

runCmd: setting set target.prefer-dynamic-value no-dynamic-values output:

Hide Details

runCmd: file /Users/buildslave/jenkins/workspace/lldb-cmake-matrix/lldb-build/lldb-test-build.noindex/functionalities/thread/concurrent_events/TestConcurrentCrashWithSignal.test/a.out output: Current executable set to '/Users/buildslave/jenkins/workspace/lldb-cmake-matrix/lldb-build/lldb-test-build.noindex/functionalities/thread/concurrent_events/TestConcurrentCrashWithSignal.test/a.out' (x86_64).

Hide Details

Hide Details

runCmd: breakpoint set -f "main.cpp" -l 130 output: Breakpoint 1: where = a.out`dotest() + 77 at main.cpp:130:5, address = 0x000000010000192d

Hide Details

Hide Details

Expecting pattern: ^Breakpoint (?P<bpno>[0-9]+): (?P<num_locations>[0-9]+) locations\.$ Not matched

Hide Details

Expecting pattern: ^Breakpoint (?P<bpno>[0-9]+): (?P<num_locations>no) locations \(pending\)\. Not matched

Hide Details

Expecting pattern: ^Breakpoint (?P<bpno>[0-9]+): where = (?P<module>.*)`(?P<symbol>[+\-]{0,1}[^+]+)( \+ (?P<offset>[0-9]+)){0,1}( \[inlined\] (?P<inline_symbol>.*)){0,1} at (?P<file>[^:]+):(?P<line_no>[0-9]+)(?P<column>(:[0-9]+)?), address = (?P<address>0x[0-9a-fA-F]+)$ Matched

Hide Details

runCmd: breakpoint set -f "main.cpp" -l 176 output: Breakpoint 2: where = a.out`main + 22 at main.cpp:176:5, address = 0x0000000100001fd6

Hide Details

Hide Details

Expecting pattern: ^Breakpoint (?P<bpno>[0-9]+): (?P<num_locations>[0-9]+) locations\.$ Not matched

Hide Details

Expecting pattern: ^Breakpoint (?P<bpno>[0-9]+): (?P<num_locations>no) locations \(pending\)\. Not matched

Hide Details

Expecting pattern: ^Breakpoint (?P<bpno>[0-9]+): where = (?P<module>.*)`(?P<symbol>[+\-]{0,1}[^+]+)( \+ (?P<offset>[0-9]+)){0,1}( \[inlined\] (?P<inline_symbol>.*)){0,1} at (?P<file>[^:]+):(?P<line_no>[0-9]+)(?P<column>(:[0-9]+)?), address = (?P<address>0x[0-9a-fA-F]+)$ Matched

Hide Details

runCmd: breakpoint list -f output: Current breakpoints: 1: file = 'main.cpp', line = 130, exact_match = 0, locations = 1 1.1: where = a.out`dotest() + 77 at main.cpp:130:5, address = a.out[0x000000010000192d], unresolved, hit count = 0

Hide Details

2: file = 'main.cpp', line = 176, exact_match = 0, locations = 1 2.1: where = a.out`main + 22 at main.cpp:176:5, address = a.out[0x0000000100001fd6], unresolved, hit count = 0

Hide Details

Hide Details

Hide Details

Ran command: "breakpoint list -f"

Hide Details

Got output: Current breakpoints: 1: file = 'main.cpp', line = 130, exact_match = 0, locations = 1 1.1: where = a.out`dotest() + 77 at main.cpp:130:5, address = a.out[0x000000010000192d], unresolved, hit count = 0

Hide Details

2: file = 'main.cpp', line = 176, exact_match = 0, locations = 1 2.1: where = a.out`main + 22 at main.cpp:176:5, address = a.out[0x0000000100001fd6], unresolved, hit count = 0

Hide Details

Hide Details

Expecting sub string: ": file = 'main.cpp', line = 176" (was found) Expecting sub string: ": file = 'main.cpp', line = 176" (was found)

Hide Details

runCmd: run runCmd failed! error: process exited with status -1 (tried to attach to process already being debugged)

Hide Details

Hide Details

Command 'run' failed!

Hide Details

FAIL: LLDB (/Users/buildslave/jenkins/workspace/lldb-cmake-matrix/lldb-build/bin/clang-x86_64) :: test (TestConcurrentCrashWithSignal.ConcurrentCrashWithSignal) <bound method SBProcess.Kill of <lldb.SBProcess; proxy of <Swig Object of type 'lldb::SBProcess *' at 0x10e839ae0> >>: success

Hide Details

Restore dir to: /Users/buildslave/jenkins/workspace/lldb-cmake-matrix/lldb-build/tools/lldb/test ====================================================================== FAIL: test (TestConcurrentCrashWithSignal.ConcurrentCrashWithSignal) Test a thread that crashes while another thread generates a signal. ---------------------------------------------------------------------- Traceback (most recent call last): File "/Users/buildslave/jenkins/workspace/lldb-cmake-matrix/llvm-project/lldb/packages/Python/lldbsuite/test/decorators.py", line 136, in wrapper return func(*args, **kwargs) File "/Users/buildslave/jenkins/workspace/lldb-cmake-matrix/llvm-project/lldb/test/API/functionalities/thread/concurrent_events/TestConcurrentCrashWithSignal.py", line 20, in test self.do_thread_actions(num_crash_threads=1, num_signal_threads=1) File "/Users/buildslave/jenkins/workspace/lldb-cmake-matrix/llvm-project/lldb/packages/Python/lldbsuite/test/concurrent_base.py", line 139, in do_thread_actions self.runCmd("run", RUN_SUCCEEDED) File "/Users/buildslave/jenkins/workspace/lldb-cmake-matrix/llvm-project/lldb/packages/Python/lldbsuite/test/lldbtest.py", line 2153, in runCmd msg if (msg) else CMD_MSG(cmd)) AssertionError: False is not True : Process is launched successfully Error output: error: process exited with status -1 (tried to attach to process already being debugged)

Hide Details

Config=x86_64-/Users/buildslave/jenkins/workspace/lldb-cmake-matrix/lldb-build/bin/clang ---------------------------------------------------------------------- Ran 1 test in 33.014s

Hide Details

RESULT: FAILED (0 passes, 1 failures, 0 errors, 0 skipped, 0 expected failures, 0 unexpected successes)

Hide Details

--

Hide Details

******************** FAIL: lldb-api :: functionalities/data-formatter/boolreference/TestFormattersBoolRefPtr.py (1361 of 2167) ******************** TEST 'lldb-api :: functionalities/data-formatter/boolreference/TestFormattersBoolRefPtr.py' FAILED ******************** Script: -- /usr/local/Frameworks/Python.framework/Versions/3.7/bin/python3.7 /Users/buildslave/jenkins/workspace/lldb-cmake-matrix/llvm-project/lldb/test/API/dotest.py -S nm -u CXXFLAGS -u CFLAGS --codesign-identity lldb_codesign --arch x86_64 --build-dir /Users/buildslave/jenkins/workspace/lldb-cmake-matrix/lldb-build/lldb-test-build.noindex -s=/Users/buildslave/jenkins/workspace/lldb-cmake-matrix/test/logs -t --env TERM=vt100 --skip-category gmodules --skip-category watchpoint --arch=x86_64 --env LLVM_LIBS_DIR=/Users/buildslave/jenkins/workspace/lldb-cmake-matrix/lldb-build/./lib --arch x86_64 --build-dir /Users/buildslave/jenkins/workspace/lldb-cmake-matrix/lldb-build/lldb-test-build.noindex -s /Users/buildslave/jenkins/workspace/lldb-cmake-matrix/lldb-build/lldb-test-traces --lldb-module-cache-dir /Users/buildslave/jenkins/workspace/lldb-cmake-matrix/lldb-build/lldb-test-build.noindex/module-cache-lldb/lldb-api --clang-module-cache-dir /Users/buildslave/jenkins/workspace/lldb-cmake-matrix/lldb-build/lldb-test-build.noindex/module-cache-clang/lldb-api --executable /Users/buildslave/jenkins/workspace/lldb-cmake-matrix/lldb-build/./bin/lldb --compiler /Users/buildslave/jenkins/workspace/lldb-cmake-matrix/lldb-build/./bin/clang --dsymutil /Users/buildslave/jenkins/workspace/lldb-cmake-matrix/lldb-build/./bin/dsymutil --filecheck /Users/buildslave/jenkins/workspace/lldb-cmake-matrix/lldb-build/./bin/FileCheck --yaml2obj /Users/buildslave/jenkins/workspace/lldb-cmake-matrix/lldb-build/./bin/yaml2obj --server /Users/buildslave/jenkins/workspace/lldb-cmake-matrix/lldb-build/./bin/debugserver --lldb-libs-dir /Users/buildslave/jenkins/workspace/lldb-cmake-matrix/lldb-build/./lib /Users/buildslave/jenkins/workspace/lldb-cmake-matrix/llvm-project/lldb/test/API/functionalities/data-formatter/boolreference -p TestFormattersBoolRefPtr.py -- Exit Code: 1

Hide Details

Command Output (stdout): -- lldb version 12.0.99 (http://labmaster3.local/git/llvm-project.git revision d5adadb3a564236a894cbb5f189496a65d9e9742) clang revision d5adadb3a564236a894cbb5f189496a65d9e9742 llvm revision d5adadb3a564236a894cbb5f189496a65d9e9742 libstdcxx tests will not be run because: Don't know how to build with libstdcxx on macosx Skipping following debug info categories: ['dwo']

Hide Details

-- Command Output (stderr): --

Hide Details

Session logs for test failures/errors/unexpected successes will go into directory '/Users/buildslave/jenkins/workspace/lldb-cmake-matrix/lldb-build/lldb-test-traces' Change dir to: /Users/buildslave/jenkins/workspace/lldb-cmake-matrix/llvm-project/lldb/test/API/functionalities/data-formatter/boolreference runCmd: settings clear -all output:

Hide Details

runCmd: settings set symbols.enable-external-lookup false output:

Hide Details

runCmd: settings set target.inherit-tcc true output:

Hide Details

runCmd: settings set target.auto-apply-fixits false output:

Hide Details

runCmd: settings set plugin.process.gdb-remote.packet-timeout 60 output:

Hide Details

runCmd: settings set symbols.clang-modules-cache-path "/Users/buildslave/jenkins/workspace/lldb-cmake-matrix/lldb-build/lldb-test-build.noindex/module-cache-lldb/lldb-api" output:

Hide Details

runCmd: settings set use-color false output:

Hide Details

runCmd: setting set target.prefer-dynamic-value no-dynamic-values output:

Hide Details

runCmd: file /Users/buildslave/jenkins/workspace/lldb-cmake-matrix/lldb-build/lldb-test-build.noindex/functionalities/data-formatter/boolreference/TestFormattersBoolRefPtr.test_boolrefptr_with_run_command_dsym/a.out output: Current executable set to '/Users/buildslave/jenkins/workspace/lldb-cmake-matrix/lldb-build/lldb-test-build.noindex/functionalities/data-formatter/boolreference/TestFormattersBoolRefPtr.test_boolrefptr_with_run_command_dsym/a.out' (x86_64).

Hide Details

Hide Details

runCmd: breakpoint set -f "main.mm" -l 19 output: Breakpoint 1: where = a.out`main + 86 at main.mm:19:6, address = 0x0000000100000f76

Hide Details

Hide Details

Expecting pattern: ^Breakpoint (?P<bpno>[0-9]+): (?P<num_locations>[0-9]+) locations\.$ Not matched

Hide Details

Expecting pattern: ^Breakpoint (?P<bpno>[0-9]+): (?P<num_locations>no) locations \(pending\)\. Not matched

Hide Details

Expecting pattern: ^Breakpoint (?P<bpno>[0-9]+): where = (?P<module>.*)`(?P<symbol>[+\-]{0,1}[^+]+)( \+ (?P<offset>[0-9]+)){0,1}( \[inlined\] (?P<inline_symbol>.*)){0,1} at (?P<file>[^:]+):(?P<line_no>[0-9]+)(?P<column>(:[0-9]+)?), address = (?P<address>0x[0-9a-fA-F]+)$ Matched

Hide Details

runCmd: run output: Process 73214 stopped * thread #1, queue = 'com.apple.main-thread', stop reason = breakpoint 1.1 frame #0: 0x0000000100000f76 a.out`main(argc=1, argv=0x00007ffeefbff810) at main.mm:19:6 16 BOOL* no_ptr = &no; 17 BOOL* unset_ptr = &unset; 18 -> 19 [pool drain];// Set break point at this line. ^ 20 return 0; 21 } 22

Hide Details

Process 73214 launched: '/Users/buildslave/jenkins/workspace/lldb-cmake-matrix/lldb-build/lldb-test-build.noindex/functionalities/data-formatter/boolreference/TestFormattersBoolRefPtr.test_boolrefptr_with_run_command_dsym/a.out' (x86_64)

Hide Details

Hide Details

runCmd: thread list output: Process 73214 stopped * thread #1: tid = 0x65c873, 0x0000000100000f76 a.out`main(argc=1, argv=0x00007ffeefbff810) at main.mm:19:6, queue = 'com.apple.main-thread', stop reason = breakpoint 1.1

Hide Details

Hide Details

Ran command: "thread list"

Hide Details

Got output: Process 73214 stopped * thread #1: tid = 0x65c873, 0x0000000100000f76 a.out`main(argc=1, argv=0x00007ffeefbff810) at main.mm:19:6, queue = 'com.apple.main-thread', stop reason = breakpoint 1.1

Hide Details

Expecting sub string: "stopped" (was found) Expecting sub string: "stop reason = breakpoint" (was found)

Hide Details

Adding tearDown hook: def cleanup(): self.runCmd('type format clear', check=False) self.runCmd('type summary clear', check=False) self.runCmd('type synth clear', check=False)

Hide Details

Hide Details

runCmd: frame variable yes_ref output: (BOOL &) yes_ref = YES: { &yes_ref = '\x01' }

Hide Details

Hide Details

Ran command: "frame variable yes_ref"

Hide Details

Got output: (BOOL &) yes_ref = YES: { &yes_ref = '\x01' }

Hide Details

Expecting sub string: "YES" (was found)

Hide Details

runCmd: frame variable no_ref output: (BOOL &) no_ref = NO: { &no_ref = '\0' }

Hide Details

Hide Details

Ran command: "frame variable no_ref"

Hide Details

Got output: (BOOL &) no_ref = NO: { &no_ref = '\0' }

Hide Details

Expecting sub string: "NO" (was found)

Hide Details

runCmd: frame variable unset_ref output: (BOOL &) unset_ref = 12: { &unset_ref = '\f' }

Hide Details

Hide Details

Ran command: "frame variable unset_ref"

Hide Details

Got output: (BOOL &) unset_ref = 12: { &unset_ref = '\f' }

Hide Details

Expecting sub string: "12" (was found)

Hide Details

runCmd: frame variable yes_ptr output: (BOOL *) yes_ptr = YES

Hide Details

Hide Details

Ran command: "frame variable yes_ptr"

Hide Details

Got output: (BOOL *) yes_ptr = YES

Hide Details

Expecting sub string: "YES" (was found)

Hide Details

runCmd: frame variable no_ptr output: (BOOL *) no_ptr = NO

Hide Details

Hide Details

Ran command: "frame variable no_ptr"

Hide Details

Got output: (BOOL *) no_ptr = NO

Hide Details

Expecting sub string: "NO" (was found)

Hide Details

runCmd: frame variable unset_ptr output: (BOOL *) unset_ptr = 12

Hide Details

Hide Details

Ran command: "frame variable unset_ptr"

Hide Details

Got output: (BOOL *) unset_ptr = 12

Hide Details

Expecting sub string: "12" (was found)

Hide Details

runCmd: frame variable yes output: (BOOL) yes = YES

Hide Details

Hide Details

Ran command: "frame variable yes"

Hide Details

Got output: (BOOL) yes = YES

Hide Details

Expecting sub string: "YES" (was found)

Hide Details

runCmd: frame variable no output: (BOOL) no = NO

Hide Details

Hide Details

Ran command: "frame variable no"

Hide Details

Got output: (BOOL) no = NO

Hide Details

Expecting sub string: "NO" (was found)

Hide Details

runCmd: frame variable unset output: (BOOL) unset = 12

Hide Details

Hide Details

Ran command: "frame variable unset"

Hide Details

Got output: (BOOL) unset = 12

Hide Details

Expecting sub string: "12" (was found)

Hide Details

<bound method SBProcess.Kill of <lldb.SBProcess; proxy of <Swig Object of type 'lldb::SBProcess *' at 0x1066fb810> >>: success

Hide Details

Executing tearDown hook: def cleanup(): self.runCmd('type format clear', check=False) self.runCmd('type summary clear', check=False) self.runCmd('type synth clear', check=False)

Hide Details

Hide Details

runCmd: type format clear check of return status not required output:

Hide Details

runCmd: type summary clear check of return status not required output:

Hide Details

runCmd: type synth clear check of return status not required output:

Hide Details

PASS: LLDB (/Users/buildslave/jenkins/workspace/lldb-cmake-matrix/lldb-build/bin/clang-x86_64) :: test_boolrefptr_with_run_command_dsym (TestFormattersBoolRefPtr.DataFormatterBoolRefPtr) runCmd: settings clear -all output:

Hide Details

runCmd: settings set symbols.enable-external-lookup false output:

Hide Details

runCmd: settings set target.inherit-tcc true output:

Hide Details

runCmd: settings set target.auto-apply-fixits false output:

Hide Details

runCmd: settings set plugin.process.gdb-remote.packet-timeout 60 output:

Hide Details

runCmd: settings set symbols.clang-modules-cache-path "/Users/buildslave/jenkins/workspace/lldb-cmake-matrix/lldb-build/lldb-test-build.noindex/module-cache-lldb/lldb-api" output:

Hide Details

runCmd: settings set use-color false output:

Hide Details

runCmd: setting set target.prefer-dynamic-value no-dynamic-values output:

Hide Details

runCmd: file /Users/buildslave/jenkins/workspace/lldb-cmake-matrix/lldb-build/lldb-test-build.noindex/functionalities/data-formatter/boolreference/TestFormattersBoolRefPtr.test_boolrefptr_with_run_command_dwarf/a.out output: Current executable set to '/Users/buildslave/jenkins/workspace/lldb-cmake-matrix/lldb-build/lldb-test-build.noindex/functionalities/data-formatter/boolreference/TestFormattersBoolRefPtr.test_boolrefptr_with_run_command_dwarf/a.out' (x86_64).

Hide Details

Hide Details

runCmd: breakpoint set -f "main.mm" -l 19 output: Breakpoint 1: where = a.out`main + 86 at main.mm:19:6, address = 0x0000000100000f76

Hide Details

Hide Details

Expecting pattern: ^Breakpoint (?P<bpno>[0-9]+): (?P<num_locations>[0-9]+) locations\.$ Not matched

Hide Details

Expecting pattern: ^Breakpoint (?P<bpno>[0-9]+): (?P<num_locations>no) locations \(pending\)\. Not matched

Hide Details

Expecting pattern: ^Breakpoint (?P<bpno>[0-9]+): where = (?P<module>.*)`(?P<symbol>[+\-]{0,1}[^+]+)( \+ (?P<offset>[0-9]+)){0,1}( \[inlined\] (?P<inline_symbol>.*)){0,1} at (?P<file>[^:]+):(?P<line_no>[0-9]+)(?P<column>(:[0-9]+)?), address = (?P<address>0x[0-9a-fA-F]+)$ Matched

Hide Details

runCmd: run runCmd failed! error: process exited with status -1 (tried to attach to process already being debugged)

Hide Details

Hide Details

Command 'run' failed!

Hide Details

FAIL: LLDB (/Users/buildslave/jenkins/workspace/lldb-cmake-matrix/lldb-build/bin/clang-x86_64) :: test_boolrefptr_with_run_command_dwarf (TestFormattersBoolRefPtr.DataFormatterBoolRefPtr) <bound method SBProcess.Kill of <lldb.SBProcess; proxy of <Swig Object of type 'lldb::SBProcess *' at 0x1064c19c0> >>: success

Hide Details

UNSUPPORTED: LLDB (/Users/buildslave/jenkins/workspace/lldb-cmake-matrix/lldb-build/bin/clang-x86_64) :: test_boolrefptr_with_run_command_dwo (TestFormattersBoolRefPtr.DataFormatterBoolRefPtr) (test case does not fall in any category of interest for this run) UNSUPPORTED: LLDB (/Users/buildslave/jenkins/workspace/lldb-cmake-matrix/lldb-build/bin/clang-x86_64) :: test_boolrefptr_with_run_command_gmodules (TestFormattersBoolRefPtr.DataFormatterBoolRefPtr) (test case does not fall in any category of interest for this run) Restore dir to: /Users/buildslave/jenkins/workspace/lldb-cmake-matrix/lldb-build/tools/lldb/test ====================================================================== FAIL: test_boolrefptr_with_run_command_dwarf (TestFormattersBoolRefPtr.DataFormatterBoolRefPtr) Test the formatters we use for BOOL& and BOOL* in Objective-C. ---------------------------------------------------------------------- Traceback (most recent call last): File "/Users/buildslave/jenkins/workspace/lldb-cmake-matrix/llvm-project/lldb/packages/Python/lldbsuite/test/lldbtest.py", line 1823, in test_method return attrvalue(self) File "/Users/buildslave/jenkins/workspace/lldb-cmake-matrix/llvm-project/lldb/test/API/functionalities/data-formatter/boolreference/TestFormattersBoolRefPtr.py", line 21, in test_boolrefptr_with_run_command self.boolrefptr_data_formatter_commands() File "/Users/buildslave/jenkins/workspace/lldb-cmake-matrix/llvm-project/lldb/test/API/functionalities/data-formatter/boolreference/TestFormattersBoolRefPtr.py", line 36, in boolrefptr_data_formatter_commands self.runCmd("run", RUN_SUCCEEDED) File "/Users/buildslave/jenkins/workspace/lldb-cmake-matrix/llvm-project/lldb/packages/Python/lldbsuite/test/lldbtest.py", line 2153, in runCmd msg if (msg) else CMD_MSG(cmd)) AssertionError: False is not True : Process is launched successfully Error output: error: process exited with status -1 (tried to attach to process already being debugged)

Hide Details

Config=x86_64-/Users/buildslave/jenkins/workspace/lldb-cmake-matrix/lldb-build/bin/clang ---------------------------------------------------------------------- Ran 4 tests in 39.615s

Hide Details

RESULT: FAILED (1 passes, 1 failures, 0 errors, 2 skipped, 0 expected failures, 0 unexpected successes)

Hide Details

--

Hide Details

******************** PASS: lldb-unit :: ObjectFile/MachO/./ObjectFileMachOTests/ObjectFileMachOTest.ModuleFromSharedCacheInfo (1362 of 2167) UNSUPPORTED: lldb-shell :: SymbolFile/NativePDB/typedefs.cpp (1363 of 2167) PASS: lldb-unit :: Utility/./UtilityTests/StringLexerTest.Peek (1364 of 2167) PASS: lldb-api :: lang/objc/self/TestObjCSelf.py (1365 of 2167) PASS: lldb-unit :: Utility/./UtilityTests/RangeTest.NotEqualInvalid (1366 of 2167) PASS: lldb-api :: functionalities/data-formatter/data-formatter-stl/libcxx/iterator/TestDataFormatterLibccIterator.py (1367 of 2167) PASS: lldb-unit :: Symbol/./SymbolTests/TestTypeSystemClang.TestGetTypeClassNested (1368 of 2167) PASS: lldb-unit :: Utility/./UtilityTests/ScalarTest.TruncOrExtendTo (1369 of 2167) PASS: lldb-unit :: Utility/./UtilityTests/StringExtractorTest.InitMisc (1370 of 2167) PASS: lldb-shell :: Settings/TestFrameFormatColor.test (1371 of 2167) UNSUPPORTED: lldb-shell :: ScriptInterpreter/Lua/lua-python.test (1372 of 2167) PASS: lldb-unit :: Utility/./UtilityTests/StreamTest.PutRawBytesToBigEndian (1373 of 2167) PASS: lldb-api :: functionalities/thread/concurrent_events/TestConcurrentTwoBreakpointThreads.py (1374 of 2167) PASS: lldb-shell :: SymbolFile/DWARF/debug-types-line-tables.s (1375 of 2167) PASS: lldb-shell :: SymbolFile/DWARF/DW_AT_low_pc-addrx.s (1376 of 2167) PASS: lldb-unit :: Utility/./UtilityTests/StreamTest.ShiftOperatorStrings (1377 of 2167) PASS: lldb-unit :: Utility/./UtilityTests/FileSpecTest.RemoveLastPathComponent (1378 of 2167) PASS: lldb-api :: tools/lldb-vscode/breakpoint/TestVSCode_setExceptionBreakpoints.py (1379 of 2167) PASS: lldb-unit :: Utility/./UtilityTests/StreamTeeTest.Assignment (1380 of 2167) PASS: lldb-unit :: Core/./LLDBCoreTests/SourceFileCache.FindSourceFileNotFound (1381 of 2167) PASS: lldb-unit :: Utility/./UtilityTests/RecordReplayTest.InstrumentedBarPtr (1382 of 2167) FAIL: lldb-api :: functionalities/data-formatter/data-formatter-script/TestDataFormatterScript.py (1383 of 2167) ******************** TEST 'lldb-api :: functionalities/data-formatter/data-formatter-script/TestDataFormatterScript.py' FAILED ******************** Script: -- /usr/local/Frameworks/Python.framework/Versions/3.7/bin/python3.7 /Users/buildslave/jenkins/workspace/lldb-cmake-matrix/llvm-project/lldb/test/API/dotest.py -S nm -u CXXFLAGS -u CFLAGS --codesign-identity lldb_codesign --arch x86_64 --build-dir /Users/buildslave/jenkins/workspace/lldb-cmake-matrix/lldb-build/lldb-test-build.noindex -s=/Users/buildslave/jenkins/workspace/lldb-cmake-matrix/test/logs -t --env TERM=vt100 --skip-category gmodules --skip-category watchpoint --arch=x86_64 --env LLVM_LIBS_DIR=/Users/buildslave/jenkins/workspace/lldb-cmake-matrix/lldb-build/./lib --arch x86_64 --build-dir /Users/buildslave/jenkins/workspace/lldb-cmake-matrix/lldb-build/lldb-test-build.noindex -s /Users/buildslave/jenkins/workspace/lldb-cmake-matrix/lldb-build/lldb-test-traces --lldb-module-cache-dir /Users/buildslave/jenkins/workspace/lldb-cmake-matrix/lldb-build/lldb-test-build.noindex/module-cache-lldb/lldb-api --clang-module-cache-dir /Users/buildslave/jenkins/workspace/lldb-cmake-matrix/lldb-build/lldb-test-build.noindex/module-cache-clang/lldb-api --executable /Users/buildslave/jenkins/workspace/lldb-cmake-matrix/lldb-build/./bin/lldb --compiler /Users/buildslave/jenkins/workspace/lldb-cmake-matrix/lldb-build/./bin/clang --dsymutil /Users/buildslave/jenkins/workspace/lldb-cmake-matrix/lldb-build/./bin/dsymutil --filecheck /Users/buildslave/jenkins/workspace/lldb-cmake-matrix/lldb-build/./bin/FileCheck --yaml2obj /Users/buildslave/jenkins/workspace/lldb-cmake-matrix/lldb-build/./bin/yaml2obj --server /Users/buildslave/jenkins/workspace/lldb-cmake-matrix/lldb-build/./bin/debugserver --lldb-libs-dir /Users/buildslave/jenkins/workspace/lldb-cmake-matrix/lldb-build/./lib /Users/buildslave/jenkins/workspace/lldb-cmake-matrix/llvm-project/lldb/test/API/functionalities/data-formatter/data-formatter-script -p TestDataFormatterScript.py -- Exit Code: 1

Hide Details

Command Output (stdout): -- lldb version 12.0.99 (http://labmaster3.local/git/llvm-project.git revision d5adadb3a564236a894cbb5f189496a65d9e9742) clang revision d5adadb3a564236a894cbb5f189496a65d9e9742 llvm revision d5adadb3a564236a894cbb5f189496a65d9e9742 libstdcxx tests will not be run because: Don't know how to build with libstdcxx on macosx Skipping following debug info categories: ['dwo']

Hide Details

-- Command Output (stderr): --

Hide Details

Session logs for test failures/errors/unexpected successes will go into directory '/Users/buildslave/jenkins/workspace/lldb-cmake-matrix/lldb-build/lldb-test-traces' Change dir to: /Users/buildslave/jenkins/workspace/lldb-cmake-matrix/llvm-project/lldb/test/API/functionalities/data-formatter/data-formatter-script runCmd: settings clear -all output:

Hide Details

runCmd: settings set symbols.enable-external-lookup false output:

Hide Details

runCmd: settings set target.inherit-tcc true output:

Hide Details

runCmd: settings set target.auto-apply-fixits false output:

Hide Details

runCmd: settings set plugin.process.gdb-remote.packet-timeout 60 output:

Hide Details

runCmd: settings set symbols.clang-modules-cache-path "/Users/buildslave/jenkins/workspace/lldb-cmake-matrix/lldb-build/lldb-test-build.noindex/module-cache-lldb/lldb-api" output:

Hide Details

runCmd: settings set use-color false output:

Hide Details

runCmd: setting set target.prefer-dynamic-value no-dynamic-values output:

Hide Details

runCmd: file /Users/buildslave/jenkins/workspace/lldb-cmake-matrix/lldb-build/lldb-test-build.noindex/functionalities/data-formatter/data-formatter-script/TestDataFormatterScript.test_with_run_command_dsym/a.out output: Current executable set to '/Users/buildslave/jenkins/workspace/lldb-cmake-matrix/lldb-build/lldb-test-build.noindex/functionalities/data-formatter/data-formatter-script/TestDataFormatterScript.test_with_run_command_dsym/a.out' (x86_64).

Hide Details

Hide Details

runCmd: breakpoint set -f "main.cpp" -l 37 output: Breakpoint 1: where = a.out`main + 197 at main.cpp:37:17, address = 0x0000000100000d85

Hide Details

Hide Details

Expecting pattern: ^Breakpoint (?P<bpno>[0-9]+): (?P<num_locations>[0-9]+) locations\.$ Not matched

Hide Details

Expecting pattern: ^Breakpoint (?P<bpno>[0-9]+): (?P<num_locations>no) locations \(pending\)\. Not matched

Hide Details

Expecting pattern: ^Breakpoint (?P<bpno>[0-9]+): where = (?P<module>.*)`(?P<symbol>[+\-]{0,1}[^+]+)( \+ (?P<offset>[0-9]+)){0,1}( \[inlined\] (?P<inline_symbol>.*)){0,1} at (?P<file>[^:]+):(?P<line_no>[0-9]+)(?P<column>(:[0-9]+)?), address = (?P<address>0x[0-9a-fA-F]+)$ Matched

Hide Details

runCmd: run runCmd failed! error: process exited with status -1 (tried to attach to process already being debugged)

Hide Details

Hide Details

Command 'run' failed!

Hide Details

FAIL: LLDB (/Users/buildslave/jenkins/workspace/lldb-cmake-matrix/lldb-build/bin/clang-x86_64) :: test_with_run_command_dsym (TestDataFormatterScript.ScriptDataFormatterTestCase) <bound method SBProcess.Kill of <lldb.SBProcess; proxy of <Swig Object of type 'lldb::SBProcess *' at 0x1100f3b70> >>: success

Hide Details

runCmd: settings clear -all output:

Hide Details

runCmd: settings set symbols.enable-external-lookup false output:

Hide Details

runCmd: settings set target.inherit-tcc true output:

Hide Details

runCmd: settings set target.auto-apply-fixits false output:

Hide Details

runCmd: settings set plugin.process.gdb-remote.packet-timeout 60 output:

Hide Details

runCmd: settings set symbols.clang-modules-cache-path "/Users/buildslave/jenkins/workspace/lldb-cmake-matrix/lldb-build/lldb-test-build.noindex/module-cache-lldb/lldb-api" output:

Hide Details

runCmd: settings set use-color false output:

Hide Details

runCmd: setting set target.prefer-dynamic-value no-dynamic-values output:

Hide Details

runCmd: file /Users/buildslave/jenkins/workspace/lldb-cmake-matrix/lldb-build/lldb-test-build.noindex/functionalities/data-formatter/data-formatter-script/TestDataFormatterScript.test_with_run_command_dwarf/a.out output: Current executable set to '/Users/buildslave/jenkins/workspace/lldb-cmake-matrix/lldb-build/lldb-test-build.noindex/functionalities/data-formatter/data-formatter-script/TestDataFormatterScript.test_with_run_command_dwarf/a.out' (x86_64).

Hide Details

Hide Details

runCmd: breakpoint set -f "main.cpp" -l 37 output: Breakpoint 1: where = a.out`main + 197 at main.cpp:37:17, address = 0x0000000100000d85

Hide Details

Hide Details

Expecting pattern: ^Breakpoint (?P<bpno>[0-9]+): (?P<num_locations>[0-9]+) locations\.$ Not matched

Hide Details

Expecting pattern: ^Breakpoint (?P<bpno>[0-9]+): (?P<num_locations>no) locations \(pending\)\. Not matched

Hide Details

Expecting pattern: ^Breakpoint (?P<bpno>[0-9]+): where = (?P<module>.*)`(?P<symbol>[+\-]{0,1}[^+]+)( \+ (?P<offset>[0-9]+)){0,1}( \[inlined\] (?P<inline_symbol>.*)){0,1} at (?P<file>[^:]+):(?P<line_no>[0-9]+)(?P<column>(:[0-9]+)?), address = (?P<address>0x[0-9a-fA-F]+)$ Matched

Hide Details

runCmd: run output: Process 75537 stopped * thread #1, queue = 'com.apple.main-thread', stop reason = breakpoint 1.1 frame #0: 0x0000000100000d85 a.out`main(argc=1, argv=0x00007ffeefbff818) at main.cpp:37:17 34 35 i_am_cool array[5]; 36 -> 37 i_am_cooler three(10,4,1985,1/1/2011,'B','E'); // Set break point at this line. ^ 38 39 two.integer = 1; 40

Hide Details

Process 75537 launched: '/Users/buildslave/jenkins/workspace/lldb-cmake-matrix/lldb-build/lldb-test-build.noindex/functionalities/data-formatter/data-formatter-script/TestDataFormatterScript.test_with_run_command_dwarf/a.out' (x86_64)

Hide Details

Hide Details

runCmd: thread list output: Process 75537 stopped * thread #1: tid = 0x65deaa, 0x0000000100000d85 a.out`main(argc=1, argv=0x00007ffeefbff818) at main.cpp:37:17, queue = 'com.apple.main-thread', stop reason = breakpoint 1.1

Hide Details

Hide Details

Ran command: "thread list"

Hide Details

Got output: Process 75537 stopped * thread #1: tid = 0x65deaa, 0x0000000100000d85 a.out`main(argc=1, argv=0x00007ffeefbff818) at main.cpp:37:17, queue = 'com.apple.main-thread', stop reason = breakpoint 1.1

Hide Details

Expecting sub string: "stopped" (was found) Expecting sub string: "stop reason = breakpoint" (was found)

Hide Details

Adding tearDown hook: def cleanup(): self.runCmd('type format clear', check=False) self.runCmd('type summary clear', check=False)

Hide Details

Hide Details

runCmd: type summary add i_am_cool --python-script "a = valobj.GetChildMemberWithName('integer'); a_val = a.GetValue(); str = 'Hello from Python, ' + a_val + ' time'; return str + ('!' if a_val == '1' else 's!');" output:

Hide Details

runCmd: type summary list i_am_cool output: ----------------------- Category: default ----------------------- i_am_cool: a = valobj.GetChildMemberWithName('integer'); a_val = a.GetValue(); str = 'Hello from Python, ' + a_val + ' time'; return str + ('!' if a_val == '1' else 's!'); ----------------------- Category: VectorTypes ----------------------- ----------------------- Category: system ----------------------- ----------------------- Category: cplusplus ----------------------- ----------------------- Category: objc -----------------------

Hide Details

Hide Details

Ran command: "type summary list i_am_cool"

Hide Details

Got output: ----------------------- Category: default ----------------------- i_am_cool: a = valobj.GetChildMemberWithName('integer'); a_val = a.GetValue(); str = 'Hello from Python, ' + a_val + ' time'; return str + ('!' if a_val == '1' else 's!'); ----------------------- Category: VectorTypes ----------------------- ----------------------- Category: system ----------------------- ----------------------- Category: cplusplus ----------------------- ----------------------- Category: objc -----------------------

Hide Details

Expecting sub string: "a = valobj.GetChildMemberWithName('integer'); a_val = a.GetValue(); str = 'Hello from Python, ' + a_val + ' time'; return str + ('!' if a_val == '1' else 's!');" (was found)

Hide Details

runCmd: frame variable one output: (i_am_cool) one = Hello from Python, 1 time!

Hide Details

Hide Details

Ran command: "frame variable one"

Hide Details

Got output: (i_am_cool) one = Hello from Python, 1 time!

Hide Details

Expecting sub string: "Hello from Python" (was found) Expecting sub string: "1 time!" (was found)

Hide Details

runCmd: frame variable two output: (i_am_cool) two = Hello from Python, 4 times!

Hide Details

Hide Details

Ran command: "frame variable two"

Hide Details

Got output: (i_am_cool) two = Hello from Python, 4 times!

Hide Details

Expecting sub string: "Hello from Python" (was found) Expecting sub string: "4 times!" (was found)

Hide Details

runCmd: n output: Process 75537 stopped * thread #1, queue = 'com.apple.main-thread', stop reason = step over frame #0: 0x0000000100000da9 a.out`main(argc=1, argv=0x00007ffeefbff818) at main.cpp:39:17 36 37 i_am_cooler three(10,4,1985,1/1/2011,'B','E'); // Set break point at this line. 38 -> 39 two.integer = 1; ^ 40 41 int dummy = 1; 42

Hide Details

Hide Details

Hide Details

runCmd: frame variable three output: (i_am_cooler) three = (first_cool = Hello from Python, 10 times!, second_cool = Hello from Python, 4 times!, floating = 992.5)

Hide Details

Hide Details

Ran command: "frame variable three"

Hide Details

Got output: (i_am_cooler) three = (first_cool = Hello from Python, 10 times!, second_cool = Hello from Python, 4 times!, floating = 992.5)

Hide Details

Expecting sub string: "Hello from Python, 10 times!" (was found) Expecting sub string: "Hello from Python, 4 times!" (was found)

Hide Details

runCmd: n output: Process 75537 stopped * thread #1, queue = 'com.apple.main-thread', stop reason = step over frame #0: 0x0000000100000db0 a.out`main(argc=1, argv=0x00007ffeefbff818) at main.cpp:41:9 38 39 two.integer = 1; 40 -> 41 int dummy = 1; ^ 42 43 return 0; 44 }

Hide Details

Hide Details

Hide Details

runCmd: frame variable two output: (i_am_cool) two = Hello from Python, 1 time!

Hide Details

Hide Details

Ran command: "frame variable two"

Hide Details

Got output: (i_am_cool) two = Hello from Python, 1 time!

Hide Details

Expecting sub string: "Hello from Python" (was found) Expecting sub string: "1 time!" (was found)

Hide Details

runCmd: type summary add i_am_cool --python-script "a = valobj.GetChildMemberWithName('integer'); a_val = a.GetValue(); str = 'int says ' + a_val; return str;" output:

Hide Details

runCmd: frame variable two output: (i_am_cool) two = int says 1

Hide Details

Hide Details

Ran command: "frame variable two"

Hide Details

Got output: (i_am_cool) two = int says 1

Hide Details

Expecting sub string: "int says 1" (was found)

Hide Details

runCmd: frame variable twoptr output: (i_am_cool *) twoptr = 0x00007ffeefbff770 int says 1

Hide Details

Hide Details

Ran command: "frame variable twoptr"

Hide Details

Got output: (i_am_cool *) twoptr = 0x00007ffeefbff770 int says 1

Hide Details

Expecting sub string: "int says 1" (was found)

Hide Details

runCmd: type summary add --summary-string "int says ${var.integer}, and float says ${var.floating}" i_am_cool output:

Hide Details

runCmd: frame variable two output: (i_am_cool) two = int says 1, and float says 2.71000004

Hide Details

Hide Details

Ran command: "frame variable two"

Hide Details

Got output: (i_am_cool) two = int says 1, and float says 2.71000004

Hide Details

Expecting sub string: "int says 1" (was found) Expecting sub string: "and float says 2.71" (was found)

Hide Details

runCmd: frame variable twoptr output: (i_am_cool *) twoptr = 0x00007ffeefbff770 int says 1, and float says 2.71000004

Hide Details

Hide Details

Ran command: "frame variable twoptr"

Hide Details

Got output: (i_am_cool *) twoptr = 0x00007ffeefbff770 int says 1, and float says 2.71000004

Hide Details

Expecting sub string: "int says 1" (was found) Expecting sub string: "and float says 2.71" (was found)

Hide Details

runCmd: type summary add i_am_cool -p --python-script "a = valobj.GetChildMemberWithName('integer'); a_val = a.GetValue(); str = 'int says ' + a_val; return str;" output:

Hide Details

runCmd: frame variable twoptr output: (i_am_cool *) twoptr = 0x00007ffeefbff770

Hide Details

Hide Details

Ran command: "frame variable twoptr"

Hide Details

Got output: (i_am_cool *) twoptr = 0x00007ffeefbff770

Hide Details

Not expecting sub string: "and float says 2.71" (was not found)

Hide Details

runCmd: type summary add --name test_summary --python-script "return 'Python summary'" output:

Hide Details

runCmd: frame variable one --summary test_summary output: (i_am_cool) one = Python summary

Hide Details

Hide Details

Ran command: "frame variable one --summary test_summary"

Hide Details

Got output: (i_am_cool) one = Python summary

Hide Details

Expecting sub string: "Python summary" (was found)

Hide Details

runCmd: frame variable two output: (i_am_cool) two = int says 1

Hide Details

Hide Details

Ran command: "frame variable two"

Hide Details

Got output: (i_am_cool) two = int says 1

Hide Details

Not expecting sub string: "Python summary" (was not found)

Hide Details

runCmd: frame variable one output: (i_am_cool) one = int says 1

Hide Details

Hide Details

Ran command: "frame variable one"

Hide Details

Got output: (i_am_cool) one = int says 1

Hide Details

Not expecting sub string: "Python summary" (was not found)

Hide Details

runCmd: type summary add i_am_cool --summary-string "Text summary" output:

Hide Details

runCmd: frame variable one output: (i_am_cool) one = Text summary

Hide Details

Hide Details

Ran command: "frame variable one"

Hide Details

Got output: (i_am_cool) one = Text summary

Hide Details

Not expecting sub string: "Python summary" (was not found)

Hide Details

runCmd: frame variable two output: (i_am_cool) two = Text summary

Hide Details

Hide Details

Ran command: "frame variable two"

Hide Details

Got output: (i_am_cool) two = Text summary

Hide Details

Expecting sub string: "Text summary" (was found)

Hide Details

runCmd: n output: Process 75537 stopped * thread #1, queue = 'com.apple.main-thread', stop reason = step over frame #0: 0x0000000100000dd3 a.out`main(argc=1, argv=0x00007ffeefbff818) at main.cpp:43:5 40 41 int dummy = 1; 42 -> 43 return 0; ^ 44 }

Hide Details

Hide Details

Hide Details

runCmd: frame variable one output: (i_am_cool) one = Text summary

Hide Details

Hide Details

Ran command: "frame variable one"

Hide Details

Got output: (i_am_cool) one = Text summary

Hide Details

Expecting sub string: "Text summary" (was found)

Hide Details

runCmd: frame variable two output: (i_am_cool) two = Text summary

Hide Details

Hide Details

Ran command: "frame variable two"

Hide Details

Got output: (i_am_cool) two = Text summary

Hide Details

Expecting sub string: "Text summary" (was found)

Hide Details

runCmd: type summary add i_am_cool -p --summary-string "Text summary" output:

Hide Details

runCmd: type summary add -x cool --python-script "return 'Python summary'" output:

Hide Details

runCmd: frame variable one output: (i_am_cool) one = Text summary

Hide Details

Hide Details

Ran command: "frame variable one"

Hide Details

Got output: (i_am_cool) one = Text summary

Hide Details

Expecting sub string: "Text summary" (was found)

Hide Details

runCmd: frame variable two output: (i_am_cool) two = Text summary

Hide Details

Hide Details

Ran command: "frame variable two"

Hide Details

Got output: (i_am_cool) two = Text summary

Hide Details

Expecting sub string: "Text summary" (was found)

Hide Details

runCmd: frame variable twoptr output: (i_am_cool *) twoptr = 0x00007ffeefbff770 Python summary

Hide Details

Hide Details

Ran command: "frame variable twoptr"

Hide Details

Got output: (i_am_cool *) twoptr = 0x00007ffeefbff770 Python summary

Hide Details

Expecting sub string: "Python summary" (was found)

Hide Details

runCmd: frame variable array output: (i_am_cool [5]) array = Python summary

Hide Details

Hide Details

Ran command: "frame variable array"

Hide Details

Got output: (i_am_cool [5]) array = Python summary

Hide Details

Expecting sub string: "Python summary" (was found)

Hide Details

runCmd: type summary add i_am_cool --summary-string "Text summary" output:

Hide Details

runCmd: frame variable one output: (i_am_cool) one = Text summary

Hide Details

Hide Details

Ran command: "frame variable one"

Hide Details

Got output: (i_am_cool) one = Text summary

Hide Details

Expecting sub string: "Text summary" (was found)

Hide Details

runCmd: frame variable two output: (i_am_cool) two = Text summary

Hide Details

Hide Details

Ran command: "frame variable two"

Hide Details

Got output: (i_am_cool) two = Text summary

Hide Details

Expecting sub string: "Text summary" (was found)

Hide Details

runCmd: frame variable twoptr output: (i_am_cool *) twoptr = 0x00007ffeefbff770 Text summary

Hide Details

Hide Details

Ran command: "frame variable twoptr"

Hide Details

Got output: (i_am_cool *) twoptr = 0x00007ffeefbff770 Text summary

Hide Details

Expecting sub string: "Text summary" (was found)

Hide Details

runCmd: frame variable array output: (i_am_cool [5]) array = Python summary

Hide Details

Hide Details

Ran command: "frame variable array"

Hide Details

Got output: (i_am_cool [5]) array = Python summary

Hide Details

Expecting sub string: "Python summary" (was found)

Hide Details

<bound method SBProcess.Kill of <lldb.SBProcess; proxy of <Swig Object of type 'lldb::SBProcess *' at 0x10b5589c0> >>: success

Hide Details

Executing tearDown hook: def cleanup(): self.runCmd('type format clear', check=False) self.runCmd('type summary clear', check=False)

Hide Details

Hide Details

runCmd: type format clear check of return status not required output:

Hide Details

runCmd: type summary clear check of return status not required output:

Hide Details

PASS: LLDB (/Users/buildslave/jenkins/workspace/lldb-cmake-matrix/lldb-build/bin/clang-x86_64) :: test_with_run_command_dwarf (TestDataFormatterScript.ScriptDataFormatterTestCase) UNSUPPORTED: LLDB (/Users/buildslave/jenkins/workspace/lldb-cmake-matrix/lldb-build/bin/clang-x86_64) :: test_with_run_command_dwo (TestDataFormatterScript.ScriptDataFormatterTestCase) (test case does not fall in any category of interest for this run) UNSUPPORTED: LLDB (/Users/buildslave/jenkins/workspace/lldb-cmake-matrix/lldb-build/bin/clang-x86_64) :: test_with_run_command_gmodules (TestDataFormatterScript.ScriptDataFormatterTestCase) (test case does not fall in any category of interest for this run) Restore dir to: /Users/buildslave/jenkins/workspace/lldb-cmake-matrix/lldb-build/tools/lldb/test ====================================================================== FAIL: test_with_run_command_dsym (TestDataFormatterScript.ScriptDataFormatterTestCase) Test data formatter commands. ---------------------------------------------------------------------- Traceback (most recent call last): File "/Users/buildslave/jenkins/workspace/lldb-cmake-matrix/llvm-project/lldb/packages/Python/lldbsuite/test/lldbtest.py", line 1823, in test_method return attrvalue(self) File "/Users/buildslave/jenkins/workspace/lldb-cmake-matrix/llvm-project/lldb/test/API/functionalities/data-formatter/data-formatter-script/TestDataFormatterScript.py", line 19, in test_with_run_command self.data_formatter_commands() File "/Users/buildslave/jenkins/workspace/lldb-cmake-matrix/llvm-project/lldb/test/API/functionalities/data-formatter/data-formatter-script/TestDataFormatterScript.py", line 34, in data_formatter_commands self.runCmd("run", RUN_SUCCEEDED) File "/Users/buildslave/jenkins/workspace/lldb-cmake-matrix/llvm-project/lldb/packages/Python/lldbsuite/test/lldbtest.py", line 2153, in runCmd msg if (msg) else CMD_MSG(cmd)) AssertionError: False is not True : Process is launched successfully Error output: error: process exited with status -1 (tried to attach to process already being debugged)

Hide Details

Config=x86_64-/Users/buildslave/jenkins/workspace/lldb-cmake-matrix/lldb-build/bin/clang ---------------------------------------------------------------------- Ran 4 tests in 33.123s

Hide Details

RESULT: FAILED (1 passes, 1 failures, 0 errors, 2 skipped, 0 expected failures, 0 unexpected successes)

Hide Details

--

Hide Details

******************** PASS: lldb-unit :: Host/./HostTests/MainLoopTest.TerminatesImmediately (1384 of 2167) PASS: lldb-unit :: Utility/./UtilityTests/TimeoutTest.Format (1385 of 2167) UNSUPPORTED: lldb-api :: lang/cpp/static_members/TestCPPStaticMembers.py (1386 of 2167) PASS: lldb-unit :: Utility/./UtilityTests/Flags.Clear (1387 of 2167) PASS: lldb-api :: tools/lldb-vscode/console/TestVSCode_console.py (1388 of 2167) PASS: lldb-api :: functionalities/unwind/zeroth_frame/TestZerothFrame.py (1389 of 2167) PASS: lldb-api :: functionalities/gdb_remote_client/TestNoGPacketSupported.py (1390 of 2167) PASS: lldb-unit :: Utility/./UtilityTests/NameMatchesTest.EndsWith (1391 of 2167) PASS: lldb-unit :: Process/gdb-remote/./ProcessGdbRemoteTests/GDBRemoteClientBaseTest.SendPacketAndReceiveResponseWithOutputSupport (1392 of 2167) PASS: lldb-unit :: Process/gdb-remote/./ProcessGdbRemoteTests/GDBRemoteClientBaseTest.SendContinueDelegateInterface (1393 of 2167) UNSUPPORTED: lldb-api :: tools/lldb-server/TestGdbRemoteAuxvSupport.py (1394 of 2167) PASS: lldb-api :: functionalities/show_location/TestShowLocationDwarf5.py (1395 of 2167) PASS: lldb-api :: lang/cpp/exceptions/TestCPPExceptionBreakpoints.py (1396 of 2167) PASS: lldb-api :: functionalities/data-formatter/data-formatter-stl/libcxx/map/TestDataFormatterLibccMap.py (1397 of 2167) PASS: lldb-api :: lang/c/tls_globals/TestTlsGlobals.py (1398 of 2167) PASS: lldb-unit :: Utility/./UtilityTests/StringListTest.JoinEmpty (1399 of 2167) PASS: lldb-api :: functionalities/postmortem/elf-core/TestLinuxCore.py (1400 of 2167) PASS: lldb-shell :: ObjectFile/PECOFF/basic-info.yaml (1401 of 2167) UNSUPPORTED: lldb-api :: functionalities/thread/concurrent_events/TestConcurrentTwoWatchpointThreads.py (1402 of 2167) PASS: lldb-unit :: Utility/./UtilityTests/StringExtractorTest.GetNameColonValueNoSemicolon (1403 of 2167) PASS: lldb-api :: functionalities/unwind/noreturn/module-end/TestNoReturnModuleEnd.py (1404 of 2167) PASS: lldb-api :: lang/cpp/thread_local/TestThreadLocal.py (1405 of 2167) PASS: lldb-api :: commands/expression/import-std-module/vector-dbg-info-content/TestDbgInfoContentVectorFromStdModule.py (1406 of 2167) PASS: lldb-shell :: Settings/TestEchoCommands.test (1407 of 2167) PASS: lldb-shell :: Minidump/breakpad-symbols.test (1408 of 2167) PASS: lldb-unit :: Utility/./UtilityTests/ArgsTest.ReplaceArgumentAtIndexShort (1409 of 2167) PASS: lldb-shell :: SymbolFile/DWARF/dwp-debug-types.s (1410 of 2167) PASS: lldb-shell :: Reproducer/TestRelativePath.test (1411 of 2167) PASS: lldb-unit :: Interpreter/./InterpreterTests/OptionValueFileColonLine.setFromString (1412 of 2167) PASS: lldb-shell :: Reproducer/TestFinalize.test (1413 of 2167) PASS: lldb-api :: functionalities/paths/TestPaths.py (1414 of 2167) PASS: lldb-shell :: SymbolFile/DWARF/debug-types-dwarf5.s (1415 of 2167) UNSUPPORTED: lldb-api :: functionalities/thread/concurrent_events/TestConcurrentSignalDelayWatch.py (1416 of 2167) PASS: lldb-shell :: ObjectFile/PECOFF/invalid-export-table.yaml (1417 of 2167) PASS: lldb-shell :: Minidump/disassemble-no-module.yaml (1418 of 2167) PASS: lldb-shell :: ObjectFile/ELF/PT_TLS-overlap-PT_LOAD.yaml (1419 of 2167) PASS: lldb-unit :: Utility/./UtilityTests/UriParserTest.SchemeHostSeparator (1420 of 2167) PASS: lldb-unit :: Process/gdb-remote/./ProcessGdbRemoteTests/GDBRemoteCommunicationClientTest.GetModulesInfoInvalidResponse (1421 of 2167) PASS: lldb-unit :: Language/Highlighting/./HighlighterTests/HighlighterTest.ClangCursorPos (1422 of 2167) PASS: lldb-api :: commands/expression/import-std-module/queue/TestQueueFromStdModule.py (1423 of 2167) PASS: lldb-api :: commands/expression/completion/TestExprCompletion.py (1424 of 2167) PASS: lldb-unit :: Utility/./UtilityTests/StringExtractorTest.GetHexU8_InvalidHex (1425 of 2167) PASS: lldb-api :: functionalities/gdb_remote_client/TestqOffsets.py (1426 of 2167) PASS: lldb-unit :: Utility/./UtilityTests/RangeTest.EqualInvalid (1427 of 2167) UNSUPPORTED: lldb-shell :: SymbolFile/DWARF/find-method.cpp (1428 of 2167) PASS: lldb-api :: functionalities/data-formatter/varscript_formatting/TestDataFormatterVarScriptFormatting.py (1429 of 2167) PASS: lldb-api :: lang/objc/objc-new-syntax/TestObjCNewSyntaxDictionary.py (1430 of 2167) PASS: lldb-api :: lang/c/vla/TestVLA.py (1431 of 2167) PASS: lldb-api :: functionalities/thread/concurrent_events/TestConcurrentDelayedCrashWithBreakpointSignal.py (1432 of 2167) PASS: lldb-unit :: Target/./TargetTests/StackFrameRecognizerTest.NullModuleRegex (1433 of 2167) UNSUPPORTED: lldb-api :: functionalities/darwin_log/basic/TestDarwinLogBasic.py (1434 of 2167) PASS: lldb-api :: commands/frame/select/TestFrameSelect.py (1435 of 2167) PASS: lldb-api :: macosx/find-dsym/deep-bundle/TestDeepBundle.py (1436 of 2167) PASS: lldb-shell :: SymbolFile/DWARF/dwp.s (1437 of 2167) PASS: lldb-unit :: Core/./LLDBCoreTests/MangledTest.NameIndexes_FindFunctionSymbols (1438 of 2167) PASS: lldb-api :: functionalities/target-new-solib-notifications/TestModuleLoadedNotifys.py (1439 of 2167) UNSUPPORTED: lldb-shell :: Register/x86-64-zmm-write.test (1440 of 2167) PASS: lldb-unit :: Utility/./UtilityTests/StreamTest.SetIndentLevel (1441 of 2167) PASS: lldb-unit :: Utility/./UtilityTests/RangeDataVector.CustomSort (1442 of 2167) PASS: lldb-unit :: Utility/./UtilityTests/PassiveReplayTest.InstrumentedBarRef (1443 of 2167) UNSUPPORTED: lldb-api :: functionalities/tsan/multiple/TestTsanMultiple.py (1444 of 2167) PASS: lldb-unit :: Host/./HostTests/FileSystemTest.Readable (1445 of 2167) PASS: lldb-api :: commands/expression/static-initializers/TestStaticInitializers.py (1446 of 2167) PASS: lldb-api :: lang/objc/ptr_refs/TestPtrRefsObjC.py (1447 of 2167) PASS: lldb-unit :: Utility/./UtilityTests/ScalarTest.Equality (1448 of 2167) PASS: lldb-unit :: Expression/./ExpressionTests/DiagnosticManagerTest.GetStringSeverityLabels (1449 of 2167) PASS: lldb-unit :: Symbol/./SymbolTests/LineEntryTest.GetSameLineContiguousAddressRangeNoInlines (1450 of 2167) PASS: lldb-api :: lang/cpp/char1632_t/TestChar1632T.py (1451 of 2167) PASS: lldb-unit :: ScriptInterpreter/Python/./ScriptInterpreterPythonTests/PythonDataObjectsTest.TestPythonListToStructuredList (1452 of 2167) PASS: lldb-api :: functionalities/data-formatter/data-formatter-stl/libcxx/function/TestLibCxxFunction.py (1453 of 2167) PASS: lldb-shell :: Driver/TestSingleQuote.test (1454 of 2167) PASS: lldb-unit :: Utility/./UtilityTests/FileSpecTest.Match (1455 of 2167) PASS: lldb-api :: functionalities/target_var/no_vars/TestTargetVarNoVars.py (1456 of 2167) UNSUPPORTED: lldb-shell :: Breakpoint/case-insensitive.test (1457 of 2167) PASS: lldb-unit :: Utility/./UtilityTests/OptionsWithRawTest.QuotedSuffix (1458 of 2167) PASS: lldb-api :: commands/frame/diagnose/dereference-argument/TestDiagnoseDereferenceArgument.py (1459 of 2167) PASS: lldb-api :: lang/cpp/gmodules-templates/TestGModules.py (1460 of 2167) PASS: lldb-unit :: Utility/./UtilityTests/StringListTest.ShiftCString (1461 of 2167) PASS: lldb-unit :: Utility/./UtilityTests/VMRange.Ordering (1462 of 2167) XFAIL: lldb-shell :: Register/x86-mm-xmm-write.test (1463 of 2167) PASS: lldb-api :: python_api/frame/get-variables/TestGetVariables.py (1464 of 2167) PASS: lldb-unit :: Utility/./UtilityTests/EnvironmentTest.EnvpConversion (1465 of 2167) PASS: lldb-api :: tools/lldb-server/commandline/TestStubSetSID.py (1466 of 2167) PASS: lldb-api :: functionalities/postmortem/elf-core/thread_crash/TestLinuxCoreThreads.py (1467 of 2167) PASS: lldb-api :: commands/command/source/TestCommandSource.py (1468 of 2167) UNSUPPORTED: lldb-api :: lang/c/typedef/Testtypedef.py (1469 of 2167) PASS: lldb-api :: lang/objc/foundation/TestObjCMethodsString.py (1470 of 2167) PASS: lldb-unit :: Utility/./UtilityTests/RangeDataVector.FindEntryIndexesThatContain (1471 of 2167) UNSUPPORTED: lldb-shell :: SymbolFile/DWARF/dir-separator-posix.s (1472 of 2167) PASS: lldb-unit :: Utility/./UtilityTests/OptionsWithRawTest.ArgsButNoLeadingDash (1473 of 2167) PASS: lldb-api :: functionalities/gdb_remote_client/TestProcessConnect.py (1474 of 2167) PASS: lldb-api :: lang/c/complex_int/TestComplexInt.py (1475 of 2167) PASS: lldb-unit :: Utility/./UtilityTests/FileSpecTest.Equal (1476 of 2167) PASS: lldb-unit :: ObjectFile/PECOFF/./ObjectFilePECOFFTests/PECallFrameInfoTest.Frame_reg_eh (1477 of 2167) PASS: lldb-api :: functionalities/thread/concurrent_events/TestConcurrentCrashWithBreak.py (1478 of 2167) PASS: lldb-api :: tools/lldb-server/inferior-crash/TestGdbRemoteSegFault.py (1479 of 2167) UNSUPPORTED: lldb-api :: commands/watchpoints/variable_out_of_scope/TestWatchedVarHitWhenInScope.py (1480 of 2167) PASS: lldb-api :: tools/lldb-server/TestGdbRemote_qThreadStopInfo.py (1481 of 2167) UNSUPPORTED: lldb-api :: functionalities/thread/concurrent_events/TestConcurrentDelayedCrashWithBreakpointWatchpoint.py (1482 of 2167) UNSUPPORTED: lldb-shell :: SymbolFile/DWARF/find-type-in-function.cpp (1483 of 2167) PASS: lldb-api :: functionalities/data-formatter/data-formatter-synthtype/TestDataFormatterSynthType.py (1484 of 2167) PASS: lldb-shell :: Minidump/Windows/find-module.test (1485 of 2167) PASS: lldb-api :: lang/cpp/char8_t/TestCxxChar8_t.py (1486 of 2167) PASS: lldb-unit :: Host/./HostTests/ProcessLaunchInfoTest.Constructor (1487 of 2167) PASS: lldb-api :: lang/objc/objc-ivar-protocols/TestIvarProtocols.py (1488 of 2167) PASS: lldb-shell :: SymbolFile/DWARF/DW_TAG_variable-DW_AT_const_value.s (1489 of 2167) PASS: lldb-shell :: Reproducer/TestSynchronous.test (1490 of 2167) PASS: lldb-api :: functionalities/breakpoint/breakpoint_by_file_colon_line/TestBreakpointByFileColonLine.py (1491 of 2167) UNSUPPORTED: lldb-api :: lang/cpp/breakpoint_in_member_func_w_non_primitive_params/TestBreakpointInMemberFuncWNonPrimitiveParams.py (1492 of 2167) PASS: lldb-unit :: Utility/./UtilityTests/StringExtractorTest.DecodeHexU8_Underflow2 (1493 of 2167) PASS: lldb-api :: functionalities/data-formatter/refpointer-recursion/TestDataFormatterRefPtrRecursion.py (1494 of 2167) PASS: lldb-api :: functionalities/data-formatter/data-formatter-globals/TestDataFormatterGlobals.py (1495 of 2167) UNSUPPORTED: lldb-shell :: ScriptInterpreter/Lua/watchpoint_callback.test (1496 of 2167) PASS: lldb-unit :: Expression/./ExpressionTests/CppModuleConfigurationTest.Xcode (1497 of 2167) PASS: lldb-unit :: Core/./LLDBCoreTests/MangledTest.ResultForBlockInvocation (1498 of 2167) PASS: lldb-unit :: Utility/./UtilityTests/RecordReplayTest.InstrumentedBarRef (1499 of 2167) UNSUPPORTED: lldb-api :: functionalities/thread/concurrent_events/TestConcurrentSignalNWatchNBreak.py (1500 of 2167) PASS: lldb-unit :: Utility/./UtilityTests/StringListTest.PopBack (1501 of 2167) PASS: lldb-unit :: Expression/./ExpressionTests/CppModuleConfigurationTest.UnknownLibCppFile (1502 of 2167) PASS: lldb-unit :: Host/./HostTests/Host.GetEnvironment (1503 of 2167) UNSUPPORTED: lldb-shell :: SymbolFile/DWARF/find-basic-variable.cpp (1504 of 2167) PASS: lldb-api :: tools/lldb-server/TestGdbRemoteKill.py (1505 of 2167) PASS: lldb-api :: functionalities/data-formatter/data-formatter-objc/TestDataFormatterObjNSException.py (1506 of 2167) UNSUPPORTED: lldb-api :: functionalities/data-formatter/data-formatter-stl/libstdcpp/smart_ptr/TestDataFormatterStdSmartPtr.py (1507 of 2167) PASS: lldb-api :: types/TestShortTypeExpr.py (1508 of 2167) PASS: lldb-unit :: Expression/./ExpressionTests/DiagnosticManagerTest.GetStringMultiline (1509 of 2167) PASS: lldb-unit :: Utility/./UtilityTests/ArgsTest.TestArgv (1510 of 2167) PASS: lldb-api :: lang/cpp/unsigned_types/TestUnsignedTypes.py (1511 of 2167) PASS: lldb-unit :: UnwindAssembly/x86/./UnwindAssemblyx86Tests/Testx86AssemblyInspectionEngine.Test32bitFramelessSmallStackFrame (1512 of 2167) PASS: lldb-unit :: Utility/./UtilityTests/ArgsTest.StringListConstructor (1513 of 2167) PASS: lldb-unit :: SymbolFile/NativePDB/./SymbolFileNativePDBTests/PDBFPOProgramToDWARFExpressionTests.InvalidAssignmentSingle (1514 of 2167) PASS: lldb-unit :: Symbol/./SymbolTests/TestClangASTImporter.RecordLayout (1515 of 2167) PASS: lldb-shell :: SymbolFile/DWARF/debug_line-tombstone.s (1516 of 2167) PASS: lldb-api :: functionalities/pre_run_dylibs/TestPreRunDylibs.py (1517 of 2167) UNSUPPORTED: lldb-api :: python_api/watchpoint/TestWatchpointIter.py (1518 of 2167) PASS: lldb-api :: functionalities/mtc/simple/TestMTCSimple.py (1519 of 2167) PASS: lldb-shell :: ObjectFile/wasm/basic.yaml (1520 of 2167) PASS: lldb-unit :: Host/./HostTests/SocketTests/SocketTest.UDPConnect/ipv4 (1521 of 2167) PASS: lldb-shell :: Reproducer/TestDebugSymbols.test (1522 of 2167) PASS: lldb-api :: lang/cpp/multiple-inheritance/TestCppMultipleInheritance.py (1523 of 2167) UNSUPPORTED: lldb-shell :: ScriptInterpreter/Lua/io.test (1524 of 2167) PASS: lldb-unit :: Language/Highlighting/./HighlighterTests/HighlighterTest.ClangCursorPosEndOfLine (1525 of 2167) PASS: lldb-api :: tools/lldb-vscode/breakpoint/TestVSCode_setBreakpoints.py (1526 of 2167) PASS: lldb-api :: functionalities/data-formatter/data-formatter-skip-summary/TestDataFormatterSkipSummary.py (1527 of 2167) PASS: lldb-unit :: Process/minidump/./LLDBMinidumpTests/MinidumpParserTest.GetMemoryRegionInfoLinuxMaps (1528 of 2167) PASS: lldb-shell :: SymbolFile/Breakpad/unwind-via-stack-win-no-memory-info.yaml (1529 of 2167) PASS: lldb-api :: commands/expression/error-limit/TestExprErrorLimit.py (1530 of 2167) PASS: lldb-api :: functionalities/data-formatter/type_summary_list_arg/TestTypeSummaryListArg.py (1531 of 2167) PASS: lldb-unit :: ScriptInterpreter/Python/./ScriptInterpreterPythonTests/PythonDataObjectsTest.TestPythonFile (1532 of 2167) PASS: lldb-api :: commands/target/create-no-such-arch/TestNoSuchArch.py (1533 of 2167) PASS: lldb-api :: lang/c/unicode/TestUnicodeSymbols.py (1534 of 2167) PASS: lldb-unit :: Symbol/./SymbolTests/Type.GetTypeScopeAndBasename (1535 of 2167) UNSUPPORTED: lldb-shell :: ScriptInterpreter/Lua/quit.test (1536 of 2167) PASS: lldb-unit :: Utility/./UtilityTests/RangeTest.Equal (1537 of 2167) PASS: lldb-api :: functionalities/data-formatter/vector-types/TestVectorTypesFormatting.py (1538 of 2167) PASS: lldb-api :: lang/c/conflicting-symbol/TestConflictingSymbol.py (1539 of 2167) PASS: lldb-unit :: Utility/./UtilityTests/StringListTest.AppendListCStringArray (1540 of 2167) PASS: lldb-unit :: Utility/./UtilityTests/Flags.Test (1541 of 2167) PASS: lldb-api :: lang/cpp/symbols/TestSymbols.py (1542 of 2167) PASS: lldb-unit :: Utility/./UtilityTests/BinaryStreamTest.PutULEB128OneByte (1543 of 2167) PASS: lldb-unit :: ScriptInterpreter/Python/./ScriptInterpreterPythonTests/PythonDataObjectsTest.TestPythonTupleValues (1544 of 2167) PASS: lldb-unit :: Utility/./UtilityTests/XcodeSDKTest.SDKSupportsModules (1545 of 2167) PASS: lldb-unit :: Process/gdb-remote/./ProcessGdbRemoteTests/GDBRemoteCommunicationServerTest.SendErrorResponse_ErrorNumber (1546 of 2167) PASS: lldb-api :: lang/cpp/auto/TestCPPAuto.py (1547 of 2167) PASS: lldb-api :: functionalities/inline-stepping/TestInlineStepping.py (1548 of 2167) UNSUPPORTED: lldb-shell :: SymbolFile/NativePDB/break-by-function.cpp (1549 of 2167) PASS: lldb-api :: lang/cpp/namespace/TestNamespaceLookup.py (1550 of 2167) UNSUPPORTED: lldb-shell :: Breakpoint/ppc64-localentry.test (1551 of 2167) PASS: lldb-shell :: ObjectFile/MachO/lc_version_min.yaml (1552 of 2167) XFAIL: lldb-shell :: Register/x86-multithread-write.test (1553 of 2167) PASS: lldb-unit :: ObjectFile/ELF/./ObjectFileELFTests/ObjectFileELFTest.SectionsResolveConsistently (1554 of 2167) PASS: lldb-api :: commands/expression/persistent_variables/TestPersistentVariables.py (1555 of 2167) PASS: lldb-api :: commands/expression/options/TestExprOptions.py (1556 of 2167) PASS: lldb-unit :: Utility/./UtilityTests/StringExtractorTest.GetHexU8_Underflow2_NoEof (1557 of 2167) PASS: lldb-unit :: Host/./HostTests/MainLoopTest.Signal (1558 of 2167) PASS: lldb-api :: commands/expression/test/TestExprs.py (1559 of 2167) PASS: lldb-unit :: Utility/./UtilityTests/BroadcasterTest.EventTypeHasListeners (1560 of 2167) PASS: lldb-unit :: Utility/./UtilityTests/RangeTest.SlideZero (1561 of 2167) UNSUPPORTED: lldb-api :: functionalities/tty/TestTerminal.py (1562 of 2167) PASS: lldb-api :: lang/objcxx/cxx-bridged-po/TestObjCXXBridgedPO.py (1563 of 2167) PASS: lldb-unit :: Utility/./UtilityTests/StateTest.Formatv (1564 of 2167) PASS: lldb-shell :: Driver/TestConvenienceVariables.test (1565 of 2167) PASS: lldb-unit :: Host/./HostTests/SocketTests/SocketTest.TCPGetConnectURI/ipv6 (1566 of 2167) UNSUPPORTED: lldb-shell :: SymbolFile/dissassemble-entry-point.s (1567 of 2167) PASS: lldb-api :: functionalities/target_var/TestTargetVar.py (1568 of 2167) PASS: lldb-api :: functionalities/gdb_remote_client/TestArmRegisterDefinition.py (1569 of 2167) PASS: lldb-unit :: Utility/./UtilityTests/StringListTest.AppendList (1570 of 2167) PASS: lldb-unit :: Utility/./UtilityTests/UriParserTest.BracketedHostnamePort (1571 of 2167) PASS: lldb-api :: tools/lldb-server/TestGdbRemoteSingleStep.py (1572 of 2167) PASS: lldb-unit :: Target/./TargetTests/ModuleCacheTest.GetAndPut (1573 of 2167) PASS: lldb-unit :: Utility/./UtilityTests/StringExtractorTest.GetHexU8_Extra_NoEof (1574 of 2167) UNSUPPORTED: lldb-api :: commands/watchpoints/watchpoint_events/TestWatchpointEvents.py (1575 of 2167) PASS: lldb-api :: commands/frame/diagnose/array/TestArray.py (1576 of 2167) PASS: lldb-api :: python_api/process/io/TestProcessIO.py (1577 of 2167) PASS: lldb-shell :: ObjectFile/MachO/symtab.yaml (1578 of 2167) PASS: lldb-shell :: ScriptInterpreter/Python/sb_address_exception.test (1579 of 2167) PASS: lldb-shell :: Process/TestAbortExitCode.test (1580 of 2167) PASS: lldb-shell :: Breakpoint/case-sensitive.test (1581 of 2167) UNSUPPORTED: lldb-api :: functionalities/asan/TestReportData.py (1582 of 2167) PASS: lldb-api :: functionalities/data-formatter/data-formatter-proper-plurals/TestFormattersOneIsSingular.py (1583 of 2167) PASS: lldb-shell :: ObjectFile/ELF/base-address.yaml (1584 of 2167) PASS: lldb-unit :: Utility/./UtilityTests/CompletionRequest.ShiftArguments (1585 of 2167) PASS: lldb-unit :: Utility/./UtilityTests/DataExtractorTest.GetULEB128_bit63 (1586 of 2167) PASS: lldb-unit :: Process/minidump/./LLDBMinidumpTests/MinidumpParserTest.GetMemoryRegionInfo (1587 of 2167) PASS: lldb-unit :: Utility/./UtilityTests/ProcessInfoTest.Constructor (1588 of 2167) UNSUPPORTED: lldb-shell :: SymbolFile/DWARF/win-i386-line-table.s (1589 of 2167) PASS: lldb-api :: lang/cpp/dynamic-value/TestCppValueCast.py (1590 of 2167) PASS: lldb-unit :: Utility/./UtilityTests/SerializationRountripTest.SerializeDeserializePodPointers (1591 of 2167) PASS: lldb-unit :: Utility/./UtilityTests/PassiveReplayTest.InstrumentedBar (1592 of 2167) PASS: lldb-unit :: Utility/./UtilityTests/StringListTest.GetMaxStringLengthIncreasingSize (1593 of 2167) PASS: lldb-unit :: Utility/./UtilityTests/UriParserTest.BracketedHostnameWithPortIPv4 (1594 of 2167) PASS: lldb-api :: lang/objc/objc-new-syntax/TestObjCNewSyntaxArray.py (1595 of 2167) PASS: lldb-api :: lang/cpp/wchar_t/TestCxxWCharT.py (1596 of 2167) PASS: lldb-shell :: Breakpoint/split-dwarf5-debug-stroffsets.test (1597 of 2167) PASS: lldb-unit :: Utility/./UtilityTests/ReproducerTest.SetCapture (1598 of 2167) UNSUPPORTED: lldb-api :: tools/intel-features/intel-pt/test/TestIntelPTSimpleBinary.py (1599 of 2167) UNSUPPORTED: lldb-shell :: SymbolFile/NativePDB/ast-functions.cpp (1600 of 2167) PASS: lldb-api :: commands/expression/import-std-module/deque-dbg-info-content/TestDbgInfoContentDequeFromStdModule.py (1601 of 2167) PASS: lldb-api :: lang/mixed/TestMixedLanguages.py (1602 of 2167) PASS: lldb-unit :: ScriptInterpreter/Python/./ScriptInterpreterPythonTests/PythonDataObjectsTest.TestPythonListManipulation (1603 of 2167) PASS: lldb-api :: functionalities/thread/concurrent_events/TestConcurrentSignalBreak.py (1604 of 2167) PASS: lldb-api :: tools/lldb-server/TestAppleSimulatorOSType.py (1605 of 2167) PASS: lldb-api :: macosx/find-app-in-bundle/TestFindAppInBundle.py (1606 of 2167) PASS: lldb-api :: python_api/sblaunchinfo/TestSBLaunchInfo.py (1607 of 2167) UNSUPPORTED: lldb-api :: commands/watchpoints/multiple_hits/TestMultipleHits.py (1608 of 2167) PASS: lldb-api :: lang/cpp/unicode-literals/TestUnicodeLiterals.py (1609 of 2167) PASS: lldb-unit :: Utility/./UtilityTests/Flags.AllSet (1610 of 2167) PASS: lldb-unit :: Utility/./UtilityTests/RangeTest.Constructor (1611 of 2167) PASS: lldb-unit :: Utility/./UtilityTests/ConstStringTest.NullAndEmptyStates (1612 of 2167) PASS: lldb-api :: functionalities/breakpoint/breakpoint_command/TestRegexpBreakCommand.py (1613 of 2167) PASS: lldb-api :: functionalities/stats_api/TestStatisticsAPI.py (1614 of 2167) PASS: lldb-api :: functionalities/thread/backtrace_all/TestBacktraceAll.py (1615 of 2167) PASS: lldb-shell :: Quit/TestQuitExitCodeHex0.test (1616 of 2167) PASS: lldb-api :: commands/gui/invalid-args/TestInvalidArgsGui.py (1617 of 2167) UNSUPPORTED: lldb-shell :: SymbolFile/PDB/pointers.test (1618 of 2167) UNSUPPORTED: lldb-api :: linux/add-symbols/TestTargetSymbolsAddCommand.py (1619 of 2167) PASS: lldb-unit :: Utility/./UtilityTests/ConstStringTest.format_provider (1620 of 2167) PASS: lldb-shell :: ObjectFile/wasm/stripped-debug-sections.yaml (1621 of 2167) PASS: lldb-api :: functionalities/data-formatter/var-in-aggregate-misuse/TestVarInAggregateMisuse.py (1622 of 2167) PASS: lldb-unit :: DataFormatter/./LLDBFormatterTests/TypeMatcherTests.RegexName (1623 of 2167) PASS: lldb-unit :: UnwindAssembly/x86/./UnwindAssemblyx86Tests/Testx86AssemblyInspectionEngine.TestPopR13 (1624 of 2167) PASS: lldb-api :: lang/cpp/diamond/TestDiamond.py (1625 of 2167) UNSUPPORTED: lldb-api :: functionalities/darwin_log/source/debug/TestDarwinLogSourceDebug.py (1626 of 2167) PASS: lldb-unit :: ScriptInterpreter/Python/./ScriptInterpreterPythonTests/PythonDataObjectsTest.TestGlobalNameResolutionWithDot (1627 of 2167) PASS: lldb-shell :: lldb-server/TestErrorMessages.test (1628 of 2167) PASS: lldb-unit :: Utility/./UtilityTests/StringListTest.ForRangeEmpty (1629 of 2167) PASS: lldb-unit :: Expression/./ExpressionTests/DWARFExpression.DW_OP_stack_value (1630 of 2167) UNSUPPORTED: lldb-api :: tools/lldb-server/platform-process-connect/TestPlatformProcessConnect.py (1631 of 2167) PASS: lldb-unit :: Utility/./UtilityTests/RangeTest.ContainsEndInclusiveInvalid (1632 of 2167) UNSUPPORTED: lldb-api :: python_api/watchpoint/condition/TestWatchpointConditionAPI.py (1633 of 2167) PASS: lldb-api :: lang/cpp/operators/TestCppOperators.py (1634 of 2167) UNSUPPORTED: lldb-shell :: SymbolFile/NativePDB/function-types-builtins.cpp (1635 of 2167) PASS: lldb-api :: commands/expression/top-level/TestTopLevelExprs.py (1636 of 2167) PASS: lldb-unit :: Editline/./EditlineTests/EditlineTestFixture.EditlineReceivesSingleLineText (1637 of 2167) PASS: lldb-unit :: Core/./LLDBCoreTests/RichManglingContextTest.Basic (1638 of 2167) PASS: lldb-unit :: UnwindAssembly/x86/./UnwindAssemblyx86Tests/Testx86AssemblyInspectionEngine.TestSpillRegToStackViaMOVx86_64 (1639 of 2167) PASS: lldb-unit :: Utility/./UtilityTests/ArgsTest.DoubleQuotedItem (1640 of 2167) PASS: lldb-unit :: Utility/./UtilityTests/DataExtractorTest.GetCStrEmpty (1641 of 2167) PASS: lldb-api :: commands/platform/file/close/TestPlatformFileClose.py (1642 of 2167) PASS: lldb-api :: macosx/lc-note/kern-ver-str/TestKernVerStrLCNOTE.py (1643 of 2167) PASS: lldb-api :: functionalities/data-formatter/typedef_array/TestTypedefArray.py (1644 of 2167) PASS: lldb-shell :: Settings/TestSettingsWrite.test (1645 of 2167) PASS: lldb-api :: functionalities/data-formatter/data-formatter-stl/libcxx/list/TestDataFormatterLibcxxList.py (1646 of 2167) PASS: lldb-unit :: Utility/./UtilityTests/UUIDTest.RelationalOperators (1647 of 2167) UNSUPPORTED: lldb-api :: functionalities/darwin_log/filter/regex/subsystem/TestDarwinLogFilterRegexSubsystem.py (1648 of 2167) PASS: lldb-unit :: Utility/./UtilityTests/UUIDTest.Validity (1649 of 2167) PASS: lldb-unit :: ScriptInterpreter/Python/./ScriptInterpreterPythonTests/PythonDataObjectsTest.TestExceptions (1650 of 2167) PASS: lldb-api :: functionalities/dlopen_other_executable/TestDlopenOtherExecutable.py (1651 of 2167) PASS: lldb-unit :: SymbolFile/NativePDB/./SymbolFileNativePDBTests/PDBFPOProgramToDWARFExpressionTests.InvalidAssignmentMultiple (1652 of 2167) PASS: lldb-api :: lang/c/array_types/TestArrayTypes.py (1653 of 2167) PASS: lldb-api :: functionalities/thread/backtrace_limit/TestBacktraceLimit.py (1654 of 2167) PASS: lldb-api :: lang/c/local_types/TestUseClosestType.py (1655 of 2167) PASS: lldb-unit :: Utility/./UtilityTests/StreamTest.PutMaxHex64ByteOrderLittle (1656 of 2167) PASS: lldb-api :: lang/c/find_struct_type/TestFindStructTypes.py (1657 of 2167) PASS: lldb-unit :: Utility/./UtilityTests/ScalarTest.Comparison (1658 of 2167) PASS: lldb-unit :: ScriptInterpreter/Python/./ScriptInterpreterPythonTests/PythonDataObjectsTest.TestPythonIntegerToStr (1659 of 2167) PASS: lldb-unit :: Expression/./ExpressionTests/CppModuleConfigurationTest.UnrelatedLibrary (1660 of 2167) PASS: lldb-shell :: Breakpoint/debug_rnglist_basic.test (1661 of 2167) UNSUPPORTED: lldb-shell :: Register/x86-64-ymm16-read.test (1662 of 2167) PASS: lldb-shell :: Settings/TestDisableColor.test (1663 of 2167) PASS: lldb-unit :: Symbol/./SymbolTests/LineEntryTest.GetSameLineContiguousAddressRangeNestedInline (1664 of 2167) PASS: lldb-api :: functionalities/memory/read/TestMemoryRead.py (1665 of 2167) PASS: lldb-unit :: Interpreter/./InterpreterTests/CompletionTest.FileCompletionAbsolute (1666 of 2167) PASS: lldb-shell :: Commands/CommandScriptImmediateOutput/CommandScriptImmediateOutputConsole.test (1667 of 2167) PASS: lldb-unit :: Utility/./UtilityTests/RangeTest.Clear (1668 of 2167) PASS: lldb-unit :: SymbolFile/NativePDB/./SymbolFileNativePDBTests/PDBFPOProgramToDWARFExpressionTests.SingleAssignmentRegisterRef (1669 of 2167) PASS: lldb-unit :: Symbol/./SymbolTests/TestClangASTImporter.CopyDeclTagDecl (1670 of 2167) PASS: lldb-unit :: Expression/./ExpressionTests/DiagnosticManagerTest.PutStringSeverities (1671 of 2167) UNSUPPORTED: lldb-api :: commands/watchpoints/watchpoint_size/TestWatchpointSizes.py (1672 of 2167) PASS: lldb-unit :: Utility/./UtilityTests/StringExtractorTest.GetU32BigEndian (1673 of 2167) PASS: lldb-unit :: Utility/./UtilityTests/ProcessInstanceInfo.DumpTable (1674 of 2167) PASS: lldb-unit :: Expression/./ExpressionTests/DWARFExpression.DW_OP_convert (1675 of 2167) PASS: lldb-unit :: Utility/./UtilityTests/ListenerTest.GetEventWait (1676 of 2167) PASS: lldb-unit :: Utility/./UtilityTests/StringExtractorTest.GetHexU8_Underflow_NoEof (1677 of 2167) PASS: lldb-api :: lang/objc/objc-checker/TestObjCCheckers.py (1678 of 2167) PASS: lldb-api :: functionalities/archives/TestBSDArchives.py (1679 of 2167) PASS: lldb-unit :: Utility/./UtilityTests/Flags.AnySet (1680 of 2167) PASS: lldb-unit :: Utility/./UtilityTests/VASprintfTest.BufferResize (1681 of 2167) PASS: lldb-unit :: Utility/./UtilityTests/DataExtractorTest.GetBitfield (1682 of 2167) UNSUPPORTED: lldb-api :: functionalities/thread/concurrent_events/TestConcurrentTwoBreakpointsOneWatchpoint.py (1683 of 2167) PASS: lldb-unit :: Utility/./UtilityTests/StringListTest.GetSize (1684 of 2167) PASS: lldb-unit :: Host/./HostTests/SocketTests/SocketTest.DomainListenConnectAccept/ipv4 (1685 of 2167) PASS: lldb-unit :: DataFormatter/./LLDBFormatterTests/TypeMatcherTests.ExactName (1686 of 2167) PASS: lldb-unit :: Utility/./UtilityTests/StringListTest.AppendStringCString (1687 of 2167) PASS: lldb-api :: lang/objc/conflicting-definition/TestConflictingDefinition.py (1688 of 2167) PASS: lldb-api :: commands/expression/call-throws/TestCallThatThrows.py (1689 of 2167) PASS: lldb-api :: commands/platform/basic/TestPlatformPython.py (1690 of 2167) PASS: lldb-api :: functionalities/thread_plan/TestThreadPlanCommands.py (1691 of 2167) PASS: lldb-api :: macosx/nslog/TestDarwinNSLogOutput.py (1692 of 2167) PASS: lldb-unit :: Process/gdb-remote/./ProcessGdbRemoteTests/GDBRemoteClientBaseTest.SendContinueDelegateStructuredDataReceipt (1693 of 2167) PASS: lldb-api :: python_api/lldbutil/iter/TestLLDBIterator.py (1694 of 2167) PASS: lldb-unit :: Utility/./UtilityTests/StringExtractorTest.DecodeHexU8_InvalidHex2 (1695 of 2167) PASS: lldb-api :: lang/cpp/inlines/TestInlines.py (1696 of 2167) PASS: lldb-unit :: Utility/./UtilityTests/StringExtractorTest.GetHexBytes_FullString (1697 of 2167) PASS: lldb-unit :: Utility/./UtilityTests/StringExtractorTest.GetHexBytesAvail_OddPair (1698 of 2167) UNSUPPORTED: lldb-shell :: ScriptInterpreter/Lua/independent_state.test (1699 of 2167) PASS: lldb-api :: functionalities/data-formatter/builtin-formats/TestBuiltinFormats.py (1700 of 2167) PASS: lldb-unit :: Utility/./UtilityTests/ArgsTest.TestQuotedTrailingBackslash (1701 of 2167) PASS: lldb-unit :: Utility/./UtilityTests/ArgsTest.ReplaceArgumentAtIndexEqual (1702 of 2167) PASS: lldb-api :: lang/cpp/frame-var-anon-unions/TestFrameVariableAnonymousUnions.py (1703 of 2167) PASS: lldb-unit :: Utility/./UtilityTests/TimerTest.CategoryTimesStats (1704 of 2167) PASS: lldb-api :: python_api/value/change_values/TestChangeValueAPI.py (1705 of 2167) PASS: lldb-api :: functionalities/dynamic_value_child_count/TestDynamicValueChildCount.py (1706 of 2167) PASS: lldb-unit :: Core/./LLDBCoreTests/CommunicationTest.SynchronizeWhileClosing (1707 of 2167) PASS: lldb-shell :: Commands/command-thread-select.test (1708 of 2167) PASS: lldb-unit :: Language/Highlighting/./HighlighterTests/HighlighterTest.ClangCursorPosInOtherToken (1709 of 2167) PASS: lldb-api :: functionalities/data-formatter/hexcaps/TestDataFormatterHexCaps.py (1710 of 2167) PASS: lldb-api :: functionalities/jitloader_gdb/TestJITLoaderGDB.py (1711 of 2167) UNSUPPORTED: lldb-api :: lang/objc/modules-update/TestClangModulesUpdate.py (1712 of 2167) PASS: lldb-unit :: Utility/./UtilityTests/StreamTeeTest.GetStreamAtIndexOutOfBoundsEmpty (1713 of 2167) PASS: lldb-unit :: Utility/./UtilityTests/OptionsWithRawTest.EmptySuffix (1714 of 2167) PASS: lldb-api :: lang/cpp/overloaded-functions/TestOverloadedFunctions.py (1715 of 2167) PASS: lldb-unit :: Utility/./UtilityTests/StreamTest.PutHex64ByteOrderBig (1716 of 2167) PASS: lldb-unit :: Utility/./UtilityTests/TimerTest.CategoryTimesNested (1717 of 2167) PASS: lldb-unit :: Utility/./UtilityTests/NameMatchesTest.Contains (1718 of 2167) PASS: lldb-api :: functionalities/completion/TestCompletion.py (1719 of 2167) UNSUPPORTED: lldb-shell :: Register/x86-gp-read.test (1720 of 2167) UNSUPPORTED: lldb-api :: functionalities/data-formatter/data-formatter-stl/libstdcpp/unique_ptr/TestDataFormatterStdUniquePtr.py (1721 of 2167) UNSUPPORTED: lldb-api :: functionalities/thread/concurrent_events/TestConcurrentWatchpointWithDelayWatchpointThreads.py (1722 of 2167) PASS: lldb-unit :: Platform/./LLDBPlatformTests/PlatformAppleSimulatorTest.TestSimHasSimEnvionament (1723 of 2167) PASS: lldb-unit :: Utility/./UtilityTests/StringExtractorTest.GetHexU8_Exact_NoEof (1724 of 2167) PASS: lldb-unit :: UnwindAssembly/x86/./UnwindAssemblyx86Tests/Testx86AssemblyInspectionEngine.TestPushEAX (1725 of 2167) PASS: lldb-unit :: Host/./HostTests/FileActionTest.Open (1726 of 2167) UNSUPPORTED: lldb-shell :: SymbolFile/PDB/variables.test (1727 of 2167) UNSUPPORTED: lldb-api :: tools/lldb-server/memory-allocation/TestGdbRemoteMemoryAllocation.py (1728 of 2167) PASS: lldb-unit :: Utility/./UtilityTests/BinaryStreamTest.PutULEB128TwoBytes (1729 of 2167) PASS: lldb-api :: functionalities/breakpoint/move_nearest/TestMoveNearest.py (1730 of 2167) PASS: lldb-api :: functionalities/data-formatter/data-formatter-objc/TestDataFormatterObjCNSBundle.py (1731 of 2167) PASS: lldb-api :: commands/expression/codegen-crash-import-def-arraytype-element/TestImportDefinitionArrayType.py (1732 of 2167) PASS: lldb-unit :: Utility/./UtilityTests/SerializationRountripTest.SerializeDeserializeCStringArray (1733 of 2167) PASS: lldb-api :: functionalities/return-value/TestReturnValue.py (1734 of 2167) PASS: lldb-unit :: Utility/./UtilityTests/StreamTest.PutHex32ByteOrderLittle (1735 of 2167) PASS: lldb-api :: tools/lldb-vscode/breakpoint/TestVSCode_setFunctionBreakpoints.py (1736 of 2167) PASS: lldb-unit :: Utility/./UtilityTests/ScalarTest.ComparisonFloat (1737 of 2167) PASS: lldb-api :: functionalities/rerun/TestRerun.py (1738 of 2167) PASS: lldb-api :: types/TestCharTypeExpr.py (1739 of 2167) PASS: lldb-unit :: Process/minidump/./LLDBMinidumpTests/MinidumpParserTest.GetMemoryRegionInfoFromMemory64List (1740 of 2167) PASS: lldb-unit :: Utility/./UtilityTests/XcodeSDKTest.FindXcodeContentsDirectoryInPath (1741 of 2167) PASS: lldb-api :: functionalities/multidebugger_commands/TestMultipleDebuggersCommands.py (1742 of 2167) PASS: lldb-unit :: Language/CPlusPlus/./LanguageCPlusPlusTests/CPlusPlusLanguage.FindAlternateFunctionManglings (1743 of 2167) PASS: lldb-unit :: Utility/./UtilityTests/StringListTest.InsertStringAtIndexStart (1744 of 2167) PASS: lldb-unit :: Utility/./UtilityTests/FileSpecTest.Yaml (1745 of 2167) PASS: lldb-api :: functionalities/data-formatter/data-formatter-python-synth/TestDataFormatterPythonSynth.py (1746 of 2167) PASS: lldb-api :: lang/objc/direct-dispatch-step/TestObjCDirectDispatchStepping.py (1747 of 2167) PASS: lldb-unit :: Expression/./ExpressionTests/CppModuleConfigurationTest.Sysroot (1748 of 2167) PASS: lldb-api :: functionalities/data-formatter/data-formatter-objc/TestDataFormatterObjCKVO.py (1749 of 2167) PASS: lldb-unit :: Utility/./UtilityTests/RecordReplayTest.InstrumentedBar (1750 of 2167) PASS: lldb-api :: commands/command/nested_alias/TestNestedAlias.py (1751 of 2167) PASS: lldb-unit :: Utility/./UtilityTests/StreamTest.PutRawBytesToLittleEndian (1752 of 2167) PASS: lldb-unit :: Utility/./UtilityTests/SubsystemRAIITest.SubsystemWithErrorSuccess (1753 of 2167) PASS: lldb-api :: tools/lldb-server/commandline/TestStubReverseConnect.py (1754 of 2167) PASS: lldb-api :: api/listeners/TestListener.py (1755 of 2167) PASS: lldb-unit :: Utility/./UtilityTests/UriParserTest.Minimal (1756 of 2167) PASS: lldb-unit :: Process/gdb-remote/./ProcessGdbRemoteTests/GDBRemoteCommunicationClientTest.ReadRegister (1757 of 2167) PASS: lldb-unit :: Utility/./UtilityTests/UriParserTest.MinimalPath (1758 of 2167) PASS: lldb-unit :: Language/Highlighting/./HighlighterTests/HighlighterTest.ClangTrailingBackslashBeforeNewline (1759 of 2167) PASS: lldb-api :: lang/objc/real-definition/TestRealDefinition.py (1760 of 2167) PASS: lldb-shell :: BuildScript/toolchain-clang.test (1761 of 2167) UNSUPPORTED: lldb-shell :: Register/aarch64-fp-read.test (1762 of 2167) UNSUPPORTED: lldb-shell :: SymbolFile/DWARF/debug-types-basic.test (1763 of 2167) PASS: lldb-unit :: Utility/./UtilityTests/ScalarTest.GetValue (1764 of 2167) PASS: lldb-api :: commands/frame/var/TestFrameVar.py (1765 of 2167) UNSUPPORTED: lldb-shell :: ObjectFile/ELF/minidebuginfo-set-and-hit-breakpoint.test (1766 of 2167) PASS: lldb-api :: lang/c/stepping/TestStepAndBreakpoints.py (1767 of 2167) PASS: lldb-unit :: Expression/./ExpressionTests/DiagnosticManagerTest.AddDiagnostic (1768 of 2167) PASS: lldb-unit :: ScriptInterpreter/Python/./ScriptInterpreterPythonTests/PythonDataObjectsTest.TestPythonCallableCheck (1769 of 2167) PASS: lldb-api :: lang/cpp/lambdas/TestLambdas.py (1770 of 2167) UNSUPPORTED: lldb-api :: commands/expression/import_builtin_fileid/TestImportBuiltinFileID.py (1771 of 2167) UNSUPPORTED: lldb-shell :: SymbolFile/DWARF/dwarf5-partial-index.cpp (1772 of 2167) PASS: lldb-unit :: Utility/./UtilityTests/OptionsWithRawTest.WhitespaceInput (1773 of 2167) PASS: lldb-api :: functionalities/breakpoint/breakpoint_by_line_and_column/TestBreakpointByLineAndColumn.py (1774 of 2167) PASS: lldb-api :: macosx/indirect_symbol/TestIndirectSymbols.py (1775 of 2167) PASS: lldb-unit :: Utility/./UtilityTests/ArchSpecTest.MergeFrom (1776 of 2167) PASS: lldb-unit :: Utility/./UtilityTests/FileSpecTest.FileAndDirectoryComponents (1777 of 2167) PASS: lldb-unit :: Host/./HostTests/MainLoopTest.ReadObject (1778 of 2167) PASS: lldb-unit :: SymbolFile/DWARF/./SymbolFileDWARFTests/SymbolFileDWARFTests.TestAbbrevMissingTerminator (1779 of 2167) UNSUPPORTED: lldb-shell :: SymbolFile/PDB/vbases.test (1780 of 2167) PASS: lldb-api :: lang/objc/modules-inline-functions/TestModulesInlineFunctions.py (1781 of 2167) PASS: lldb-api :: types/TestIntegerTypeExpr.py (1782 of 2167) UNSUPPORTED: lldb-api :: functionalities/asan/TestMemoryHistory.py (1783 of 2167) PASS: lldb-api :: lang/cpp/template-function/TestTemplateFunctions.py (1784 of 2167) UNSUPPORTED: lldb-shell :: SymbolFile/PDB/variables-locations.test (1785 of 2167) PASS: lldb-unit :: Signals/./SignalsTests/UnixSignalsTest.GetInfo (1786 of 2167) PASS: lldb-unit :: Utility/./UtilityTests/XcodeSDKTest.GetSDKTypeForTriple (1787 of 2167) UNSUPPORTED: lldb-shell :: BuildScript/toolchain-msvc.test (1788 of 2167) PASS: lldb-unit :: Symbol/./SymbolTests/TestClangASTImporter.CopyTypeTagDecl (1789 of 2167) PASS: lldb-unit :: Utility/./UtilityTests/AnsiTerminal.AtStart (1790 of 2167) PASS: lldb-unit :: ScriptInterpreter/Python/./ScriptInterpreterPythonTests/PythonDataObjectsTest.TestResetting (1791 of 2167) PASS: lldb-unit :: Utility/./UtilityTests/ArgsTest.Yaml (1792 of 2167) PASS: lldb-api :: functionalities/memory-region/TestMemoryRegion.py (1793 of 2167) PASS: lldb-unit :: ScriptInterpreter/Python/./ScriptInterpreterPythonTests/PythonDataObjectsTest.TestPythonByteArray (1794 of 2167) UNSUPPORTED: lldb-api :: commands/register/register/aarch64_sve_registers/rw_access_static_config/TestSVERegisters.py (1795 of 2167) PASS: lldb-api :: lang/cpp/const_this/TestConstThis.py (1796 of 2167) PASS: lldb-api :: python_api/interpreter/TestRunCommandInterpreterAPI.py (1797 of 2167) PASS: lldb-unit :: Utility/./UtilityTests/ListenerTest.GetEventImmediate (1798 of 2167) PASS: lldb-unit :: Symbol/./SymbolTests/TestTypeSystemClang.TestGetTypeClassDeclType (1799 of 2167) PASS: lldb-unit :: DataFormatter/./LLDBFormatterTests/TypeMatcherTests.GetMatchStringRegex (1800 of 2167) PASS: lldb-shell :: ScriptInterpreter/None/none.test (1801 of 2167) PASS: lldb-api :: lang/c/anonymous/TestAnonymous.py (1802 of 2167) UNSUPPORTED: lldb-api :: functionalities/data-formatter/data-formatter-stl/libstdcpp/tuple/TestDataFormatterStdTuple.py (1803 of 2167) PASS: lldb-api :: types/TestDoubleTypes.py (1804 of 2167) PASS: lldb-shell :: BuildScript/modes.test (1805 of 2167) PASS: lldb-unit :: UnwindAssembly/x86/./UnwindAssemblyx86Tests/Testx86AssemblyInspectionEngine.TestCALLNextInsn (1806 of 2167) PASS: lldb-unit :: Expression/./ExpressionTests/DiagnosticManagerTest.GetStringPreserveOrder (1807 of 2167) PASS: lldb-unit :: Utility/./UtilityTests/ArchSpecTest.YAML (1808 of 2167) PASS: lldb-unit :: Utility/./UtilityTests/SerializationRountripTest.SerializeDeserializeObjectReference (1809 of 2167) PASS: lldb-unit :: ScriptInterpreter/Python/./ScriptInterpreterPythonTests/PythonDataObjectsTest.TestModuleNameResolutionNoDot (1810 of 2167) PASS: lldb-shell :: Reproducer/TestDriverOptions.test (1811 of 2167) PASS: lldb-api :: python_api/signals/TestSignalsAPI.py (1812 of 2167) PASS: lldb-api :: types/TestFloatTypes.py (1813 of 2167) UNSUPPORTED: lldb-shell :: SymbolFile/DWARF/find-variable-file.cpp (1814 of 2167) PASS: lldb-api :: iohandler/unicode/TestUnicode.py (1815 of 2167) PASS: lldb-unit :: Utility/./UtilityTests/CompletionRequest.Constructor (1816 of 2167) PASS: lldb-api :: functionalities/postmortem/minidump/TestMiniDump.py (1817 of 2167) PASS: lldb-unit :: Process/minidump/./LLDBMinidumpTests/RegisterContextMinidump.CheckRegisterContextMinidump_ARM (1818 of 2167) PASS: lldb-api :: tools/lldb-server/TestGdbRemoteHostInfo.py (1819 of 2167) PASS: lldb-api :: lang/cpp/accelerator-table/TestCPPAccelerator.py (1820 of 2167) PASS: lldb-api :: functionalities/data-formatter/data-formatter-cpp/TestDataFormatterCpp.py (1821 of 2167) PASS: lldb-shell :: Commands/command-backtrace.test (1822 of 2167) PASS: lldb-api :: tools/lldb-server/TestGdbRemoteAttach.py (1823 of 2167) PASS: lldb-api :: functionalities/tail_call_frames/disambiguate_paths_to_common_sink/TestDisambiguatePathsToCommonSink.py (1824 of 2167) PASS: lldb-unit :: Symbol/./SymbolTests/DWARFCallFrameInfoTest.Basic_dwarf4 (1825 of 2167) PASS: lldb-shell :: Driver/TestProcessAttach.test (1826 of 2167) PASS: lldb-api :: functionalities/gdb_remote_client/TestJLink6Armv7RegisterDefinition.py (1827 of 2167) PASS: lldb-unit :: Expression/./ExpressionTests/CppModuleConfigurationTest.Linux (1828 of 2167) PASS: lldb-api :: functionalities/data-formatter/data-formatter-stl/libcxx/string/TestDataFormatterLibcxxString.py (1829 of 2167) UNSUPPORTED: lldb-shell :: Register/x86-64-xmm16-read.test (1830 of 2167) PASS: lldb-api :: functionalities/inferior-crashing/TestInferiorCrashing.py (1831 of 2167) PASS: lldb-shell :: SymbolFile/Breakpad/line-table.test (1832 of 2167) PASS: lldb-unit :: ObjectFile/Breakpad/./ObjectFileBreakpadTests/StackWinRecord.parse (1833 of 2167) PASS: lldb-unit :: Host/./HostTests/FileSystemTest.MakeAbsolute (1834 of 2167) PASS: lldb-unit :: Target/./TargetTests/MCBasedABI.MapRegisterName (1835 of 2167) PASS: lldb-unit :: Expression/./ExpressionTests/ClangExpressionDeclMapTest.TestUnknownIdentifierLookup (1836 of 2167) PASS: lldb-unit :: Utility/./UtilityTests/ArgsTest.TestOverwriteArgs (1837 of 2167) UNSUPPORTED: lldb-shell :: SymbolFile/PDB/calling-conventions.test (1838 of 2167) PASS: lldb-shell :: ScriptInterpreter/Python/python.test (1839 of 2167) PASS: lldb-unit :: Utility/./UtilityTests/StringLexerTest.GetUnlexed (1840 of 2167) PASS: lldb-unit :: Process/gdb-remote/./ProcessGdbRemoteTests/GDBRemoteCommunicationClientTest.SendSignalsToIgnore (1841 of 2167) PASS: lldb-api :: lang/cpp/chained-calls/TestCppChainedCalls.py (1842 of 2167) PASS: lldb-unit :: UnwindAssembly/x86/./UnwindAssemblyx86Tests/Testx86AssemblyInspectionEngine.Testi386IgnoredRegisters (1843 of 2167) PASS: lldb-shell :: SymbolFile/DWARF/DW_OP_piece-smaller-than-struct.s (1844 of 2167) PASS: lldb-shell :: SymbolFile/Breakpad/line-table-discontinuous-file-ids.test (1845 of 2167) PASS: lldb-api :: functionalities/breakpoint/address_breakpoints/TestAddressBreakpoints.py (1846 of 2167) PASS: lldb-unit :: Utility/./UtilityTests/RangeDataVector.FindEntryThatContains (1847 of 2167) PASS: lldb-api :: commands/expression/import-std-module/list/TestListFromStdModule.py (1848 of 2167) PASS: lldb-unit :: Utility/./UtilityTests/StringListTest.Assignment (1849 of 2167) PASS: lldb-unit :: Utility/./UtilityTests/TimerTest.CategoryTimes2 (1850 of 2167) PASS: lldb-unit :: Utility/./UtilityTests/StreamTest.PutBytesAsRawHex8ToMixedEndian (1851 of 2167) PASS: lldb-api :: functionalities/breakpoint/auto_continue/TestBreakpointAutoContinue.py (1852 of 2167) PASS: lldb-unit :: Utility/./UtilityTests/ArgsTest.ReplaceArgumentAtIndexLonger (1853 of 2167) PASS: lldb-unit :: DataFormatter/./LLDBFormatterTests/TypeMatcherTests.CreatedBySameMatchStringExactNamePrefixes (1854 of 2167) PASS: lldb-unit :: Symbol/./SymbolTests/TestTypeSystemClang.TestConvertAccessTypeToAccessSpecifier (1855 of 2167) PASS: lldb-unit :: Utility/./UtilityTests/SerializationRountripTest.SerializeDeserializeCStringNull (1856 of 2167) PASS: lldb-unit :: Process/minidump/./LLDBMinidumpTests/MinidumpParserTest.GetMiscInfo_no_stream (1857 of 2167) PASS: lldb-unit :: Expression/./ExpressionTests/CppModuleConfigurationTest.AmbiguousCLib (1858 of 2167) PASS: lldb-unit :: Utility/./UtilityTests/RangeTest.Slide (1859 of 2167) UNSUPPORTED: lldb-api :: android/platform/TestDefaultCacheLineSize.py (1860 of 2167) PASS: lldb-unit :: Utility/./UtilityTests/StreamTest.AddressRangeEmptyRange (1861 of 2167) PASS: lldb-unit :: Process/gdb-remote/./ProcessGdbRemoteTests/GDBRemoteCommunicationClientTest.SendStartTracePacket (1862 of 2167) PASS: lldb-api :: commands/expression/diagnostics/TestExprDiagnostics.py (1863 of 2167) PASS: lldb-shell :: SymbolFile/DWARF/deterministic-build.cpp (1864 of 2167) PASS: lldb-api :: functionalities/data-formatter/data-formatter-categories/TestDataFormatterCategories.py (1865 of 2167) UNSUPPORTED: lldb-api :: commands/watchpoints/watchpoint_on_vectors/TestValueOfVectorVariable.py (1866 of 2167) PASS: lldb-unit :: Utility/./UtilityTests/NameMatchesTest.RegularExpression (1867 of 2167) PASS: lldb-unit :: Process/gdb-remote/./ProcessGdbRemoteTests/GDBRemoteCommunicationServerTest.SendErrorResponse_Status (1868 of 2167) PASS: lldb-api :: functionalities/set-data/TestSetData.py (1869 of 2167) PASS: lldb-unit :: Utility/./UtilityTests/StreamTest.ChangingByteOrder (1870 of 2167) PASS: lldb-api :: functionalities/non-overlapping-index-variable-i/TestIndexVariable.py (1871 of 2167) PASS: lldb-api :: commands/expression/unwind_expression/TestUnwindExpression.py (1872 of 2167) PASS: lldb-api :: python_api/findvalue_duplist/TestSBFrameFindValue.py (1873 of 2167) PASS: lldb-api :: functionalities/signal/handle-abrt/TestHandleAbort.py (1874 of 2167) PASS: lldb-api :: functionalities/conditional_break/TestConditionalBreak.py (1875 of 2167) UNSUPPORTED: lldb-shell :: SymbolFile/DWARF/dir-separator-no-comp-dir.s (1876 of 2167) PASS: lldb-api :: functionalities/data-formatter/data-formatter-advanced/TestDataFormatterAdv.py (1877 of 2167) PASS: lldb-unit :: Utility/./UtilityTests/StringListTest.CopyListSingle (1878 of 2167) PASS: lldb-unit :: ObjectFile/Breakpad/./ObjectFileBreakpadTests/PublicRecord.parse (1879 of 2167) PASS: lldb-api :: lang/objc/modules/TestObjCModules.py (1880 of 2167) PASS: lldb-unit :: Host/./HostTests/SocketTests/SocketTest.TCPListen0ConnectAccept/ipv4 (1881 of 2167) PASS: lldb-shell :: Process/Optimization.test (1882 of 2167) PASS: lldb-api :: lang/objc/objc-super/TestObjCSuper.py (1883 of 2167) UNSUPPORTED: lldb-api :: functionalities/thread/concurrent_events/TestConcurrentNWatchNBreak.py (1884 of 2167) UNSUPPORTED: lldb-api :: lang/objc/modules-incomplete/TestIncompleteModules.py (1885 of 2167) UNSUPPORTED: lldb-shell :: SymbolFile/DWARF/limit-debug-info.s (1886 of 2167) PASS: lldb-api :: functionalities/data-formatter/data-formatter-objc/TestDataFormatterObjCNSData.py (1887 of 2167) PASS: lldb-unit :: Expression/./ExpressionTests/DiagnosticManagerTest.HasFixits (1888 of 2167) PASS: lldb-api :: functionalities/breakpoint/consecutive_breakpoints/TestConsecutiveBreakpoints.py (1889 of 2167) PASS: lldb-api :: lang/cpp/call-function/TestCallCPPFunction.py (1890 of 2167) PASS: lldb-unit :: Utility/./UtilityTests/OptionsWithRawTest.EmptyArgsOnlySuffix (1891 of 2167) PASS: lldb-api :: macosx/function-starts/TestFunctionStarts.py (1892 of 2167) PASS: lldb-unit :: UnwindAssembly/x86/./UnwindAssemblyx86Tests/Testx86AssemblyInspectionEngine.TestSimplex86_64Augmented (1893 of 2167) PASS: lldb-api :: lang/cpp/namespace_definitions/TestNamespaceDefinitions.py (1894 of 2167) UNSUPPORTED: lldb-shell :: SymbolFile/DWARF/debug-types-expressions.test (1895 of 2167) PASS: lldb-api :: commands/disassemble/basic/TestDisassembleBreakpoint.py (1896 of 2167) PASS: lldb-unit :: Utility/./UtilityTests/StringExtractorTest.GetHexBytesAvail_FullString (1897 of 2167) PASS: lldb-shell :: Reproducer/TestDSYM.test (1898 of 2167) UNSUPPORTED: lldb-api :: functionalities/tsan/global_location/TestTsanGlobalLocation.py (1899 of 2167) PASS: lldb-unit :: Utility/./UtilityTests/StreamTest.PutNHex8 (1900 of 2167) PASS: lldb-api :: functionalities/data-formatter/data-formatter-objc/cmtime/TestDataFormatterCMTime.py (1901 of 2167) PASS: lldb-unit :: Symbol/./SymbolTests/TestTypeSystemClang.TestRemoveFastQualifiers (1902 of 2167) PASS: lldb-api :: lang/c/forward/TestForwardDeclaration.py (1903 of 2167) PASS: lldb-unit :: Utility/./UtilityTests/SerializationRountripTest.SerializeDeserializePod (1904 of 2167) PASS: lldb-api :: commands/expression/import-std-module/unique_ptr/TestUniquePtrFromStdModule.py (1905 of 2167) PASS: lldb-unit :: Process/minidump/./LLDBMinidumpTests/MinidumpParserTest.MinidumpModuleOrder (1906 of 2167) PASS: lldb-api :: functionalities/breakpoint/breakpoint_command/TestBreakpointCommand.py (1907 of 2167) PASS: lldb-unit :: Host/./HostTests/FileSystemTest.GetPermissions (1908 of 2167) PASS: lldb-unit :: Utility/./UtilityTests/RegularExpression.Empty (1909 of 2167) PASS: lldb-unit :: Language/Highlighting/./HighlighterTests/HighlighterTest.ClangBraces (1910 of 2167) PASS: lldb-shell :: Breakpoint/debug_rnglistx_rlex.test (1911 of 2167) PASS: lldb-unit :: Utility/./UtilityTests/RegisterValueTest.GetSet8 (1912 of 2167) UNSUPPORTED: lldb-shell :: SymbolFile/DWARF/find-inline-method.s (1913 of 2167) PASS: lldb-shell :: Settings/TestFrameFormatMangling.test (1914 of 2167) PASS: lldb-api :: lang/cpp/class_types/TestClassTypes.py (1915 of 2167) PASS: lldb-unit :: Utility/./UtilityTests/RangeTest.LessThan (1916 of 2167) UNSUPPORTED: lldb-api :: functionalities/darwin_log/filter/regex/activity-chain/TestDarwinLogFilterRegexActivityChain.py (1917 of 2167) PASS: lldb-api :: lang/objc/hidden-ivars/TestHiddenIvars.py (1918 of 2167) UNSUPPORTED: lldb-api :: linux/sepdebugsymlink/TestTargetSymbolsSepDebugSymlink.py (1919 of 2167) PASS: lldb-api :: python_api/process/TestProcessAPI.py (1920 of 2167) PASS: lldb-unit :: Utility/./UtilityTests/ArgsTest.TestInsertArg (1921 of 2167) PASS: lldb-api :: functionalities/breakpoint/breakpoint_conditions/TestBreakpointConditions.py (1922 of 2167) PASS: lldb-unit :: Utility/./UtilityTests/UriParserTest.MinimalPortPath (1923 of 2167) PASS: lldb-api :: functionalities/data-formatter/data-formatter-objc/nsindexpath/TestDataFormatterNSIndexPath.py (1924 of 2167) PASS: lldb-api :: functionalities/data-formatter/compactvectors/TestCompactVectors.py (1925 of 2167) UNSUPPORTED: lldb-api :: functionalities/thread/concurrent_events/TestConcurrentTwoWatchpointsOneDelayBreakpoint.py (1926 of 2167) PASS: lldb-unit :: Process/minidump/./LLDBMinidumpTests/RegisterContextMinidump.ConvertMinidumpContext_x86_32 (1927 of 2167) PASS: lldb-unit :: Utility/./UtilityTests/RangeDataVector.FindEntryThatContains_Overlap (1928 of 2167) PASS: lldb-api :: functionalities/data-formatter/data-formatter-stl/libcxx/deque/TestDataFormatterLibcxxDeque.py (1929 of 2167) UNSUPPORTED: lldb-shell :: SymbolFile/PDB/ast-restore.test (1930 of 2167) PASS: lldb-api :: commands/expression/function_template_specialization_temp_args/TestFunctionTemplateSpecializationTempArgs.py (1931 of 2167) PASS: lldb-api :: functionalities/thread/concurrent_events/TestConcurrentBreakpointOneDelayBreakpointThreads.py (1932 of 2167) PASS: lldb-api :: functionalities/breakpoint/breakpoint_set_restart/TestBreakpointSetRestart.py (1933 of 2167) PASS: lldb-unit :: Core/./LLDBCoreTests/ModuleSpecTest.InvalidInMemoryBufferValidFile (1934 of 2167) PASS: lldb-api :: commands/target/create-deps/TestTargetCreateDeps.py (1935 of 2167) PASS: lldb-api :: commands/expression/import-std-module/unique_ptr-dbg-info-content/TestUniquePtrDbgInfoContent.py (1936 of 2167) UNSUPPORTED: lldb-shell :: SymbolFile/DWARF/debug-types-dwo-cross-reference.cpp (1937 of 2167) PASS: lldb-api :: functionalities/data-formatter/data-formatter-stl/libcxx/vector/TestDataFormatterLibcxxVector.py (1938 of 2167) PASS: lldb-api :: macosx/profile_vrs_detach/TestDetachVrsProfile.py (1939 of 2167) UNSUPPORTED: lldb-api :: tools/lldb-server/TestGdbRemoteModuleInfo.py (1940 of 2167) PASS: lldb-shell :: ObjectFile/ELF/duplicate-section.yaml (1941 of 2167) PASS: lldb-unit :: SymbolFile/NativePDB/./SymbolFileNativePDBTests/PDBFPOProgramToDWARFExpressionTests.InvalidOpUnary (1942 of 2167) PASS: lldb-shell :: SymbolFile/Breakpad/unwind-via-stack-win.test (1943 of 2167) PASS: lldb-api :: lang/objc/objc-new-syntax/TestObjCNewSyntaxLiteral.py (1944 of 2167) PASS: lldb-api :: lang/objc/variadic_methods/TestVariadicMethods.py (1945 of 2167) PASS: lldb-unit :: SymbolFile/NativePDB/./SymbolFileNativePDBTests/PDBFPOProgramToDWARFExpressionTests.InvalidOpBinary (1946 of 2167) PASS: lldb-unit :: Utility/./UtilityTests/ArchSpecTest.TestParseMachCPUDashSubtypeTripleExtra (1947 of 2167) PASS: lldb-unit :: Expression/./ExpressionTests/CppModuleConfigurationTest.AmbiguousLibCpp (1948 of 2167) PASS: lldb-unit :: UnwindAssembly/x86/./UnwindAssemblyx86Tests/Testx86AssemblyInspectionEngine.TestSimple32bitFrameFunction (1949 of 2167) PASS: lldb-unit :: Utility/./UtilityTests/ScalarTest.SetValueFromCString (1950 of 2167) PASS: lldb-api :: functionalities/data-formatter/data-formatter-caching/TestDataFormatterCaching.py (1951 of 2167) PASS: lldb-unit :: Utility/./UtilityTests/VMRange.ContainsAddr (1952 of 2167) PASS: lldb-unit :: Host/./HostTests/NativeProcessProtocolTest.SetBreakpoint (1953 of 2167) UNSUPPORTED: lldb-shell :: SymbolFile/PDB/compilands.test (1954 of 2167) PASS: lldb-api :: commands/frame/diagnose/dereference-this/TestDiagnoseDereferenceThis.py (1955 of 2167) XFAIL: lldb-shell :: Expr/nodefaultlib.cpp (1956 of 2167) PASS: lldb-api :: lang/cpp/template-specialization-type/TestTemplateSpecializationType.py (1957 of 2167) PASS: lldb-unit :: Utility/./UtilityTests/RangeVector.CombineConsecutiveRanges (1958 of 2167) PASS: lldb-unit :: Utility/./UtilityTests/ArchSpecTest.TestSetTriple (1959 of 2167) PASS: lldb-shell :: Register/x86-64-ymm-read.test (1960 of 2167) PASS: lldb-unit :: ObjectFile/Breakpad/./ObjectFileBreakpadTests/FuncRecord.parse (1961 of 2167) PASS: lldb-api :: functionalities/data-formatter/poarray/TestPrintObjectArray.py (1962 of 2167) PASS: lldb-unit :: Utility/./UtilityTests/FileSpecTest.EqualDotsWindows (1963 of 2167) PASS: lldb-unit :: Expression/./ExpressionTests/DiagnosticManagerTest.GetStringNoDiags (1964 of 2167) PASS: lldb-unit :: Symbol/./SymbolTests/DWARFCallFrameInfoTest.Basic_dwarf3 (1965 of 2167) PASS: lldb-unit :: Utility/./UtilityTests/ConstStringTest.YAML (1966 of 2167) PASS: lldb-unit :: Utility/./UtilityTests/ProcessInstanceInfoMatch.Name (1967 of 2167) PASS: lldb-unit :: UnwindAssembly/x86/./UnwindAssemblyx86Tests/Testx86AssemblyInspectionEngine.TestMovRSPtoRBP (1968 of 2167) PASS: lldb-api :: python_api/process/read-mem-cstring/TestReadMemCString.py (1969 of 2167) PASS: lldb-unit :: Host/./HostTests/SocketTests/SocketTest.UDPConnect/ipv6 (1970 of 2167) PASS: lldb-unit :: ScriptInterpreter/Python/./ScriptInterpreterPythonTests/PythonDataObjectsTest.TestDictionaryResolutionWithDot (1971 of 2167) PASS: lldb-unit :: DataFormatter/./LLDBFormatterTests/StringPrinterTests.CxxASCII (1972 of 2167) PASS: lldb-unit :: Utility/./UtilityTests/StreamTest.AddressRangeInvalidRange (1973 of 2167) PASS: lldb-unit :: Utility/./UtilityTests/OptionsWithRawTest.ArgsButNoDelimiter (1974 of 2167) PASS: lldb-unit :: Utility/./UtilityTests/SharedCluster.ClusterManager (1975 of 2167) PASS: lldb-unit :: Language/Highlighting/./HighlighterTests/HighlighterTest.ClangCursorOutOfBounds (1976 of 2167) PASS: lldb-shell :: ScriptInterpreter/Python/crashlog.test (1977 of 2167) PASS: lldb-unit :: Utility/./UtilityTests/FileSpecTest.AppendPathComponent (1978 of 2167) PASS: lldb-unit :: Utility/./UtilityTests/Flags.Reset (1979 of 2167) PASS: lldb-api :: functionalities/breakpoint/breakpoint_language/TestBreakpointLanguage.py (1980 of 2167) PASS: lldb-api :: commands/expression/import-std-module/shared_ptr/TestSharedPtrFromStdModule.py (1981 of 2167) PASS: lldb-shell :: SymbolFile/DWARF/DW_TAG_basic_type_DW_ATE_UTF_nonC.ll (1982 of 2167) PASS: lldb-unit :: Utility/./UtilityTests/ArchSpecTest.MergeFromMachOUnknown (1983 of 2167) PASS: lldb-unit :: ObjectFile/ELF/./ObjectFileELFTests/ObjectFileELFTest.GetModuleSpecifications_EarlySectionHeaders (1984 of 2167) UNSUPPORTED: lldb-shell :: Unwind/basic-block-sections.test (1985 of 2167) PASS: lldb-shell :: SymbolFile/DWARF/DW_AT_loclists_base.s (1986 of 2167) PASS: lldb-unit :: SymbolFile/NativePDB/./SymbolFileNativePDBTests/PDBFPOProgramToDWARFExpressionTests.UnresolvedDependentCyclicRegisterAssignmentReference (1987 of 2167) PASS: lldb-unit :: Symbol/./SymbolTests/TestTypeSystemClang.TestDisplayName (1988 of 2167) PASS: lldb-api :: commands/expression/inline-namespace/TestInlineNamespace.py (1989 of 2167) PASS: lldb-unit :: Utility/./UtilityTests/StringListTest.SplitIntoLinesSingleTrailingCR (1990 of 2167) PASS: lldb-unit :: Utility/./UtilityTests/ScalarTest.LongLongAssigmentOperator (1991 of 2167) PASS: lldb-api :: lang/c/stepping/TestThreadStepping.py (1992 of 2167) PASS: lldb-unit :: Process/gdb-remote/./ProcessGdbRemoteTests/GDBRemoteCommunicationClientTest.SendStopTracePacket (1993 of 2167) UNSUPPORTED: lldb-shell :: SymbolFile/NativePDB/locate-pdb.cpp (1994 of 2167) PASS: lldb-api :: functionalities/backticks/TestBackticksWithoutATarget.py (1995 of 2167) UNSUPPORTED: lldb-shell :: Register/x86-zmm-read.test (1996 of 2167) PASS: lldb-api :: commands/frame/diagnose/local-variable/TestLocalVariable.py (1997 of 2167) PASS: lldb-unit :: Process/gdb-remote/./ProcessGdbRemoteTests/GDBRemoteCommunicationClientTest.GetModulesInfo_UUID20 (1998 of 2167) PASS: lldb-api :: commands/breakpoint/set/func-regex/TestBreakpointRegexError.py (1999 of 2167) PASS: lldb-unit :: Host/./HostTests/NativeProcessProtocolTest.ReadMemoryWithoutTrap (2000 of 2167) PASS: lldb-unit :: UnwindAssembly/x86/./UnwindAssemblyx86Tests/Testx86AssemblyInspectionEngine.TestSimple64bitFrameFunction (2001 of 2167) PASS: lldb-unit :: Expression/./ExpressionTests/DiagnosticManagerTest.AppendMessageNoDiag (2002 of 2167) PASS: lldb-unit :: Host/./HostTests/File.GetStreamFromDescriptor (2003 of 2167) PASS: lldb-unit :: Target/./TargetTests/ModuleCacheTest.GetAndPutStrangeHostname (2004 of 2167) UNSUPPORTED: lldb-api :: functionalities/thread/thread_specific_break_plus_condition/TestThreadSpecificBpPlusCondition.py (2005 of 2167) PASS: lldb-unit :: Process/minidump/./LLDBMinidumpTests/MinidumpParserTest.GetArchitectureWindows (2006 of 2167) PASS: lldb-unit :: Utility/./UtilityTests/StreamTeeTest.GetStreamAtIndexOutOfBounds (2007 of 2167) PASS: lldb-unit :: Process/./ProcessEventDataTests/ProcessEventDataTest.ShouldStop (2008 of 2167) PASS: lldb-api :: commands/expression/invalid-args/TestInvalidArgsExpression.py (2009 of 2167) PASS: lldb-unit :: Utility/./UtilityTests/SerializationRountripTest.SerializeDeserializeObjectPointer (2010 of 2167) PASS: lldb-unit :: Utility/./UtilityTests/RangeTest.ContainsAddrInvalid (2011 of 2167) PASS: lldb-unit :: tools/lldb-server/tests/./LLDBServerTests/TestBase.LaunchModePreservesEnvironment (2012 of 2167) UNSUPPORTED: lldb-api :: lang/cpp/function-template-parameter-pack/TestFunctionTemplateParameterPack.py (2013 of 2167) PASS: lldb-unit :: Utility/./UtilityTests/BinaryStreamTest.PutULEB128EightBytes (2014 of 2167) PASS: lldb-shell :: Breakpoint/debug_rnglist_rlestartend.test (2015 of 2167) PASS: lldb-api :: commands/expression/dollar-in-variable/TestDollarInVariable.py (2016 of 2167) PASS: lldb-unit :: Utility/./UtilityTests/StringListTest.JoinThree (2017 of 2167) PASS: lldb-api :: commands/expression/radar_8638051/Test8638051.py (2018 of 2167) PASS: lldb-unit :: Utility/./UtilityTests/ScalarTest.GetBytes (2019 of 2167) PASS: lldb-api :: python_api/sbtype_typeclass/TestSBTypeTypeClass.py (2020 of 2167) PASS: lldb-api :: python_api/sbplatform/TestSBPlatform.py (2021 of 2167) PASS: lldb-unit :: debugserver/./debugserverTests/RNBSocket.LoopBackListenIPv4 (2022 of 2167) PASS: lldb-api :: types/TestCharType.py (2023 of 2167) PASS: lldb-unit :: Utility/./UtilityTests/GeneratorTest.GetOrCreate (2024 of 2167) PASS: lldb-api :: commands/frame/language/TestGuessLanguage.py (2025 of 2167) PASS: lldb-api :: functionalities/gdb_remote_client/TestNestedRegDefinitions.py (2026 of 2167) UNSUPPORTED: lldb-shell :: ScriptInterpreter/Lua/nested_sessions.test (2027 of 2167) PASS: lldb-unit :: Utility/./UtilityTests/ProcessInstanceInfo.Dump (2028 of 2167) PASS: lldb-unit :: Utility/./UtilityTests/RegularExpression.Match (2029 of 2167) PASS: lldb-api :: functionalities/data-formatter/data-formatter-smart-array/TestDataFormatterSmartArray.py (2030 of 2167) PASS: lldb-unit :: Utility/./UtilityTests/DataExtractorTest.GetCStrUnterminated (2031 of 2167) PASS: lldb-unit :: Utility/./UtilityTests/CompletionRequest.TryCompleteCurrentArgGood (2032 of 2167) PASS: lldb-api :: lang/cpp/global_variables/TestCPPGlobalVariables.py (2033 of 2167) PASS: lldb-unit :: Utility/./UtilityTests/StreamTest.PutCStringWithStringRef (2034 of 2167) PASS: lldb-api :: commands/expression/import-std-module/deque-basic/TestDequeFromStdModule.py (2035 of 2167) UNSUPPORTED: lldb-api :: functionalities/ubsan/user-expression/TestUbsanUserExpression.py (2036 of 2167) PASS: lldb-unit :: ObjectFile/Breakpad/./ObjectFileBreakpadTests/Record.classify (2037 of 2167) UNSUPPORTED: lldb-api :: lang/objc/modules-app-update/TestClangModulesAppUpdate.py (2038 of 2167) PASS: lldb-unit :: Utility/./UtilityTests/RangeTest.ContainsAddr (2039 of 2167) UNSUPPORTED: lldb-api :: commands/trace/TestTraceSchema.py (2040 of 2167) PASS: lldb-api :: functionalities/gdb_remote_client/TestPlatformClient.py (2041 of 2167) PASS: lldb-unit :: Utility/./UtilityTests/AnsiTerminal.Incomplete (2042 of 2167) PASS: lldb-shell :: SymbolFile/DWARF/DW_AT_data_bit_offset-DW_OP_stack_value.s (2043 of 2167) PASS: lldb-api :: terminal/TestSTTYBeforeAndAfter.py (2044 of 2167) PASS: lldb-shell :: Reproducer/TestCaptureEnvOverride.test (2045 of 2167) PASS: lldb-api :: commands/target/dump-symtab-demangle/TestDumpSymtabDemangle.py (2046 of 2167) PASS: lldb-api :: functionalities/postmortem/wow64_minidump/TestWow64MiniDump.py (2047 of 2167) PASS: lldb-shell :: Reproducer/TestVerify.test (2048 of 2167) PASS: lldb-api :: commands/target/stop-hook/disable/TestTargetStopHookDisable.py (2049 of 2167) PASS: lldb-unit :: Process/minidump/./LLDBMinidumpTests/MinidumpParserTest.GetPidWindows (2050 of 2167) PASS: lldb-api :: lang/cpp/this_class_type_mixing/TestThisClassTypeMixing.py (2051 of 2167) PASS: lldb-api :: python_api/module_section/TestModuleAndSection.py (2052 of 2167) PASS: lldb-shell :: SymbolFile/Breakpad/unwind-via-raSearch.test (2053 of 2167) UNSUPPORTED: lldb-api :: functionalities/thread/concurrent_events/TestConcurrentManySignals.py (2054 of 2167) PASS: lldb-unit :: Symbol/./SymbolTests/TestTypeSystemClang.TestBuiltinTypeForEncodingAndBitSize (2055 of 2167) PASS: lldb-api :: commands/expression/vector_of_enums/TestVectorOfEnums.py (2056 of 2167) PASS: lldb-api :: commands/expression/save_jit_objects/TestSaveJITObjects.py (2057 of 2167) PASS: lldb-shell :: Reproducer/TestProcessList.test (2058 of 2167) PASS: lldb-unit :: Utility/./UtilityTests/ArchSpecTest.TripleComponentsWereSpecified (2059 of 2167) PASS: lldb-api :: lang/objc/objc-foundation-dictionary-empty/TestNSDictionary0.py (2060 of 2167) PASS: lldb-api :: api/log/TestAPILog.py (2061 of 2167) PASS: lldb-api :: lang/objc/radar-9691614/TestObjCMethodReturningBOOL.py (2062 of 2167) PASS: lldb-unit :: Utility/./UtilityTests/StringExtractorTest.GetHexU8_Underflow (2063 of 2167) PASS: lldb-unit :: UnwindAssembly/x86/./UnwindAssemblyx86Tests/Testx86AssemblyInspectionEngine.TestStackRealignMSVC_i386 (2064 of 2167) PASS: lldb-unit :: Utility/./UtilityTests/BinaryStreamTest.PutSLEB128EightBytes (2065 of 2167) PASS: lldb-unit :: Utility/./UtilityTests/StringLexerTest.HasAtLeast (2066 of 2167) PASS: lldb-api :: lang/cpp/member-and-local-vars-with-same-name/TestMembersAndLocalsWithSameName.py (2067 of 2167) PASS: lldb-shell :: SymbolFile/DWARF/clang-ast-from-dwarf-objc-property.m (2068 of 2167) PASS: lldb-unit :: Host/./HostTests/SocketTests/SocketTest.TCPListen0GetPort/ipv6 (2069 of 2167) PASS: lldb-api :: linux/builtin_trap/TestBuiltinTrap.py (2070 of 2167) PASS: lldb-unit :: UnwindAssembly/x86/./UnwindAssemblyx86Tests/Testx86AssemblyInspectionEngine.TestStackRealign32BitDisp_x86_64 (2071 of 2167) PASS: lldb-api :: functionalities/postmortem/minidump-new/TestMiniDumpUUID.py (2072 of 2167) PASS: lldb-unit :: Symbol/./SymbolTests/PostfixExpression.ParseOneExpression (2073 of 2167) PASS: lldb-unit :: Utility/./UtilityTests/PassiveReplayTest.InstrumentedFoo (2074 of 2167) PASS: lldb-unit :: Utility/./UtilityTests/StringExtractorTest.GetHexBytes_Partial (2075 of 2167) UNSUPPORTED: lldb-shell :: Register/x86-ymm-write.test (2076 of 2167) PASS: lldb-unit :: DataFormatter/./LLDBFormatterTests/TypeMatcherTests.GetMatchStringExactName (2077 of 2167) PASS: lldb-unit :: Utility/./UtilityTests/StreamTeeTest.SetStreamAtIndexOverwrite (2078 of 2167) PASS: lldb-api :: commands/platform/file/read/TestPlatformFileRead.py (2079 of 2167) PASS: lldb-unit :: Utility/./UtilityTests/StringExtractorTest.GetHexU8_Underflow2 (2080 of 2167) PASS: lldb-api :: functionalities/postmortem/elf-core/gcore/TestGCore.py (2081 of 2167) PASS: lldb-unit :: Utility/./UtilityTests/ConstStringTest.CompareStringRef (2082 of 2167) PASS: lldb-shell :: ObjectFile/ELF/netbsd-exec-8.99.30-amd64.yaml (2083 of 2167) PASS: lldb-shell :: Register/x86-fp-read.test (2084 of 2167) UNSUPPORTED: lldb-shell :: SymbolFile/NativePDB/tag-types.cpp (2085 of 2167) PASS: lldb-unit :: Process/gdb-remote/./ProcessGdbRemoteTests/GDBRemoteCommunicationClientTest.SyncThreadState (2086 of 2167) PASS: lldb-api :: functionalities/breakpoint/breakpoint_options/TestBreakpointOptions.py (2087 of 2167) UNSUPPORTED: lldb-shell :: Register/x86-ymm-read.test (2088 of 2167) UNSUPPORTED: lldb-shell :: Unwind/eh-frame-augment-noop.test (2089 of 2167) PASS: lldb-shell :: SymbolFile/DWARF/split-dwarf-inlining.cpp (2090 of 2167) PASS: lldb-api :: functionalities/data-formatter/data-formatter-stl/libstdcpp/unique_ptr/invalid/TestDataFormatterInvalidStdUniquePtr.py (2091 of 2167) PASS: lldb-api :: commands/expression/import-std-module/vector-bool/TestVectorBoolFromStdModule.py (2092 of 2167) PASS: lldb-api :: functionalities/data-formatter/data-formatter-stl/libcxx/unordered/TestDataFormatterUnordered.py (2093 of 2167) PASS: lldb-api :: types/TestDoubleTypesExpr.py (2094 of 2167) UNSUPPORTED: lldb-shell :: SymbolFile/NativePDB/local-variables.cpp (2095 of 2167) PASS: lldb-api :: lang/cpp/operator-overload/TestOperatorOverload.py (2096 of 2167) PASS: lldb-api :: lang/cpp/template/TestTemplateArgs.py (2097 of 2167) PASS: lldb-shell :: Breakpoint/single-file-split-dwarf.test (2098 of 2167) PASS: lldb-unit :: Language/Highlighting/./HighlighterTests/HighlighterTest.ClangPreserveNewLine (2099 of 2167) PASS: lldb-api :: functionalities/data-formatter/stringprinter/TestStringPrinter.py (2100 of 2167) PASS: lldb-api :: driver/batch_mode/TestBatchMode.py (2101 of 2167) PASS: lldb-unit :: Utility/./UtilityTests/DataExtractorTest.GetSLEB128_bit63 (2102 of 2167) PASS: lldb-api :: lang/objc/objc-class-method/TestObjCClassMethod.py (2103 of 2167) PASS: lldb-unit :: Utility/./UtilityTests/RangeTest.DefaultConstructor (2104 of 2167) PASS: lldb-unit :: Editline/./EditlineTests/EditlineTestFixture.EditlineReceivesMultiLineText (2105 of 2167) PASS: lldb-api :: functionalities/tail_call_frames/inlining_and_tail_calls/TestInliningAndTailCalls.py (2106 of 2167) PASS: lldb-api :: functionalities/data-formatter/summary-string-onfail/Test-rdar-9974002.py (2107 of 2167) PASS: lldb-unit :: Utility/./UtilityTests/StringListTest.LongestCommonPrefixSingleElement (2108 of 2167) PASS: lldb-unit :: Utility/./UtilityTests/ArgsTest.GetQuotedCommandString (2109 of 2167) PASS: lldb-api :: lang/objc/global_ptrs/TestGlobalObjects.py (2110 of 2167) PASS: lldb-unit :: Expression/./ExpressionTests/CppModuleConfigurationTest.IgnoreLibStdCpp (2111 of 2167) PASS: lldb-api :: lang/objc/objc-optimized/TestObjcOptimized.py (2112 of 2167) PASS: lldb-unit :: UnwindAssembly/x86/./UnwindAssemblyx86Tests/Testx86AssemblyInspectionEngine.Test64bitFramelessSmallStackFrame (2113 of 2167) PASS: lldb-api :: commands/expression/fixits/TestFixIts.py (2114 of 2167) PASS: lldb-shell :: Quit/TestQuitExitCode0.test (2115 of 2167) UNSUPPORTED: lldb-shell :: SymbolFile/PDB/enums-layout.test (2116 of 2167) PASS: lldb-unit :: ScriptInterpreter/Python/./ScriptInterpreterPythonTests/PythonDataObjectsTest.TestInstanceNameResolutionNoDot (2117 of 2167) PASS: lldb-unit :: Utility/./UtilityTests/BinaryStreamTest.PutSLEB128SevenBytes (2118 of 2167) PASS: lldb-api :: functionalities/data-formatter/pyobjsynthprovider/TestPyObjSynthProvider.py (2119 of 2167) PASS: lldb-unit :: Utility/./UtilityTests/XcodeSDKTest.SDKSupportsSwift (2120 of 2167) PASS: lldb-unit :: Symbol/./SymbolTests/SymbolsTest.TerminateLocateExecutableSymbolFileForUnknownExecutableAndUnknownSymbolFile (2121 of 2167) PASS: lldb-unit :: Expression/./ExpressionTests/DiagnosticManagerTest.AppendMessageAttachToLastDiag (2122 of 2167) PASS: lldb-shell :: SymbolFile/DWARF/DW_OP_piece-struct.s (2123 of 2167) PASS: lldb-unit :: SymbolFile/DWARF/./SymbolFileDWARFTests/SymbolFileDWARFTests.ParseAranges (2124 of 2167) PASS: lldb-api :: tools/lldb-server/TestGdbRemoteExpeditedRegisters.py (2125 of 2167) PASS: lldb-unit :: Utility/./UtilityTests/ArgsTest.TestUnknownEscape (2126 of 2167) PASS: lldb-unit :: Utility/./UtilityTests/TildeExpressionResolver.ResolveFullPath (2127 of 2167) PASS: lldb-unit :: UnwindAssembly/x86/./UnwindAssemblyx86Tests/Testx86AssemblyInspectionEngine.TestSubRSP (2128 of 2167) PASS: lldb-api :: lang/cpp/incomplete-types/TestCppIncompleteTypes.py (2129 of 2167) PASS: lldb-unit :: Utility/./UtilityTests/ArgsTest.TestTrailingBackslash (2130 of 2167) UNSUPPORTED: lldb-api :: lang/cpp/gmodules/TestWithModuleDebugging.py (2131 of 2167) PASS: lldb-unit :: Utility/./UtilityTests/UriParserTest.TypicalPortPathIPv6 (2132 of 2167) PASS: lldb-unit :: Host/./HostTests/FileSystemTest.EmptyTest (2133 of 2167) PASS: lldb-unit :: Symbol/./SymbolTests/TestTypeSystemClang.TestIsClangType (2134 of 2167) UNSUPPORTED: lldb-shell :: Minidump/Windows/arm-fp-unwind.test (2135 of 2167) PASS: lldb-unit :: Utility/./UtilityTests/GeneratorTest.YamlMultiProvider (2136 of 2167) PASS: lldb-unit :: Process/gdb-remote/./ProcessGdbRemoteTests/GDBRemoteCommunicationClientTest.GetModulesInfo (2137 of 2167) PASS: lldb-unit :: Host/./HostTests/SocketTests/SocketTest.DomainGetConnectURI/ipv6 (2138 of 2167) PASS: lldb-unit :: debugserver/./debugserverTests/RNBSocket.LoopBackConnectIPv4 (2139 of 2167) PASS: lldb-unit :: Thread/./ThreadTests/ThreadTest.GetPrivateStopInfo (2140 of 2167) PASS: lldb-api :: functionalities/data-formatter/data-formatter-stl/libcxx/tuple/TestDataFormatterLibcxxTuple.py (2141 of 2167) PASS: lldb-unit :: Utility/./UtilityTests/StringListTest.LongestCommonPrefixDuplicateElement (2142 of 2167) PASS: lldb-unit :: UnwindAssembly/x86/./UnwindAssemblyx86Tests/Testx86AssemblyInspectionEngine.TestPushEDI (2143 of 2167) PASS: lldb-api :: lang/objc/objc-struct-return/TestObjCStructReturn.py (2144 of 2167) UNSUPPORTED: lldb-api :: functionalities/tsan/basic/TestTsanBasic.py (2145 of 2167) UNSUPPORTED: lldb-shell :: ObjectFile/ELF/basic-info.yaml (2146 of 2167) PASS: lldb-unit :: Process/minidump/./LLDBMinidumpTests/MinidumpParserTest.GetLinuxProcStatus (2147 of 2167) PASS: lldb-unit :: DataFormatter/./LLDBFormatterTests/StringPrinterTests.CxxUTF8 (2148 of 2167) UNSUPPORTED: lldb-shell :: SymbolFile/NativePDB/ast-functions-msvc.cpp (2149 of 2167) PASS: lldb-shell :: SymbolFile/DWARF/gnu-style-compression.cpp (2150 of 2167) PASS: lldb-shell :: SymbolFile/Breakpad/stack-cfi-parsing.test (2151 of 2167) PASS: lldb-api :: functionalities/object-file/TestImageListMultiArchitecture.py (2152 of 2167) PASS: lldb-api :: lang/c/step_over_no_deadlock/TestStepOverDoesntBlock.py (2153 of 2167) PASS: lldb-api :: commands/expression/pr35310/TestExprsBug35310.py (2154 of 2167) PASS: lldb-api :: functionalities/memory/find/TestMemoryFind.py (2155 of 2167) PASS: lldb-api :: commands/expression/no-deadlock/TestExprDoesntBlock.py (2156 of 2167) PASS: lldb-api :: tools/lldb-server/inferior-crash/TestGdbRemoteAbort.py (2157 of 2167) PASS: lldb-api :: functionalities/thread/thread_exit/TestThreadExit.py (2158 of 2167) PASS: lldb-api :: functionalities/tail_call_frames/thread_step_out_message/TestArtificialFrameStepOutMessage.py (2159 of 2167) PASS: lldb-api :: functionalities/exec/TestExec.py (2160 of 2167) PASS: lldb-shell :: Reproducer/Functionalities/TestDataFormatter.test (2161 of 2167) PASS: lldb-api :: functionalities/limit-debug-info/TestLimitDebugInfo.py (2162 of 2167) PASS: lldb-api :: python_api/objc_type/TestObjCType.py (2163 of 2167) PASS: lldb-api :: tools/lldb-vscode/attach/TestVSCode_attach.py (2164 of 2167) PASS: lldb-api :: tools/lldb-server/TestGdbRemote_vCont.py (2165 of 2167) PASS: lldb-api :: lang/objc/foundation/TestFoundationDisassembly.py (2166 of 2167) PASS: lldb-api :: tools/lldb-server/TestLldbGdbServer.py (2167 of 2167) Slowest Tests: -------------------------------------------------------------------------- 105.35s: lldb-api :: tools/lldb-server/TestLldbGdbServer.py 69.00s: lldb-api :: api/multithreaded/TestMultithreaded.py 60.45s: lldb-api :: lang/objc/hidden-ivars/TestHiddenIvars.py 60.18s: lldb-api :: lang/objc/foundation/TestFoundationDisassembly.py 56.76s: lldb-api :: lang/objc/objc-new-syntax/TestObjCNewSyntaxDictionary.py 55.15s: lldb-api :: lang/objc/foundation/TestObjCMethodsString.py 54.54s: lldb-api :: macosx/simulator/TestSimulatorPlatform.py 51.19s: lldb-api :: lang/objc/foundation/TestObjCMethods.py 50.72s: lldb-api :: functionalities/completion/TestCompletion.py 50.67s: lldb-api :: lang/objc/exceptions/TestObjCExceptions.py 49.28s: lldb-api :: commands/expression/import-std-module/queue/TestQueueFromStdModule.py 41.96s: lldb-api :: commands/expression/import-std-module/vector-dbg-info-content/TestDbgInfoContentVectorFromStdModule.py 41.77s: lldb-api :: python_api/exprpath_synthetic/TestExprPathSynthetic.py 40.13s: lldb-api :: functionalities/data-formatter/boolreference/TestFormattersBoolRefPtr.py 38.86s: lldb-api :: tools/lldb-server/TestGdbRemoteAuxvSupport.py 38.64s: lldb-api :: lang/objc/real-definition/TestRealDefinition.py 38.30s: lldb-api :: lang/objc/self/TestObjCSelf.py 37.70s: lldb-api :: functionalities/data-formatter/data-formatter-stl/libcxx/map/TestDataFormatterLibccMap.py 36.86s: lldb-api :: functionalities/data-formatter/data-formatter-stl/libcxx/iterator/TestDataFormatterLibccIterator.py 35.47s: lldb-api :: lang/objc/objc-new-syntax/TestObjCNewSyntaxLiteral.py

Hide Details

Tests Times: -------------------------------------------------------------------------- [ Range ] :: [ Percentage ] :: [ Count ] -------------------------------------------------------------------------- [100s,110s) :: [ ] :: [ 1/2167] [ 90s,100s) :: [ ] :: [ 0/2167] [ 80s, 90s) :: [ ] :: [ 0/2167] [ 70s, 80s) :: [ ] :: [ 1/2167] [ 60s, 70s) :: [ ] :: [ 2/2167] [ 50s, 60s) :: [ ] :: [ 7/2167] [ 40s, 50s) :: [ ] :: [ 5/2167] [ 30s, 40s) :: [ ] :: [ 17/2167] [ 20s, 30s) :: [ ] :: [ 7/2167] [ 10s, 20s) :: [* ] :: [ 99/2167] [ 0s, 10s) :: [************************************* ] :: [2028/2167] -------------------------------------------------------------------------- ******************** Failed Tests (8): lldb-api :: python_api/exprpath_synthetic/TestExprPathSynthetic.py lldb-api :: functionalities/data-formatter/boolreference/TestFormattersBoolRefPtr.py lldb-api :: lang/cpp/static_methods/TestCPPStaticMethods.py lldb-api :: functionalities/thread/concurrent_events/TestConcurrentCrashWithSignal.py lldb-api :: functionalities/data-formatter/user-format-vs-summary/TestUserFormatVsSummary.py lldb-api :: commands/target/stop-hooks/TestStopHooks.py lldb-api :: macosx/thread_suspend/TestInternalThreadSuspension.py lldb-api :: functionalities/data-formatter/data-formatter-script/TestDataFormatterScript.py

Hide Details

Hide Details

Testing Time: 353.10s Unsupported : 276 Passed : 1875 Expectedly Failed: 8 Failed : 8 FAILED: tools/lldb/test/CMakeFiles/check-lldb-lit cd /Users/buildslave/jenkins/workspace/lldb-cmake-matrix/lldb-build/tools/lldb/test && /usr/local/Frameworks/Python.framework/Versions/3.7/bin/python3.7 /Users/buildslave/jenkins/workspace/lldb-cmake-matrix/lldb-build/./bin/llvm-lit -v --time-tests --shuffle --xunit-xml-output=/Users/buildslave/jenkins/workspace/lldb-cmake-matrix/test/results.xml -v /Users/buildslave/jenkins/workspace/lldb-cmake-matrix/lldb-build/tools/lldb/test ninja: build stopped: subcommand failed. Command failed: Command '['/usr/bin/env', 'TERM=vt100', '/usr/local/bin/ninja', '-v', 'check-lldb']' returned non-zero exit status 1. Command: ['/usr/bin/env', 'TERM=vt100', '/usr/local/bin/ninja', '-v', 'check-lldb'] + set -e [Pipeline] } [Pipeline] // timeout [Pipeline] junit Recording test results [Pipeline] } [Pipeline] // stage [Pipeline] } [Pipeline] // withEnv [Pipeline] } [Pipeline] // node [Pipeline] End of Pipeline [Checks API] No suitable checks publisher found. Finished: UNSTABLE