FailedConsole Output

Skipping 9,927 KB.. Full Log
       os.rmdir(temp_dir)
            except:
                print(
                    "failed to delete temp dir: {}, directory contents: '{}'".format(
                        temp_dir, os.listdir(temp_dir)))
                None

Hide Details

Hide Details

PASS: LLDB (/Users/buildslave/jenkins/workspace/lldb-cmake-reproducers/lldb-build/bin/clang-x86_64) :: test_p_returns_correct_data_size_for_each_qRegisterInfo_launch_debugserver (TestLldbGdbServer.LldbGdbServerTestCase) runCmd: settings clear -all output:

Hide Details

runCmd: settings set symbols.enable-external-lookup false output:

Hide Details

runCmd: settings set target.inherit-tcc true output:

Hide Details

runCmd: settings set target.auto-apply-fixits false output:

Hide Details

runCmd: settings set plugin.process.gdb-remote.packet-timeout 60 output:

Hide Details

runCmd: settings set symbols.clang-modules-cache-path "/Users/buildslave/jenkins/workspace/lldb-cmake-reproducers/lldb-build/lldb-test-build.noindex/module-cache-lldb/lldb-api" output:

Hide Details

runCmd: settings set use-color false output:

Hide Details

runCmd: setting set target.prefer-dynamic-value no-dynamic-values output:

Hide Details

UNSUPPORTED: LLDB (/Users/buildslave/jenkins/workspace/lldb-cmake-reproducers/lldb-build/bin/clang-x86_64) :: test_p_returns_correct_data_size_for_each_qRegisterInfo_launch_llgs (TestLldbGdbServer.LldbGdbServerTestCase) (llgs tests) runCmd: settings clear -all output:

Hide Details

runCmd: settings set symbols.enable-external-lookup false output:

Hide Details

runCmd: settings set target.inherit-tcc true output:

Hide Details

runCmd: settings set target.auto-apply-fixits false output:

Hide Details

runCmd: settings set plugin.process.gdb-remote.packet-timeout 60 output:

Hide Details

runCmd: settings set symbols.clang-modules-cache-path "/Users/buildslave/jenkins/workspace/lldb-cmake-reproducers/lldb-build/lldb-test-build.noindex/module-cache-lldb/lldb-api" output:

Hide Details

runCmd: settings set use-color false output:

Hide Details

runCmd: setting set target.prefer-dynamic-value no-dynamic-values output:

Hide Details

Adding tearDown hook: def shutdown_named_pipe(): # Close the pipe. try: named_pipe.close() except: print("failed to close named pipe") None

Hide Details

# Delete the pipe. try: os.remove(named_pipe_path) except: print("failed to delete named pipe: {}".format(named_pipe_path)) None

Hide Details

# Delete the temp directory. try: os.rmdir(temp_dir) except: print( "failed to delete temp dir: {}, directory contents: '{}'".format( temp_dir, os.listdir(temp_dir))) None

Hide Details

Hide Details

Adding tearDown hook: def shutdown_socket(): if sock: try: # send the kill packet so lldb-server shuts down gracefully sock.sendall(GdbRemoteTestCaseBase._GDBREMOTE_KILL_PACKET) except: logger.warning( "failed to send kill packet to debug monitor: {}; ignoring".format( sys.exc_info()[0]))

Hide Details

try: sock.close() except: logger.warning( "failed to close socket to debug monitor: {}; ignoring".format( sys.exc_info()[0]))

Hide Details

Hide Details

Executing tearDown hook: def shutdown_socket(): if sock: try: # send the kill packet so lldb-server shuts down gracefully sock.sendall(GdbRemoteTestCaseBase._GDBREMOTE_KILL_PACKET) except: logger.warning( "failed to send kill packet to debug monitor: {}; ignoring".format( sys.exc_info()[0]))

Hide Details

try: sock.close() except: logger.warning( "failed to close socket to debug monitor: {}; ignoring".format( sys.exc_info()[0]))

Hide Details

Hide Details

2020-08-13 03:07:54,881 WARNING failed to send kill packet to debug monitor: <class 'TypeError'>; ignoring Executing tearDown hook: def shutdown_named_pipe(): # Close the pipe. try: named_pipe.close() except: print("failed to close named pipe") None

Hide Details

# Delete the pipe. try: os.remove(named_pipe_path) except: print("failed to delete named pipe: {}".format(named_pipe_path)) None

Hide Details

# Delete the temp directory. try: os.rmdir(temp_dir) except: print( "failed to delete temp dir: {}, directory contents: '{}'".format( temp_dir, os.listdir(temp_dir))) None

Hide Details

Hide Details

PASS: LLDB (/Users/buildslave/jenkins/workspace/lldb-cmake-reproducers/lldb-build/bin/clang-x86_64) :: test_qMemoryRegionInfo_is_supported_debugserver (TestLldbGdbServer.LldbGdbServerTestCase) runCmd: settings clear -all output:

Hide Details

runCmd: settings set symbols.enable-external-lookup false output:

Hide Details

runCmd: settings set target.inherit-tcc true output:

Hide Details

runCmd: settings set target.auto-apply-fixits false output:

Hide Details

runCmd: settings set plugin.process.gdb-remote.packet-timeout 60 output:

Hide Details

runCmd: settings set symbols.clang-modules-cache-path "/Users/buildslave/jenkins/workspace/lldb-cmake-reproducers/lldb-build/lldb-test-build.noindex/module-cache-lldb/lldb-api" output:

Hide Details

runCmd: settings set use-color false output:

Hide Details

runCmd: setting set target.prefer-dynamic-value no-dynamic-values output:

Hide Details

UNSUPPORTED: LLDB (/Users/buildslave/jenkins/workspace/lldb-cmake-reproducers/lldb-build/bin/clang-x86_64) :: test_qMemoryRegionInfo_is_supported_llgs (TestLldbGdbServer.LldbGdbServerTestCase) (llgs tests) runCmd: settings clear -all output:

Hide Details

runCmd: settings set symbols.enable-external-lookup false output:

Hide Details

runCmd: settings set target.inherit-tcc true output:

Hide Details

runCmd: settings set target.auto-apply-fixits false output:

Hide Details

runCmd: settings set plugin.process.gdb-remote.packet-timeout 60 output:

Hide Details

runCmd: settings set symbols.clang-modules-cache-path "/Users/buildslave/jenkins/workspace/lldb-cmake-reproducers/lldb-build/lldb-test-build.noindex/module-cache-lldb/lldb-api" output:

Hide Details

runCmd: settings set use-color false output:

Hide Details

runCmd: setting set target.prefer-dynamic-value no-dynamic-values output:

Hide Details

Adding tearDown hook: def shutdown_named_pipe(): # Close the pipe. try: named_pipe.close() except: print("failed to close named pipe") None

Hide Details

# Delete the pipe. try: os.remove(named_pipe_path) except: print("failed to delete named pipe: {}".format(named_pipe_path)) None

Hide Details

# Delete the temp directory. try: os.rmdir(temp_dir) except: print( "failed to delete temp dir: {}, directory contents: '{}'".format( temp_dir, os.listdir(temp_dir))) None

Hide Details

Hide Details

Adding tearDown hook: def shutdown_socket(): if sock: try: # send the kill packet so lldb-server shuts down gracefully sock.sendall(GdbRemoteTestCaseBase._GDBREMOTE_KILL_PACKET) except: logger.warning( "failed to send kill packet to debug monitor: {}; ignoring".format( sys.exc_info()[0]))

Hide Details

try: sock.close() except: logger.warning( "failed to close socket to debug monitor: {}; ignoring".format( sys.exc_info()[0]))

Hide Details

Hide Details

Executing tearDown hook: def shutdown_socket(): if sock: try: # send the kill packet so lldb-server shuts down gracefully sock.sendall(GdbRemoteTestCaseBase._GDBREMOTE_KILL_PACKET) except: logger.warning( "failed to send kill packet to debug monitor: {}; ignoring".format( sys.exc_info()[0]))

Hide Details

try: sock.close() except: logger.warning( "failed to close socket to debug monitor: {}; ignoring".format( sys.exc_info()[0]))

Hide Details

Hide Details

2020-08-13 03:07:57,040 WARNING failed to send kill packet to debug monitor: <class 'TypeError'>; ignoring Executing tearDown hook: def shutdown_named_pipe(): # Close the pipe. try: named_pipe.close() except: print("failed to close named pipe") None

Hide Details

# Delete the pipe. try: os.remove(named_pipe_path) except: print("failed to delete named pipe: {}".format(named_pipe_path)) None

Hide Details

# Delete the temp directory. try: os.rmdir(temp_dir) except: print( "failed to delete temp dir: {}, directory contents: '{}'".format( temp_dir, os.listdir(temp_dir))) None

Hide Details

Hide Details

PASS: LLDB (/Users/buildslave/jenkins/workspace/lldb-cmake-reproducers/lldb-build/bin/clang-x86_64) :: test_qMemoryRegionInfo_reports_code_address_as_executable_debugserver (TestLldbGdbServer.LldbGdbServerTestCase) runCmd: settings clear -all output:

Hide Details

runCmd: settings set symbols.enable-external-lookup false output:

Hide Details

runCmd: settings set target.inherit-tcc true output:

Hide Details

runCmd: settings set target.auto-apply-fixits false output:

Hide Details

runCmd: settings set plugin.process.gdb-remote.packet-timeout 60 output:

Hide Details

runCmd: settings set symbols.clang-modules-cache-path "/Users/buildslave/jenkins/workspace/lldb-cmake-reproducers/lldb-build/lldb-test-build.noindex/module-cache-lldb/lldb-api" output:

Hide Details

runCmd: settings set use-color false output:

Hide Details

runCmd: setting set target.prefer-dynamic-value no-dynamic-values output:

Hide Details

UNSUPPORTED: LLDB (/Users/buildslave/jenkins/workspace/lldb-cmake-reproducers/lldb-build/bin/clang-x86_64) :: test_qMemoryRegionInfo_reports_code_address_as_executable_llgs (TestLldbGdbServer.LldbGdbServerTestCase) (llgs tests) runCmd: settings clear -all output:

Hide Details

runCmd: settings set symbols.enable-external-lookup false output:

Hide Details

runCmd: settings set target.inherit-tcc true output:

Hide Details

runCmd: settings set target.auto-apply-fixits false output:

Hide Details

runCmd: settings set plugin.process.gdb-remote.packet-timeout 60 output:

Hide Details

runCmd: settings set symbols.clang-modules-cache-path "/Users/buildslave/jenkins/workspace/lldb-cmake-reproducers/lldb-build/lldb-test-build.noindex/module-cache-lldb/lldb-api" output:

Hide Details

runCmd: settings set use-color false output:

Hide Details

runCmd: setting set target.prefer-dynamic-value no-dynamic-values output:

Hide Details

Adding tearDown hook: def shutdown_named_pipe(): # Close the pipe. try: named_pipe.close() except: print("failed to close named pipe") None

Hide Details

# Delete the pipe. try: os.remove(named_pipe_path) except: print("failed to delete named pipe: {}".format(named_pipe_path)) None

Hide Details

# Delete the temp directory. try: os.rmdir(temp_dir) except: print( "failed to delete temp dir: {}, directory contents: '{}'".format( temp_dir, os.listdir(temp_dir))) None

Hide Details

Hide Details

Adding tearDown hook: def shutdown_socket(): if sock: try: # send the kill packet so lldb-server shuts down gracefully sock.sendall(GdbRemoteTestCaseBase._GDBREMOTE_KILL_PACKET) except: logger.warning( "failed to send kill packet to debug monitor: {}; ignoring".format( sys.exc_info()[0]))

Hide Details

try: sock.close() except: logger.warning( "failed to close socket to debug monitor: {}; ignoring".format( sys.exc_info()[0]))

Hide Details

Hide Details

Executing tearDown hook: def shutdown_socket(): if sock: try: # send the kill packet so lldb-server shuts down gracefully sock.sendall(GdbRemoteTestCaseBase._GDBREMOTE_KILL_PACKET) except: logger.warning( "failed to send kill packet to debug monitor: {}; ignoring".format( sys.exc_info()[0]))

Hide Details

try: sock.close() except: logger.warning( "failed to close socket to debug monitor: {}; ignoring".format( sys.exc_info()[0]))

Hide Details

Hide Details

2020-08-13 03:07:59,287 WARNING failed to send kill packet to debug monitor: <class 'TypeError'>; ignoring Executing tearDown hook: def shutdown_named_pipe(): # Close the pipe. try: named_pipe.close() except: print("failed to close named pipe") None

Hide Details

# Delete the pipe. try: os.remove(named_pipe_path) except: print("failed to delete named pipe: {}".format(named_pipe_path)) None

Hide Details

# Delete the temp directory. try: os.rmdir(temp_dir) except: print( "failed to delete temp dir: {}, directory contents: '{}'".format( temp_dir, os.listdir(temp_dir))) None

Hide Details

Hide Details

PASS: LLDB (/Users/buildslave/jenkins/workspace/lldb-cmake-reproducers/lldb-build/bin/clang-x86_64) :: test_qMemoryRegionInfo_reports_heap_address_as_readable_writeable_debugserver (TestLldbGdbServer.LldbGdbServerTestCase) runCmd: settings clear -all output:

Hide Details

runCmd: settings set symbols.enable-external-lookup false output:

Hide Details

runCmd: settings set target.inherit-tcc true output:

Hide Details

runCmd: settings set target.auto-apply-fixits false output:

Hide Details

runCmd: settings set plugin.process.gdb-remote.packet-timeout 60 output:

Hide Details

runCmd: settings set symbols.clang-modules-cache-path "/Users/buildslave/jenkins/workspace/lldb-cmake-reproducers/lldb-build/lldb-test-build.noindex/module-cache-lldb/lldb-api" output:

Hide Details

runCmd: settings set use-color false output:

Hide Details

runCmd: setting set target.prefer-dynamic-value no-dynamic-values output:

Hide Details

UNSUPPORTED: LLDB (/Users/buildslave/jenkins/workspace/lldb-cmake-reproducers/lldb-build/bin/clang-x86_64) :: test_qMemoryRegionInfo_reports_heap_address_as_readable_writeable_llgs (TestLldbGdbServer.LldbGdbServerTestCase) (llgs tests) runCmd: settings clear -all output:

Hide Details

runCmd: settings set symbols.enable-external-lookup false output:

Hide Details

runCmd: settings set target.inherit-tcc true output:

Hide Details

runCmd: settings set target.auto-apply-fixits false output:

Hide Details

runCmd: settings set plugin.process.gdb-remote.packet-timeout 60 output:

Hide Details

runCmd: settings set symbols.clang-modules-cache-path "/Users/buildslave/jenkins/workspace/lldb-cmake-reproducers/lldb-build/lldb-test-build.noindex/module-cache-lldb/lldb-api" output:

Hide Details

runCmd: settings set use-color false output:

Hide Details

runCmd: setting set target.prefer-dynamic-value no-dynamic-values output:

Hide Details

Adding tearDown hook: def shutdown_named_pipe(): # Close the pipe. try: named_pipe.close() except: print("failed to close named pipe") None

Hide Details

# Delete the pipe. try: os.remove(named_pipe_path) except: print("failed to delete named pipe: {}".format(named_pipe_path)) None

Hide Details

# Delete the temp directory. try: os.rmdir(temp_dir) except: print( "failed to delete temp dir: {}, directory contents: '{}'".format( temp_dir, os.listdir(temp_dir))) None

Hide Details

Hide Details

Adding tearDown hook: def shutdown_socket(): if sock: try: # send the kill packet so lldb-server shuts down gracefully sock.sendall(GdbRemoteTestCaseBase._GDBREMOTE_KILL_PACKET) except: logger.warning( "failed to send kill packet to debug monitor: {}; ignoring".format( sys.exc_info()[0]))

Hide Details

try: sock.close() except: logger.warning( "failed to close socket to debug monitor: {}; ignoring".format( sys.exc_info()[0]))

Hide Details

Hide Details

Executing tearDown hook: def shutdown_socket(): if sock: try: # send the kill packet so lldb-server shuts down gracefully sock.sendall(GdbRemoteTestCaseBase._GDBREMOTE_KILL_PACKET) except: logger.warning( "failed to send kill packet to debug monitor: {}; ignoring".format( sys.exc_info()[0]))

Hide Details

try: sock.close() except: logger.warning( "failed to close socket to debug monitor: {}; ignoring".format( sys.exc_info()[0]))

Hide Details

Hide Details

2020-08-13 03:08:01,599 WARNING failed to send kill packet to debug monitor: <class 'TypeError'>; ignoring Executing tearDown hook: def shutdown_named_pipe(): # Close the pipe. try: named_pipe.close() except: print("failed to close named pipe") None

Hide Details

# Delete the pipe. try: os.remove(named_pipe_path) except: print("failed to delete named pipe: {}".format(named_pipe_path)) None

Hide Details

# Delete the temp directory. try: os.rmdir(temp_dir) except: print( "failed to delete temp dir: {}, directory contents: '{}'".format( temp_dir, os.listdir(temp_dir))) None

Hide Details

Hide Details

PASS: LLDB (/Users/buildslave/jenkins/workspace/lldb-cmake-reproducers/lldb-build/bin/clang-x86_64) :: test_qMemoryRegionInfo_reports_stack_address_as_readable_writeable_debugserver (TestLldbGdbServer.LldbGdbServerTestCase) runCmd: settings clear -all output:

Hide Details

runCmd: settings set symbols.enable-external-lookup false output:

Hide Details

runCmd: settings set target.inherit-tcc true output:

Hide Details

runCmd: settings set target.auto-apply-fixits false output:

Hide Details

runCmd: settings set plugin.process.gdb-remote.packet-timeout 60 output:

Hide Details

runCmd: settings set symbols.clang-modules-cache-path "/Users/buildslave/jenkins/workspace/lldb-cmake-reproducers/lldb-build/lldb-test-build.noindex/module-cache-lldb/lldb-api" output:

Hide Details

runCmd: settings set use-color false output:

Hide Details

runCmd: setting set target.prefer-dynamic-value no-dynamic-values output:

Hide Details

UNSUPPORTED: LLDB (/Users/buildslave/jenkins/workspace/lldb-cmake-reproducers/lldb-build/bin/clang-x86_64) :: test_qMemoryRegionInfo_reports_stack_address_as_readable_writeable_llgs (TestLldbGdbServer.LldbGdbServerTestCase) (llgs tests) runCmd: settings clear -all output:

Hide Details

runCmd: settings set symbols.enable-external-lookup false output:

Hide Details

runCmd: settings set target.inherit-tcc true output:

Hide Details

runCmd: settings set target.auto-apply-fixits false output:

Hide Details

runCmd: settings set plugin.process.gdb-remote.packet-timeout 60 output:

Hide Details

runCmd: settings set symbols.clang-modules-cache-path "/Users/buildslave/jenkins/workspace/lldb-cmake-reproducers/lldb-build/lldb-test-build.noindex/module-cache-lldb/lldb-api" output:

Hide Details

runCmd: settings set use-color false output:

Hide Details

runCmd: setting set target.prefer-dynamic-value no-dynamic-values output:

Hide Details

Adding tearDown hook: def shutdown_named_pipe(): # Close the pipe. try: named_pipe.close() except: print("failed to close named pipe") None

Hide Details

# Delete the pipe. try: os.remove(named_pipe_path) except: print("failed to delete named pipe: {}".format(named_pipe_path)) None

Hide Details

# Delete the temp directory. try: os.rmdir(temp_dir) except: print( "failed to delete temp dir: {}, directory contents: '{}'".format( temp_dir, os.listdir(temp_dir))) None

Hide Details

Hide Details

Adding tearDown hook: def shutdown_socket(): if sock: try: # send the kill packet so lldb-server shuts down gracefully sock.sendall(GdbRemoteTestCaseBase._GDBREMOTE_KILL_PACKET) except: logger.warning( "failed to send kill packet to debug monitor: {}; ignoring".format( sys.exc_info()[0]))

Hide Details

try: sock.close() except: logger.warning( "failed to close socket to debug monitor: {}; ignoring".format( sys.exc_info()[0]))

Hide Details

Hide Details

Executing tearDown hook: def shutdown_socket(): if sock: try: # send the kill packet so lldb-server shuts down gracefully sock.sendall(GdbRemoteTestCaseBase._GDBREMOTE_KILL_PACKET) except: logger.warning( "failed to send kill packet to debug monitor: {}; ignoring".format( sys.exc_info()[0]))

Hide Details

try: sock.close() except: logger.warning( "failed to close socket to debug monitor: {}; ignoring".format( sys.exc_info()[0]))

Hide Details

Hide Details

2020-08-13 03:08:03,903 WARNING failed to send kill packet to debug monitor: <class 'TypeError'>; ignoring Executing tearDown hook: def shutdown_named_pipe(): # Close the pipe. try: named_pipe.close() except: print("failed to close named pipe") None

Hide Details

# Delete the pipe. try: os.remove(named_pipe_path) except: print("failed to delete named pipe: {}".format(named_pipe_path)) None

Hide Details

# Delete the temp directory. try: os.rmdir(temp_dir) except: print( "failed to delete temp dir: {}, directory contents: '{}'".format( temp_dir, os.listdir(temp_dir))) None

Hide Details

Hide Details

PASS: LLDB (/Users/buildslave/jenkins/workspace/lldb-cmake-reproducers/lldb-build/bin/clang-x86_64) :: test_qRegisterInfo_contains_at_least_one_register_set_debugserver (TestLldbGdbServer.LldbGdbServerTestCase) runCmd: settings clear -all output:

Hide Details

runCmd: settings set symbols.enable-external-lookup false output:

Hide Details

runCmd: settings set target.inherit-tcc true output:

Hide Details

runCmd: settings set target.auto-apply-fixits false output:

Hide Details

runCmd: settings set plugin.process.gdb-remote.packet-timeout 60 output:

Hide Details

runCmd: settings set symbols.clang-modules-cache-path "/Users/buildslave/jenkins/workspace/lldb-cmake-reproducers/lldb-build/lldb-test-build.noindex/module-cache-lldb/lldb-api" output:

Hide Details

runCmd: settings set use-color false output:

Hide Details

runCmd: setting set target.prefer-dynamic-value no-dynamic-values output:

Hide Details

UNSUPPORTED: LLDB (/Users/buildslave/jenkins/workspace/lldb-cmake-reproducers/lldb-build/bin/clang-x86_64) :: test_qRegisterInfo_contains_at_least_one_register_set_llgs (TestLldbGdbServer.LldbGdbServerTestCase) (llgs tests) runCmd: settings clear -all output:

Hide Details

runCmd: settings set symbols.enable-external-lookup false output:

Hide Details

runCmd: settings set target.inherit-tcc true output:

Hide Details

runCmd: settings set target.auto-apply-fixits false output:

Hide Details

runCmd: settings set plugin.process.gdb-remote.packet-timeout 60 output:

Hide Details

runCmd: settings set symbols.clang-modules-cache-path "/Users/buildslave/jenkins/workspace/lldb-cmake-reproducers/lldb-build/lldb-test-build.noindex/module-cache-lldb/lldb-api" output:

Hide Details

runCmd: settings set use-color false output:

Hide Details

runCmd: setting set target.prefer-dynamic-value no-dynamic-values output:

Hide Details

UNSUPPORTED: LLDB (/Users/buildslave/jenkins/workspace/lldb-cmake-reproducers/lldb-build/bin/clang-x86_64) :: test_qRegisterInfo_contains_avx_registers_llgs (TestLldbGdbServer.LldbGdbServerTestCase) (llgs tests) runCmd: settings clear -all output:

Hide Details

runCmd: settings set symbols.enable-external-lookup false output:

Hide Details

runCmd: settings set target.inherit-tcc true output:

Hide Details

runCmd: settings set target.auto-apply-fixits false output:

Hide Details

runCmd: settings set plugin.process.gdb-remote.packet-timeout 60 output:

Hide Details

runCmd: settings set symbols.clang-modules-cache-path "/Users/buildslave/jenkins/workspace/lldb-cmake-reproducers/lldb-build/lldb-test-build.noindex/module-cache-lldb/lldb-api" output:

Hide Details

runCmd: settings set use-color false output:

Hide Details

runCmd: setting set target.prefer-dynamic-value no-dynamic-values output:

Hide Details

Adding tearDown hook: def shutdown_named_pipe(): # Close the pipe. try: named_pipe.close() except: print("failed to close named pipe") None

Hide Details

# Delete the pipe. try: os.remove(named_pipe_path) except: print("failed to delete named pipe: {}".format(named_pipe_path)) None

Hide Details

# Delete the temp directory. try: os.rmdir(temp_dir) except: print( "failed to delete temp dir: {}, directory contents: '{}'".format( temp_dir, os.listdir(temp_dir))) None

Hide Details

Hide Details

Adding tearDown hook: def shutdown_socket(): if sock: try: # send the kill packet so lldb-server shuts down gracefully sock.sendall(GdbRemoteTestCaseBase._GDBREMOTE_KILL_PACKET) except: logger.warning( "failed to send kill packet to debug monitor: {}; ignoring".format( sys.exc_info()[0]))

Hide Details

try: sock.close() except: logger.warning( "failed to close socket to debug monitor: {}; ignoring".format( sys.exc_info()[0]))

Hide Details

Hide Details

Executing tearDown hook: def shutdown_socket(): if sock: try: # send the kill packet so lldb-server shuts down gracefully sock.sendall(GdbRemoteTestCaseBase._GDBREMOTE_KILL_PACKET) except: logger.warning( "failed to send kill packet to debug monitor: {}; ignoring".format( sys.exc_info()[0]))

Hide Details

try: sock.close() except: logger.warning( "failed to close socket to debug monitor: {}; ignoring".format( sys.exc_info()[0]))

Hide Details

Hide Details

2020-08-13 03:08:06,051 WARNING failed to send kill packet to debug monitor: <class 'TypeError'>; ignoring Executing tearDown hook: def shutdown_named_pipe(): # Close the pipe. try: named_pipe.close() except: print("failed to close named pipe") None

Hide Details

# Delete the pipe. try: os.remove(named_pipe_path) except: print("failed to delete named pipe: {}".format(named_pipe_path)) None

Hide Details

# Delete the temp directory. try: os.rmdir(temp_dir) except: print( "failed to delete temp dir: {}, directory contents: '{}'".format( temp_dir, os.listdir(temp_dir))) None

Hide Details

Hide Details

PASS: LLDB (/Users/buildslave/jenkins/workspace/lldb-cmake-reproducers/lldb-build/bin/clang-x86_64) :: test_qRegisterInfo_contains_required_generics_debugserver (TestLldbGdbServer.LldbGdbServerTestCase) runCmd: settings clear -all output:

Hide Details

runCmd: settings set symbols.enable-external-lookup false output:

Hide Details

runCmd: settings set target.inherit-tcc true output:

Hide Details

runCmd: settings set target.auto-apply-fixits false output:

Hide Details

runCmd: settings set plugin.process.gdb-remote.packet-timeout 60 output:

Hide Details

runCmd: settings set symbols.clang-modules-cache-path "/Users/buildslave/jenkins/workspace/lldb-cmake-reproducers/lldb-build/lldb-test-build.noindex/module-cache-lldb/lldb-api" output:

Hide Details

runCmd: settings set use-color false output:

Hide Details

runCmd: setting set target.prefer-dynamic-value no-dynamic-values output:

Hide Details

UNSUPPORTED: LLDB (/Users/buildslave/jenkins/workspace/lldb-cmake-reproducers/lldb-build/bin/clang-x86_64) :: test_qRegisterInfo_contains_required_generics_llgs (TestLldbGdbServer.LldbGdbServerTestCase) (llgs tests) runCmd: settings clear -all output:

Hide Details

runCmd: settings set symbols.enable-external-lookup false output:

Hide Details

runCmd: settings set target.inherit-tcc true output:

Hide Details

runCmd: settings set target.auto-apply-fixits false output:

Hide Details

runCmd: settings set plugin.process.gdb-remote.packet-timeout 60 output:

Hide Details

runCmd: settings set symbols.clang-modules-cache-path "/Users/buildslave/jenkins/workspace/lldb-cmake-reproducers/lldb-build/lldb-test-build.noindex/module-cache-lldb/lldb-api" output:

Hide Details

runCmd: settings set use-color false output:

Hide Details

runCmd: setting set target.prefer-dynamic-value no-dynamic-values output:

Hide Details

Adding tearDown hook: def shutdown_named_pipe(): # Close the pipe. try: named_pipe.close() except: print("failed to close named pipe") None

Hide Details

# Delete the pipe. try: os.remove(named_pipe_path) except: print("failed to delete named pipe: {}".format(named_pipe_path)) None

Hide Details

# Delete the temp directory. try: os.rmdir(temp_dir) except: print( "failed to delete temp dir: {}, directory contents: '{}'".format( temp_dir, os.listdir(temp_dir))) None

Hide Details

Hide Details

Adding tearDown hook: def shutdown_socket(): if sock: try: # send the kill packet so lldb-server shuts down gracefully sock.sendall(GdbRemoteTestCaseBase._GDBREMOTE_KILL_PACKET) except: logger.warning( "failed to send kill packet to debug monitor: {}; ignoring".format( sys.exc_info()[0]))

Hide Details

try: sock.close() except: logger.warning( "failed to close socket to debug monitor: {}; ignoring".format( sys.exc_info()[0]))

Hide Details

Hide Details

Executing tearDown hook: def shutdown_socket(): if sock: try: # send the kill packet so lldb-server shuts down gracefully sock.sendall(GdbRemoteTestCaseBase._GDBREMOTE_KILL_PACKET) except: logger.warning( "failed to send kill packet to debug monitor: {}; ignoring".format( sys.exc_info()[0]))

Hide Details

try: sock.close() except: logger.warning( "failed to close socket to debug monitor: {}; ignoring".format( sys.exc_info()[0]))

Hide Details

Hide Details

2020-08-13 03:08:08,236 WARNING failed to send kill packet to debug monitor: <class 'TypeError'>; ignoring Executing tearDown hook: def shutdown_named_pipe(): # Close the pipe. try: named_pipe.close() except: print("failed to close named pipe") None

Hide Details

# Delete the pipe. try: os.remove(named_pipe_path) except: print("failed to delete named pipe: {}".format(named_pipe_path)) None

Hide Details

# Delete the temp directory. try: os.rmdir(temp_dir) except: print( "failed to delete temp dir: {}, directory contents: '{}'".format( temp_dir, os.listdir(temp_dir))) None

Hide Details

Hide Details

PASS: LLDB (/Users/buildslave/jenkins/workspace/lldb-cmake-reproducers/lldb-build/bin/clang-x86_64) :: test_qRegisterInfo_returns_all_valid_results_debugserver (TestLldbGdbServer.LldbGdbServerTestCase) runCmd: settings clear -all output:

Hide Details

runCmd: settings set symbols.enable-external-lookup false output:

Hide Details

runCmd: settings set target.inherit-tcc true output:

Hide Details

runCmd: settings set target.auto-apply-fixits false output:

Hide Details

runCmd: settings set plugin.process.gdb-remote.packet-timeout 60 output:

Hide Details

runCmd: settings set symbols.clang-modules-cache-path "/Users/buildslave/jenkins/workspace/lldb-cmake-reproducers/lldb-build/lldb-test-build.noindex/module-cache-lldb/lldb-api" output:

Hide Details

runCmd: settings set use-color false output:

Hide Details

runCmd: setting set target.prefer-dynamic-value no-dynamic-values output:

Hide Details

UNSUPPORTED: LLDB (/Users/buildslave/jenkins/workspace/lldb-cmake-reproducers/lldb-build/bin/clang-x86_64) :: test_qRegisterInfo_returns_all_valid_results_llgs (TestLldbGdbServer.LldbGdbServerTestCase) (llgs tests) runCmd: settings clear -all output:

Hide Details

runCmd: settings set symbols.enable-external-lookup false output:

Hide Details

runCmd: settings set target.inherit-tcc true output:

Hide Details

runCmd: settings set target.auto-apply-fixits false output:

Hide Details

runCmd: settings set plugin.process.gdb-remote.packet-timeout 60 output:

Hide Details

runCmd: settings set symbols.clang-modules-cache-path "/Users/buildslave/jenkins/workspace/lldb-cmake-reproducers/lldb-build/lldb-test-build.noindex/module-cache-lldb/lldb-api" output:

Hide Details

runCmd: settings set use-color false output:

Hide Details

runCmd: setting set target.prefer-dynamic-value no-dynamic-values output:

Hide Details

Adding tearDown hook: def shutdown_named_pipe(): # Close the pipe. try: named_pipe.close() except: print("failed to close named pipe") None

Hide Details

# Delete the pipe. try: os.remove(named_pipe_path) except: print("failed to delete named pipe: {}".format(named_pipe_path)) None

Hide Details

# Delete the temp directory. try: os.rmdir(temp_dir) except: print( "failed to delete temp dir: {}, directory contents: '{}'".format( temp_dir, os.listdir(temp_dir))) None

Hide Details

Hide Details

Adding tearDown hook: def shutdown_socket(): if sock: try: # send the kill packet so lldb-server shuts down gracefully sock.sendall(GdbRemoteTestCaseBase._GDBREMOTE_KILL_PACKET) except: logger.warning( "failed to send kill packet to debug monitor: {}; ignoring".format( sys.exc_info()[0]))

Hide Details

try: sock.close() except: logger.warning( "failed to close socket to debug monitor: {}; ignoring".format( sys.exc_info()[0]))

Hide Details

Hide Details

Executing tearDown hook: def shutdown_socket(): if sock: try: # send the kill packet so lldb-server shuts down gracefully sock.sendall(GdbRemoteTestCaseBase._GDBREMOTE_KILL_PACKET) except: logger.warning( "failed to send kill packet to debug monitor: {}; ignoring".format( sys.exc_info()[0]))

Hide Details

try: sock.close() except: logger.warning( "failed to close socket to debug monitor: {}; ignoring".format( sys.exc_info()[0]))

Hide Details

Hide Details

2020-08-13 03:08:10,314 WARNING failed to send kill packet to debug monitor: <class 'TypeError'>; ignoring Executing tearDown hook: def shutdown_named_pipe(): # Close the pipe. try: named_pipe.close() except: print("failed to close named pipe") None

Hide Details

# Delete the pipe. try: os.remove(named_pipe_path) except: print("failed to delete named pipe: {}".format(named_pipe_path)) None

Hide Details

# Delete the temp directory. try: os.rmdir(temp_dir) except: print( "failed to delete temp dir: {}, directory contents: '{}'".format( temp_dir, os.listdir(temp_dir))) None

Hide Details

Hide Details

PASS: LLDB (/Users/buildslave/jenkins/workspace/lldb-cmake-reproducers/lldb-build/bin/clang-x86_64) :: test_qRegisterInfo_returns_one_valid_result_debugserver (TestLldbGdbServer.LldbGdbServerTestCase) runCmd: settings clear -all output:

Hide Details

runCmd: settings set symbols.enable-external-lookup false output:

Hide Details

runCmd: settings set target.inherit-tcc true output:

Hide Details

runCmd: settings set target.auto-apply-fixits false output:

Hide Details

runCmd: settings set plugin.process.gdb-remote.packet-timeout 60 output:

Hide Details

runCmd: settings set symbols.clang-modules-cache-path "/Users/buildslave/jenkins/workspace/lldb-cmake-reproducers/lldb-build/lldb-test-build.noindex/module-cache-lldb/lldb-api" output:

Hide Details

runCmd: settings set use-color false output:

Hide Details

runCmd: setting set target.prefer-dynamic-value no-dynamic-values output:

Hide Details

UNSUPPORTED: LLDB (/Users/buildslave/jenkins/workspace/lldb-cmake-reproducers/lldb-build/bin/clang-x86_64) :: test_qRegisterInfo_returns_one_valid_result_llgs (TestLldbGdbServer.LldbGdbServerTestCase) (llgs tests) runCmd: settings clear -all output:

Hide Details

runCmd: settings set symbols.enable-external-lookup false output:

Hide Details

runCmd: settings set target.inherit-tcc true output:

Hide Details

runCmd: settings set target.auto-apply-fixits false output:

Hide Details

runCmd: settings set plugin.process.gdb-remote.packet-timeout 60 output:

Hide Details

runCmd: settings set symbols.clang-modules-cache-path "/Users/buildslave/jenkins/workspace/lldb-cmake-reproducers/lldb-build/lldb-test-build.noindex/module-cache-lldb/lldb-api" output:

Hide Details

runCmd: settings set use-color false output:

Hide Details

runCmd: setting set target.prefer-dynamic-value no-dynamic-values output:

Hide Details

Adding tearDown hook: def shutdown_named_pipe(): # Close the pipe. try: named_pipe.close() except: print("failed to close named pipe") None

Hide Details

# Delete the pipe. try: os.remove(named_pipe_path) except: print("failed to delete named pipe: {}".format(named_pipe_path)) None

Hide Details

# Delete the temp directory. try: os.rmdir(temp_dir) except: print( "failed to delete temp dir: {}, directory contents: '{}'".format( temp_dir, os.listdir(temp_dir))) None

Hide Details

Hide Details

Adding tearDown hook: def shutdown_socket(): if sock: try: # send the kill packet so lldb-server shuts down gracefully sock.sendall(GdbRemoteTestCaseBase._GDBREMOTE_KILL_PACKET) except: logger.warning( "failed to send kill packet to debug monitor: {}; ignoring".format( sys.exc_info()[0]))

Hide Details

try: sock.close() except: logger.warning( "failed to close socket to debug monitor: {}; ignoring".format( sys.exc_info()[0]))

Hide Details

Hide Details

Executing tearDown hook: def shutdown_socket(): if sock: try: # send the kill packet so lldb-server shuts down gracefully sock.sendall(GdbRemoteTestCaseBase._GDBREMOTE_KILL_PACKET) except: logger.warning( "failed to send kill packet to debug monitor: {}; ignoring".format( sys.exc_info()[0]))

Hide Details

try: sock.close() except: logger.warning( "failed to close socket to debug monitor: {}; ignoring".format( sys.exc_info()[0]))

Hide Details

Hide Details

2020-08-13 03:08:12,922 WARNING failed to send kill packet to debug monitor: <class 'TypeError'>; ignoring Executing tearDown hook: def shutdown_named_pipe(): # Close the pipe. try: named_pipe.close() except: print("failed to close named pipe") None

Hide Details

# Delete the pipe. try: os.remove(named_pipe_path) except: print("failed to delete named pipe: {}".format(named_pipe_path)) None

Hide Details

# Delete the temp directory. try: os.rmdir(temp_dir) except: print( "failed to delete temp dir: {}, directory contents: '{}'".format( temp_dir, os.listdir(temp_dir))) None

Hide Details

Hide Details

PASS: LLDB (/Users/buildslave/jenkins/workspace/lldb-cmake-reproducers/lldb-build/bin/clang-x86_64) :: test_qSupported_returns_known_stub_features_debugserver (TestLldbGdbServer.LldbGdbServerTestCase) runCmd: settings clear -all output:

Hide Details

runCmd: settings set symbols.enable-external-lookup false output:

Hide Details

runCmd: settings set target.inherit-tcc true output:

Hide Details

runCmd: settings set target.auto-apply-fixits false output:

Hide Details

runCmd: settings set plugin.process.gdb-remote.packet-timeout 60 output:

Hide Details

runCmd: settings set symbols.clang-modules-cache-path "/Users/buildslave/jenkins/workspace/lldb-cmake-reproducers/lldb-build/lldb-test-build.noindex/module-cache-lldb/lldb-api" output:

Hide Details

runCmd: settings set use-color false output:

Hide Details

runCmd: setting set target.prefer-dynamic-value no-dynamic-values output:

Hide Details

UNSUPPORTED: LLDB (/Users/buildslave/jenkins/workspace/lldb-cmake-reproducers/lldb-build/bin/clang-x86_64) :: test_qSupported_returns_known_stub_features_llgs (TestLldbGdbServer.LldbGdbServerTestCase) (llgs tests) runCmd: settings clear -all output:

Hide Details

runCmd: settings set symbols.enable-external-lookup false output:

Hide Details

runCmd: settings set target.inherit-tcc true output:

Hide Details

runCmd: settings set target.auto-apply-fixits false output:

Hide Details

runCmd: settings set plugin.process.gdb-remote.packet-timeout 60 output:

Hide Details

runCmd: settings set symbols.clang-modules-cache-path "/Users/buildslave/jenkins/workspace/lldb-cmake-reproducers/lldb-build/lldb-test-build.noindex/module-cache-lldb/lldb-api" output:

Hide Details

runCmd: settings set use-color false output:

Hide Details

runCmd: setting set target.prefer-dynamic-value no-dynamic-values output:

Hide Details

Adding tearDown hook: def shutdown_named_pipe(): # Close the pipe. try: named_pipe.close() except: print("failed to close named pipe") None

Hide Details

# Delete the pipe. try: os.remove(named_pipe_path) except: print("failed to delete named pipe: {}".format(named_pipe_path)) None

Hide Details

# Delete the temp directory. try: os.rmdir(temp_dir) except: print( "failed to delete temp dir: {}, directory contents: '{}'".format( temp_dir, os.listdir(temp_dir))) None

Hide Details

Hide Details

Adding tearDown hook: def shutdown_socket(): if sock: try: # send the kill packet so lldb-server shuts down gracefully sock.sendall(GdbRemoteTestCaseBase._GDBREMOTE_KILL_PACKET) except: logger.warning( "failed to send kill packet to debug monitor: {}; ignoring".format( sys.exc_info()[0]))

Hide Details

try: sock.close() except: logger.warning( "failed to close socket to debug monitor: {}; ignoring".format( sys.exc_info()[0]))

Hide Details

Hide Details

Executing tearDown hook: def shutdown_socket(): if sock: try: # send the kill packet so lldb-server shuts down gracefully sock.sendall(GdbRemoteTestCaseBase._GDBREMOTE_KILL_PACKET) except: logger.warning( "failed to send kill packet to debug monitor: {}; ignoring".format( sys.exc_info()[0]))

Hide Details

try: sock.close() except: logger.warning( "failed to close socket to debug monitor: {}; ignoring".format( sys.exc_info()[0]))

Hide Details

Hide Details

2020-08-13 03:08:15,255 WARNING failed to send kill packet to debug monitor: <class 'TypeError'>; ignoring Executing tearDown hook: def shutdown_named_pipe(): # Close the pipe. try: named_pipe.close() except: print("failed to close named pipe") None

Hide Details

# Delete the pipe. try: os.remove(named_pipe_path) except: print("failed to delete named pipe: {}".format(named_pipe_path)) None

Hide Details

# Delete the temp directory. try: os.rmdir(temp_dir) except: print( "failed to delete temp dir: {}, directory contents: '{}'".format( temp_dir, os.listdir(temp_dir))) None

Hide Details

Hide Details

PASS: LLDB (/Users/buildslave/jenkins/workspace/lldb-cmake-reproducers/lldb-build/bin/clang-x86_64) :: test_qThreadInfo_contains_thread_attach_debugserver (TestLldbGdbServer.LldbGdbServerTestCase) runCmd: settings clear -all output:

Hide Details

runCmd: settings set symbols.enable-external-lookup false output:

Hide Details

runCmd: settings set target.inherit-tcc true output:

Hide Details

runCmd: settings set target.auto-apply-fixits false output:

Hide Details

runCmd: settings set plugin.process.gdb-remote.packet-timeout 60 output:

Hide Details

runCmd: settings set symbols.clang-modules-cache-path "/Users/buildslave/jenkins/workspace/lldb-cmake-reproducers/lldb-build/lldb-test-build.noindex/module-cache-lldb/lldb-api" output:

Hide Details

runCmd: settings set use-color false output:

Hide Details

runCmd: setting set target.prefer-dynamic-value no-dynamic-values output:

Hide Details

UNSUPPORTED: LLDB (/Users/buildslave/jenkins/workspace/lldb-cmake-reproducers/lldb-build/bin/clang-x86_64) :: test_qThreadInfo_contains_thread_attach_llgs (TestLldbGdbServer.LldbGdbServerTestCase) (llgs tests) runCmd: settings clear -all output:

Hide Details

runCmd: settings set symbols.enable-external-lookup false output:

Hide Details

runCmd: settings set target.inherit-tcc true output:

Hide Details

runCmd: settings set target.auto-apply-fixits false output:

Hide Details

runCmd: settings set plugin.process.gdb-remote.packet-timeout 60 output:

Hide Details

runCmd: settings set symbols.clang-modules-cache-path "/Users/buildslave/jenkins/workspace/lldb-cmake-reproducers/lldb-build/lldb-test-build.noindex/module-cache-lldb/lldb-api" output:

Hide Details

runCmd: settings set use-color false output:

Hide Details

runCmd: setting set target.prefer-dynamic-value no-dynamic-values output:

Hide Details

Adding tearDown hook: def shutdown_named_pipe(): # Close the pipe. try: named_pipe.close() except: print("failed to close named pipe") None

Hide Details

# Delete the pipe. try: os.remove(named_pipe_path) except: print("failed to delete named pipe: {}".format(named_pipe_path)) None

Hide Details

# Delete the temp directory. try: os.rmdir(temp_dir) except: print( "failed to delete temp dir: {}, directory contents: '{}'".format( temp_dir, os.listdir(temp_dir))) None

Hide Details

Hide Details

Adding tearDown hook: def shutdown_socket(): if sock: try: # send the kill packet so lldb-server shuts down gracefully sock.sendall(GdbRemoteTestCaseBase._GDBREMOTE_KILL_PACKET) except: logger.warning( "failed to send kill packet to debug monitor: {}; ignoring".format( sys.exc_info()[0]))

Hide Details

try: sock.close() except: logger.warning( "failed to close socket to debug monitor: {}; ignoring".format( sys.exc_info()[0]))

Hide Details

Hide Details

Executing tearDown hook: def shutdown_socket(): if sock: try: # send the kill packet so lldb-server shuts down gracefully sock.sendall(GdbRemoteTestCaseBase._GDBREMOTE_KILL_PACKET) except: logger.warning( "failed to send kill packet to debug monitor: {}; ignoring".format( sys.exc_info()[0]))

Hide Details

try: sock.close() except: logger.warning( "failed to close socket to debug monitor: {}; ignoring".format( sys.exc_info()[0]))

Hide Details

Hide Details

2020-08-13 03:08:17,965 WARNING failed to send kill packet to debug monitor: <class 'TypeError'>; ignoring Executing tearDown hook: def shutdown_named_pipe(): # Close the pipe. try: named_pipe.close() except: print("failed to close named pipe") None

Hide Details

# Delete the pipe. try: os.remove(named_pipe_path) except: print("failed to delete named pipe: {}".format(named_pipe_path)) None

Hide Details

# Delete the temp directory. try: os.rmdir(temp_dir) except: print( "failed to delete temp dir: {}, directory contents: '{}'".format( temp_dir, os.listdir(temp_dir))) None

Hide Details

Hide Details

PASS: LLDB (/Users/buildslave/jenkins/workspace/lldb-cmake-reproducers/lldb-build/bin/clang-x86_64) :: test_qThreadInfo_contains_thread_launch_debugserver (TestLldbGdbServer.LldbGdbServerTestCase) runCmd: settings clear -all output:

Hide Details

runCmd: settings set symbols.enable-external-lookup false output:

Hide Details

runCmd: settings set target.inherit-tcc true output:

Hide Details

runCmd: settings set target.auto-apply-fixits false output:

Hide Details

runCmd: settings set plugin.process.gdb-remote.packet-timeout 60 output:

Hide Details

runCmd: settings set symbols.clang-modules-cache-path "/Users/buildslave/jenkins/workspace/lldb-cmake-reproducers/lldb-build/lldb-test-build.noindex/module-cache-lldb/lldb-api" output:

Hide Details

runCmd: settings set use-color false output:

Hide Details

runCmd: setting set target.prefer-dynamic-value no-dynamic-values output:

Hide Details

UNSUPPORTED: LLDB (/Users/buildslave/jenkins/workspace/lldb-cmake-reproducers/lldb-build/bin/clang-x86_64) :: test_qThreadInfo_contains_thread_launch_llgs (TestLldbGdbServer.LldbGdbServerTestCase) (llgs tests) runCmd: settings clear -all output:

Hide Details

runCmd: settings set symbols.enable-external-lookup false output:

Hide Details

runCmd: settings set target.inherit-tcc true output:

Hide Details

runCmd: settings set target.auto-apply-fixits false output:

Hide Details

runCmd: settings set plugin.process.gdb-remote.packet-timeout 60 output:

Hide Details

runCmd: settings set symbols.clang-modules-cache-path "/Users/buildslave/jenkins/workspace/lldb-cmake-reproducers/lldb-build/lldb-test-build.noindex/module-cache-lldb/lldb-api" output:

Hide Details

runCmd: settings set use-color false output:

Hide Details

runCmd: setting set target.prefer-dynamic-value no-dynamic-values output:

Hide Details

Adding tearDown hook: def shutdown_named_pipe(): # Close the pipe. try: named_pipe.close() except: print("failed to close named pipe") None

Hide Details

# Delete the pipe. try: os.remove(named_pipe_path) except: print("failed to delete named pipe: {}".format(named_pipe_path)) None

Hide Details

# Delete the temp directory. try: os.rmdir(temp_dir) except: print( "failed to delete temp dir: {}, directory contents: '{}'".format( temp_dir, os.listdir(temp_dir))) None

Hide Details

Hide Details

Adding tearDown hook: def shutdown_socket(): if sock: try: # send the kill packet so lldb-server shuts down gracefully sock.sendall(GdbRemoteTestCaseBase._GDBREMOTE_KILL_PACKET) except: logger.warning( "failed to send kill packet to debug monitor: {}; ignoring".format( sys.exc_info()[0]))

Hide Details

try: sock.close() except: logger.warning( "failed to close socket to debug monitor: {}; ignoring".format( sys.exc_info()[0]))

Hide Details

Hide Details

Executing tearDown hook: def shutdown_socket(): if sock: try: # send the kill packet so lldb-server shuts down gracefully sock.sendall(GdbRemoteTestCaseBase._GDBREMOTE_KILL_PACKET) except: logger.warning( "failed to send kill packet to debug monitor: {}; ignoring".format( sys.exc_info()[0]))

Hide Details

try: sock.close() except: logger.warning( "failed to close socket to debug monitor: {}; ignoring".format( sys.exc_info()[0]))

Hide Details

Hide Details

2020-08-13 03:08:20,502 WARNING failed to send kill packet to debug monitor: <class 'TypeError'>; ignoring Executing tearDown hook: def shutdown_named_pipe(): # Close the pipe. try: named_pipe.close() except: print("failed to close named pipe") None

Hide Details

# Delete the pipe. try: os.remove(named_pipe_path) except: print("failed to delete named pipe: {}".format(named_pipe_path)) None

Hide Details

# Delete the temp directory. try: os.rmdir(temp_dir) except: print( "failed to delete temp dir: {}, directory contents: '{}'".format( temp_dir, os.listdir(temp_dir))) None

Hide Details

Hide Details

PASS: LLDB (/Users/buildslave/jenkins/workspace/lldb-cmake-reproducers/lldb-build/bin/clang-x86_64) :: test_qThreadInfo_matches_qC_attach_debugserver (TestLldbGdbServer.LldbGdbServerTestCase) runCmd: settings clear -all output:

Hide Details

runCmd: settings set symbols.enable-external-lookup false output:

Hide Details

runCmd: settings set target.inherit-tcc true output:

Hide Details

runCmd: settings set target.auto-apply-fixits false output:

Hide Details

runCmd: settings set plugin.process.gdb-remote.packet-timeout 60 output:

Hide Details

runCmd: settings set symbols.clang-modules-cache-path "/Users/buildslave/jenkins/workspace/lldb-cmake-reproducers/lldb-build/lldb-test-build.noindex/module-cache-lldb/lldb-api" output:

Hide Details

runCmd: settings set use-color false output:

Hide Details

runCmd: setting set target.prefer-dynamic-value no-dynamic-values output:

Hide Details

UNSUPPORTED: LLDB (/Users/buildslave/jenkins/workspace/lldb-cmake-reproducers/lldb-build/bin/clang-x86_64) :: test_qThreadInfo_matches_qC_attach_llgs (TestLldbGdbServer.LldbGdbServerTestCase) (llgs tests) runCmd: settings clear -all output:

Hide Details

runCmd: settings set symbols.enable-external-lookup false output:

Hide Details

runCmd: settings set target.inherit-tcc true output:

Hide Details

runCmd: settings set target.auto-apply-fixits false output:

Hide Details

runCmd: settings set plugin.process.gdb-remote.packet-timeout 60 output:

Hide Details

runCmd: settings set symbols.clang-modules-cache-path "/Users/buildslave/jenkins/workspace/lldb-cmake-reproducers/lldb-build/lldb-test-build.noindex/module-cache-lldb/lldb-api" output:

Hide Details

runCmd: settings set use-color false output:

Hide Details

runCmd: setting set target.prefer-dynamic-value no-dynamic-values output:

Hide Details

Adding tearDown hook: def shutdown_named_pipe(): # Close the pipe. try: named_pipe.close() except: print("failed to close named pipe") None

Hide Details

# Delete the pipe. try: os.remove(named_pipe_path) except: print("failed to delete named pipe: {}".format(named_pipe_path)) None

Hide Details

# Delete the temp directory. try: os.rmdir(temp_dir) except: print( "failed to delete temp dir: {}, directory contents: '{}'".format( temp_dir, os.listdir(temp_dir))) None

Hide Details

Hide Details

Adding tearDown hook: def shutdown_socket(): if sock: try: # send the kill packet so lldb-server shuts down gracefully sock.sendall(GdbRemoteTestCaseBase._GDBREMOTE_KILL_PACKET) except: logger.warning( "failed to send kill packet to debug monitor: {}; ignoring".format( sys.exc_info()[0]))

Hide Details

try: sock.close() except: logger.warning( "failed to close socket to debug monitor: {}; ignoring".format( sys.exc_info()[0]))

Hide Details

Hide Details

Executing tearDown hook: def shutdown_socket(): if sock: try: # send the kill packet so lldb-server shuts down gracefully sock.sendall(GdbRemoteTestCaseBase._GDBREMOTE_KILL_PACKET) except: logger.warning( "failed to send kill packet to debug monitor: {}; ignoring".format( sys.exc_info()[0]))

Hide Details

try: sock.close() except: logger.warning( "failed to close socket to debug monitor: {}; ignoring".format( sys.exc_info()[0]))

Hide Details

Hide Details

2020-08-13 03:08:22,905 WARNING failed to send kill packet to debug monitor: <class 'TypeError'>; ignoring Executing tearDown hook: def shutdown_named_pipe(): # Close the pipe. try: named_pipe.close() except: print("failed to close named pipe") None

Hide Details

# Delete the pipe. try: os.remove(named_pipe_path) except: print("failed to delete named pipe: {}".format(named_pipe_path)) None

Hide Details

# Delete the temp directory. try: os.rmdir(temp_dir) except: print( "failed to delete temp dir: {}, directory contents: '{}'".format( temp_dir, os.listdir(temp_dir))) None

Hide Details

Hide Details

PASS: LLDB (/Users/buildslave/jenkins/workspace/lldb-cmake-reproducers/lldb-build/bin/clang-x86_64) :: test_qThreadInfo_matches_qC_launch_debugserver (TestLldbGdbServer.LldbGdbServerTestCase) runCmd: settings clear -all output:

Hide Details

runCmd: settings set symbols.enable-external-lookup false output:

Hide Details

runCmd: settings set target.inherit-tcc true output:

Hide Details

runCmd: settings set target.auto-apply-fixits false output:

Hide Details

runCmd: settings set plugin.process.gdb-remote.packet-timeout 60 output:

Hide Details

runCmd: settings set symbols.clang-modules-cache-path "/Users/buildslave/jenkins/workspace/lldb-cmake-reproducers/lldb-build/lldb-test-build.noindex/module-cache-lldb/lldb-api" output:

Hide Details

runCmd: settings set use-color false output:

Hide Details

runCmd: setting set target.prefer-dynamic-value no-dynamic-values output:

Hide Details

UNSUPPORTED: LLDB (/Users/buildslave/jenkins/workspace/lldb-cmake-reproducers/lldb-build/bin/clang-x86_64) :: test_qThreadInfo_matches_qC_launch_llgs (TestLldbGdbServer.LldbGdbServerTestCase) (llgs tests) runCmd: settings clear -all output:

Hide Details

runCmd: settings set symbols.enable-external-lookup false output:

Hide Details

runCmd: settings set target.inherit-tcc true output:

Hide Details

runCmd: settings set target.auto-apply-fixits false output:

Hide Details

runCmd: settings set plugin.process.gdb-remote.packet-timeout 60 output:

Hide Details

runCmd: settings set symbols.clang-modules-cache-path "/Users/buildslave/jenkins/workspace/lldb-cmake-reproducers/lldb-build/lldb-test-build.noindex/module-cache-lldb/lldb-api" output:

Hide Details

runCmd: settings set use-color false output:

Hide Details

runCmd: setting set target.prefer-dynamic-value no-dynamic-values output:

Hide Details

Adding tearDown hook: def shutdown_named_pipe(): # Close the pipe. try: named_pipe.close() except: print("failed to close named pipe") None

Hide Details

# Delete the pipe. try: os.remove(named_pipe_path) except: print("failed to delete named pipe: {}".format(named_pipe_path)) None

Hide Details

# Delete the temp directory. try: os.rmdir(temp_dir) except: print( "failed to delete temp dir: {}, directory contents: '{}'".format( temp_dir, os.listdir(temp_dir))) None

Hide Details

Hide Details

Adding tearDown hook: def shutdown_socket(): if sock: try: # send the kill packet so lldb-server shuts down gracefully sock.sendall(GdbRemoteTestCaseBase._GDBREMOTE_KILL_PACKET) except: logger.warning( "failed to send kill packet to debug monitor: {}; ignoring".format( sys.exc_info()[0]))

Hide Details

try: sock.close() except: logger.warning( "failed to close socket to debug monitor: {}; ignoring".format( sys.exc_info()[0]))

Hide Details

Hide Details

Executing tearDown hook: def shutdown_socket(): if sock: try: # send the kill packet so lldb-server shuts down gracefully sock.sendall(GdbRemoteTestCaseBase._GDBREMOTE_KILL_PACKET) except: logger.warning( "failed to send kill packet to debug monitor: {}; ignoring".format( sys.exc_info()[0]))

Hide Details

try: sock.close() except: logger.warning( "failed to close socket to debug monitor: {}; ignoring".format( sys.exc_info()[0]))

Hide Details

Hide Details

2020-08-13 03:08:26,363 WARNING failed to send kill packet to debug monitor: <class 'TypeError'>; ignoring Executing tearDown hook: def shutdown_named_pipe(): # Close the pipe. try: named_pipe.close() except: print("failed to close named pipe") None

Hide Details

# Delete the pipe. try: os.remove(named_pipe_path) except: print("failed to delete named pipe: {}".format(named_pipe_path)) None

Hide Details

# Delete the temp directory. try: os.rmdir(temp_dir) except: print( "failed to delete temp dir: {}, directory contents: '{}'".format( temp_dir, os.listdir(temp_dir))) None

Hide Details

Hide Details

PASS: LLDB (/Users/buildslave/jenkins/workspace/lldb-cmake-reproducers/lldb-build/bin/clang-x86_64) :: test_software_breakpoint_set_and_remove_work_debugserver (TestLldbGdbServer.LldbGdbServerTestCase) runCmd: settings clear -all output:

Hide Details

runCmd: settings set symbols.enable-external-lookup false output:

Hide Details

runCmd: settings set target.inherit-tcc true output:

Hide Details

runCmd: settings set target.auto-apply-fixits false output:

Hide Details

runCmd: settings set plugin.process.gdb-remote.packet-timeout 60 output:

Hide Details

runCmd: settings set symbols.clang-modules-cache-path "/Users/buildslave/jenkins/workspace/lldb-cmake-reproducers/lldb-build/lldb-test-build.noindex/module-cache-lldb/lldb-api" output:

Hide Details

runCmd: settings set use-color false output:

Hide Details

runCmd: setting set target.prefer-dynamic-value no-dynamic-values output:

Hide Details

UNSUPPORTED: LLDB (/Users/buildslave/jenkins/workspace/lldb-cmake-reproducers/lldb-build/bin/clang-x86_64) :: test_software_breakpoint_set_and_remove_work_llgs (TestLldbGdbServer.LldbGdbServerTestCase) (llgs tests) runCmd: settings clear -all output:

Hide Details

runCmd: settings set symbols.enable-external-lookup false output:

Hide Details

runCmd: settings set target.inherit-tcc true output:

Hide Details

runCmd: settings set target.auto-apply-fixits false output:

Hide Details

runCmd: settings set plugin.process.gdb-remote.packet-timeout 60 output:

Hide Details

runCmd: settings set symbols.clang-modules-cache-path "/Users/buildslave/jenkins/workspace/lldb-cmake-reproducers/lldb-build/lldb-test-build.noindex/module-cache-lldb/lldb-api" output:

Hide Details

runCmd: settings set use-color false output:

Hide Details

runCmd: setting set target.prefer-dynamic-value no-dynamic-values output:

Hide Details

Adding tearDown hook: def shutdown_named_pipe(): # Close the pipe. try: named_pipe.close() except: print("failed to close named pipe") None

Hide Details

# Delete the pipe. try: os.remove(named_pipe_path) except: print("failed to delete named pipe: {}".format(named_pipe_path)) None

Hide Details

# Delete the temp directory. try: os.rmdir(temp_dir) except: print( "failed to delete temp dir: {}, directory contents: '{}'".format( temp_dir, os.listdir(temp_dir))) None

Hide Details

Hide Details

Adding tearDown hook: def shutdown_socket(): if sock: try: # send the kill packet so lldb-server shuts down gracefully sock.sendall(GdbRemoteTestCaseBase._GDBREMOTE_KILL_PACKET) except: logger.warning( "failed to send kill packet to debug monitor: {}; ignoring".format( sys.exc_info()[0]))

Hide Details

try: sock.close() except: logger.warning( "failed to close socket to debug monitor: {}; ignoring".format( sys.exc_info()[0]))

Hide Details

Hide Details

Executing tearDown hook: def shutdown_socket(): if sock: try: # send the kill packet so lldb-server shuts down gracefully sock.sendall(GdbRemoteTestCaseBase._GDBREMOTE_KILL_PACKET) except: logger.warning( "failed to send kill packet to debug monitor: {}; ignoring".format( sys.exc_info()[0]))

Hide Details

try: sock.close() except: logger.warning( "failed to close socket to debug monitor: {}; ignoring".format( sys.exc_info()[0]))

Hide Details

Hide Details

2020-08-13 03:08:26,425 WARNING failed to send kill packet to debug monitor: <class 'TypeError'>; ignoring Executing tearDown hook: def shutdown_named_pipe(): # Close the pipe. try: named_pipe.close() except: print("failed to close named pipe") None

Hide Details

# Delete the pipe. try: os.remove(named_pipe_path) except: print("failed to delete named pipe: {}".format(named_pipe_path)) None

Hide Details

# Delete the temp directory. try: os.rmdir(temp_dir) except: print( "failed to delete temp dir: {}, directory contents: '{}'".format( temp_dir, os.listdir(temp_dir))) None

Hide Details

Hide Details

PASS: LLDB (/Users/buildslave/jenkins/workspace/lldb-cmake-reproducers/lldb-build/bin/clang-x86_64) :: test_start_no_ack_mode_debugserver (TestLldbGdbServer.LldbGdbServerTestCase) runCmd: settings clear -all output:

Hide Details

runCmd: settings set symbols.enable-external-lookup false output:

Hide Details

runCmd: settings set target.inherit-tcc true output:

Hide Details

runCmd: settings set target.auto-apply-fixits false output:

Hide Details

runCmd: settings set plugin.process.gdb-remote.packet-timeout 60 output:

Hide Details

runCmd: settings set symbols.clang-modules-cache-path "/Users/buildslave/jenkins/workspace/lldb-cmake-reproducers/lldb-build/lldb-test-build.noindex/module-cache-lldb/lldb-api" output:

Hide Details

runCmd: settings set use-color false output:

Hide Details

runCmd: setting set target.prefer-dynamic-value no-dynamic-values output:

Hide Details

UNSUPPORTED: LLDB (/Users/buildslave/jenkins/workspace/lldb-cmake-reproducers/lldb-build/bin/clang-x86_64) :: test_start_no_ack_mode_llgs (TestLldbGdbServer.LldbGdbServerTestCase) (llgs tests) runCmd: settings clear -all output:

Hide Details

runCmd: settings set symbols.enable-external-lookup false output:

Hide Details

runCmd: settings set target.inherit-tcc true output:

Hide Details

runCmd: settings set target.auto-apply-fixits false output:

Hide Details

runCmd: settings set plugin.process.gdb-remote.packet-timeout 60 output:

Hide Details

runCmd: settings set symbols.clang-modules-cache-path "/Users/buildslave/jenkins/workspace/lldb-cmake-reproducers/lldb-build/lldb-test-build.noindex/module-cache-lldb/lldb-api" output:

Hide Details

runCmd: settings set use-color false output:

Hide Details

runCmd: setting set target.prefer-dynamic-value no-dynamic-values output:

Hide Details

Adding tearDown hook: def shutdown_named_pipe(): # Close the pipe. try: named_pipe.close() except: print("failed to close named pipe") None

Hide Details

# Delete the pipe. try: os.remove(named_pipe_path) except: print("failed to delete named pipe: {}".format(named_pipe_path)) None

Hide Details

# Delete the temp directory. try: os.rmdir(temp_dir) except: print( "failed to delete temp dir: {}, directory contents: '{}'".format( temp_dir, os.listdir(temp_dir))) None

Hide Details

Hide Details

Adding tearDown hook: def shutdown_socket(): if sock: try: # send the kill packet so lldb-server shuts down gracefully sock.sendall(GdbRemoteTestCaseBase._GDBREMOTE_KILL_PACKET) except: logger.warning( "failed to send kill packet to debug monitor: {}; ignoring".format( sys.exc_info()[0]))

Hide Details

try: sock.close() except: logger.warning( "failed to close socket to debug monitor: {}; ignoring".format( sys.exc_info()[0]))

Hide Details

Hide Details

Executing tearDown hook: def shutdown_socket(): if sock: try: # send the kill packet so lldb-server shuts down gracefully sock.sendall(GdbRemoteTestCaseBase._GDBREMOTE_KILL_PACKET) except: logger.warning( "failed to send kill packet to debug monitor: {}; ignoring".format( sys.exc_info()[0]))

Hide Details

try: sock.close() except: logger.warning( "failed to close socket to debug monitor: {}; ignoring".format( sys.exc_info()[0]))

Hide Details

Hide Details

2020-08-13 03:08:26,491 WARNING failed to send kill packet to debug monitor: <class 'TypeError'>; ignoring Executing tearDown hook: def shutdown_named_pipe(): # Close the pipe. try: named_pipe.close() except: print("failed to close named pipe") None

Hide Details

# Delete the pipe. try: os.remove(named_pipe_path) except: print("failed to delete named pipe: {}".format(named_pipe_path)) None

Hide Details

# Delete the temp directory. try: os.rmdir(temp_dir) except: print( "failed to delete temp dir: {}, directory contents: '{}'".format( temp_dir, os.listdir(temp_dir))) None

Hide Details

Hide Details

PASS: LLDB (/Users/buildslave/jenkins/workspace/lldb-cmake-reproducers/lldb-build/bin/clang-x86_64) :: test_thread_suffix_supported_debugserver (TestLldbGdbServer.LldbGdbServerTestCase) runCmd: settings clear -all output:

Hide Details

runCmd: settings set symbols.enable-external-lookup false output:

Hide Details

runCmd: settings set target.inherit-tcc true output:

Hide Details

runCmd: settings set target.auto-apply-fixits false output:

Hide Details

runCmd: settings set plugin.process.gdb-remote.packet-timeout 60 output:

Hide Details

runCmd: settings set symbols.clang-modules-cache-path "/Users/buildslave/jenkins/workspace/lldb-cmake-reproducers/lldb-build/lldb-test-build.noindex/module-cache-lldb/lldb-api" output:

Hide Details

runCmd: settings set use-color false output:

Hide Details

runCmd: setting set target.prefer-dynamic-value no-dynamic-values output:

Hide Details

UNSUPPORTED: LLDB (/Users/buildslave/jenkins/workspace/lldb-cmake-reproducers/lldb-build/bin/clang-x86_64) :: test_thread_suffix_supported_llgs (TestLldbGdbServer.LldbGdbServerTestCase) (llgs tests) runCmd: settings clear -all output:

Hide Details

runCmd: settings set symbols.enable-external-lookup false output:

Hide Details

runCmd: settings set target.inherit-tcc true output:

Hide Details

runCmd: settings set target.auto-apply-fixits false output:

Hide Details

runCmd: settings set plugin.process.gdb-remote.packet-timeout 60 output:

Hide Details

runCmd: settings set symbols.clang-modules-cache-path "/Users/buildslave/jenkins/workspace/lldb-cmake-reproducers/lldb-build/lldb-test-build.noindex/module-cache-lldb/lldb-api" output:

Hide Details

runCmd: settings set use-color false output:

Hide Details

runCmd: setting set target.prefer-dynamic-value no-dynamic-values output:

Hide Details

Adding tearDown hook: def shutdown_named_pipe(): # Close the pipe. try: named_pipe.close() except: print("failed to close named pipe") None

Hide Details

# Delete the pipe. try: os.remove(named_pipe_path) except: print("failed to delete named pipe: {}".format(named_pipe_path)) None

Hide Details

# Delete the temp directory. try: os.rmdir(temp_dir) except: print( "failed to delete temp dir: {}, directory contents: '{}'".format( temp_dir, os.listdir(temp_dir))) None

Hide Details

Hide Details

Adding tearDown hook: def shutdown_socket(): if sock: try: # send the kill packet so lldb-server shuts down gracefully sock.sendall(GdbRemoteTestCaseBase._GDBREMOTE_KILL_PACKET) except: logger.warning( "failed to send kill packet to debug monitor: {}; ignoring".format( sys.exc_info()[0]))

Hide Details

try: sock.close() except: logger.warning( "failed to close socket to debug monitor: {}; ignoring".format( sys.exc_info()[0]))

Hide Details

Hide Details

Executing tearDown hook: def shutdown_socket(): if sock: try: # send the kill packet so lldb-server shuts down gracefully sock.sendall(GdbRemoteTestCaseBase._GDBREMOTE_KILL_PACKET) except: logger.warning( "failed to send kill packet to debug monitor: {}; ignoring".format( sys.exc_info()[0]))

Hide Details

try: sock.close() except: logger.warning( "failed to close socket to debug monitor: {}; ignoring".format( sys.exc_info()[0]))

Hide Details

Hide Details

2020-08-13 03:08:29,843 WARNING failed to send kill packet to debug monitor: <class 'TypeError'>; ignoring Executing tearDown hook: def shutdown_named_pipe(): # Close the pipe. try: named_pipe.close() except: print("failed to close named pipe") None

Hide Details

# Delete the pipe. try: os.remove(named_pipe_path) except: print("failed to delete named pipe: {}".format(named_pipe_path)) None

Hide Details

# Delete the temp directory. try: os.rmdir(temp_dir) except: print( "failed to delete temp dir: {}, directory contents: '{}'".format( temp_dir, os.listdir(temp_dir))) None

Hide Details

Hide Details

PASS: LLDB (/Users/buildslave/jenkins/workspace/lldb-cmake-reproducers/lldb-build/bin/clang-x86_64) :: test_written_M_content_reads_back_correctly_debugserver (TestLldbGdbServer.LldbGdbServerTestCase) runCmd: settings clear -all output:

Hide Details

runCmd: settings set symbols.enable-external-lookup false output:

Hide Details

runCmd: settings set target.inherit-tcc true output:

Hide Details

runCmd: settings set target.auto-apply-fixits false output:

Hide Details

runCmd: settings set plugin.process.gdb-remote.packet-timeout 60 output:

Hide Details

runCmd: settings set symbols.clang-modules-cache-path "/Users/buildslave/jenkins/workspace/lldb-cmake-reproducers/lldb-build/lldb-test-build.noindex/module-cache-lldb/lldb-api" output:

Hide Details

runCmd: settings set use-color false output:

Hide Details

runCmd: setting set target.prefer-dynamic-value no-dynamic-values output:

Hide Details

UNSUPPORTED: LLDB (/Users/buildslave/jenkins/workspace/lldb-cmake-reproducers/lldb-build/bin/clang-x86_64) :: test_written_M_content_reads_back_correctly_llgs (TestLldbGdbServer.LldbGdbServerTestCase) (llgs tests) Restore dir to: /Users/buildslave/jenkins/workspace/lldb-cmake-reproducers/lldb-build/tools/lldb/test ====================================================================== ERROR: test_Hg_switches_to_3_threads_launch_debugserver (TestLldbGdbServer.LldbGdbServerTestCase) ---------------------------------------------------------------------- Traceback (most recent call last): File "/Users/buildslave/jenkins/workspace/lldb-cmake-reproducers/llvm-project/lldb/packages/Python/lldbsuite/test/decorators.py", line 135, in wrapper return func(*args, **kwargs) File "/Users/buildslave/jenkins/workspace/lldb-cmake-reproducers/llvm-project/lldb/test/API/tools/lldb-server/TestLldbGdbServer.py", line 672, in test_Hg_switches_to_3_threads_launch_debugserver self.Hg_switches_to_3_threads() File "/Users/buildslave/jenkins/workspace/lldb-cmake-reproducers/llvm-project/lldb/test/API/tools/lldb-server/TestLldbGdbServer.py", line 645, in Hg_switches_to_3_threads threads = self.wait_for_thread_count(3) File "/Users/buildslave/jenkins/workspace/lldb-cmake-reproducers/llvm-project/lldb/packages/Python/lldbsuite/test/tools/lldb-server/gdbremote_testcase.py", line 874, in wait_for_thread_count self.DEFAULT_TIMEOUT, thread_count, actual_thread_count)) Exception: timed out after 10 seconds while waiting for theads: waiting for at least 3 threads, found 1 Config=x86_64-/Users/buildslave/jenkins/workspace/lldb-cmake-reproducers/lldb-build/bin/clang ---------------------------------------------------------------------- Ran 65 tests in 124.386s

Hide Details

RESULT: FAILED (29 passes, 0 failures, 1 errors, 34 skipped, 1 expected failures, 0 unexpected successes)

Hide Details

--

Hide Details

******************** PASS: lldb-api :: lang/c/stepping/TestThreadStepping.py (526 of 1208) UNSUPPORTED: lldb-shell :: SymbolFile/NativePDB/typedefs.cpp (527 of 1208) UNSUPPORTED: lldb-shell :: ScriptInterpreter/Lua/convenience_variables.test (528 of 1208) UNSUPPORTED: lldb-api :: functionalities/postmortem/netbsd-core/TestNetBSDCore.py (529 of 1208) PASS: lldb-api :: lang/cpp/member-and-local-vars-with-same-name/TestMembersAndLocalsWithSameName.py (530 of 1208) PASS: lldb-api :: functionalities/data-formatter/data-formatter-stl/libcxx/optional/TestDataFormatterLibcxxOptional.py (531 of 1208) PASS: lldb-api :: python_api/class_members/TestSBTypeClassMembers.py (532 of 1208) UNSUPPORTED: lldb-api :: lang/cpp/printf/TestPrintf.py (533 of 1208) PASS: lldb-shell :: ObjectFile/Breakpad/uuid-matching-mac.test (534 of 1208) PASS: lldb-shell :: ObjectFile/wasm/embedded-debug-sections.yaml (535 of 1208) PASS: lldb-shell :: SymbolFile/Breakpad/line-table-edgecases.test (536 of 1208) PASS: lldb-api :: functionalities/history/TestHistoryRecall.py (537 of 1208) PASS: lldb-api :: python_api/symbol-context/two-files/TestSymbolContextTwoFiles.py (538 of 1208) PASS: lldb-api :: lang/objc/objc-property/TestObjCProperty.py (539 of 1208) PASS: lldb-shell :: ObjectFile/ELF/section-types-edgecases.yaml (540 of 1208) PASS: lldb-api :: python_api/watchpoint/TestWatchpointIgnoreCount.py (541 of 1208) PASS: lldb-api :: python_api/target/TestTargetAPI.py (542 of 1208) PASS: lldb-api :: lang/objc/foundation/TestObjectDescriptionAPI.py (543 of 1208) PASS: lldb-api :: functionalities/load_unload/TestLoadUnload.py (544 of 1208) PASS: lldb-api :: python_api/sbenvironment/TestSBEnvironment.py (545 of 1208) PASS: lldb-api :: lang/cpp/type_lookup/TestCppTypeLookup.py (546 of 1208) PASS: lldb-api :: commands/register/register/register_command/TestRegisters.py (547 of 1208) PASS: lldb-api :: macosx/add-dsym/TestAddDsymMidExecutionCommand.py (548 of 1208) PASS: lldb-api :: commands/watchpoints/watchpoint_size/TestWatchpointSizes.py (549 of 1208) UNSUPPORTED: lldb-api :: lang/objc/objc-dynamic-value/TestObjCDynamicValue.py (550 of 1208) PASS: lldb-api :: functionalities/data-formatter/data-formatter-stl/libcxx/atomic/TestLibCxxAtomic.py (551 of 1208) PASS: lldb-api :: functionalities/thread/exit_during_step/TestExitDuringStep.py (552 of 1208) PASS: lldb-api :: commands/command/script/import/rdar-12586188/TestRdar12586188.py (553 of 1208) PASS: lldb-api :: lang/cpp/breakpoint_in_member_func_w_non_primitive_params/TestBreakpointInMemberFuncWNonPrimitiveParams.py (554 of 1208) PASS: lldb-shell :: ObjectFile/wasm/basic.yaml (555 of 1208) PASS: lldb-api :: commands/target/stop-hooks/TestStopHooks.py (556 of 1208) PASS: lldb-api :: lang/cpp/namespace/TestNamespaceLookup.py (557 of 1208) UNSUPPORTED: lldb-api :: macosx/macCatalystAppMacOSFramework/TestMacCatalystAppWithMacOSFramework.py (558 of 1208) PASS: lldb-shell :: SymbolFile/DWARF/debug_loclists-dwo.s (559 of 1208) UNSUPPORTED: lldb-shell :: SymbolFile/PDB/function-level-linking.test (560 of 1208) PASS: lldb-api :: functionalities/data-formatter/synthupdate/TestSyntheticFilterRecompute.py (561 of 1208) PASS: lldb-api :: functionalities/breakpoint/inlined_breakpoints/TestInlinedBreakpoints.py (562 of 1208) PASS: lldb-api :: commands/expression/save_jit_objects/TestSaveJITObjects.py (563 of 1208) PASS: lldb-api :: lang/objc/modules-non-objc-target/TestObjCModulesNonObjCTarget.py (564 of 1208) UNSUPPORTED: lldb-api :: commands/register/register/intel_xtended_registers/mpx_bound_violation/TestBoundViolation.py (565 of 1208) PASS: lldb-api :: iohandler/unicode/TestUnicode.py (566 of 1208) PASS: lldb-api :: lang/c/const_variables/TestConstVariables.py (567 of 1208) UNSUPPORTED: lldb-shell :: SymbolFile/PDB/function-nested-block.test (568 of 1208) PASS: lldb-api :: functionalities/thread/backtrace_limit/TestBacktraceLimit.py (569 of 1208) PASS: lldb-api :: functionalities/data-formatter/data-formatter-proper-plurals/TestFormattersOneIsSingular.py (570 of 1208) PASS: lldb-shell :: Quit/TestQuitExitCodeTooManyArgs.test (571 of 1208) UNSUPPORTED: lldb-api :: functionalities/data-formatter/data-formatter-stl/libstdcpp/list/TestDataFormatterStdList.py (572 of 1208) UNSUPPORTED: lldb-api :: functionalities/breakpoint/hardware_breakpoints/write_memory_with_hw_breakpoint/TestWriteMemoryWithHWBreakpoint.py (573 of 1208) PASS: lldb-api :: lang/c/register_variables/TestRegisterVariables.py (574 of 1208) PASS: lldb-shell :: Minidump/fb-dump.test (575 of 1208) PASS: lldb-shell :: SymbolFile/NativePDB/break-by-line.cpp (576 of 1208) PASS: lldb-shell :: ObjectFile/ELF/build-id-case.yaml (577 of 1208) PASS: lldb-api :: functionalities/breakpoint/breakpoint_command/TestBreakpointCommand.py (578 of 1208) PASS: lldb-api :: lang/objc/objc-optimized/TestObjcOptimized.py (579 of 1208) UNSUPPORTED: lldb-api :: commands/target/auto-install-main-executable/TestAutoInstallMainExecutable.py (580 of 1208) PASS: lldb-api :: lang/cpp/symbols/TestSymbols.py (581 of 1208) PASS: lldb-api :: functionalities/tsan/global_location/TestTsanGlobalLocation.py (582 of 1208) PASS: lldb-shell :: Host/TestCustomShell.test (583 of 1208) PASS: lldb-api :: functionalities/breakpoint/source_regexp/TestSourceRegexBreakpoints.py (584 of 1208) PASS: lldb-api :: functionalities/data-formatter/data-formatter-stl/libcxx/bitset/TestDataFormatterLibcxxBitset.py (585 of 1208) PASS: lldb-api :: commands/target/select/TestTargetSelect.py (586 of 1208) PASS: lldb-api :: functionalities/data-formatter/boolreference/TestFormattersBoolRefPtr.py (587 of 1208) UNSUPPORTED: lldb-shell :: ScriptInterpreter/Lua/independent_state.test (588 of 1208) UNSUPPORTED: lldb-api :: tools/lldb-server/TestGdbRemote_vContThreads.py (589 of 1208) UNSUPPORTED: lldb-api :: functionalities/thread/multi_break/TestMultipleBreakpoints.py (590 of 1208) UNSUPPORTED: lldb-api :: commands/expression/import-std-module/queue/TestQueueFromStdModule.py (591 of 1208) UNSUPPORTED: lldb-api :: python_api/disassemble-raw-data/TestDisassemble_VST1_64.py (592 of 1208) PASS: lldb-api :: functionalities/show_location/TestShowLocationDwarf5.py (593 of 1208) UNSUPPORTED: lldb-shell :: Watchpoint/netbsd-nouserdbregs.test (594 of 1208) PASS: lldb-api :: functionalities/breakpoint/breakpoint_conditions/TestBreakpointConditions.py (595 of 1208) PASS: lldb-shell :: ObjectFile/PECOFF/basic-info-arm.yaml (596 of 1208) PASS: lldb-api :: lang/c/array_types/TestArrayTypes.py (597 of 1208) PASS: lldb-api :: lang/cpp/thread_local/TestThreadLocal.py (598 of 1208) PASS: lldb-api :: python_api/thread/TestThreadAPI.py (599 of 1208) PASS: lldb-api :: commands/platform/basic/TestPlatformPython.py (600 of 1208) PASS: lldb-api :: python_api/watchpoint/watchlocation/TestSetWatchlocation.py (601 of 1208) UNSUPPORTED: lldb-shell :: Reproducer/TestDump.test (602 of 1208) PASS: lldb-shell :: SymbolFile/DWARF/debug-line-basic.s (603 of 1208) PASS: lldb-api :: types/TestFloatTypes.py (604 of 1208) PASS: lldb-api :: functionalities/thread/exit_during_break/TestExitDuringBreak.py (605 of 1208) PASS: lldb-api :: functionalities/postmortem/elf-core/TestLinuxCore.py (606 of 1208) UNSUPPORTED: lldb-shell :: Reproducer/TestDriverOptions.test (607 of 1208) PASS: lldb-shell :: SymbolFile/DWARF/dir-separator-posix.s (608 of 1208) PASS: lldb-api :: functionalities/data-formatter/data-formatter-script/TestDataFormatterScript.py (609 of 1208) PASS: lldb-api :: functionalities/thread/concurrent_events/TestConcurrentCrashWithWatchpointBreakpointSignal.py (610 of 1208) UNSUPPORTED: lldb-shell :: SymbolFile/DWARF/debug_loc.s (611 of 1208) PASS: lldb-api :: tools/lldb-server/TestGdbRemoteHostInfo.py (612 of 1208) UNSUPPORTED: lldb-shell :: ScriptInterpreter/Python/scripted_breakpoint.test (613 of 1208) UNSUPPORTED: lldb-api :: tools/lldb-server/registers-target-xml-reading/TestGdbRemoteTargetXmlPacket.py (614 of 1208) PASS: lldb-api :: functionalities/data-formatter/parray/TestPrintArray.py (615 of 1208) PASS: lldb-shell :: Breakpoint/single-file-split-dwarf.test (616 of 1208) UNSUPPORTED: lldb-api :: lang/objc/modules/TestObjCModules.py (617 of 1208) UNSUPPORTED: lldb-api :: commands/expression/import-std-module/weak_ptr-dbg-info-content/TestDbgInfoContentWeakPtrFromStdModule.py (618 of 1208) UNSUPPORTED: lldb-shell :: Reproducer/TestFileRepro.test (619 of 1208) PASS: lldb-api :: commands/settings/TestSettings.py (620 of 1208) PASS: lldb-api :: lang/objc/foundation/TestObjCMethodsNSError.py (621 of 1208) UNSUPPORTED: lldb-shell :: Unwind/eh-frame-augment-noop.test (622 of 1208) PASS: lldb-api :: lang/cpp/class_static/TestStaticVariables.py (623 of 1208) PASS: lldb-api :: commands/thread/select/TestThreadSelect.py (624 of 1208) PASS: lldb-api :: lang/objc/rdar-11355592/TestRdar11355592.py (625 of 1208) PASS: lldb-api :: functionalities/unwind/sigtramp/TestSigtrampUnwind.py (626 of 1208) UNSUPPORTED: lldb-shell :: SymbolFile/DWARF/debug-types-expressions.test (627 of 1208) PASS: lldb-api :: lang/cpp/typedef/TestCppTypedef.py (628 of 1208) PASS: lldb-api :: functionalities/thread/concurrent_events/TestConcurrentSignalBreak.py (629 of 1208) PASS: lldb-api :: python_api/watchpoint/TestSetWatchpoint.py (630 of 1208) PASS: lldb-shell :: Minidump/no-process-id.yaml (631 of 1208) PASS: lldb-api :: functionalities/data-formatter/poarray/TestPrintObjectArray.py (632 of 1208) PASS: lldb-api :: functionalities/thread/concurrent_events/TestConcurrentTwoBreakpointThreads.py (633 of 1208) UNSUPPORTED: lldb-shell :: SymbolFile/PDB/calling-conventions.test (634 of 1208) UNSUPPORTED: lldb-shell :: Quit/TestQuitExitCode-30.test (635 of 1208) PASS: lldb-api :: driver/batch_mode/TestBatchMode.py (636 of 1208) PASS: lldb-api :: functionalities/data-formatter/data-formatter-objc/TestDataFormatterObjCKVO.py (637 of 1208) PASS: lldb-api :: lang/cpp/class_types/TestClassTypesDisassembly.py (638 of 1208) PASS: lldb-api :: commands/log/invalid-args/TestInvalidArgsLog.py (639 of 1208) UNSUPPORTED: lldb-api :: commands/expression/import-std-module/deque-dbg-info-content/TestDbgInfoContentDequeFromStdModule.py (640 of 1208) PASS: lldb-shell :: SymbolFile/Breakpad/unwind-via-stack-cfi.test (641 of 1208) PASS: lldb-api :: functionalities/data-formatter/user-format-vs-summary/TestUserFormatVsSummary.py (642 of 1208) PASS: lldb-api :: functionalities/data-formatter/data-formatter-python-synth/TestDataFormatterPythonSynth.py (643 of 1208) PASS: lldb-api :: lang/objc/self/TestObjCSelf.py (644 of 1208) PASS: lldb-shell :: Breakpoint/dummy-target.test (645 of 1208) PASS: lldb-shell :: SymbolFile/DWARF/find-function-regex.cpp (646 of 1208) PASS: lldb-api :: commands/watchpoints/step_over_watchpoint/TestStepOverWatchpoint.py (647 of 1208) PASS: lldb-api :: functionalities/breakpoint/address_breakpoints/TestBadAddressBreakpoints.py (648 of 1208) PASS: lldb-api :: functionalities/memory/cache/TestMemoryCache.py (649 of 1208) PASS: lldb-api :: commands/platform/file/close/TestPlatformFileClose.py (650 of 1208) PASS: lldb-api :: lang/objc/modules-compile-error/TestModulesCompileError.py (651 of 1208) UNSUPPORTED: lldb-api :: arm/breakpoint-thumb-codesection/TestBreakpointThumbCodesection.py (652 of 1208) UNSUPPORTED: lldb-api :: commands/expression/import-std-module/no-std-module/TestMissingStdModule.py (653 of 1208) PASS: lldb-api :: commands/frame/select/TestFrameSelect.py (654 of 1208) PASS: lldb-shell :: SymbolFile/Breakpad/line-table-discontinuous-file-ids.test (655 of 1208) PASS: lldb-shell :: BuildScript/compiler-full-path.test (656 of 1208) PASS: lldb-api :: commands/frame/var/TestFrameVar.py (657 of 1208) PASS: lldb-api :: python_api/sbplatform/TestSBPlatform.py (658 of 1208) PASS: lldb-api :: lang/objc/foundation/TestObjCMethodsString.py (659 of 1208) UNSUPPORTED: lldb-api :: benchmarks/libcxxlist/TestBenchmarkLibcxxList.py (660 of 1208) UNSUPPORTED: lldb-shell :: Register/x86-64-zmm-read.test (661 of 1208) PASS: lldb-api :: lang/c/local_variables/TestLocalVariables.py (662 of 1208) UNSUPPORTED: lldb-shell :: Register/arm-gp-read.test (663 of 1208) PASS: lldb-api :: functionalities/data-formatter/data-formatter-synthval/TestDataFormatterSynthVal.py (664 of 1208) PASS: lldb-api :: lang/objc/real-definition/TestRealDefinition.py (665 of 1208) UNSUPPORTED: lldb-api :: functionalities/data-formatter/data-formatter-stl/libstdcpp/unique_ptr/TestDataFormatterStdUniquePtr.py (666 of 1208) UNSUPPORTED: lldb-shell :: Reproducer/TestProcessList.test (667 of 1208) UNSUPPORTED: lldb-shell :: SymbolFile/PDB/class-layout.test (668 of 1208) PASS: lldb-api :: commands/watchpoints/watchpoint_count/TestWatchpointCount.py (669 of 1208) PASS: lldb-api :: lang/c/blocks/TestBlocks.py (670 of 1208) PASS: lldb-shell :: Minidump/memory-region-from-module.yaml (671 of 1208) PASS: lldb-shell :: SymbolFile/symbol-binding.test (672 of 1208) PASS: lldb-api :: lang/cpp/multiple-inheritance/TestCppMultipleInheritance.py (673 of 1208) PASS: lldb-api :: macosx/find-dsym/bundle-with-dot-in-filename/TestBundleWithDotInFilename.py (674 of 1208) PASS: lldb-api :: functionalities/data-formatter/data-formatter-objc/TestDataFormatterObjNSException.py (675 of 1208) PASS: lldb-api :: functionalities/thread/concurrent_events/TestConcurrentNWatchNBreak.py (676 of 1208) PASS: lldb-shell :: Breakpoint/ppc64-localentry.test (677 of 1208) PASS: lldb-api :: python_api/type/TestTypeList.py (678 of 1208) PASS: lldb-api :: lang/cpp/unique-types/TestUniqueTypes.py (679 of 1208) PASS: lldb-api :: functionalities/ptr_refs/TestPtrRefs.py (680 of 1208) PASS: lldb-api :: functionalities/thread/concurrent_events/TestConcurrentBreakpointDelayBreakpointOneSignal.py (681 of 1208) PASS: lldb-api :: commands/expression/argument_passing_restrictions/TestArgumentPassingRestrictions.py (682 of 1208) PASS: lldb-api :: functionalities/breakpoint/breakpoint_options/TestBreakpointOptions.py (683 of 1208) PASS: lldb-api :: functionalities/data-formatter/data-formatter-objc/TestDataFormatterObjCNSBundle.py (684 of 1208) PASS: lldb-api :: api/command-return-object/TestSBCommandReturnObject.py (685 of 1208) PASS: lldb-shell :: SymbolFile/DWARF/compilercontext.ll (686 of 1208) PASS: lldb-api :: tools/lldb-server/commandline/TestStubReverseConnect.py (687 of 1208) UNSUPPORTED: lldb-shell :: Reproducer/TestCrash.test (688 of 1208) PASS: lldb-api :: functionalities/data-formatter/dump_dynamic/TestDumpDynamic.py (689 of 1208) PASS: lldb-shell :: SymbolFile/NativePDB/bitfields.cpp (690 of 1208) PASS: lldb-shell :: Minidump/Windows/Sigsegv/sigsegv.test (691 of 1208) PASS: lldb-api :: python_api/frame/inlines/TestInlinedFrame.py (692 of 1208) PASS: lldb-api :: commands/version/TestVersion.py (693 of 1208) PASS: lldb-shell :: SymbolFile/DWARF/dir-separator-windows.s (694 of 1208) PASS: lldb-api :: functionalities/optimized_code/TestNoASanExceptionAfterEvalOP_piece.py (695 of 1208) PASS: lldb-shell :: SymbolFile/DWARF/dwarf5-index-is-used.cpp (696 of 1208) UNSUPPORTED: lldb-api :: benchmarks/stepping/TestSteppingSpeed.py (697 of 1208) PASS: lldb-api :: lang/cpp/subst_template_type_param/TestSubstTemplateTypeParam.py (698 of 1208) UNSUPPORTED: lldb-shell :: ScriptInterpreter/Lua/persistent_state.test (699 of 1208) PASS: lldb-api :: python_api/value/TestValueAPI.py (700 of 1208) PASS: lldb-shell :: Settings/TestModuleCacheSanity.test (701 of 1208) PASS: lldb-api :: source-manager/TestSourceManager.py (702 of 1208) PASS: lldb-api :: functionalities/thread/concurrent_events/TestConcurrentCrashWithWatchpoint.py (703 of 1208) PASS: lldb-api :: lang/cpp/gmodules-templates/TestGModules.py (704 of 1208) PASS: lldb-api :: functionalities/data-formatter/data-formatter-objc/TestDataFormatterObjCNSError.py (705 of 1208) UNSUPPORTED: lldb-api :: commands/register/register/intel_xtended_registers/mpx_offset_intersection/TestMPXOffsetIntersection.py (706 of 1208) PASS: lldb-api :: functionalities/data-formatter/data-formatter-objc/TestDataFormatterObjCCF.py (707 of 1208) PASS: lldb-api :: lang/cpp/stl/TestSTL.py (708 of 1208) UNSUPPORTED: lldb-api :: benchmarks/startup/TestStartupDelays.py (709 of 1208) PASS: lldb-api :: lang/cpp/scope/TestCppScope.py (710 of 1208) PASS: lldb-api :: functionalities/breakpoint/cpp_exception/TestCPPExceptionBreakpoint.py (711 of 1208) PASS: lldb-api :: functionalities/mtc/simple/TestMTCSimple.py (712 of 1208) UNSUPPORTED: lldb-shell :: ScriptInterpreter/Lua/breakpoint_callback.test (713 of 1208) PASS: lldb-api :: functionalities/type_lookup/TestTypeLookup.py (714 of 1208) PASS: lldb-shell :: SymbolFile/DWARF/DW_TAG_basic_type_DW_ATE_UTF_nonC.ll (715 of 1208) PASS: lldb-api :: lang/objc/modules-hash-mismatch/TestClangModulesHashMismatch.py (716 of 1208) PASS: lldb-api :: commands/expression/call-function/TestCallUserDefinedFunction.py (717 of 1208) UNSUPPORTED: lldb-api :: tools/lldb-server/TestGdbRemoteAuxvSupport.py (718 of 1208) PASS: lldb-shell :: SymbolFile/NativePDB/globals-fundamental.cpp (719 of 1208) PASS: lldb-api :: commands/platform/process/list/TestProcessList.py (720 of 1208) UNSUPPORTED: lldb-shell :: SymbolFile/PDB/type-quals.test (721 of 1208) PASS: lldb-api :: lang/cpp/breakpoint-commands/TestCPPBreakpointCommands.py (722 of 1208) PASS: lldb-api :: python_api/watchpoint/watchlocation/TestTargetWatchAddress.py (723 of 1208) PASS: lldb-shell :: ObjectFile/PECOFF/sections-names.yaml (724 of 1208) UNSUPPORTED: lldb-shell :: Driver/TestRepl.test (725 of 1208) PASS: lldb-api :: terminal/TestSTTYBeforeAndAfter.py (726 of 1208) PASS: lldb-api :: macosx/queues/TestQueues.py (727 of 1208) PASS: lldb-shell :: ObjectFile/Breakpad/sections-trailing-func.test (728 of 1208) PASS: lldb-api :: commands/process/attach/TestProcessAttach.py (729 of 1208) PASS: lldb-api :: commands/expression/top-level/TestTopLevelExprs.py (730 of 1208) UNSUPPORTED: lldb-shell :: SymbolFile/target-symbols-add-unwind.test (731 of 1208) UNSUPPORTED: lldb-api :: functionalities/data-formatter/data-formatter-stl/libstdcpp/iterator/TestDataFormatterStdIterator.py (732 of 1208) UNSUPPORTED: lldb-shell :: SymbolFile/DWARF/split-dwarf-expression-eval-bug.cpp (733 of 1208) PASS: lldb-shell :: SymbolFile/DWARF/clang-ast-from-dwarf-unamed-and-anon-structs.cpp (734 of 1208) PASS: lldb-api :: functionalities/data-formatter/data-formatter-stl/libcxx/vbool/TestDataFormatterLibcxxVBool.py (735 of 1208) PASS: lldb-api :: lang/cpp/operator-overload/TestOperatorOverload.py (736 of 1208) PASS: lldb-api :: lang/objc/objc-baseclass-sbtype/TestObjCBaseClassSBType.py (737 of 1208) UNSUPPORTED: lldb-api :: lang/cpp/function-template-parameter-pack/TestFunctionTemplateParameterPack.py (738 of 1208) PASS: lldb-api :: lang/cpp/operators/TestCppOperators.py (739 of 1208) PASS: lldb-api :: api/check_public_api_headers/TestPublicAPIHeaders.py (740 of 1208) PASS: lldb-api :: commands/watchpoints/multiple_threads/TestWatchpointMultipleThreads.py (741 of 1208) PASS: lldb-api :: python_api/function_symbol/TestDisasmAPI.py (742 of 1208) PASS: lldb-shell :: SymbolFile/DWARF/anon_class_w_and_wo_export_symbols.ll (743 of 1208) UNSUPPORTED: lldb-api :: functionalities/process_save_core/TestProcessSaveCore.py (744 of 1208) UNSUPPORTED: lldb-api :: functionalities/darwin_log/filter/exact_match/category/TestDarwinLogFilterMatchCategory.py (745 of 1208) PASS: lldb-shell :: Driver/TestCommands.test (746 of 1208) PASS: lldb-api :: functionalities/data-formatter/data-formatter-advanced/TestDataFormatterAdv.py (747 of 1208) PASS: lldb-api :: functionalities/breakpoint/breakpoint_callback_command_source/TestBreakpointCallbackCommandSource.py (748 of 1208) PASS: lldb-api :: commands/session/history/TestSessionHistory.py (749 of 1208) PASS: lldb-api :: commands/expression/ir-interpreter/TestIRInterpreter.py (750 of 1208) PASS: lldb-shell :: SymbolFile/DWARF/debug_ranges_and_rnglists.test (751 of 1208) UNSUPPORTED: lldb-shell :: Reproducer/Modules/TestModuleCXX.test (752 of 1208) PASS: lldb-api :: lang/cpp/inlines/TestInlines.py (753 of 1208) PASS: lldb-api :: lang/c/anonymous/TestAnonymous.py (754 of 1208) PASS: lldb-api :: python_api/sbstructureddata/TestStructuredDataAPI.py (755 of 1208) UNSUPPORTED: lldb-shell :: Register/aarch64-fp-read.test (756 of 1208) PASS: lldb-api :: functionalities/data-formatter/varscript_formatting/TestDataFormatterVarScriptFormatting.py (757 of 1208) UNSUPPORTED: lldb-api :: functionalities/thread/break_after_join/TestBreakAfterJoin.py (758 of 1208) PASS: lldb-shell :: SymbolFile/DWARF/debug-types-basic.test (759 of 1208) PASS: lldb-api :: lang/objc/global_ptrs/TestGlobalObjects.py (760 of 1208) PASS: lldb-api :: commands/apropos/basic/TestApropos.py (761 of 1208) PASS: lldb-shell :: SymbolFile/NativePDB/source-list.cpp (762 of 1208) PASS: lldb-api :: commands/expression/function_template_specialization_temp_args/TestFunctionTemplateSpecializationTempArgs.py (763 of 1208) PASS: lldb-api :: functionalities/thread/concurrent_events/TestConcurrentWatchBreak.py (764 of 1208) PASS: lldb-api :: functionalities/breakpoint/breakpoint_by_file_colon_line/TestBreakpointByFileColonLine.py (765 of 1208) UNSUPPORTED: lldb-shell :: Register/x86-64-xmm16-write.test (766 of 1208) PASS: lldb-shell :: ObjectFile/MachO/lc_build_version.yaml (767 of 1208) PASS: lldb-api :: commands/expression/rdar42038760/TestScalarURem.py (768 of 1208) PASS: lldb-shell :: SymbolFile/Breakpad/stack-cfi-parsing.test (769 of 1208) UNSUPPORTED: lldb-api :: functionalities/longjmp/TestLongjmp.py (770 of 1208) PASS: lldb-api :: commands/expression/context-object-objc/TestContextObjectObjc.py (771 of 1208) PASS: lldb-api :: functionalities/data-formatter/vector-types/TestVectorTypesFormatting.py (772 of 1208) PASS: lldb-api :: functionalities/breakpoint/hardware_breakpoints/require_hw_breakpoints/TestRequireHWBreakpoints.py (773 of 1208) PASS: lldb-api :: functionalities/multidebugger_commands/TestMultipleDebuggersCommands.py (774 of 1208) PASS: lldb-api :: python_api/breakpoint/TestBreakpointAPI.py (775 of 1208) PASS: lldb-api :: functionalities/thread/concurrent_events/TestConcurrentDelaySignalWatch.py (776 of 1208) PASS: lldb-shell :: SymbolFile/DWARF/find-basic-function.cpp (777 of 1208) PASS: lldb-shell :: Minidump/Windows/find-module.test (778 of 1208) PASS: lldb-api :: functionalities/gdb_remote_client/TestArmRegisterDefinition.py (779 of 1208) PASS: lldb-api :: lang/c/struct_types/TestStructTypes.py (780 of 1208) PASS: lldb-api :: functionalities/tail_call_frames/sbapi_support/TestTailCallFrameSBAPI.py (781 of 1208) UNSUPPORTED: lldb-api :: commands/expression/import-std-module/weak_ptr/TestWeakPtrFromStdModule.py (782 of 1208) PASS: lldb-api :: python_api/value_var_update/TestValueVarUpdate.py (783 of 1208) UNSUPPORTED: lldb-shell :: ObjectFile/ELF/minidebuginfo-set-and-hit-breakpoint.test (784 of 1208) PASS: lldb-shell :: Commands/CommandScriptImmediateOutput/CommandScriptImmediateOutputConsole.test (785 of 1208) PASS: lldb-api :: functionalities/asan/TestReportData.py (786 of 1208) PASS: lldb-shell :: ScriptInterpreter/None/none.test (787 of 1208) UNSUPPORTED: lldb-api :: functionalities/darwin_log/format/TestDarwinLogMessageFormat.py (788 of 1208) PASS: lldb-shell :: SymbolFile/DWARF/debug-types-line-tables.s (789 of 1208) PASS: lldb-api :: commands/expression/persistent_variables/TestPersistentVariables.py (790 of 1208) PASS: lldb-api :: commands/expression/ignore-artificial-constructors/TestIgnoreArtificialConstructors.py (791 of 1208) PASS: lldb-api :: commands/expression/dollar-in-variable/TestDollarInVariable.py (792 of 1208) PASS: lldb-shell :: SymbolFile/NativePDB/function-types-classes.cpp (793 of 1208) PASS: lldb-api :: python_api/lldbutil/process/TestPrintStackTraces.py (794 of 1208) PASS: lldb-api :: functionalities/float-display/TestFloatDisplay.py (795 of 1208) PASS: lldb-api :: lang/objc/foundation/TestFoundationDisassembly.py (796 of 1208) PASS: lldb-api :: lang/cpp/signed_types/TestSignedTypes.py (797 of 1208) UNSUPPORTED: lldb-api :: functionalities/darwin_log/source/debug/TestDarwinLogSourceDebug.py (798 of 1208) PASS: lldb-shell :: SymbolFile/NativePDB/s_constant.cpp (799 of 1208) UNSUPPORTED: lldb-shell :: Reproducer/TestGDBRemoteRepro.test (800 of 1208) UNSUPPORTED: lldb-shell :: SymbolFile/PDB/variables.test (801 of 1208) PASS: lldb-api :: lang/cpp/namespace_definitions/TestNamespaceDefinitions.py (802 of 1208) PASS: lldb-api :: commands/expression/context-object/TestContextObject.py (803 of 1208) PASS: lldb-api :: lang/objc/objc-stepping/TestObjCStepping.py (804 of 1208) PASS: lldb-api :: commands/breakpoint/command/list/TestBreakpointCommandList.py (805 of 1208) PASS: lldb-api :: tools/lldb-server/TestGdbRemote_vCont.py (806 of 1208) PASS: lldb-api :: functionalities/data-formatter/nssetsynth/TestNSSetSynthetic.py (807 of 1208) UNSUPPORTED: lldb-shell :: Breakpoint/case-insensitive.test (808 of 1208) PASS: lldb-api :: lang/cpp/constructors/TestCppConstructors.py (809 of 1208) PASS: lldb-api :: python_api/module_section/TestModuleAndSection.py (810 of 1208) UNSUPPORTED: lldb-api :: functionalities/data-formatter/data-formatter-stl/libstdcpp/smart_ptr/TestDataFormatterStdSmartPtr.py (811 of 1208) PASS: lldb-api :: functionalities/thread/create_after_attach/TestCreateAfterAttach.py (812 of 1208) PASS: lldb-api :: functionalities/data-formatter/data-formatter-cpp/TestDataFormatterCpp.py (813 of 1208) PASS: lldb-api :: functionalities/return-value/TestReturnValue.py (814 of 1208) PASS: lldb-api :: python_api/findvalue_duplist/TestSBFrameFindValue.py (815 of 1208) PASS: lldb-shell :: ObjectFile/ELF/section-addresses.yaml (816 of 1208) PASS: lldb-api :: commands/help/TestHelp.py (817 of 1208) PASS: lldb-shell :: SymbolFile/DWARF/find-inline-method.s (818 of 1208) PASS: lldb-api :: commands/expression/unicode-in-variable/TestUnicodeInVariable.py (819 of 1208) PASS: lldb-api :: functionalities/data-formatter/data-formatter-objc/TestDataFormatterObjCNSData.py (820 of 1208) PASS: lldb-api :: commands/disassemble/basic/TestDisassembleBreakpoint.py (821 of 1208) PASS: lldb-shell :: ObjectFile/ELF/gnu-debuglink.yaml (822 of 1208) PASS: lldb-shell :: SymbolFile/DWARF/module-ownership.mm (823 of 1208) PASS: lldb-shell :: SymbolFile/DWARF/split-dwarf-multiple-cu.ll (824 of 1208) PASS: lldb-api :: commands/gui/invalid-args/TestInvalidArgsGui.py (825 of 1208) PASS: lldb-shell :: Settings/TestFrameFormatColor.test (826 of 1208) PASS: lldb-api :: functionalities/archives/TestBSDArchives.py (827 of 1208) PASS: lldb-api :: types/TestIntegerTypeExpr.py (828 of 1208) PASS: lldb-api :: lang/cpp/dynamic-value/TestCppValueCast.py (829 of 1208) PASS: lldb-api :: functionalities/breakpoint/dummy_target_breakpoints/TestBreakpointsWithNoTargets.py (830 of 1208) PASS: lldb-api :: lang/c/shared_lib_stripped_symbols/TestSharedLibStrippedSymbols.py (831 of 1208) PASS: lldb-api :: lang/c/unicode/TestUnicodeSymbols.py (832 of 1208) PASS: lldb-shell :: ObjectFile/ELF/compressed-sections.yaml (833 of 1208) UNSUPPORTED: lldb-api :: commands/expression/import-std-module/vector-of-vectors/TestVectorOfVectorsFromStdModule.py (834 of 1208) PASS: lldb-api :: lang/cpp/llvm-style/TestLLVMStyle.py (835 of 1208) UNSUPPORTED: lldb-api :: commands/expression/import-std-module/unique_ptr-dbg-info-content/TestUniquePtrDbgInfoContent.py (836 of 1208) PASS: lldb-api :: lang/objc/objc-dyn-sbtype/TestObjCDynamicSBType.py (837 of 1208) PASS: lldb-api :: functionalities/postmortem/minidump-new/TestMiniDumpNew.py (838 of 1208) PASS: lldb-api :: functionalities/tail_call_frames/disambiguate_tail_call_seq/TestDisambiguateTailCallSeq.py (839 of 1208) PASS: lldb-api :: lang/objc/objc-super/TestObjCSuper.py (840 of 1208) UNSUPPORTED: lldb-api :: commands/expression/import-std-module/stack/TestStackFromStdModule.py (841 of 1208) PASS: lldb-shell :: ObjectFile/PECOFF/section-types.yaml (842 of 1208) PASS: lldb-api :: functionalities/data-formatter/data-formatter-objc/cmtime/TestDataFormatterCMTime.py (843 of 1208) PASS: lldb-api :: lang/cpp/frame-var-anon-unions/TestFrameVariableAnonymousUnions.py (844 of 1208) PASS: lldb-shell :: ObjectFile/wasm/stripped-debug-sections.yaml (845 of 1208) PASS: lldb-api :: commands/command/invalid-args/TestInvalidArgsCommand.py (846 of 1208) UNSUPPORTED: lldb-api :: functionalities/data-formatter/data-formatter-stl/libstdcpp/map/TestDataFormatterStdMap.py (847 of 1208) PASS: lldb-api :: lang/c/enum_types/TestEnumTypes.py (848 of 1208) PASS: lldb-shell :: SymbolFile/DWARF/debug-types-missing-signature.test (849 of 1208) PASS: lldb-api :: lang/cpp/template/TestTemplateArgs.py (850 of 1208) PASS: lldb-api :: lang/cpp/alignas_base_class/TestAlignAsBaseClass.py (851 of 1208) PASS: lldb-shell :: SymbolFile/DWARF/static_scope.s (852 of 1208) UNSUPPORTED: lldb-api :: functionalities/unwind/ehframe/TestEhFrameUnwind.py (853 of 1208) PASS: lldb-api :: functionalities/gdb_remote_client/TestJLink6Armv7RegisterDefinition.py (854 of 1208) UNSUPPORTED: lldb-shell :: Reproducer/TestSynchronous.test (855 of 1208) UNSUPPORTED: lldb-api :: functionalities/data-formatter/data-formatter-stl/libstdcpp/vector/TestDataFormatterStdVector.py (856 of 1208) PASS: lldb-shell :: SymbolFile/DWARF/dwp-separate-debug-file.cpp (857 of 1208) PASS: lldb-api :: lang/cpp/exceptions/TestCPPExceptionBreakpoints.py (858 of 1208) UNSUPPORTED: lldb-shell :: Driver/TestCore.test (859 of 1208) PASS: lldb-shell :: SymbolFile/DWARF/deterministic-build.cpp (860 of 1208) PASS: lldb-shell :: SymbolFile/DWARF/debug-types-address-ranges.s (861 of 1208) UNSUPPORTED: lldb-api :: commands/expression/import-std-module/unique_ptr/TestUniquePtrFromStdModule.py (862 of 1208) PASS: lldb-api :: lang/c/inlines/TestRedefinitionsInInlines.py (863 of 1208) UNSUPPORTED: lldb-api :: commands/process/attach/attach_denied/TestAttachDenied.py (864 of 1208) PASS: lldb-shell :: ObjectFile/ELF/duplicate-section.yaml (865 of 1208) PASS: lldb-shell :: SymbolFile/DWARF/win-i386-line-table.s (866 of 1208) PASS: lldb-api :: functionalities/thread/concurrent_events/TestConcurrentTwoBreakpointsOneSignal.py (867 of 1208) PASS: lldb-api :: functionalities/gdb_remote_client/TestWasm.py (868 of 1208) PASS: lldb-api :: commands/target/dump-symtab-demangle/TestDumpSymtabDemangle.py (869 of 1208) PASS: lldb-api :: functionalities/gdb_remote_client/TestNoGPacketSupported.py (870 of 1208) PASS: lldb-api :: commands/frame/diagnose/complicated-expression/TestComplicatedExpression.py (871 of 1208) PASS: lldb-api :: tools/lldb-server/register-reading/TestGdbRemoteGPacket.py (872 of 1208) PASS: lldb-api :: commands/expression/dont_allow_jit/TestAllowJIT.py (873 of 1208) UNSUPPORTED: lldb-shell :: Reproducer/TestLuaImport.test (874 of 1208) PASS: lldb-api :: functionalities/tail_call_frames/inlining_and_tail_calls/TestInliningAndTailCalls.py (875 of 1208) PASS: lldb-api :: lang/c/function_types/TestFunctionTypes.py (876 of 1208) PASS: lldb-api :: tools/lldb-server/commandline/TestStubSetSID.py (877 of 1208) PASS: lldb-api :: functionalities/data-formatter/data-formatter-objc/nsindexpath/TestDataFormatterNSIndexPath.py (878 of 1208) PASS: lldb-api :: types/TestRecursiveTypes.py (879 of 1208) PASS: lldb-api :: lang/cpp/stl/TestStdCXXDisassembly.py (880 of 1208) PASS: lldb-api :: functionalities/thread/backtrace_all/TestBacktraceAll.py (881 of 1208) UNSUPPORTED: lldb-api :: functionalities/thread/state/TestThreadStates.py (882 of 1208) UNSUPPORTED: lldb-api :: python_api/file_handle/TestFileHandle.py (883 of 1208) PASS: lldb-api :: functionalities/data-formatter/data-formatter-objc/nsstring/TestDataFormatterNSString.py (884 of 1208) PASS: lldb-api :: lang/cpp/class-template-parameter-pack/TestClassTemplateParameterPack.py (885 of 1208) PASS: lldb-api :: python_api/lldbutil/iter/TestLLDBIterator.py (886 of 1208) UNSUPPORTED: lldb-api :: functionalities/deleted-executable/TestDeletedExecutable.py (887 of 1208) PASS: lldb-api :: lang/cpp/std-function-step-into-callable/TestStdFunctionStepIntoCallable.py (888 of 1208) PASS: lldb-api :: lang/objc/objc-runtime-ivars/TestRuntimeIvars.py (889 of 1208) PASS: lldb-api :: functionalities/data-formatter/data-formatter-stl/libstdcpp/unique_ptr/invalid/TestDataFormatterInvalidStdUniquePtr.py (890 of 1208) PASS: lldb-api :: python_api/lldbutil/TestSwigVersion.py (891 of 1208) PASS: lldb-api :: commands/frame/language/TestGuessLanguage.py (892 of 1208) PASS: lldb-api :: macosx/lc-note/kern-ver-str/TestKernVerStrLCNOTE.py (893 of 1208) UNSUPPORTED: lldb-shell :: Reproducer/TestWorkingDir.test (894 of 1208) UNSUPPORTED: lldb-shell :: SymbolFile/PDB/pointers.test (895 of 1208) UNSUPPORTED: lldb-api :: linux/sepdebugsymlink/TestTargetSymbolsSepDebugSymlink.py (896 of 1208) UNSUPPORTED: lldb-api :: benchmarks/expression/TestRepeatedExprs.py (897 of 1208) UNSUPPORTED: lldb-api :: api/multiple-debuggers/TestMultipleDebuggers.py (898 of 1208) PASS: lldb-api :: functionalities/ubsan/basic/TestUbsanBasic.py (899 of 1208) PASS: lldb-api :: lang/c/strings/TestCStrings.py (900 of 1208) PASS: lldb-shell :: Commands/command-regex-delete.test (901 of 1208) UNSUPPORTED: lldb-shell :: ScriptInterpreter/Python/crashlog.test (902 of 1208) PASS: lldb-api :: lang/cpp/bitfields/TestCppBitfields.py (903 of 1208) PASS: lldb-shell :: SymbolFile/DWARF/DW_AT_declaration-with-children.s (904 of 1208) PASS: lldb-api :: python_api/get-value-32bit-int/TestGetValue32BitInt.py (905 of 1208) PASS: lldb-shell :: Commands/command-source.test (906 of 1208) PASS: lldb-api :: lang/objc/objc-static-method/TestObjCStaticMethod.py (907 of 1208) PASS: lldb-shell :: ObjectFile/MachO/symtab.yaml (908 of 1208) PASS: lldb-api :: functionalities/breakpoint/move_nearest/TestMoveNearest.py (909 of 1208) PASS: lldb-api :: functionalities/data-formatter/data-formatter-objc/TestDataFormatterObjCPlain.py (910 of 1208) PASS: lldb-api :: tools/lldb-server/TestGdbRemote_qThreadStopInfo.py (911 of 1208) PASS: lldb-shell :: ObjectFile/ELF/basic-info.yaml (912 of 1208) UNSUPPORTED: lldb-api :: functionalities/breakpoint/serialize/TestBreakpointSerialization.py (913 of 1208) PASS: lldb-api :: functionalities/avoids-fd-leak/TestFdLeak.py (914 of 1208) PASS: lldb-api :: types/TestCharTypeExpr.py (915 of 1208) XFAIL: lldb-shell :: Register/x86-64-write.test (916 of 1208) PASS: lldb-api :: functionalities/thread/num_threads/TestNumThreads.py (917 of 1208) PASS: lldb-api :: functionalities/thread/concurrent_events/TestConcurrentDelayWatchBreak.py (918 of 1208) PASS: lldb-api :: lang/cpp/const_this/TestConstThis.py (919 of 1208) PASS: lldb-api :: functionalities/data-formatter/data-formatter-disabling/TestDataFormatterDisabling.py (920 of 1208) UNSUPPORTED: lldb-api :: functionalities/thread/create_during_step/TestCreateDuringStep.py (921 of 1208) PASS: lldb-api :: commands/expression/weak_symbols/TestWeakSymbols.py (922 of 1208) PASS: lldb-api :: functionalities/rerun/TestRerun.py (923 of 1208) UNSUPPORTED: lldb-shell :: Register/x86-ymm-write.test (924 of 1208) PASS: lldb-shell :: Breakpoint/jitbp_elf.test (925 of 1208) UNSUPPORTED: lldb-api :: functionalities/data-formatter/data-formatter-stl/libstdcpp/tuple/TestDataFormatterStdTuple.py (926 of 1208) PASS: lldb-api :: functionalities/data-formatter/data-formatter-objc/TestDataFormatterObjCNSDate.py (927 of 1208) PASS: lldb-api :: commands/gui/breakpoints/TestGuiBreakpoints.py (928 of 1208) PASS: lldb-shell :: ObjectFile/ELF/minidebuginfo-find-symbols.yaml (929 of 1208) PASS: lldb-api :: functionalities/breakpoint/breakpoint_ignore_count/TestBreakpointIgnoreCount.py (930 of 1208) PASS: lldb-api :: lang/cpp/incomplete-types/TestCppIncompleteTypes.py (931 of 1208) PASS: lldb-api :: lang/c/complex/TestComplexC99.py (932 of 1208) PASS: lldb-api :: macosx/universal/TestUniversal.py (933 of 1208) UNSUPPORTED: lldb-api :: arm/breakpoint-it/TestBreakpointIt.py (934 of 1208) PASS: lldb-api :: commands/expression/persistent_ptr_update/TestPersistentPtrUpdate.py (935 of 1208) UNSUPPORTED: lldb-api :: commands/process/attach-resume/TestAttachResume.py (936 of 1208) UNSUPPORTED: lldb-shell :: ExecControl/StopHook/stop-hook-threads.test (937 of 1208) PASS: lldb-api :: functionalities/memory/find/TestMemoryFind.py (938 of 1208) PASS: lldb-shell :: Settings/TestFrameFormatNoColor.test (939 of 1208) PASS: lldb-api :: lang/c/local_types/TestUseClosestType.py (940 of 1208) PASS: lldb-api :: lang/cpp/trivial_abi/TestTrivialABI.py (941 of 1208) PASS: lldb-shell :: ObjectFile/ELF/netbsd-core-amd64.test (942 of 1208) PASS: lldb-api :: functionalities/data-formatter/data-formatter-categories/TestDataFormatterCategories.py (943 of 1208) PASS: lldb-shell :: SymbolFile/NativePDB/function-types-calling-conv.cpp (944 of 1208) PASS: lldb-api :: sample_test/TestSampleInlineTest.py (945 of 1208) UNSUPPORTED: lldb-api :: python_api/event/TestEvents.py (946 of 1208) PASS: lldb-shell :: BuildScript/toolchain-clang.test (947 of 1208) UNSUPPORTED: lldb-api :: functionalities/signal/handle-segv/TestHandleSegv.py (948 of 1208) UNSUPPORTED: lldb-shell :: SymbolFile/NativePDB/stack_unwinding01.cpp (949 of 1208) PASS: lldb-api :: functionalities/tsan/thread_leak/TestTsanThreadLeak.py (950 of 1208) PASS: lldb-api :: commands/process/signal/TestProcessSignal.py (951 of 1208) PASS: lldb-api :: functionalities/thread/step_until/TestStepUntil.py (952 of 1208) PASS: lldb-api :: python_api/exprpath_synthetic/TestExprPathSynthetic.py (953 of 1208) PASS: lldb-api :: python_api/default-constructor/TestDefaultConstructorForAPIObjects.py (954 of 1208) UNSUPPORTED: lldb-shell :: ScriptInterpreter/Lua/quit.test (955 of 1208) PASS: lldb-api :: python_api/frame/TestFrames.py (956 of 1208) PASS: lldb-api :: functionalities/gdb_remote_client/TestRecognizeBreakpoint.py (957 of 1208) PASS: lldb-api :: functionalities/data-formatter/type_summary_list_script/TestTypeSummaryListScript.py (958 of 1208) UNSUPPORTED: lldb-shell :: SymbolFile/PDB/ast-restore.test (959 of 1208) PASS: lldb-api :: lang/c/set_values/TestSetValues.py (960 of 1208) PASS: lldb-api :: lang/objc/blocks/TestObjCIvarsInBlocks.py (961 of 1208) PASS: lldb-api :: functionalities/thread/thread_specific_break/TestThreadSpecificBreakpoint.py (962 of 1208) PASS: lldb-api :: functionalities/breakpoint/objc/TestObjCBreakpoints.py (963 of 1208) PASS: lldb-shell :: ObjectFile/MachO/subsections.yaml (964 of 1208) PASS: lldb-api :: commands/expression/regression-access-function-template-in-record/TestRegressionAccessFunctionTemplateInRecord.py (965 of 1208) PASS: lldb-api :: lang/objc/variadic_methods/TestVariadicMethods.py (966 of 1208) PASS: lldb-api :: lang/cpp/template-function/TestTemplateFunctions.py (967 of 1208) PASS: lldb-api :: functionalities/data-formatter/data-formatter-stl/libcxx/iterator/TestDataFormatterLibccIterator.py (968 of 1208) PASS: lldb-api :: python_api/sblaunchinfo/TestSBLaunchInfo.py (969 of 1208) PASS: lldb-api :: functionalities/data-formatter/data-formatter-stl/libcxx/list/TestDataFormatterLibcxxList.py (970 of 1208) PASS: lldb-api :: functionalities/object-file/TestImageListMultiArchitecture.py (971 of 1208) PASS: lldb-shell :: SymbolFile/DWARF/DW_AT_low_pc-addrx.s (972 of 1208) PASS: lldb-api :: functionalities/recursion/TestValueObjectRecursion.py (973 of 1208) PASS: lldb-api :: functionalities/data-formatter/data-formatter-stl/libcxx/map/TestDataFormatterLibccMap.py (974 of 1208) UNSUPPORTED: lldb-shell :: Register/x86-64-gp-write.test (975 of 1208) PASS: lldb-api :: python_api/watchpoint/condition/TestWatchpointConditionAPI.py (976 of 1208) PASS: lldb-shell :: SymbolFile/DWARF/DW_OP_piece-struct.s (977 of 1208) PASS: lldb-api :: functionalities/tsan/multiple/TestTsanMultiple.py (978 of 1208) PASS: lldb-shell :: Recognizer/assert.test (979 of 1208) PASS: lldb-api :: functionalities/plugins/python_os_plugin/TestPythonOSPlugin.py (980 of 1208) PASS: lldb-api :: functionalities/target_var/TestTargetVar.py (981 of 1208) PASS: lldb-api :: functionalities/thread/crash_during_step/TestCrashDuringStep.py (982 of 1208) PASS: lldb-shell :: SymbolFile/DWARF/debug_ranges-missing-section.s (983 of 1208) PASS: lldb-api :: commands/expression/entry-bp/TestExprEntryBP.py (984 of 1208) PASS: lldb-shell :: SymbolFile/DWARF/DW_OP_piece-smaller-than-struct.s (985 of 1208) PASS: lldb-shell :: Minidump/memory-region.yaml (986 of 1208) PASS: lldb-api :: functionalities/asan/TestMemoryHistory.py (987 of 1208) PASS: lldb-api :: lang/objc/modules-auto-import/TestModulesAutoImport.py (988 of 1208) PASS: lldb-shell :: SymbolFile/DWARF/debug-types-dwo-cross-reference.cpp (989 of 1208) PASS: lldb-api :: lang/objc/objc-new-syntax/TestObjCNewSyntaxLiteral.py (990 of 1208) PASS: lldb-shell :: SymbolFile/NativePDB/globals-bss.cpp (991 of 1208) UNSUPPORTED: lldb-api :: benchmarks/libcxxmap/TestBenchmarkLibcxxMap.py (992 of 1208) PASS: lldb-api :: functionalities/tsan/cpp_global_location/TestTsanCPPGlobalLocation.py (993 of 1208) PASS: lldb-api :: macosx/save_crashlog/TestSaveCrashlog.py (994 of 1208) PASS: lldb-api :: functionalities/pointer_num_children/TestPointerNumChildren.py (995 of 1208) PASS: lldb-api :: commands/expression/deleting-implicit-copy-constructor/TestDeletingImplicitCopyConstructor.py (996 of 1208) PASS: lldb-api :: functionalities/thread/concurrent_events/TestConcurrentSignalDelayBreak.py (997 of 1208) PASS: lldb-shell :: ObjectFile/ELF/PT_LOAD-empty.yaml (998 of 1208) UNSUPPORTED: lldb-api :: benchmarks/frame_variable/TestFrameVariableResponse.py (999 of 1208) PASS: lldb-shell :: Breakpoint/split-dwarf5-debug-stroffsets.test (1000 of 1208) PASS: lldb-api :: functionalities/dead-strip/TestDeadStrip.py (1001 of 1208) UNSUPPORTED: lldb-shell :: Process/Windows/exception_access_violation.cpp (1002 of 1208) PASS: lldb-api :: lang/cpp/wchar_t/TestCxxWCharT.py (1003 of 1208) PASS: lldb-shell :: SymbolFile/NativePDB/ast-functions.cpp (1004 of 1208) PASS: lldb-api :: functionalities/data-formatter/data-formatter-stl/libcxx/forward_list/TestDataFormatterLibcxxForwardList.py (1005 of 1208) PASS: lldb-api :: macosx/duplicate-archive-members/TestDuplicateMembers.py (1006 of 1208) PASS: lldb-shell :: Commands/CommandScriptImmediateOutput/CommandScriptImmediateOutputFile.test (1007 of 1208) PASS: lldb-shell :: SymbolFile/Breakpad/stack-cfi-arm.yaml (1008 of 1208) PASS: lldb-api :: python_api/lldbutil/iter/TestRegistersIterator.py (1009 of 1208) PASS: lldb-api :: lang/cpp/unsigned_types/TestUnsignedTypes.py (1010 of 1208) UNSUPPORTED: lldb-api :: commands/expression/import-std-module/vector-dbg-info-content/TestDbgInfoContentVectorFromStdModule.py (1011 of 1208) PASS: lldb-api :: functionalities/unwind/noreturn/module-end/TestNoReturnModuleEnd.py (1012 of 1208) PASS: lldb-shell :: Driver/TestUseColor.test (1013 of 1208) UNSUPPORTED: lldb-api :: commands/expression/expr-in-syscall/TestExpressionInSyscall.py (1014 of 1208) PASS: lldb-api :: api/multiple-targets/TestMultipleTargets.py (1015 of 1208) PASS: lldb-api :: functionalities/backticks/TestBackticksWithoutATarget.py (1016 of 1208) PASS: lldb-shell :: ObjectFile/ELF/section-overlap.yaml (1017 of 1208) PASS: lldb-shell :: SymbolFile/Breakpad/line-table-missing-file.test (1018 of 1208) PASS: lldb-api :: functionalities/thread/concurrent_events/TestConcurrentTwoWatchpointThreads.py (1019 of 1208) PASS: lldb-api :: commands/frame/diagnose/inheritance/TestDiagnoseInheritance.py (1020 of 1208) UNSUPPORTED: lldb-api :: tools/lldb-vscode/breakpoint/TestVSCode_setBreakpoints.py (1021 of 1208) PASS: lldb-api :: functionalities/exec/TestExec.py (1022 of 1208) PASS: lldb-api :: commands/expression/static-initializers/TestStaticInitializers.py (1023 of 1208) PASS: lldb-shell :: SymbolFile/DWARF/gnu-style-compression.cpp (1024 of 1208) PASS: lldb-api :: lang/cpp/gmodules/TestWithModuleDebugging.py (1025 of 1208) PASS: lldb-shell :: SymbolFile/NativePDB/break-by-function.cpp (1026 of 1208) PASS: lldb-api :: functionalities/gdb_remote_client/TestIOSSimulator.py (1027 of 1208) PASS: lldb-api :: lang/objcxx/objcxx-ivar-vector/TestIvarVector.py (1028 of 1208) PASS: lldb-api :: lang/objc/objc-ivar-offsets/TestObjCIvarOffsets.py (1029 of 1208) PASS: lldb-api :: commands/watchpoints/watchpoint_commands/TestWatchpointCommands.py (1030 of 1208) PASS: lldb-api :: lang/c/step_over_no_deadlock/TestStepOverDoesntBlock.py (1031 of 1208) UNSUPPORTED: lldb-api :: commands/expression/import-std-module/deque-basic/TestDequeFromStdModule.py (1032 of 1208) PASS: lldb-api :: lang/objc/exceptions/TestObjCExceptions.py (1033 of 1208) PASS: lldb-api :: lang/cpp/typeof/TestTypeOfDeclTypeExpr.py (1034 of 1208) UNSUPPORTED: lldb-shell :: BuildScript/toolchain-clang-cl.test (1035 of 1208) PASS: lldb-api :: commands/target/basic/TestTargetCommand.py (1036 of 1208) UNSUPPORTED: lldb-api :: commands/register/register/intel_xtended_registers/TestMPXRegisters.py (1037 of 1208) PASS: lldb-shell :: SymbolFile/DWARF/find-method.cpp (1038 of 1208) PASS: lldb-shell :: SymbolFile/DWARF/debug_line-tombstone.s (1039 of 1208) PASS: lldb-api :: functionalities/tail_call_frames/thread_step_out_message/TestArtificialFrameStepOutMessage.py (1040 of 1208) PASS: lldb-api :: commands/frame/diagnose/local-variable/TestLocalVariable.py (1041 of 1208) PASS: lldb-api :: macosx/simulator/TestSimulatorPlatform.py (1042 of 1208) PASS: lldb-api :: commands/command/source/TestCommandSource.py (1043 of 1208) PASS: lldb-api :: functionalities/jitloader_gdb/TestJITLoaderGDB.py (1044 of 1208) PASS: lldb-shell :: Minidump/Windows/broken-unwind.test (1045 of 1208) PASS: lldb-api :: functionalities/data-formatter/synthcapping/TestSyntheticCapping.py (1046 of 1208) UNSUPPORTED: lldb-api :: macosx/function-starts/TestFunctionStarts.py (1047 of 1208) PASS: lldb-api :: linux/builtin_trap/TestBuiltinTrap.py (1048 of 1208) PASS: lldb-api :: functionalities/breakpoint/scripted_bkpt/TestScriptedResolver.py (1049 of 1208) UNSUPPORTED: lldb-api :: commands/expression/completion-crash-invalid-iterator/TestInvalidIteratorCompletionCrash.py (1050 of 1208) UNSUPPORTED: lldb-api :: tools/lldb-vscode/coreFile/TestVSCode_coreFile.py (1051 of 1208) PASS: lldb-shell :: Settings/TestEchoCommands.test (1052 of 1208) PASS: lldb-api :: functionalities/data-formatter/data-formatter-globals/TestDataFormatterGlobals.py (1053 of 1208) PASS: lldb-shell :: Unwind/thread-step-out-ret-addr-check.test (1054 of 1208) PASS: lldb-shell :: ObjectFile/ELF/section-permissions.yaml (1055 of 1208) PASS: lldb-shell :: SymbolFile/NativePDB/ast-types.cpp (1056 of 1208) PASS: lldb-api :: functionalities/data-formatter/ptr_ref_typedef/TestPtrRef2Typedef.py (1057 of 1208) UNSUPPORTED: lldb-api :: tools/lldb-vscode/console/TestVSCode_console.py (1058 of 1208) PASS: lldb-api :: functionalities/plugins/python_os_plugin/stepping_plugin_threads/TestOSPluginStepping.py (1059 of 1208) PASS: lldb-api :: functionalities/gdb_remote_client/TestProcessConnect.py (1060 of 1208) PASS: lldb-shell :: Driver/TestSingleQuote.test (1061 of 1208) PASS: lldb-api :: functionalities/data-formatter/data-formatter-stl/libcxx/vector/TestDataFormatterLibcxxVector.py (1062 of 1208) PASS: lldb-shell :: ObjectFile/ELF/PT_LOAD.yaml (1063 of 1208) PASS: lldb-shell :: ObjectFile/ELF/avr-basic-info.yaml (1064 of 1208) PASS: lldb-api :: tools/lldb-server/TestGdbRemoteThreadsInStopReply.py (1065 of 1208) PASS: lldb-api :: functionalities/tail_call_frames/thread_step_out_or_return/TestSteppingOutWithArtificialFrames.py (1066 of 1208) PASS: lldb-api :: functionalities/data-formatter/type_summary_list_arg/TestTypeSummaryListArg.py (1067 of 1208) PASS: lldb-api :: commands/watchpoints/multiple_hits/TestMultipleHits.py (1068 of 1208) PASS: lldb-api :: commands/settings/use_source_cache/TestUseSourceCache.py (1069 of 1208) PASS: lldb-api :: tools/lldb-server/TestGdbRemoteSingleStep.py (1070 of 1208) PASS: lldb-shell :: Minidump/Windows/arm-fp-unwind.test (1071 of 1208) PASS: lldb-shell :: SymbolFile/DWARF/dwarf5-partial-index.cpp (1072 of 1208) PASS: lldb-shell :: SymbolFile/DWARF/find-variable-file.cpp (1073 of 1208) PASS: lldb-shell :: Settings/TestDisassemblyFormat.test (1074 of 1208) PASS: lldb-api :: functionalities/memory/read/TestMemoryRead.py (1075 of 1208) PASS: lldb-api :: functionalities/data-formatter/refpointer-recursion/TestDataFormatterRefPtrRecursion.py (1076 of 1208) PASS: lldb-api :: functionalities/process_crash_info/TestProcessCrashInfo.py (1077 of 1208) PASS: lldb-shell :: ObjectFile/ELF/many-sections.s (1078 of 1208) PASS: lldb-api :: functionalities/thread/concurrent_events/TestConcurrentManyWatchpoints.py (1079 of 1208) PASS: lldb-api :: functionalities/data-formatter/data-formatter-stl/libcxx/initializerlist/TestInitializerList.py (1080 of 1208) PASS: lldb-shell :: SymbolFile/DWARF/dir-separator-no-comp-dir.s (1081 of 1208) UNSUPPORTED: lldb-api :: functionalities/load_using_paths/TestLoadUsingPaths.py (1082 of 1208) PASS: lldb-api :: python_api/function_symbol/TestSymbolAPI.py (1083 of 1208) PASS: lldb-api :: functionalities/thread/concurrent_events/TestConcurrentManyBreakpoints.py (1084 of 1208) UNSUPPORTED: lldb-api :: functionalities/darwin_log/filter/exact_match/subsystem/TestDarwinLogFilterMatchSubsystem.py (1085 of 1208) PASS: lldb-api :: functionalities/tail_call_frames/cross_object/TestCrossObjectTailCalls.py (1086 of 1208) PASS: lldb-api :: functionalities/conditional_break/TestConditionalBreak.py (1087 of 1208) UNSUPPORTED: lldb-shell :: Register/x86-zmm-read.test (1088 of 1208) PASS: lldb-api :: functionalities/data-formatter/typedef_array/TestTypedefArray.py (1089 of 1208) PASS: lldb-api :: functionalities/data-formatter/data-formatter-stl/libcxx/queue/TestDataFormatterLibcxxQueue.py (1090 of 1208) PASS: lldb-shell :: Commands/command-regex-unalias.test (1091 of 1208) PASS: lldb-api :: functionalities/thread/concurrent_events/TestConcurrentBreakpointOneDelayBreakpointThreads.py (1092 of 1208) UNSUPPORTED: lldb-api :: tools/lldb-vscode/stackTrace/TestVSCode_stackTrace.py (1093 of 1208) PASS: lldb-api :: functionalities/dlopen_other_executable/TestDlopenOtherExecutable.py (1094 of 1208) PASS: lldb-api :: commands/expression/test/TestExprs2.py (1095 of 1208) UNSUPPORTED: lldb-api :: tools/lldb-server/signal-filtering/TestGdbRemote_QPassSignals.py (1096 of 1208) PASS: lldb-api :: functionalities/thread/ignore_suspended/TestIgnoreSuspendedThread.py (1097 of 1208) PASS: lldb-api :: lang/cpp/dynamic-value/TestDynamicValue.py (1098 of 1208) UNSUPPORTED: lldb-api :: python_api/interpreter/TestRunCommandInterpreterAPI.py (1099 of 1208) PASS: lldb-shell :: Breakpoint/debug_rnglist_basic.test (1100 of 1208) PASS: lldb-api :: functionalities/signal/handle-abrt/TestHandleAbort.py (1101 of 1208) UNSUPPORTED: lldb-api :: functionalities/darwin_log/filter/exact_match/activity/TestDarwinLogFilterMatchActivity.py (1102 of 1208) PASS: lldb-api :: functionalities/thread/concurrent_events/TestConcurrentDelayedCrashWithBreakpointSignal.py (1103 of 1208) PASS: lldb-shell :: SymbolFile/DWARF/DW_AT_loclists_base.s (1104 of 1208) PASS: lldb-api :: commands/expression/calculator_mode/TestCalculatorMode.py (1105 of 1208) PASS: lldb-api :: functionalities/data-formatter/data-formatter-stl/libcxx/function/TestLibCxxFunction.py (1106 of 1208) UNSUPPORTED: lldb-api :: functionalities/thread/exit_during_expression/TestExitDuringExpression.py (1107 of 1208) PASS: lldb-api :: commands/frame/diagnose/dereference-argument/TestDiagnoseDereferenceArgument.py (1108 of 1208) PASS: lldb-api :: functionalities/thread/concurrent_events/TestConcurrentSignalWatch.py (1109 of 1208) PASS: lldb-shell :: SymbolFile/DWARF/split-dwarf-inlining.cpp (1110 of 1208) PASS: lldb-shell :: SymbolFile/DWARF/find-basic-variable.cpp (1111 of 1208) PASS: lldb-api :: functionalities/data-formatter/summary-string-onfail/Test-rdar-9974002.py (1112 of 1208) UNSUPPORTED: lldb-shell :: ObjectFile/ELF/minidebuginfo-no-lzma.yaml (1113 of 1208) PASS: lldb-api :: lang/c/vla/TestVLA.py (1114 of 1208) UNSUPPORTED: lldb-shell :: Driver/LocalLLDBInit.test (1115 of 1208) PASS: lldb-api :: commands/statistics/basic/TestStats.py (1116 of 1208) PASS: lldb-shell :: Minidump/breakpad-symbols.test (1117 of 1208) PASS: lldb-api :: functionalities/thread/concurrent_events/TestConcurrentDelayedCrashWithBreakpointWatchpoint.py (1118 of 1208) PASS: lldb-api :: tools/lldb-server/TestGdbRemoteAttach.py (1119 of 1208) PASS: lldb-api :: functionalities/postmortem/wow64_minidump/TestWow64MiniDump.py (1120 of 1208) PASS: lldb-api :: lang/cpp/char1632_t/TestChar1632T.py (1121 of 1208) PASS: lldb-api :: commands/expression/call-function/TestCallStopAndContinue.py (1122 of 1208) UNSUPPORTED: lldb-shell :: Register/x86-64-ymm-read.test (1123 of 1208) PASS: lldb-api :: commands/frame/diagnose/bad-reference/TestBadReference.py (1124 of 1208) PASS: lldb-shell :: Quit/TestQuitExitCodeNonInt.test (1125 of 1208) PASS: lldb-api :: lang/objc/objc-struct-argument/TestObjCStructArgument.py (1126 of 1208) PASS: lldb-shell :: Expr/TestIRMemoryMap.test (1127 of 1208) PASS: lldb-api :: python_api/objc_type/TestObjCType.py (1128 of 1208) UNSUPPORTED: lldb-api :: functionalities/process_group/TestChangeProcessGroup.py (1129 of 1208) PASS: lldb-api :: functionalities/tail_call_frames/ambiguous_tail_call_seq2/TestAmbiguousTailCallSeq2.py (1130 of 1208) PASS: lldb-shell :: SymbolFile/DWARF/childless-compile-unit.s (1131 of 1208) PASS: lldb-api :: lang/cpp/limit-debug-info/TestWithLimitDebugInfo.py (1132 of 1208) PASS: lldb-shell :: SymbolFile/NativePDB/ast-methods.cpp (1133 of 1208) PASS: lldb-api :: functionalities/lazy-loading/TestLazyLoading.py (1134 of 1208) UNSUPPORTED: lldb-shell :: Unwind/eh-frame-small-fde.test (1135 of 1208) UNSUPPORTED: lldb-api :: lang/c/typedef/Testtypedef.py (1136 of 1208) PASS: lldb-api :: commands/expression/xvalue/TestXValuePrinting.py (1137 of 1208) PASS: lldb-api :: python_api/interpreter/TestCommandInterpreterAPI.py (1138 of 1208) PASS: lldb-shell :: Driver/TestNoUseColor.test (1139 of 1208) UNSUPPORTED: lldb-api :: tools/lldb-vscode/breakpoint/TestVSCode_setExceptionBreakpoints.py (1140 of 1208) PASS: lldb-api :: functionalities/thread/concurrent_events/TestConcurrentSignalDelayWatch.py (1141 of 1208) PASS: lldb-api :: functionalities/data-formatter/builtin-formats/TestBuiltinFormats.py (1142 of 1208) UNSUPPORTED: lldb-api :: commands/expression/import-std-module/sysroot/TestStdModuleSysroot.py (1143 of 1208) PASS: lldb-api :: functionalities/data-formatter/data-formatter-stl/libcxx/set/TestDataFormatterLibcxxSet.py (1144 of 1208) UNSUPPORTED: lldb-api :: lang/objc/modules-update/TestClangModulesUpdate.py (1145 of 1208) PASS: lldb-shell :: Minidump/dump-all.test (1146 of 1208) PASS: lldb-shell :: ObjectFile/ELF/section-types.yaml (1147 of 1208) PASS: lldb-api :: lang/objc/objc-ivar-protocols/TestIvarProtocols.py (1148 of 1208) PASS: lldb-shell :: SymbolFile/DWARF/clang-ast-from-dwarf-objc-property.m (1149 of 1208) PASS: lldb-api :: commands/expression/call-throws/TestCallThatThrows.py (1150 of 1208) PASS: lldb-api :: python_api/value/empty_class/TestValueAPIEmptyClass.py (1151 of 1208) PASS: lldb-api :: lang/cpp/function_refs/TestFunctionRefs.py (1152 of 1208) PASS: lldb-api :: commands/frame/diagnose/dereference-this/TestDiagnoseDereferenceThis.py (1153 of 1208) PASS: lldb-api :: commands/frame/recognizer/TestFrameRecognizer.py (1154 of 1208) UNSUPPORTED: lldb-api :: functionalities/thread/concurrent_events/TestConcurrentManySignals.py (1155 of 1208) PASS: lldb-shell :: ObjectFile/PECOFF/uuid.yaml (1156 of 1208) PASS: lldb-shell :: ObjectFile/Breakpad/discontiguous-sections.test (1157 of 1208) PASS: lldb-api :: macosx/DBGSourcePathRemapping/TestDSYMSourcePathRemapping.py (1158 of 1208) PASS: lldb-api :: commands/expression/persistent_types/TestPersistentTypes.py (1159 of 1208) UNSUPPORTED: lldb-api :: functionalities/darwin_log/filter/regex/activity/TestDarwinLogFilterRegexActivity.py (1160 of 1208) PASS: lldb-shell :: ObjectFile/Breakpad/sections.test (1161 of 1208) PASS: lldb-shell :: SymbolFile/DWARF/debug-types-signature-loop.s (1162 of 1208) PASS: lldb-api :: macosx/safe-to-func-call/TestSafeFuncCalls.py (1163 of 1208) UNSUPPORTED: lldb-shell :: SymbolFile/PDB/compilands.test (1164 of 1208) UNSUPPORTED: lldb-api :: commands/expression/import-std-module/forward_list/TestForwardListFromStdModule.py (1165 of 1208) PASS: lldb-api :: arm/emulation/TestEmulations.py (1166 of 1208) PASS: lldb-api :: functionalities/data-formatter/stringprinter/TestStringPrinter.py (1167 of 1208) UNSUPPORTED: lldb-shell :: Reproducer/TestVersionCheck.test (1168 of 1208) PASS: lldb-api :: lang/cpp/auto/TestCPPAuto.py (1169 of 1208) UNSUPPORTED: lldb-shell :: Register/x86-gp-write.test (1170 of 1208) UNSUPPORTED: lldb-api :: macosx/thread-names/TestInterruptThreadNames.py (1171 of 1208) PASS: lldb-api :: commands/target/create-deps/TestTargetCreateDeps.py (1172 of 1208) PASS: lldb-shell :: SymbolFile/DWARF/dwp.s (1173 of 1208) PASS: lldb-api :: python_api/value/linked_list/TestValueAPILinkedList.py (1174 of 1208) PASS: lldb-shell :: Settings/TestSettingsSet.test (1175 of 1208) PASS: lldb-api :: functionalities/gdb_remote_client/TestRestartBug.py (1176 of 1208) PASS: lldb-api :: functionalities/thread/concurrent_events/TestConcurrentSignalNWatchNBreak.py (1177 of 1208) UNSUPPORTED: lldb-api :: benchmarks/turnaround/TestCompileRunToBreakpointTurnaround.py (1178 of 1208) PASS: lldb-shell :: ObjectFile/Breakpad/breakpad-identification.test (1179 of 1208) PASS: lldb-api :: functionalities/gdb_remote_client/TestStopPCs.py (1180 of 1208) UNSUPPORTED: lldb-api :: functionalities/breakpoint/hardware_breakpoints/hardware_breakpoint_on_multiple_threads/TestHWBreakMultiThread.py (1181 of 1208) PASS: lldb-api :: functionalities/inferior-crashing/recursive-inferior/TestRecursiveInferior.py (1182 of 1208) PASS: lldb-shell :: Settings/TestStopCommandSourceOnError.test (1183 of 1208) PASS: lldb-shell :: Settings/TestDisableColor.test (1184 of 1208) PASS: lldb-shell :: SymbolFile/Breakpad/line-table.test (1185 of 1208) PASS: lldb-api :: lang/cpp/virtual-functions/TestCppVirtualFunctions.py (1186 of 1208) PASS: lldb-api :: functionalities/data-formatter/data-formatter-stl/libcxx/variant/TestDataFormatterLibcxxVariant.py (1187 of 1208) PASS: lldb-api :: lang/cpp/virtual-overload/TestVirtualOverload.py (1188 of 1208) PASS: lldb-api :: lang/objc/objc-static-method-stripped/TestObjCStaticMethodStripped.py (1189 of 1208) PASS: lldb-api :: commands/expression/rdar44436068/Test128BitsInteger.py (1190 of 1208) PASS: lldb-shell :: SymbolFile/Breakpad/unwind-via-stack-win.test (1191 of 1208) PASS: lldb-api :: functionalities/data-formatter/data-formatter-caching/TestDataFormatterCaching.py (1192 of 1208) PASS: lldb-api :: commands/apropos/with-process/TestAproposWithProcess.py (1193 of 1208) PASS: lldb-api :: types/TestLongTypes.py (1194 of 1208) PASS: lldb-api :: functionalities/data-formatter/data-formatter-objc/TestDataFormatterObjCExpr.py (1195 of 1208) PASS: lldb-api :: functionalities/gdb_remote_client/TestTargetXMLArch.py (1196 of 1208) PASS: lldb-api :: lang/c/step-target/TestStepTarget.py (1197 of 1208) PASS: lldb-api :: functionalities/data-formatter/data-formatter-enum-format/TestDataFormatterEnumFormat.py (1198 of 1208) PASS: lldb-api :: api/multithreaded/TestMultithreaded.py (1199 of 1208) PASS: lldb-shell :: SymbolFile/NativePDB/tag-types.cpp (1200 of 1208) PASS: lldb-api :: functionalities/gdb_remote_client/TestNoWatchpointSupportInfo.py (1201 of 1208) PASS: lldb-api :: lang/objc/objc-new-syntax/TestObjCNewSyntaxArray.py (1202 of 1208) PASS: lldb-api :: lang/objc/objc_direct-methods/TestObjCDirectMethods.py (1203 of 1208) PASS: lldb-api :: tools/lldb-server/TestGdbRemoteProcessInfo.py (1204 of 1208) PASS: lldb-api :: lang/objc/foundation/TestObjCMethods.py (1205 of 1208) PASS: lldb-api :: lang/objc/objc-new-syntax/TestObjCNewSyntaxDictionary.py (1206 of 1208) PASS: lldb-api :: lang/cpp/enum_types/TestCPP11EnumTypes.py (1207 of 1208) PASS: lldb-api :: functionalities/gdb_remote_client/TestGDBRemoteClient.py (1208 of 1208) Slowest Tests: -------------------------------------------------------------------------- 188.20s: lldb-api :: functionalities/gdb_remote_client/TestGDBRemoteClient.py 125.01s: lldb-api :: tools/lldb-server/TestLldbGdbServer.py 78.99s: lldb-api :: lang/objc/foundation/TestFoundationDisassembly.py 66.16s: lldb-api :: functionalities/gdb_remote_client/TestGDBRemoteLoad.py 64.66s: lldb-api :: lang/objc/exceptions/TestObjCExceptions.py 60.62s: lldb-api :: functionalities/gdb_remote_client/TestProcessConnect.py 58.31s: lldb-api :: types/TestLongTypesExpr.py 58.30s: lldb-api :: api/multithreaded/TestMultithreaded.py 55.73s: lldb-api :: lang/objc/foundation/TestObjCMethods.py 54.98s: lldb-api :: lang/cpp/enum_types/TestCPP11EnumTypes.py 52.55s: lldb-api :: lang/objc/objc-new-syntax/TestObjCNewSyntaxLiteral.py 49.77s: lldb-api :: lang/cpp/namespace/TestNamespaceLookup.py 48.07s: lldb-api :: macosx/simulator/TestSimulatorPlatform.py 43.41s: lldb-api :: lang/objc/real-definition/TestRealDefinition.py 42.54s: lldb-api :: lang/objc/hidden-ivars/TestHiddenIvars.py 39.66s: lldb-api :: functionalities/recursion/TestValueObjectRecursion.py 38.39s: lldb-api :: lang/objc/foundation/TestObjCMethodsString.py 38.24s: lldb-api :: lang/objc/foundation/TestObjCMethodsNSError.py 34.74s: lldb-api :: lang/objc/objc-new-syntax/TestObjCNewSyntaxArray.py 34.71s: lldb-api :: types/TestLongTypes.py

Hide Details

Tests Times: -------------------------------------------------------------------------- [ Range ] :: [ Percentage ] :: [ Count ] -------------------------------------------------------------------------- [180s,190s) :: [ ] :: [ 1/1208] [170s,180s) :: [ ] :: [ 0/1208] [160s,170s) :: [ ] :: [ 0/1208] [150s,160s) :: [ ] :: [ 0/1208] [140s,150s) :: [ ] :: [ 0/1208] [130s,140s) :: [ ] :: [ 0/1208] [120s,130s) :: [ ] :: [ 1/1208] [110s,120s) :: [ ] :: [ 0/1208] [100s,110s) :: [ ] :: [ 0/1208] [ 90s,100s) :: [ ] :: [ 0/1208] [ 80s, 90s) :: [ ] :: [ 0/1208] [ 70s, 80s) :: [ ] :: [ 1/1208] [ 60s, 70s) :: [ ] :: [ 3/1208] [ 50s, 60s) :: [ ] :: [ 6/1208] [ 40s, 50s) :: [ ] :: [ 4/1208] [ 30s, 40s) :: [ ] :: [ 9/1208] [ 20s, 30s) :: [ ] :: [ 28/1208] [ 10s, 20s) :: [**** ] :: [ 131/1208] [ 0s, 10s) :: [********************************* ] :: [1024/1208] -------------------------------------------------------------------------- ******************** Failed Tests (1): lldb-api :: tools/lldb-server/TestLldbGdbServer.py

Hide Details

Hide Details

Testing Time: 463.24s Unsupported : 262 Passed : 939 Expectedly Failed: 6 Failed : 1 FAILED: tools/lldb/test/CMakeFiles/check-lldb-reproducers-capture cd /Users/buildslave/jenkins/workspace/lldb-cmake-reproducers/lldb-build/tools/lldb/test && /usr/local/Frameworks/Python.framework/Versions/3.7/bin/python3.7 /Users/buildslave/jenkins/workspace/lldb-cmake-reproducers/lldb-build/./bin/llvm-lit -v --time-tests --shuffle --xunit-xml-output=/Users/buildslave/jenkins/workspace/lldb-cmake-reproducers/test/results.xml -v --param lldb-run-with-repro=capture /Users/buildslave/jenkins/workspace/lldb-cmake-reproducers/lldb-build/tools/lldb/test/API /Users/buildslave/jenkins/workspace/lldb-cmake-reproducers/lldb-build/tools/lldb/test/Shell ninja: build stopped: cannot make progress due to previous errors. Command failed: Command '['/usr/local/bin/ninja', '-k', '0', '-v', 'check-lldb-reproducers']' returned non-zero exit status 1. Command: ['/usr/local/bin/ninja', '-k', '0', '-v', 'check-lldb-reproducers'] [Pipeline] } [Pipeline] // timeout [Pipeline] } [Pipeline] // stage [Pipeline] stage [Pipeline] { (Declarative: Post Actions) [Pipeline] scanForIssues [Clang (LLVM based)] Sleeping for 5 seconds due to JENKINS-32191... [Clang (LLVM based)] Parsing console log (workspace: '/Users/buildslave/jenkins/workspace/lldb-cmake-reproducers') [Clang (LLVM based)] Successfully parsed console log [Clang (LLVM based)] -> found 14 issues (skipped 95 duplicates) [Clang (LLVM based)] Post processing issues on 'green-dragon-23' with source code encoding 'UTF-8' [Clang (LLVM based)] Creating SCM blamer to obtain author and commit information for affected files [Clang (LLVM based)] Creating SCM miner to obtain statistics for affected repository files [Clang (LLVM based)] Resolving file names for all issues in source directory '/Users/buildslave/jenkins/workspace/lldb-cmake-reproducers' [Clang (LLVM based)] -> resolved paths in source directory (9 found, 0 not found) [Clang (LLVM based)] Resolving module names from module definitions (build.xml, pom.xml, or Manifest.mf files) [Clang (LLVM based)] -> resolved module names for 14 issues [Clang (LLVM based)] Resolving package names (or namespaces) by parsing the affected files [Clang (LLVM based)] -> resolved package names of 8 affected files [Clang (LLVM based)] No filter has been set, publishing all 13 issues [Clang (LLVM based)] Creating fingerprints for all affected code blocks to track issues over different builds [Clang (LLVM based)] -> created fingerprints for 13 issues (skipped 0 issues) [Clang (LLVM based)] Copying affected files to Jenkins' build folder '/Users/Shared/Jenkins/Home/jobs/lldb-cmake-reproducers/builds/213/files-with-issues' [Clang (LLVM based)] -> 6 copied, 2 not in workspace, 0 not-found, 0 with I/O error [Pipeline] junit Recording test results [Pipeline] } [Pipeline] // stage [Pipeline] } [Pipeline] // withEnv [Pipeline] } [Pipeline] // node [Pipeline] End of Pipeline ERROR: script returned exit code 1 Finished: FAILURE